lucene-dev mailing list archives

Site index · List index
Message view « Date » · « Thread »
Top « Date » · « Thread »
From Policeman Jenkins Server <jenk...@thetaphi.de>
Subject [JENKINS] Lucene-Solr-7.x-Windows (64bit/jdk-9.0.1) - Build # 343 - Still Unstable!
Date Fri, 15 Dec 2017 19:22:19 GMT
Build: https://jenkins.thetaphi.de/job/Lucene-Solr-7.x-Windows/343/
Java: 64bit/jdk-9.0.1 -XX:+UseCompressedOops -XX:+UseParallelGC

6 tests failed.
FAILED:  junit.framework.TestSuite.org.apache.lucene.codecs.lucene50.TestLucene60FieldInfoFormat

Error Message:
Could not remove the following files (in the order of attempts):    C:\Users\jenkins\workspace\Lucene-Solr-7.x-Windows\lucene\build\core\test\J1\temp\lucene.codecs.lucene50.TestLucene60FieldInfoFormat_4C19A03B72EF7DD1-001\justSoYouGetSomeChannelErrors-001: java.nio.file.DirectoryNotEmptyException: C:\Users\jenkins\workspace\Lucene-Solr-7.x-Windows\lucene\build\core\test\J1\temp\lucene.codecs.lucene50.TestLucene60FieldInfoFormat_4C19A03B72EF7DD1-001\justSoYouGetSomeChannelErrors-001    C:\Users\jenkins\workspace\Lucene-Solr-7.x-Windows\lucene\build\core\test\J1\temp\lucene.codecs.lucene50.TestLucene60FieldInfoFormat_4C19A03B72EF7DD1-001\justSoYouGetSomeChannelErrors-001\extra0: java.nio.file.AccessDeniedException: C:\Users\jenkins\workspace\Lucene-Solr-7.x-Windows\lucene\build\core\test\J1\temp\lucene.codecs.lucene50.TestLucene60FieldInfoFormat_4C19A03B72EF7DD1-001\justSoYouGetSomeChannelErrors-001\extra0    C:\Users\jenkins\workspace\Lucene-Solr-7.x-Windows\lucene\build\core\test\J1\temp\lucene.codecs.lucene50.TestLucene60FieldInfoFormat_4C19A03B72EF7DD1-001: java.nio.file.DirectoryNotEmptyException: C:\Users\jenkins\workspace\Lucene-Solr-7.x-Windows\lucene\build\core\test\J1\temp\lucene.codecs.lucene50.TestLucene60FieldInfoFormat_4C19A03B72EF7DD1-001 

Stack Trace:
java.io.IOException: Could not remove the following files (in the order of attempts):
   C:\Users\jenkins\workspace\Lucene-Solr-7.x-Windows\lucene\build\core\test\J1\temp\lucene.codecs.lucene50.TestLucene60FieldInfoFormat_4C19A03B72EF7DD1-001\justSoYouGetSomeChannelErrors-001: java.nio.file.DirectoryNotEmptyException: C:\Users\jenkins\workspace\Lucene-Solr-7.x-Windows\lucene\build\core\test\J1\temp\lucene.codecs.lucene50.TestLucene60FieldInfoFormat_4C19A03B72EF7DD1-001\justSoYouGetSomeChannelErrors-001
   C:\Users\jenkins\workspace\Lucene-Solr-7.x-Windows\lucene\build\core\test\J1\temp\lucene.codecs.lucene50.TestLucene60FieldInfoFormat_4C19A03B72EF7DD1-001\justSoYouGetSomeChannelErrors-001\extra0: java.nio.file.AccessDeniedException: C:\Users\jenkins\workspace\Lucene-Solr-7.x-Windows\lucene\build\core\test\J1\temp\lucene.codecs.lucene50.TestLucene60FieldInfoFormat_4C19A03B72EF7DD1-001\justSoYouGetSomeChannelErrors-001\extra0
   C:\Users\jenkins\workspace\Lucene-Solr-7.x-Windows\lucene\build\core\test\J1\temp\lucene.codecs.lucene50.TestLucene60FieldInfoFormat_4C19A03B72EF7DD1-001: java.nio.file.DirectoryNotEmptyException: C:\Users\jenkins\workspace\Lucene-Solr-7.x-Windows\lucene\build\core\test\J1\temp\lucene.codecs.lucene50.TestLucene60FieldInfoFormat_4C19A03B72EF7DD1-001

	at __randomizedtesting.SeedInfo.seed([4C19A03B72EF7DD1]:0)
	at org.apache.lucene.util.IOUtils.rm(IOUtils.java:329)
	at org.apache.lucene.util.TestRuleTemporaryFilesCleanup.afterAlways(TestRuleTemporaryFilesCleanup.java:216)
	at com.carrotsearch.randomizedtesting.rules.TestRuleAdapter$1.afterAlways(TestRuleAdapter.java:31)
	at com.carrotsearch.randomizedtesting.rules.StatementAdapter.evaluate(StatementAdapter.java:43)
	at com.carrotsearch.randomizedtesting.rules.StatementAdapter.evaluate(StatementAdapter.java:36)
	at org.apache.lucene.util.TestRuleAssertionsRequired$1.evaluate(TestRuleAssertionsRequired.java:53)
	at org.apache.lucene.util.TestRuleMarkFailure$1.evaluate(TestRuleMarkFailure.java:47)
	at org.apache.lucene.util.TestRuleIgnoreAfterMaxFailures$1.evaluate(TestRuleIgnoreAfterMaxFailures.java:64)
	at org.apache.lucene.util.TestRuleIgnoreTestSuites$1.evaluate(TestRuleIgnoreTestSuites.java:54)
	at com.carrotsearch.randomizedtesting.rules.StatementAdapter.evaluate(StatementAdapter.java:36)
	at com.carrotsearch.randomizedtesting.ThreadLeakControl$StatementRunner.run(ThreadLeakControl.java:368)
	at java.base/java.lang.Thread.run(Thread.java:844)


FAILED:  junit.framework.TestSuite.org.apache.lucene.store.TestSimpleFSDirectory

Error Message:
Could not remove the following files (in the order of attempts):    C:\Users\jenkins\workspace\Lucene-Solr-7.x-Windows\lucene\build\core\test\J0\temp\lucene.store.TestSimpleFSDirectory_4C19A03B72EF7DD1-001\testInt-001: java.nio.file.AccessDeniedException: C:\Users\jenkins\workspace\Lucene-Solr-7.x-Windows\lucene\build\core\test\J0\temp\lucene.store.TestSimpleFSDirectory_4C19A03B72EF7DD1-001\testInt-001    C:\Users\jenkins\workspace\Lucene-Solr-7.x-Windows\lucene\build\core\test\J0\temp\lucene.store.TestSimpleFSDirectory_4C19A03B72EF7DD1-001: java.nio.file.DirectoryNotEmptyException: C:\Users\jenkins\workspace\Lucene-Solr-7.x-Windows\lucene\build\core\test\J0\temp\lucene.store.TestSimpleFSDirectory_4C19A03B72EF7DD1-001 

Stack Trace:
java.io.IOException: Could not remove the following files (in the order of attempts):
   C:\Users\jenkins\workspace\Lucene-Solr-7.x-Windows\lucene\build\core\test\J0\temp\lucene.store.TestSimpleFSDirectory_4C19A03B72EF7DD1-001\testInt-001: java.nio.file.AccessDeniedException: C:\Users\jenkins\workspace\Lucene-Solr-7.x-Windows\lucene\build\core\test\J0\temp\lucene.store.TestSimpleFSDirectory_4C19A03B72EF7DD1-001\testInt-001
   C:\Users\jenkins\workspace\Lucene-Solr-7.x-Windows\lucene\build\core\test\J0\temp\lucene.store.TestSimpleFSDirectory_4C19A03B72EF7DD1-001: java.nio.file.DirectoryNotEmptyException: C:\Users\jenkins\workspace\Lucene-Solr-7.x-Windows\lucene\build\core\test\J0\temp\lucene.store.TestSimpleFSDirectory_4C19A03B72EF7DD1-001

	at __randomizedtesting.SeedInfo.seed([4C19A03B72EF7DD1]:0)
	at org.apache.lucene.util.IOUtils.rm(IOUtils.java:329)
	at org.apache.lucene.util.TestRuleTemporaryFilesCleanup.afterAlways(TestRuleTemporaryFilesCleanup.java:216)
	at com.carrotsearch.randomizedtesting.rules.TestRuleAdapter$1.afterAlways(TestRuleAdapter.java:31)
	at com.carrotsearch.randomizedtesting.rules.StatementAdapter.evaluate(StatementAdapter.java:43)
	at com.carrotsearch.randomizedtesting.rules.StatementAdapter.evaluate(StatementAdapter.java:36)
	at org.apache.lucene.util.TestRuleAssertionsRequired$1.evaluate(TestRuleAssertionsRequired.java:53)
	at org.apache.lucene.util.TestRuleMarkFailure$1.evaluate(TestRuleMarkFailure.java:47)
	at org.apache.lucene.util.TestRuleIgnoreAfterMaxFailures$1.evaluate(TestRuleIgnoreAfterMaxFailures.java:64)
	at org.apache.lucene.util.TestRuleIgnoreTestSuites$1.evaluate(TestRuleIgnoreTestSuites.java:54)
	at com.carrotsearch.randomizedtesting.rules.StatementAdapter.evaluate(StatementAdapter.java:36)
	at com.carrotsearch.randomizedtesting.ThreadLeakControl$StatementRunner.run(ThreadLeakControl.java:368)
	at java.base/java.lang.Thread.run(Thread.java:844)


FAILED:  org.apache.lucene.replicator.IndexAndTaxonomyReplicationClientTest.testConsistencyOnExceptions

Error Message:
Captured an uncaught exception in thread: Thread[id=15, name=ReplicationThread-indexAndTaxo, state=RUNNABLE, group=TGRP-IndexAndTaxonomyReplicationClientTest]

Stack Trace:
com.carrotsearch.randomizedtesting.UncaughtExceptionError: Captured an uncaught exception in thread: Thread[id=15, name=ReplicationThread-indexAndTaxo, state=RUNNABLE, group=TGRP-IndexAndTaxonomyReplicationClientTest]
	at __randomizedtesting.SeedInfo.seed([FC233C06E863A7D8:73ADDBA6FA0F5427]:0)
Caused by: java.lang.AssertionError: handler failed too many times: -1
	at __randomizedtesting.SeedInfo.seed([FC233C06E863A7D8]:0)
	at org.apache.lucene.replicator.IndexAndTaxonomyReplicationClientTest$4.handleUpdateException(IndexAndTaxonomyReplicationClientTest.java:422)
	at org.apache.lucene.replicator.ReplicationClient$ReplicationThread.run(ReplicationClient.java:77)


FAILED:  junit.framework.TestSuite.org.apache.solr.update.processor.TestOpenNLPExtractNamedEntitiesUpdateProcessorFactory

Error Message:
Could not remove the following files (in the order of attempts):    C:\Users\jenkins\workspace\Lucene-Solr-7.x-Windows\solr\build\contrib\solr-analysis-extras\test\J0\temp\solr.update.processor.TestOpenNLPExtractNamedEntitiesUpdateProcessorFactory_56F702A965DD307C-001\tempDir-001\collection1\conf: java.nio.file.DirectoryNotEmptyException: C:\Users\jenkins\workspace\Lucene-Solr-7.x-Windows\solr\build\contrib\solr-analysis-extras\test\J0\temp\solr.update.processor.TestOpenNLPExtractNamedEntitiesUpdateProcessorFactory_56F702A965DD307C-001\tempDir-001\collection1\conf    C:\Users\jenkins\workspace\Lucene-Solr-7.x-Windows\solr\build\contrib\solr-analysis-extras\test\J0\temp\solr.update.processor.TestOpenNLPExtractNamedEntitiesUpdateProcessorFactory_56F702A965DD307C-001\tempDir-001\collection1: java.nio.file.DirectoryNotEmptyException: C:\Users\jenkins\workspace\Lucene-Solr-7.x-Windows\solr\build\contrib\solr-analysis-extras\test\J0\temp\solr.update.processor.TestOpenNLPExtractNamedEntitiesUpdateProcessorFactory_56F702A965DD307C-001\tempDir-001\collection1    C:\Users\jenkins\workspace\Lucene-Solr-7.x-Windows\solr\build\contrib\solr-analysis-extras\test\J0\temp\solr.update.processor.TestOpenNLPExtractNamedEntitiesUpdateProcessorFactory_56F702A965DD307C-001\tempDir-001: java.nio.file.DirectoryNotEmptyException: C:\Users\jenkins\workspace\Lucene-Solr-7.x-Windows\solr\build\contrib\solr-analysis-extras\test\J0\temp\solr.update.processor.TestOpenNLPExtractNamedEntitiesUpdateProcessorFactory_56F702A965DD307C-001\tempDir-001    C:\Users\jenkins\workspace\Lucene-Solr-7.x-Windows\solr\build\contrib\solr-analysis-extras\test\J0\temp\solr.update.processor.TestOpenNLPExtractNamedEntitiesUpdateProcessorFactory_56F702A965DD307C-001\tempDir-001\collection1\conf\en-test-tokenizer.bin: java.nio.file.AccessDeniedException: C:\Users\jenkins\workspace\Lucene-Solr-7.x-Windows\solr\build\contrib\solr-analysis-extras\test\J0\temp\solr.update.processor.TestOpenNLPExtractNamedEntitiesUpdateProcessorFactory_56F702A965DD307C-001\tempDir-001\collection1\conf\en-test-tokenizer.bin    C:\Users\jenkins\workspace\Lucene-Solr-7.x-Windows\solr\build\contrib\solr-analysis-extras\test\J0\temp\solr.update.processor.TestOpenNLPExtractNamedEntitiesUpdateProcessorFactory_56F702A965DD307C-001\tempDir-001\collection1\conf\en-test-sent.bin: java.nio.file.AccessDeniedException: C:\Users\jenkins\workspace\Lucene-Solr-7.x-Windows\solr\build\contrib\solr-analysis-extras\test\J0\temp\solr.update.processor.TestOpenNLPExtractNamedEntitiesUpdateProcessorFactory_56F702A965DD307C-001\tempDir-001\collection1\conf\en-test-sent.bin    C:\Users\jenkins\workspace\Lucene-Solr-7.x-Windows\solr\build\contrib\solr-analysis-extras\test\J0\temp\solr.update.processor.TestOpenNLPExtractNamedEntitiesUpdateProcessorFactory_56F702A965DD307C-001\tempDir-001\collection1\conf\en-test-ner-person.bin: java.nio.file.AccessDeniedException: C:\Users\jenkins\workspace\Lucene-Solr-7.x-Windows\solr\build\contrib\solr-analysis-extras\test\J0\temp\solr.update.processor.TestOpenNLPExtractNamedEntitiesUpdateProcessorFactory_56F702A965DD307C-001\tempDir-001\collection1\conf\en-test-ner-person.bin    C:\Users\jenkins\workspace\Lucene-Solr-7.x-Windows\solr\build\contrib\solr-analysis-extras\test\J0\temp\solr.update.processor.TestOpenNLPExtractNamedEntitiesUpdateProcessorFactory_56F702A965DD307C-001: java.nio.file.DirectoryNotEmptyException: C:\Users\jenkins\workspace\Lucene-Solr-7.x-Windows\solr\build\contrib\solr-analysis-extras\test\J0\temp\solr.update.processor.TestOpenNLPExtractNamedEntitiesUpdateProcessorFactory_56F702A965DD307C-001 

Stack Trace:
java.io.IOException: Could not remove the following files (in the order of attempts):
   C:\Users\jenkins\workspace\Lucene-Solr-7.x-Windows\solr\build\contrib\solr-analysis-extras\test\J0\temp\solr.update.processor.TestOpenNLPExtractNamedEntitiesUpdateProcessorFactory_56F702A965DD307C-001\tempDir-001\collection1\conf: java.nio.file.DirectoryNotEmptyException: C:\Users\jenkins\workspace\Lucene-Solr-7.x-Windows\solr\build\contrib\solr-analysis-extras\test\J0\temp\solr.update.processor.TestOpenNLPExtractNamedEntitiesUpdateProcessorFactory_56F702A965DD307C-001\tempDir-001\collection1\conf
   C:\Users\jenkins\workspace\Lucene-Solr-7.x-Windows\solr\build\contrib\solr-analysis-extras\test\J0\temp\solr.update.processor.TestOpenNLPExtractNamedEntitiesUpdateProcessorFactory_56F702A965DD307C-001\tempDir-001\collection1: java.nio.file.DirectoryNotEmptyException: C:\Users\jenkins\workspace\Lucene-Solr-7.x-Windows\solr\build\contrib\solr-analysis-extras\test\J0\temp\solr.update.processor.TestOpenNLPExtractNamedEntitiesUpdateProcessorFactory_56F702A965DD307C-001\tempDir-001\collection1
   C:\Users\jenkins\workspace\Lucene-Solr-7.x-Windows\solr\build\contrib\solr-analysis-extras\test\J0\temp\solr.update.processor.TestOpenNLPExtractNamedEntitiesUpdateProcessorFactory_56F702A965DD307C-001\tempDir-001: java.nio.file.DirectoryNotEmptyException: C:\Users\jenkins\workspace\Lucene-Solr-7.x-Windows\solr\build\contrib\solr-analysis-extras\test\J0\temp\solr.update.processor.TestOpenNLPExtractNamedEntitiesUpdateProcessorFactory_56F702A965DD307C-001\tempDir-001
   C:\Users\jenkins\workspace\Lucene-Solr-7.x-Windows\solr\build\contrib\solr-analysis-extras\test\J0\temp\solr.update.processor.TestOpenNLPExtractNamedEntitiesUpdateProcessorFactory_56F702A965DD307C-001\tempDir-001\collection1\conf\en-test-tokenizer.bin: java.nio.file.AccessDeniedException: C:\Users\jenkins\workspace\Lucene-Solr-7.x-Windows\solr\build\contrib\solr-analysis-extras\test\J0\temp\solr.update.processor.TestOpenNLPExtractNamedEntitiesUpdateProcessorFactory_56F702A965DD307C-001\tempDir-001\collection1\conf\en-test-tokenizer.bin
   C:\Users\jenkins\workspace\Lucene-Solr-7.x-Windows\solr\build\contrib\solr-analysis-extras\test\J0\temp\solr.update.processor.TestOpenNLPExtractNamedEntitiesUpdateProcessorFactory_56F702A965DD307C-001\tempDir-001\collection1\conf\en-test-sent.bin: java.nio.file.AccessDeniedException: C:\Users\jenkins\workspace\Lucene-Solr-7.x-Windows\solr\build\contrib\solr-analysis-extras\test\J0\temp\solr.update.processor.TestOpenNLPExtractNamedEntitiesUpdateProcessorFactory_56F702A965DD307C-001\tempDir-001\collection1\conf\en-test-sent.bin
   C:\Users\jenkins\workspace\Lucene-Solr-7.x-Windows\solr\build\contrib\solr-analysis-extras\test\J0\temp\solr.update.processor.TestOpenNLPExtractNamedEntitiesUpdateProcessorFactory_56F702A965DD307C-001\tempDir-001\collection1\conf\en-test-ner-person.bin: java.nio.file.AccessDeniedException: C:\Users\jenkins\workspace\Lucene-Solr-7.x-Windows\solr\build\contrib\solr-analysis-extras\test\J0\temp\solr.update.processor.TestOpenNLPExtractNamedEntitiesUpdateProcessorFactory_56F702A965DD307C-001\tempDir-001\collection1\conf\en-test-ner-person.bin
   C:\Users\jenkins\workspace\Lucene-Solr-7.x-Windows\solr\build\contrib\solr-analysis-extras\test\J0\temp\solr.update.processor.TestOpenNLPExtractNamedEntitiesUpdateProcessorFactory_56F702A965DD307C-001: java.nio.file.DirectoryNotEmptyException: C:\Users\jenkins\workspace\Lucene-Solr-7.x-Windows\solr\build\contrib\solr-analysis-extras\test\J0\temp\solr.update.processor.TestOpenNLPExtractNamedEntitiesUpdateProcessorFactory_56F702A965DD307C-001

	at __randomizedtesting.SeedInfo.seed([56F702A965DD307C]:0)
	at org.apache.lucene.util.IOUtils.rm(IOUtils.java:329)
	at org.apache.lucene.util.TestRuleTemporaryFilesCleanup.afterAlways(TestRuleTemporaryFilesCleanup.java:216)
	at com.carrotsearch.randomizedtesting.rules.TestRuleAdapter$1.afterAlways(TestRuleAdapter.java:31)
	at com.carrotsearch.randomizedtesting.rules.StatementAdapter.evaluate(StatementAdapter.java:43)
	at com.carrotsearch.randomizedtesting.rules.StatementAdapter.evaluate(StatementAdapter.java:36)
	at org.apache.lucene.util.TestRuleAssertionsRequired$1.evaluate(TestRuleAssertionsRequired.java:53)
	at org.apache.lucene.util.TestRuleMarkFailure$1.evaluate(TestRuleMarkFailure.java:47)
	at org.apache.lucene.util.TestRuleIgnoreAfterMaxFailures$1.evaluate(TestRuleIgnoreAfterMaxFailures.java:64)
	at org.apache.lucene.util.TestRuleIgnoreTestSuites$1.evaluate(TestRuleIgnoreTestSuites.java:54)
	at com.carrotsearch.randomizedtesting.rules.StatementAdapter.evaluate(StatementAdapter.java:36)
	at com.carrotsearch.randomizedtesting.ThreadLeakControl$StatementRunner.run(ThreadLeakControl.java:368)
	at java.base/java.lang.Thread.run(Thread.java:844)


FAILED:  org.apache.solr.cloud.autoscaling.ComputePlanActionTest.testNodeLost

Error Message:
org.apache.solr.common.SolrException: 

Stack Trace:
org.apache.solr.common.SolrException: org.apache.solr.common.SolrException: 
	at __randomizedtesting.SeedInfo.seed([CD3A0C682D81610A:722FC296AE6B048C]:0)
	at org.apache.solr.common.cloud.rule.ImplicitSnitch.getTags(ImplicitSnitch.java:77)
	at org.apache.solr.client.solrj.impl.SolrClientNodeStateProvider.getNodeValues(SolrClientNodeStateProvider.java:110)
	at org.apache.solr.cloud.autoscaling.ComputePlanActionTest.printState(ComputePlanActionTest.java:150)
	at java.base/jdk.internal.reflect.NativeMethodAccessorImpl.invoke0(Native Method)
	at java.base/jdk.internal.reflect.NativeMethodAccessorImpl.invoke(NativeMethodAccessorImpl.java:62)
	at java.base/jdk.internal.reflect.DelegatingMethodAccessorImpl.invoke(DelegatingMethodAccessorImpl.java:43)
	at java.base/java.lang.reflect.Method.invoke(Method.java:564)
	at com.carrotsearch.randomizedtesting.RandomizedRunner.invoke(RandomizedRunner.java:1737)
	at com.carrotsearch.randomizedtesting.RandomizedRunner$10.evaluate(RandomizedRunner.java:992)
	at com.carrotsearch.randomizedtesting.rules.SystemPropertiesRestoreRule$1.evaluate(SystemPropertiesRestoreRule.java:57)
	at org.apache.lucene.util.TestRuleSetupTeardownChained$1.evaluate(TestRuleSetupTeardownChained.java:49)
	at org.apache.lucene.util.AbstractBeforeAfterRule$1.evaluate(AbstractBeforeAfterRule.java:45)
	at org.apache.lucene.util.TestRuleThreadAndTestName$1.evaluate(TestRuleThreadAndTestName.java:48)
	at org.apache.lucene.util.TestRuleIgnoreAfterMaxFailures$1.evaluate(TestRuleIgnoreAfterMaxFailures.java:64)
	at org.apache.lucene.util.TestRuleMarkFailure$1.evaluate(TestRuleMarkFailure.java:47)
	at com.carrotsearch.randomizedtesting.rules.StatementAdapter.evaluate(StatementAdapter.java:36)
	at com.carrotsearch.randomizedtesting.ThreadLeakControl$StatementRunner.run(ThreadLeakControl.java:368)
	at com.carrotsearch.randomizedtesting.ThreadLeakControl.forkTimeoutingTask(ThreadLeakControl.java:817)
	at com.carrotsearch.randomizedtesting.ThreadLeakControl$3.evaluate(ThreadLeakControl.java:468)
	at com.carrotsearch.randomizedtesting.RandomizedRunner.runSingleTest(RandomizedRunner.java:943)
	at com.carrotsearch.randomizedtesting.RandomizedRunner$5.evaluate(RandomizedRunner.java:829)
	at com.carrotsearch.randomizedtesting.RandomizedRunner$6.evaluate(RandomizedRunner.java:879)
	at com.carrotsearch.randomizedtesting.RandomizedRunner$7.evaluate(RandomizedRunner.java:890)
	at com.carrotsearch.randomizedtesting.rules.StatementAdapter.evaluate(StatementAdapter.java:36)
	at com.carrotsearch.randomizedtesting.rules.SystemPropertiesRestoreRule$1.evaluate(SystemPropertiesRestoreRule.java:57)
	at org.apache.lucene.util.AbstractBeforeAfterRule$1.evaluate(AbstractBeforeAfterRule.java:45)
	at com.carrotsearch.randomizedtesting.rules.StatementAdapter.evaluate(StatementAdapter.java:36)
	at org.apache.lucene.util.TestRuleStoreClassName$1.evaluate(TestRuleStoreClassName.java:41)
	at com.carrotsearch.randomizedtesting.rules.NoShadowingOrOverridesOnMethodsRule$1.evaluate(NoShadowingOrOverridesOnMethodsRule.java:40)
	at com.carrotsearch.randomizedtesting.rules.NoShadowingOrOverridesOnMethodsRule$1.evaluate(NoShadowingOrOverridesOnMethodsRule.java:40)
	at com.carrotsearch.randomizedtesting.rules.StatementAdapter.evaluate(StatementAdapter.java:36)
	at com.carrotsearch.randomizedtesting.rules.StatementAdapter.evaluate(StatementAdapter.java:36)
	at org.apache.lucene.util.TestRuleAssertionsRequired$1.evaluate(TestRuleAssertionsRequired.java:53)
	at org.apache.lucene.util.TestRuleMarkFailure$1.evaluate(TestRuleMarkFailure.java:47)
	at org.apache.lucene.util.TestRuleIgnoreAfterMaxFailures$1.evaluate(TestRuleIgnoreAfterMaxFailures.java:64)
	at org.apache.lucene.util.TestRuleIgnoreTestSuites$1.evaluate(TestRuleIgnoreTestSuites.java:54)
	at com.carrotsearch.randomizedtesting.rules.StatementAdapter.evaluate(StatementAdapter.java:36)
	at com.carrotsearch.randomizedtesting.ThreadLeakControl$StatementRunner.run(ThreadLeakControl.java:368)
	at java.base/java.lang.Thread.run(Thread.java:844)
Caused by: org.apache.solr.common.SolrException: 
	at org.apache.solr.client.solrj.impl.SolrClientNodeStateProvider$AutoScalingSnitch.getRemoteInfo(SolrClientNodeStateProvider.java:229)
	at org.apache.solr.common.cloud.rule.ImplicitSnitch.getTags(ImplicitSnitch.java:75)
	... 38 more
Caused by: org.apache.solr.client.solrj.SolrServerException: Server refused connection at: http://127.0.0.1:49704/solr
	at org.apache.solr.client.solrj.impl.HttpSolrClient.executeMethod(HttpSolrClient.java:650)
	at org.apache.solr.client.solrj.impl.HttpSolrClient.request(HttpSolrClient.java:255)
	at org.apache.solr.client.solrj.impl.HttpSolrClient.request(HttpSolrClient.java:244)
	at org.apache.solr.client.solrj.SolrClient.request(SolrClient.java:1219)
	at org.apache.solr.client.solrj.impl.SolrClientNodeStateProvider$ClientSnitchCtx.invoke(SolrClientNodeStateProvider.java:271)
	at org.apache.solr.client.solrj.impl.SolrClientNodeStateProvider$AutoScalingSnitch.getRemoteInfo(SolrClientNodeStateProvider.java:206)
	... 39 more
Caused by: org.apache.http.conn.HttpHostConnectException: Connect to 127.0.0.1:49704 [/127.0.0.1] failed: Connection refused: connect
	at org.apache.http.impl.conn.DefaultHttpClientConnectionOperator.connect(DefaultHttpClientConnectionOperator.java:159)
	at org.apache.http.impl.conn.PoolingHttpClientConnectionManager.connect(PoolingHttpClientConnectionManager.java:359)
	at org.apache.http.impl.execchain.MainClientExec.establishRoute(MainClientExec.java:381)
	at org.apache.http.impl.execchain.MainClientExec.execute(MainClientExec.java:237)
	at org.apache.http.impl.execchain.ProtocolExec.execute(ProtocolExec.java:185)
	at org.apache.http.impl.execchain.RetryExec.execute(RetryExec.java:89)
	at org.apache.http.impl.execchain.RedirectExec.execute(RedirectExec.java:111)
	at org.apache.http.impl.client.InternalHttpClient.doExecute(InternalHttpClient.java:185)
	at org.apache.http.impl.client.CloseableHttpClient.execute(CloseableHttpClient.java:83)
	at org.apache.http.impl.client.CloseableHttpClient.execute(CloseableHttpClient.java:56)
	at org.apache.solr.client.solrj.impl.HttpSolrClient.executeMethod(HttpSolrClient.java:542)
	... 44 more
Caused by: java.net.ConnectException: Connection refused: connect
	at java.base/java.net.DualStackPlainSocketImpl.waitForConnect(Native Method)
	at java.base/java.net.DualStackPlainSocketImpl.socketConnect(DualStackPlainSocketImpl.java:85)
	at java.base/java.net.AbstractPlainSocketImpl.doConnect(AbstractPlainSocketImpl.java:400)
	at java.base/java.net.AbstractPlainSocketImpl.connectToAddress(AbstractPlainSocketImpl.java:243)
	at java.base/java.net.AbstractPlainSocketImpl.connect(AbstractPlainSocketImpl.java:225)
	at java.base/java.net.PlainSocketImpl.connect(PlainSocketImpl.java:148)
	at java.base/java.net.SocksSocketImpl.connect(SocksSocketImpl.java:402)
	at java.base/java.net.Socket.connect(Socket.java:591)
	at org.apache.http.conn.socket.PlainConnectionSocketFactory.connectSocket(PlainConnectionSocketFactory.java:75)
	at org.apache.http.impl.conn.DefaultHttpClientConnectionOperator.connect(DefaultHttpClientConnectionOperator.java:142)
	... 54 more


FAILED:  junit.framework.TestSuite.org.apache.solr.client.solrj.io.graph.GraphTest

Error Message:
Could not remove the following files (in the order of attempts):    C:\Users\jenkins\workspace\Lucene-Solr-7.x-Windows\solr\build\solr-solrj\test\J0\temp\solr.client.solrj.io.graph.GraphTest_781EAD5C035E93E5-001\tempDir-001\node1\collection1_shard2_replica_n2\data\tlog: java.nio.file.DirectoryNotEmptyException: C:\Users\jenkins\workspace\Lucene-Solr-7.x-Windows\solr\build\solr-solrj\test\J0\temp\solr.client.solrj.io.graph.GraphTest_781EAD5C035E93E5-001\tempDir-001\node1\collection1_shard2_replica_n2\data\tlog    C:\Users\jenkins\workspace\Lucene-Solr-7.x-Windows\solr\build\solr-solrj\test\J0\temp\solr.client.solrj.io.graph.GraphTest_781EAD5C035E93E5-001\tempDir-001\node1\collection1_shard2_replica_n2\data: java.nio.file.DirectoryNotEmptyException: C:\Users\jenkins\workspace\Lucene-Solr-7.x-Windows\solr\build\solr-solrj\test\J0\temp\solr.client.solrj.io.graph.GraphTest_781EAD5C035E93E5-001\tempDir-001\node1\collection1_shard2_replica_n2\data    C:\Users\jenkins\workspace\Lucene-Solr-7.x-Windows\solr\build\solr-solrj\test\J0\temp\solr.client.solrj.io.graph.GraphTest_781EAD5C035E93E5-001\tempDir-001\node1\collection1_shard2_replica_n2: java.nio.file.DirectoryNotEmptyException: C:\Users\jenkins\workspace\Lucene-Solr-7.x-Windows\solr\build\solr-solrj\test\J0\temp\solr.client.solrj.io.graph.GraphTest_781EAD5C035E93E5-001\tempDir-001\node1\collection1_shard2_replica_n2    C:\Users\jenkins\workspace\Lucene-Solr-7.x-Windows\solr\build\solr-solrj\test\J0\temp\solr.client.solrj.io.graph.GraphTest_781EAD5C035E93E5-001\tempDir-001\node1: java.nio.file.DirectoryNotEmptyException: C:\Users\jenkins\workspace\Lucene-Solr-7.x-Windows\solr\build\solr-solrj\test\J0\temp\solr.client.solrj.io.graph.GraphTest_781EAD5C035E93E5-001\tempDir-001\node1    C:\Users\jenkins\workspace\Lucene-Solr-7.x-Windows\solr\build\solr-solrj\test\J0\temp\solr.client.solrj.io.graph.GraphTest_781EAD5C035E93E5-001\tempDir-001: java.nio.file.DirectoryNotEmptyException: C:\Users\jenkins\workspace\Lucene-Solr-7.x-Windows\solr\build\solr-solrj\test\J0\temp\solr.client.solrj.io.graph.GraphTest_781EAD5C035E93E5-001\tempDir-001    C:\Users\jenkins\workspace\Lucene-Solr-7.x-Windows\solr\build\solr-solrj\test\J0\temp\solr.client.solrj.io.graph.GraphTest_781EAD5C035E93E5-001\tempDir-001\node1\collection1_shard2_replica_n2\data\tlog\tlog.0000000000000000001: java.nio.file.AccessDeniedException: C:\Users\jenkins\workspace\Lucene-Solr-7.x-Windows\solr\build\solr-solrj\test\J0\temp\solr.client.solrj.io.graph.GraphTest_781EAD5C035E93E5-001\tempDir-001\node1\collection1_shard2_replica_n2\data\tlog\tlog.0000000000000000001    C:\Users\jenkins\workspace\Lucene-Solr-7.x-Windows\solr\build\solr-solrj\test\J0\temp\solr.client.solrj.io.graph.GraphTest_781EAD5C035E93E5-001: java.nio.file.DirectoryNotEmptyException: C:\Users\jenkins\workspace\Lucene-Solr-7.x-Windows\solr\build\solr-solrj\test\J0\temp\solr.client.solrj.io.graph.GraphTest_781EAD5C035E93E5-001 

Stack Trace:
java.io.IOException: Could not remove the following files (in the order of attempts):
   C:\Users\jenkins\workspace\Lucene-Solr-7.x-Windows\solr\build\solr-solrj\test\J0\temp\solr.client.solrj.io.graph.GraphTest_781EAD5C035E93E5-001\tempDir-001\node1\collection1_shard2_replica_n2\data\tlog: java.nio.file.DirectoryNotEmptyException: C:\Users\jenkins\workspace\Lucene-Solr-7.x-Windows\solr\build\solr-solrj\test\J0\temp\solr.client.solrj.io.graph.GraphTest_781EAD5C035E93E5-001\tempDir-001\node1\collection1_shard2_replica_n2\data\tlog
   C:\Users\jenkins\workspace\Lucene-Solr-7.x-Windows\solr\build\solr-solrj\test\J0\temp\solr.client.solrj.io.graph.GraphTest_781EAD5C035E93E5-001\tempDir-001\node1\collection1_shard2_replica_n2\data: java.nio.file.DirectoryNotEmptyException: C:\Users\jenkins\workspace\Lucene-Solr-7.x-Windows\solr\build\solr-solrj\test\J0\temp\solr.client.solrj.io.graph.GraphTest_781EAD5C035E93E5-001\tempDir-001\node1\collection1_shard2_replica_n2\data
   C:\Users\jenkins\workspace\Lucene-Solr-7.x-Windows\solr\build\solr-solrj\test\J0\temp\solr.client.solrj.io.graph.GraphTest_781EAD5C035E93E5-001\tempDir-001\node1\collection1_shard2_replica_n2: java.nio.file.DirectoryNotEmptyException: C:\Users\jenkins\workspace\Lucene-Solr-7.x-Windows\solr\build\solr-solrj\test\J0\temp\solr.client.solrj.io.graph.GraphTest_781EAD5C035E93E5-001\tempDir-001\node1\collection1_shard2_replica_n2
   C:\Users\jenkins\workspace\Lucene-Solr-7.x-Windows\solr\build\solr-solrj\test\J0\temp\solr.client.solrj.io.graph.GraphTest_781EAD5C035E93E5-001\tempDir-001\node1: java.nio.file.DirectoryNotEmptyException: C:\Users\jenkins\workspace\Lucene-Solr-7.x-Windows\solr\build\solr-solrj\test\J0\temp\solr.client.solrj.io.graph.GraphTest_781EAD5C035E93E5-001\tempDir-001\node1
   C:\Users\jenkins\workspace\Lucene-Solr-7.x-Windows\solr\build\solr-solrj\test\J0\temp\solr.client.solrj.io.graph.GraphTest_781EAD5C035E93E5-001\tempDir-001: java.nio.file.DirectoryNotEmptyException: C:\Users\jenkins\workspace\Lucene-Solr-7.x-Windows\solr\build\solr-solrj\test\J0\temp\solr.client.solrj.io.graph.GraphTest_781EAD5C035E93E5-001\tempDir-001
   C:\Users\jenkins\workspace\Lucene-Solr-7.x-Windows\solr\build\solr-solrj\test\J0\temp\solr.client.solrj.io.graph.GraphTest_781EAD5C035E93E5-001\tempDir-001\node1\collection1_shard2_replica_n2\data\tlog\tlog.0000000000000000001: java.nio.file.AccessDeniedException: C:\Users\jenkins\workspace\Lucene-Solr-7.x-Windows\solr\build\solr-solrj\test\J0\temp\solr.client.solrj.io.graph.GraphTest_781EAD5C035E93E5-001\tempDir-001\node1\collection1_shard2_replica_n2\data\tlog\tlog.0000000000000000001
   C:\Users\jenkins\workspace\Lucene-Solr-7.x-Windows\solr\build\solr-solrj\test\J0\temp\solr.client.solrj.io.graph.GraphTest_781EAD5C035E93E5-001: java.nio.file.DirectoryNotEmptyException: C:\Users\jenkins\workspace\Lucene-Solr-7.x-Windows\solr\build\solr-solrj\test\J0\temp\solr.client.solrj.io.graph.GraphTest_781EAD5C035E93E5-001

	at __randomizedtesting.SeedInfo.seed([781EAD5C035E93E5]:0)
	at org.apache.lucene.util.IOUtils.rm(IOUtils.java:329)
	at org.apache.lucene.util.TestRuleTemporaryFilesCleanup.afterAlways(TestRuleTemporaryFilesCleanup.java:216)
	at com.carrotsearch.randomizedtesting.rules.TestRuleAdapter$1.afterAlways(TestRuleAdapter.java:31)
	at com.carrotsearch.randomizedtesting.rules.StatementAdapter.evaluate(StatementAdapter.java:43)
	at com.carrotsearch.randomizedtesting.rules.StatementAdapter.evaluate(StatementAdapter.java:36)
	at org.apache.lucene.util.TestRuleAssertionsRequired$1.evaluate(TestRuleAssertionsRequired.java:53)
	at org.apache.lucene.util.TestRuleMarkFailure$1.evaluate(TestRuleMarkFailure.java:47)
	at org.apache.lucene.util.TestRuleIgnoreAfterMaxFailures$1.evaluate(TestRuleIgnoreAfterMaxFailures.java:64)
	at org.apache.lucene.util.TestRuleIgnoreTestSuites$1.evaluate(TestRuleIgnoreTestSuites.java:54)
	at com.carrotsearch.randomizedtesting.rules.StatementAdapter.evaluate(StatementAdapter.java:36)
	at com.carrotsearch.randomizedtesting.ThreadLeakControl$StatementRunner.run(ThreadLeakControl.java:368)
	at java.base/java.lang.Thread.run(Thread.java:844)




Build Log:
[...truncated 301 lines...]
   [junit4] Suite: org.apache.lucene.store.TestSimpleFSDirectory
   [junit4]   2> NOTE: test params are: codec=Asserting(Lucene70): {}, docValues:{}, maxPointsInLeafNode=1996, maxMBSortInHeap=5.240148990141794, sim=RandomSimilarity(queryNorm=false): {}, locale=fur-IT, timezone=Asia/Hong_Kong
   [junit4]   2> NOTE: Windows 10 10.0 amd64/Oracle Corporation 9.0.1 (64-bit)/cpus=3,threads=1,free=130672016,total=191889408
   [junit4]   2> NOTE: All tests run in this JVM: [TestWordlistLoader, TestMergePolicyWrapper, TestAllFilesHaveCodecHeader, TestPhrasePrefixQuery, TestRegExp, TestPrefixRandom, TestSearch, TestStringHelper, TestMixedCodecs, TestIntRangeFieldQueries, TestLongBitSet, TestBagOfPostings, TestBinaryDocValuesUpdates, TestForceMergeForever, TestApproximationSearchEquivalence, TestSimpleFSDirectory]
   [junit4]   2> NOTE: reproduce with: ant test  -Dtestcase=TestSimpleFSDirectory -Dtests.seed=4C19A03B72EF7DD1 -Dtests.slow=true -Dtests.locale=fur-IT -Dtests.timezone=Asia/Hong_Kong -Dtests.asserts=true -Dtests.file.encoding=UTF-8
   [junit4] ERROR   0.00s J0 | TestSimpleFSDirectory (suite) <<<
   [junit4]    > Throwable #1: java.io.IOException: Could not remove the following files (in the order of attempts):
   [junit4]    >    C:\Users\jenkins\workspace\Lucene-Solr-7.x-Windows\lucene\build\core\test\J0\temp\lucene.store.TestSimpleFSDirectory_4C19A03B72EF7DD1-001\testInt-001: java.nio.file.AccessDeniedException: C:\Users\jenkins\workspace\Lucene-Solr-7.x-Windows\lucene\build\core\test\J0\temp\lucene.store.TestSimpleFSDirectory_4C19A03B72EF7DD1-001\testInt-001
   [junit4]    >    C:\Users\jenkins\workspace\Lucene-Solr-7.x-Windows\lucene\build\core\test\J0\temp\lucene.store.TestSimpleFSDirectory_4C19A03B72EF7DD1-001: java.nio.file.DirectoryNotEmptyException: C:\Users\jenkins\workspace\Lucene-Solr-7.x-Windows\lucene\build\core\test\J0\temp\lucene.store.TestSimpleFSDirectory_4C19A03B72EF7DD1-001
   [junit4]    > 	at __randomizedtesting.SeedInfo.seed([4C19A03B72EF7DD1]:0)
   [junit4]    > 	at org.apache.lucene.util.IOUtils.rm(IOUtils.java:329)
   [junit4]    > 	at java.base/java.lang.Thread.run(Thread.java:844)
   [junit4] Completed [26/458 (1!)] on J0 in 1.40s, 42 tests, 1 error <<< FAILURES!

[...truncated 1116 lines...]
   [junit4] Suite: org.apache.lucene.codecs.lucene50.TestLucene60FieldInfoFormat
   [junit4]   2> NOTE: test params are: codec=Asserting(Lucene70): {}, docValues:{}, maxPointsInLeafNode=611, maxMBSortInHeap=7.606939594448162, sim=RandomSimilarity(queryNorm=true): {}, locale=sw-UG, timezone=America/Guadeloupe
   [junit4]   2> NOTE: Windows 10 10.0 amd64/Oracle Corporation 9.0.1 (64-bit)/cpus=3,threads=1,free=111850504,total=300941312
   [junit4]   2> NOTE: All tests run in this JVM: [TestBoolean2, TestPrefixInBooleanQuery, TestCompiledAutomaton, TestTermVectors, TestNearSpansOrdered, LimitedFiniteStringsIteratorTest, TestIndexCommit, TestWeakIdentityMap, TestBytesRefAttImpl, TestSpanBoostQuery, TestTermsEnum, TestByteBlockPool, TestAllFilesCheckIndexHeader, TestTotalHitCountCollector, TestTragicIndexWriterDeadlock, TestNRTThreads, TestStopFilter, TestNoMergeScheduler, TestUniqueTermCount, TestIndexedDISI, TestNIOFSDirectory, TestSmallFloat, TestRollingUpdates, TestDocValuesQueries, TestStringMSBRadixSorter, TestPerFieldPostingsFormat, TestMultiLevelSkipList, TestIndexWriterLockRelease, TestVersion, TestPayloads, TestDocValuesScoring, TestBooleanRewrites, TestDoubleRangeFieldQueries, TestCheckIndex, TestLongPostings, TestClassicSimilarity, TestDateTools, Test2BPostingsBytes, TestTermVectorsWriter, TestNeedsScores, TestNoDeletionPolicy, TestSetOnce, TestAutomatonQuery, TestLSBRadixSorter, TestNumericDocValuesUpdates, TestIntsRef, TestReadOnlyIndex, TestReqExclBulkScorer, TestPerSegmentDeletes, TestCachingCollector, TestOmitNorms, TestIndexTooManyDocs, TestWildcard, Test2BPagedBytes, TestParallelTermEnum, TestDocIdsWriter, TestFuzzyQuery, TestRollback, TestDocIDMerger, TermInSetQueryTest, TestIndexWriterOutOfFileDescriptors, TestForTooMuchCloning, TestDelegatingAnalyzerWrapper, TestShardSearching, Test2BBinaryDocValues, TestStressIndexing, TestFieldValueQuery, TestNumericUtils, TestSimpleSearchEquivalence, TestStressNRT, TestIndexWriterReader, TestEarlyTerminatingSortingCollector, TestReaderClosed, TestStressIndexing2, TestFieldMaskingSpanQuery, TestIndexReaderClose, TestSegmentTermDocs, TestUpgradeIndexMergePolicy, TestFieldReuse, TestSpanMultiTermQueryWrapper, TestMultiFields, TestTransactionRollback, TestMultiPhraseQuery, TestBasics, TestBooleanScorer, Test2BBKDPoints, TestNGramPhraseQuery, TestMinShouldMatch2, TestLucene50StoredFieldsFormatHighCompression, TestIndexWriterDelete, TestStressDeletes, TestSpanFirstQuery, TestPhraseQuery, TestPolygon2D, TestBlockPostingsFormat, TestConstantScoreQuery, TestGraphTokenizers, TestMergeSchedulerExternal, TestSortedSetSortField, TestPersistentSnapshotDeletionPolicy, TestLucene50CompoundFormat, TestIndexWriterOnJRECrash, TestSpanContainQuery, TestNRTReaderWithThreads, TestConjunctionDISI, TestMultiTermQueryRewrites, TestByteSlices, TestFilterDirectoryReader, TestBlendedTermQuery, TestDuelingCodecsAtNight, TestStressAdvance, TestMultiDocValues, TestIndexWriterConfig, TestTermVectorsReader, TestMultiMMap, TestSearcherManager, TestDeletionPolicy, TestNorms, TestIndexWriterCommit, TestSearchAfter, TestConcurrentMergeScheduler, TestMinimize, TestIndexWriterUnicode, TestBufferedIndexInput, TestSimpleExplanations, TestDirectoryReader, TestFixedBitSet, TestRegexpRandom2, TestNRTCachingDirectory, TestFastDecompressionMode, TestIndexWriterNRTIsCurrent, TestFieldCacheRewriteMethod, TestPagedBytes, TestTransactions, TestCrash, TestPerFieldPostingsFormat2, TestToken, TestFieldsReader, TestCustomSearcherSort, TestDocValuesIndexing, TestSimilarityBase, TestBooleanMinShouldMatch, TestTermsEnum2, Test2BDocs, TestIndexWriterOnDiskFull, TestSpans, TestCustomNorms, TestPostingsOffsets, TestFlex, TestFastCompressionMode, TestLazyProxSkipping, TestDeterminism, TestCharTermAttributeImpl, TestParallelLeafReader, TestBytesRefHash, TestSloppyPhraseQuery2, TestDisjunctionMaxQuery, TestOmitTf, TestTermRangeQuery, TestDocumentWriter, TestCrashCausesCorruptIndex, TestMultiTermConstantScore, TestDoc, TestExternalCodecs, TestRegexpQuery, TestSegmentTermEnum, TestComplexExplanationsOfNonMatches, TestPrefixCodedTerms, TestDocument, TestTermScorer, TestFileSwitchDirectory, TestDirectory, TestSizeBoundedForceMerge, TestBinaryTerms, TestConjunctions, TestField, TestSimilarity, TestRollingBuffer, TestCharsRef, Test2BPostings, TestBinaryDocument, TestRecyclingByteBlockAllocator, TestBytesRef, TestAssertions, TestNot, MultiCollectorTest, TestSimpleAttributeImpl, Test2BPositions, TestPositiveScoresOnlyCollector, TestNewestSegment, Test2BNumericDocValues, TestForUtil, TestLucene50StoredFieldsFormat, TestLucene60FieldInfoFormat]
   [junit4]   2> NOTE: reproduce with: ant test  -Dtestcase=TestLucene60FieldInfoFormat -Dtests.seed=4C19A03B72EF7DD1 -Dtests.slow=true -Dtests.locale=sw-UG -Dtests.timezone=America/Guadeloupe -Dtests.asserts=true -Dtests.file.encoding=UTF-8
   [junit4] ERROR   0.00s J1 | TestLucene60FieldInfoFormat (suite) <<<
   [junit4]    > Throwable #1: java.io.IOException: Could not remove the following files (in the order of attempts):
   [junit4]    >    C:\Users\jenkins\workspace\Lucene-Solr-7.x-Windows\lucene\build\core\test\J1\temp\lucene.codecs.lucene50.TestLucene60FieldInfoFormat_4C19A03B72EF7DD1-001\justSoYouGetSomeChannelErrors-001: java.nio.file.DirectoryNotEmptyException: C:\Users\jenkins\workspace\Lucene-Solr-7.x-Windows\lucene\build\core\test\J1\temp\lucene.codecs.lucene50.TestLucene60FieldInfoFormat_4C19A03B72EF7DD1-001\justSoYouGetSomeChannelErrors-001
   [junit4]    >    C:\Users\jenkins\workspace\Lucene-Solr-7.x-Windows\lucene\build\core\test\J1\temp\lucene.codecs.lucene50.TestLucene60FieldInfoFormat_4C19A03B72EF7DD1-001\justSoYouGetSomeChannelErrors-001\extra0: java.nio.file.AccessDeniedException: C:\Users\jenkins\workspace\Lucene-Solr-7.x-Windows\lucene\build\core\test\J1\temp\lucene.codecs.lucene50.TestLucene60FieldInfoFormat_4C19A03B72EF7DD1-001\justSoYouGetSomeChannelErrors-001\extra0
   [junit4]    >    C:\Users\jenkins\workspace\Lucene-Solr-7.x-Windows\lucene\build\core\test\J1\temp\lucene.codecs.lucene50.TestLucene60FieldInfoFormat_4C19A03B72EF7DD1-001: java.nio.file.DirectoryNotEmptyException: C:\Users\jenkins\workspace\Lucene-Solr-7.x-Windows\lucene\build\core\test\J1\temp\lucene.codecs.lucene50.TestLucene60FieldInfoFormat_4C19A03B72EF7DD1-001
   [junit4]    > 	at __randomizedtesting.SeedInfo.seed([4C19A03B72EF7DD1]:0)
   [junit4]    > 	at org.apache.lucene.util.IOUtils.rm(IOUtils.java:329)
   [junit4]    > 	at java.base/java.lang.Thread.run(Thread.java:844)
   [junit4] Completed [365/458 (2!)] on J1 in 0.25s, 11 tests, 1 error <<< FAILURES!

[...truncated 7476 lines...]
   [junit4] Suite: org.apache.lucene.replicator.IndexAndTaxonomyReplicationClientTest
   [junit4]   2> des 15, 2017 6:09:07 PM com.carrotsearch.randomizedtesting.RandomizedRunner$QueueUncaughtExceptionsHandler uncaughtException
   [junit4]   2> WARNING: Uncaught exception in thread: Thread[ReplicationThread-indexAndTaxo,5,TGRP-IndexAndTaxonomyReplicationClientTest]
   [junit4]   2> java.lang.AssertionError: handler failed too many times: -1
   [junit4]   2> 	at __randomizedtesting.SeedInfo.seed([FC233C06E863A7D8]:0)
   [junit4]   2> 	at org.apache.lucene.replicator.IndexAndTaxonomyReplicationClientTest$4.handleUpdateException(IndexAndTaxonomyReplicationClientTest.java:422)
   [junit4]   2> 	at org.apache.lucene.replicator.ReplicationClient$ReplicationThread.run(ReplicationClient.java:77)
   [junit4]   2> 
   [junit4]   2> NOTE: reproduce with: ant test  -Dtestcase=IndexAndTaxonomyReplicationClientTest -Dtests.method=testConsistencyOnExceptions -Dtests.seed=FC233C06E863A7D8 -Dtests.slow=true -Dtests.locale=bm-ML -Dtests.timezone=Etc/Zulu -Dtests.asserts=true -Dtests.file.encoding=ISO-8859-1
   [junit4] ERROR   2.06s J0 | IndexAndTaxonomyReplicationClientTest.testConsistencyOnExceptions <<<
   [junit4]    > Throwable #1: com.carrotsearch.randomizedtesting.UncaughtExceptionError: Captured an uncaught exception in thread: Thread[id=15, name=ReplicationThread-indexAndTaxo, state=RUNNABLE, group=TGRP-IndexAndTaxonomyReplicationClientTest]
   [junit4]    > 	at __randomizedtesting.SeedInfo.seed([FC233C06E863A7D8:73ADDBA6FA0F5427]:0)
   [junit4]    > Caused by: java.lang.AssertionError: handler failed too many times: -1
   [junit4]    > 	at __randomizedtesting.SeedInfo.seed([FC233C06E863A7D8]:0)
   [junit4]    > 	at org.apache.lucene.replicator.IndexAndTaxonomyReplicationClientTest$4.handleUpdateException(IndexAndTaxonomyReplicationClientTest.java:422)
   [junit4]    > 	at org.apache.lucene.replicator.ReplicationClient$ReplicationThread.run(ReplicationClient.java:77)
   [junit4]   2> NOTE: test params are: codec=Asserting(Lucene70): {$full_path$=PostingsFormat(name=Memory), $facets=PostingsFormat(name=Memory), $payloads$=PostingsFormat(name=Memory)}, docValues:{$facets=DocValuesFormat(name=Lucene70)}, maxPointsInLeafNode=261, maxMBSortInHeap=5.034594548863234, sim=RandomSimilarity(queryNorm=true): {}, locale=bm-ML, timezone=Etc/Zulu
   [junit4]   2> NOTE: Windows 10 10.0 amd64/Oracle Corporation 9.0.1 (64-bit)/cpus=3,threads=1,free=78471024,total=121634816
   [junit4]   2> NOTE: All tests run in this JVM: [IndexAndTaxonomyReplicationClientTest]
   [junit4] Completed [1/9 (1!)] on J0 in 4.22s, 5 tests, 1 error <<< FAILURES!

[...truncated 4763 lines...]
   [junit4] Suite: org.apache.solr.cloud.autoscaling.ComputePlanActionTest
   [junit4]   2> 2715492 INFO  (SUITE-ComputePlanActionTest-seed#[CD3A0C682D81610A]-worker) [    ] o.a.s.SolrTestCaseJ4 SecureRandom sanity checks: test.solr.allowed.securerandom=null & java.security.egd=file:/dev/./urandom
   [junit4]   2> Creating dataDir: C:\Users\jenkins\workspace\Lucene-Solr-7.x-Windows\solr\build\solr-core\test\J1\temp\solr.cloud.autoscaling.ComputePlanActionTest_CD3A0C682D81610A-001\init-core-data-001
   [junit4]   2> 2715494 WARN  (SUITE-ComputePlanActionTest-seed#[CD3A0C682D81610A]-worker) [    ] o.a.s.SolrTestCaseJ4 startTrackingSearchers: numOpens=7 numCloses=7
   [junit4]   2> 2715494 INFO  (SUITE-ComputePlanActionTest-seed#[CD3A0C682D81610A]-worker) [    ] o.a.s.SolrTestCaseJ4 Using TrieFields (NUMERIC_POINTS_SYSPROP=false) w/NUMERIC_DOCVALUES_SYSPROP=true
   [junit4]   2> 2715495 INFO  (SUITE-ComputePlanActionTest-seed#[CD3A0C682D81610A]-worker) [    ] o.a.s.SolrTestCaseJ4 Randomized ssl (false) and clientAuth (false) via: @org.apache.solr.util.RandomizeSSL(reason="", value=0.0/0.0, ssl=0.0/0.0, clientAuth=0.0/0.0)
   [junit4]   2> 2715495 INFO  (SUITE-ComputePlanActionTest-seed#[CD3A0C682D81610A]-worker) [    ] o.a.s.c.MiniSolrCloudCluster Starting cluster of 1 servers in C:\Users\jenkins\workspace\Lucene-Solr-7.x-Windows\solr\build\solr-core\test\J1\temp\solr.cloud.autoscaling.ComputePlanActionTest_CD3A0C682D81610A-001\tempDir-001
   [junit4]   2> 2715496 INFO  (SUITE-ComputePlanActionTest-seed#[CD3A0C682D81610A]-worker) [    ] o.a.s.c.ZkTestServer STARTING ZK TEST SERVER
   [junit4]   2> 2715496 INFO  (Thread-5180) [    ] o.a.s.c.ZkTestServer client port:0.0.0.0/0.0.0.0:0
   [junit4]   2> 2715496 INFO  (Thread-5180) [    ] o.a.s.c.ZkTestServer Starting server
   [junit4]   2> 2715501 ERROR (Thread-5180) [    ] o.a.z.s.ZooKeeperServer ZKShutdownHandler is not registered, so ZooKeeper server won't take any action on ERROR or SHUTDOWN server state changes
   [junit4]   2> 2715597 INFO  (SUITE-ComputePlanActionTest-seed#[CD3A0C682D81610A]-worker) [    ] o.a.s.c.ZkTestServer start zk server on port:49563
   [junit4]   2> 2715600 INFO  (zkConnectionManagerCallback-8500-thread-1) [    ] o.a.s.c.c.ConnectionManager zkClient has connected
   [junit4]   2> 2715605 INFO  (jetty-launcher-8497-thread-1) [    ] o.e.j.s.Server jetty-9.3.20.v20170531
   [junit4]   2> 2715606 INFO  (jetty-launcher-8497-thread-1) [    ] o.e.j.s.h.ContextHandler Started o.e.j.s.ServletContextHandler@d7151c0{/solr,null,AVAILABLE}
   [junit4]   2> 2715608 INFO  (jetty-launcher-8497-thread-1) [    ] o.e.j.s.AbstractConnector Started ServerConnector@3801e6bf{HTTP/1.1,[http/1.1]}{127.0.0.1:49567}
   [junit4]   2> 2715608 INFO  (jetty-launcher-8497-thread-1) [    ] o.e.j.s.Server Started @2725487ms
   [junit4]   2> 2715608 INFO  (jetty-launcher-8497-thread-1) [    ] o.a.s.c.s.e.JettySolrRunner Jetty properties: {hostContext=/solr, hostPort=49567}
   [junit4]   2> 2715608 ERROR (jetty-launcher-8497-thread-1) [    ] o.a.s.u.StartupLoggingUtils Missing Java Option solr.log.dir. Logging may be missing or incomplete.
   [junit4]   2> 2715608 INFO  (jetty-launcher-8497-thread-1) [    ] o.a.s.s.SolrDispatchFilter  ___      _       Welcome to Apache Solr? version 7.3.0
   [junit4]   2> 2715608 INFO  (jetty-launcher-8497-thread-1) [    ] o.a.s.s.SolrDispatchFilter / __| ___| |_ _   Starting in cloud mode on port null
   [junit4]   2> 2715608 INFO  (jetty-launcher-8497-thread-1) [    ] o.a.s.s.SolrDispatchFilter \__ \/ _ \ | '_|  Install dir: null
   [junit4]   2> 2715608 INFO  (jetty-launcher-8497-thread-1) [    ] o.a.s.s.SolrDispatchFilter |___/\___/_|_|    Start time: 2017-12-15T18:57:25.427943Z
   [junit4]   2> 2715613 INFO  (zkConnectionManagerCallback-8502-thread-1) [    ] o.a.s.c.c.ConnectionManager zkClient has connected
   [junit4]   2> 2715614 INFO  (jetty-launcher-8497-thread-1) [    ] o.a.s.s.SolrDispatchFilter solr.xml found in ZooKeeper. Loading...
   [junit4]   2> 2715621 INFO  (jetty-launcher-8497-thread-1) [    ] o.a.s.c.ZkContainer Zookeeper client=127.0.0.1:49563/solr
   [junit4]   2> 2715624 INFO  (zkConnectionManagerCallback-8506-thread-1) [    ] o.a.s.c.c.ConnectionManager zkClient has connected
   [junit4]   2> 2715627 INFO  (zkConnectionManagerCallback-8508-thread-1-processing-n:127.0.0.1:49567_solr) [n:127.0.0.1:49567_solr    ] o.a.s.c.c.ConnectionManager zkClient has connected
   [junit4]   2> 2715732 INFO  (jetty-launcher-8497-thread-1) [n:127.0.0.1:49567_solr    ] o.a.s.c.Overseer Overseer (id=null) closing
   [junit4]   2> 2715733 INFO  (jetty-launcher-8497-thread-1) [n:127.0.0.1:49567_solr    ] o.a.s.c.OverseerElectionContext I am going to be the leader 127.0.0.1:49567_solr
   [junit4]   2> 2715734 INFO  (jetty-launcher-8497-thread-1) [n:127.0.0.1:49567_solr    ] o.a.s.c.Overseer Overseer (id=99179839181225987-127.0.0.1:49567_solr-n_0000000000) starting
   [junit4]   2> 2715742 INFO  (jetty-launcher-8497-thread-1) [n:127.0.0.1:49567_solr    ] o.a.s.c.ZkController Register node as live in ZooKeeper:/live_nodes/127.0.0.1:49567_solr
   [junit4]   2> 2715742 DEBUG (OverseerStateUpdate-99179839181225987-127.0.0.1:49567_solr-n_0000000000) [n:127.0.0.1:49567_solr    ] o.a.s.c.Overseer Starting to work on the main queue
   [junit4]   2> 2715742 DEBUG (OverseerAutoScalingTriggerThread-99179839181225987-127.0.0.1:49567_solr-n_0000000000) [n:127.0.0.1:49567_solr    ] o.a.s.c.a.OverseerTriggerThread Adding .autoAddReplicas trigger
   [junit4]   2> 2715744 INFO  (OverseerStateUpdate-99179839181225987-127.0.0.1:49567_solr-n_0000000000) [n:127.0.0.1:49567_solr    ] o.a.s.c.c.ZkStateReader Updated live nodes from ZooKeeper... (0) -> (1)
   [junit4]   2> 2715744 DEBUG (OverseerAutoScalingTriggerThread-99179839181225987-127.0.0.1:49567_solr-n_0000000000) [n:127.0.0.1:49567_solr    ] o.a.s.c.a.OverseerTriggerThread Refreshing /autoscaling.json with znode version 1
   [junit4]   2> 2715744 DEBUG (OverseerAutoScalingTriggerThread-99179839181225987-127.0.0.1:49567_solr-n_0000000000) [n:127.0.0.1:49567_solr    ] o.a.s.c.a.NodeLostTrigger Initial livenodes: [127.0.0.1:49567_solr]
   [junit4]   2> 2715744 DEBUG (OverseerAutoScalingTriggerThread-99179839181225987-127.0.0.1:49567_solr-n_0000000000) [n:127.0.0.1:49567_solr    ] o.a.s.c.a.OverseerTriggerThread Current znodeVersion 1, lastZnodeVersion -1
   [junit4]   2> 2715744 DEBUG (OverseerAutoScalingTriggerThread-99179839181225987-127.0.0.1:49567_solr-n_0000000000) [n:127.0.0.1:49567_solr    ] o.a.s.c.a.OverseerTriggerThread Processed trigger updates upto znodeVersion 1
   [junit4]   2> 2715746 DEBUG (OverseerAutoScalingTriggerThread-99179839181225987-127.0.0.1:49567_solr-n_0000000000) [n:127.0.0.1:49567_solr    ] o.a.s.c.a.OverseerTriggerThread -- clean old nodeAdded markers
   [junit4]   2> 2715746 DEBUG (OverseerAutoScalingTriggerThread-99179839181225987-127.0.0.1:49567_solr-n_0000000000) [n:127.0.0.1:49567_solr    ] o.a.s.c.a.OverseerTriggerThread Current znodeVersion 1, lastZnodeVersion 1
   [junit4]   2> 2715747 DEBUG (ScheduledTrigger-11175-thread-1) [n:127.0.0.1:49567_solr    ] o.a.s.c.a.NodeLostTrigger Running NodeLostTrigger: .auto_add_replicas with currently live nodes: 1
   [junit4]   2> 2715816 INFO  (jetty-launcher-8497-thread-1) [n:127.0.0.1:49567_solr    ] o.a.s.m.r.SolrJmxReporter JMX monitoring for 'solr_49567.solr.node' (registry 'solr.node') enabled at server: com.sun.jmx.mbeanserver.JmxMBeanServer@171d5e6b
   [junit4]   2> 2715822 INFO  (jetty-launcher-8497-thread-1) [n:127.0.0.1:49567_solr    ] o.a.s.m.r.SolrJmxReporter JMX monitoring for 'solr_49567.solr.jvm' (registry 'solr.jvm') enabled at server: com.sun.jmx.mbeanserver.JmxMBeanServer@171d5e6b
   [junit4]   2> 2715822 INFO  (jetty-launcher-8497-thread-1) [n:127.0.0.1:49567_solr    ] o.a.s.m.r.SolrJmxReporter JMX monitoring for 'solr_49567.solr.jetty' (registry 'solr.jetty') enabled at server: com.sun.jmx.mbeanserver.JmxMBeanServer@171d5e6b
   [junit4]   2> 2715823 INFO  (jetty-launcher-8497-thread-1) [n:127.0.0.1:49567_solr    ] o.a.s.c.CorePropertiesLocator Found 0 core definitions underneath C:\Users\jenkins\workspace\Lucene-Solr-7.x-Windows\solr\build\solr-core\test\J1\temp\solr.cloud.autoscaling.ComputePlanActionTest_CD3A0C682D81610A-001\tempDir-001\node1\.
   [junit4]   2> 2715839 INFO  (zkConnectionManagerCallback-8512-thread-1) [    ] o.a.s.c.c.ConnectionManager zkClient has connected
   [junit4]   2> 2715841 INFO  (zkConnectionManagerCallback-8516-thread-1) [    ] o.a.s.c.c.ConnectionManager zkClient has connected
   [junit4]   2> 2715841 INFO  (SUITE-ComputePlanActionTest-seed#[CD3A0C682D81610A]-worker) [    ] o.a.s.c.c.ZkStateReader Updated live nodes from ZooKeeper... (0) -> (1)
   [junit4]   2> 2715846 INFO  (SUITE-ComputePlanActionTest-seed#[CD3A0C682D81610A]-worker) [    ] o.a.s.c.s.i.ZkClientClusterStateProvider Cluster at 127.0.0.1:49563/solr ready
   [junit4]   2> 2715858 INFO  (TEST-ComputePlanActionTest.testNodeAdded-seed#[CD3A0C682D81610A]) [    ] o.a.s.SolrTestCaseJ4 ###Starting testNodeAdded
   [junit4]   2> 2715859 DEBUG (zkCallback-8507-thread-1-processing-n:127.0.0.1:49567_solr) [n:127.0.0.1:49567_solr    ] o.a.s.c.a.OverseerTriggerThread Refreshing /autoscaling.json with znode version 2
   [junit4]   2> 2715860 DEBUG (OverseerAutoScalingTriggerThread-99179839181225987-127.0.0.1:49567_solr-n_0000000000) [n:127.0.0.1:49567_solr    ] o.a.s.c.a.OverseerTriggerThread Processed trigger updates upto znodeVersion 2
   [junit4]   2> 2715862 INFO  (qtp369983572-29725) [n:127.0.0.1:49567_solr    ] o.a.s.h.a.CollectionsHandler Invoked Collection Action :delete with params name=testNodeLost&action=DELETE&wt=javabin&version=2 and sendToOCPQueue=true
   [junit4]   2> 2715863 DEBUG (OverseerAutoScalingTriggerThread-99179839181225987-127.0.0.1:49567_solr-n_0000000000) [n:127.0.0.1:49567_solr    ] o.a.s.c.a.OverseerTriggerThread -- clean old nodeLost markers
   [junit4]   2> 2715863 DEBUG (OverseerAutoScalingTriggerThread-99179839181225987-127.0.0.1:49567_solr-n_0000000000) [n:127.0.0.1:49567_solr    ] o.a.s.c.a.OverseerTriggerThread -- clean old nodeAdded markers
   [junit4]   2> 2715864 DEBUG (OverseerAutoScalingTriggerThread-99179839181225987-127.0.0.1:49567_solr-n_0000000000) [n:127.0.0.1:49567_solr    ] o.a.s.c.a.OverseerTriggerThread Current znodeVersion 2, lastZnodeVersion 2
   [junit4]   2> 2715865 INFO  (OverseerThreadFactory-11177-thread-1-processing-n:127.0.0.1:49567_solr) [n:127.0.0.1:49567_solr    ] o.a.s.c.OverseerCollectionMessageHandler Executing Collection Cmd : action=UNLOAD&deleteInstanceDir=true&deleteDataDir=true
   [junit4]   2> 2715866 ERROR (OverseerThreadFactory-11177-thread-1-processing-n:127.0.0.1:49567_solr) [n:127.0.0.1:49567_solr    ] o.a.s.c.OverseerCollectionMessageHandler Collection: testNodeLost operation: delete failed:org.apache.solr.common.SolrException: Could not find collection : testNodeLost
   [junit4]   2> 	at org.apache.solr.common.cloud.ClusterState.getCollection(ClusterState.java:118)
   [junit4]   2> 	at org.apache.solr.cloud.OverseerCollectionMessageHandler.collectionCmd(OverseerCollectionMessageHandler.java:803)
   [junit4]   2> 	at org.apache.solr.cloud.DeleteCollectionCmd.call(DeleteCollectionCmd.java:94)
   [junit4]   2> 	at org.apache.solr.cloud.OverseerCollectionMessageHandler.processMessage(OverseerCollectionMessageHandler.java:242)
   [junit4]   2> 	at org.apache.solr.cloud.OverseerTaskProcessor$Runner.run(OverseerTaskProcessor.java:464)
   [junit4]   2> 	at org.apache.solr.common.util.ExecutorUtil$MDCAwareThreadPoolExecutor.lambda$execute$0(ExecutorUtil.java:188)
   [junit4]   2> 	at java.base/java.util.concurrent.ThreadPoolExecutor.runWorker(ThreadPoolExecutor.java:1167)
   [junit4]   2> 	at java.base/java.util.concurrent.ThreadPoolExecutor$Worker.run(ThreadPoolExecutor.java:641)
   [junit4]   2> 	at java.base/java.lang.Thread.run(Thread.java:844)
   [junit4]   2> 
   [junit4]   2> 2715868 INFO  (qtp369983572-29725) [n:127.0.0.1:49567_solr    ] o.a.s.s.HttpSolrCall [admin] webapp=null path=/admin/collections params={name=testNodeLost&action=DELETE&wt=javabin&version=2} status=400 QTime=5
   [junit4]   2> 2715869 INFO  (qtp369983572-29723) [n:127.0.0.1:49567_solr    ] o.a.s.h.a.CollectionsHandler Invoked Collection Action :delete with params name=testNodeAdded&action=DELETE&wt=javabin&version=2 and sendToOCPQueue=true
   [junit4]   2> 2715871 INFO  (OverseerCollectionConfigSetProcessor-99179839181225987-127.0.0.1:49567_solr-n_0000000000) [n:127.0.0.1:49567_solr    ] o.a.s.c.OverseerTaskQueue Response ZK path: /overseer/collection-queue-work/qnr-0000000000 doesn't exist.  Requestor may have disconnected from ZooKeeper
   [junit4]   2> 2715871 INFO  (OverseerThreadFactory-11177-thread-2-processing-n:127.0.0.1:49567_solr) [n:127.0.0.1:49567_solr    ] o.a.s.c.OverseerCollectionMessageHandler Executing Collection Cmd : action=UNLOAD&deleteInstanceDir=true&deleteDataDir=true
   [junit4]   2> 2715871 ERROR (OverseerThreadFactory-11177-thread-2-processing-n:127.0.0.1:49567_solr) [n:127.0.0.1:49567_solr    ] o.a.s.c.OverseerCollectionMessageHandler Collection: testNodeAdded operation: delete failed:org.apache.solr.common.SolrException: Could not find collection : testNodeAdded
   [junit4]   2> 	at org.apache.solr.common.cloud.ClusterState.getCollection(ClusterState.java:118)
   [junit4]   2> 	at org.apache.solr.cloud.OverseerCollectionMessageHandler.collectionCmd(OverseerCollectionMessageHandler.java:803)
   [junit4]   2> 	at org.apache.solr.cloud.DeleteCollectionCmd.call(DeleteCollectionCmd.java:94)
   [junit4]   2> 	at org.apache.solr.cloud.OverseerCollectionMessageHandler.processMessage(OverseerCollectionMessageHandler.java:242)
   [junit4]   2> 	at org.apache.solr.cloud.OverseerTaskProcessor$Runner.run(OverseerTaskProcessor.java:464)
   [junit4]   2> 	at org.apache.solr.common.util.ExecutorUtil$MDCAwareThreadPoolExecutor.lambda$execute$0(ExecutorUtil.java:188)
   [junit4]   2> 	at java.base/java.util.concurrent.ThreadPoolExecutor.runWorker(ThreadPoolExecutor.java:1167)
   [junit4]   2> 	at java.base/java.util.concurrent.ThreadPoolExecutor$Worker.run(ThreadPoolExecutor.java:641)
   [junit4]   2> 	at java.base/java.lang.Thread.run(Thread.java:844)
   [junit4]   2> 
   [junit4]   2> 2715874 INFO  (qtp369983572-29723) [n:127.0.0.1:49567_solr    ] o.a.s.s.HttpSolrCall [admin] webapp=null path=/admin/collections params={name=testNodeAdded&action=DELETE&wt=javabin&version=2} status=400 QTime=5
   [junit4]   2> 2715874 INFO  (qtp369983572-29726) [n:127.0.0.1:49567_solr    ] o.a.s.h.a.CollectionsHandler Invoked Collection Action :delete with params name=testNodeWithMultipleReplicasLost&action=DELETE&wt=javabin&version=2 and sendToOCPQueue=true
   [junit4]   2> 2715876 INFO  (OverseerCollectionConfigSetProcessor-99179839181225987-127.0.0.1:49567_solr-n_0000000000) [n:127.0.0.1:49567_solr    ] o.a.s.c.OverseerTaskQueue Response ZK path: /overseer/collection-queue-work/qnr-0000000002 doesn't exist.  Requestor may have disconnected from ZooKeeper
   [junit4]   2> 2715876 INFO  (OverseerThreadFactory-11177-thread-3-processing-n:127.0.0.1:49567_solr) [n:127.0.0.1:49567_solr    ] o.a.s.c.OverseerCollectionMessageHandler Executing Collection Cmd : action=UNLOAD&deleteInstanceDir=true&deleteDataDir=true
   [junit4]   2> 2715877 ERROR (OverseerThreadFactory-11177-thread-3-processing-n:127.0.0.1:49567_solr) [n:127.0.0.1:49567_solr    ] o.a.s.c.OverseerCollectionMessageHandler Collection: testNodeWithMultipleReplicasLost operation: delete failed:org.apache.solr.common.SolrException: Could not find collection : testNodeWithMultipleReplicasLost
   [junit4]   2> 	at org.apache.solr.common.cloud.ClusterState.getCollection(ClusterState.java:118)
   [junit4]   2> 	at org.apache.solr.cloud.OverseerCollectionMessageHandler.collectionCmd(OverseerCollectionMessageHandler.java:803)
   [junit4]   2> 	at org.apache.solr.cloud.DeleteCollectionCmd.call(DeleteCollectionCmd.java:94)
   [junit4]   2> 	at org.apache.solr.cloud.OverseerCollectionMessageHandler.processMessage(OverseerCollectionMessageHandler.java:242)
   [junit4]   2> 	at org.apache.solr.cloud.OverseerTaskProcessor$Runner.run(OverseerTaskProcessor.java:464)
   [junit4]   2> 	at org.apache.solr.common.util.ExecutorUtil$MDCAwareThreadPoolExecutor.lambda$execute$0(ExecutorUtil.java:188)
   [junit4]   2> 	at java.base/java.util.concurrent.ThreadPoolExecutor.runWorker(ThreadPoolExecutor.java:1167)
   [junit4]   2> 	at java.base/java.util.concurrent.ThreadPoolExecutor$Worker.run(ThreadPoolExecutor.java:641)
   [junit4]   2> 	at java.base/java.lang.Thread.run(Thread.java:844)
   [junit4]   2> 
   [junit4]   2> 2715877 INFO  (qtp369983572-29726) [n:127.0.0.1:49567_solr    ] o.a.s.s.HttpSolrCall [admin] webapp=null path=/admin/collections params={name=testNodeWithMultipleReplicasLost&action=DELETE&wt=javabin&version=2} status=400 QTime=5
   [junit4]   2> 2715882 INFO  (qtp369983572-29732) [n:127.0.0.1:49567_solr    ] o.a.s.s.HttpSolrCall [admin] webapp=null path=/admin/metrics params={prefix=CORE.coreName&wt=javabin&version=2&group=solr.core} status=0 QTime=0
   [junit4]   2> 2715883 DEBUG (qtp369983572-29733) [n:127.0.0.1:49567_solr    ] o.a.s.c.a.AutoScalingHandler Verified autoscaling configuration
   [junit4]   2> 2715883 INFO  (qtp369983572-29733) [n:127.0.0.1:49567_solr    ] o.a.s.s.HttpSolrCall [admin] webapp=null path=/cluster/autoscaling params={wt=javabin&version=2} status=0 QTime=3
   [junit4]   2> 2715883 DEBUG (zkCallback-8507-thread-1-processing-n:127.0.0.1:49567_solr) [n:127.0.0.1:49567_solr    ] o.a.s.c.a.OverseerTriggerThread Refreshing /autoscaling.json with znode version 3
   [junit4]   2> 2715884 DEBUG (OverseerAutoScalingTriggerThread-99179839181225987-127.0.0.1:49567_solr-n_0000000000) [n:127.0.0.1:49567_solr    ] o.a.s.c.a.OverseerTriggerThread Processed trigger updates upto znodeVersion 3
   [junit4]   2> 2715884 DEBUG (OverseerAutoScalingTriggerThread-99179839181225987-127.0.0.1:49567_solr-n_0000000000) [n:127.0.0.1:49567_solr    ] o.a.s.c.a.OverseerTriggerThread -- clean old nodeLost markers
   [junit4]   2> 2715884 DEBUG (OverseerAutoScalingTriggerThread-99179839181225987-127.0.0.1:49567_solr-n_0000000000) [n:127.0.0.1:49567_solr    ] o.a.s.c.a.OverseerTriggerThread -- clean old nodeAdded markers
   [junit4]   2> 2715885 DEBUG (OverseerAutoScalingTriggerThread-99179839181225987-127.0.0.1:49567_solr-n_0000000000) [n:127.0.0.1:49567_solr    ] o.a.s.c.a.OverseerTriggerThread Current znodeVersion 3, lastZnodeVersion 3
   [junit4]   2> 2715886 INFO  (qtp369983572-29728) [n:127.0.0.1:49567_solr    ] o.a.s.s.HttpSolrCall [admin] webapp=null path=/admin/metrics params={prefix=CONTAINER.fs.usableSpace,CORE.coreName&wt=javabin&version=2&group=solr.node,solr.core} status=0 QTime=1
   [junit4]   2> 2715889 DEBUG (qtp369983572-29734) [n:127.0.0.1:49567_solr    ] o.a.s.c.a.AutoScalingHandler Verified autoscaling configuration
   [junit4]   2> 2715889 INFO  (qtp369983572-29734) [n:127.0.0.1:49567_solr    ] o.a.s.s.HttpSolrCall [admin] webapp=null path=/admin/autoscaling params={wt=javabin&version=2} status=0 QTime=4
   [junit4]   2> 2715889 DEBUG (zkCallback-8507-thread-1-processing-n:127.0.0.1:49567_solr) [n:127.0.0.1:49567_solr    ] o.a.s.c.a.OverseerTriggerThread Refreshing /autoscaling.json with znode version 4
   [junit4]   2> 2715889 DEBUG (OverseerAutoScalingTriggerThread-99179839181225987-127.0.0.1:49567_solr-n_0000000000) [n:127.0.0.1:49567_solr    ] o.a.s.c.a.OverseerTriggerThread Processed trigger updates upto znodeVersion 4
   [junit4]   2> 2715889 DEBUG (OverseerAutoScalingTriggerThread-99179839181225987-127.0.0.1:49567_solr-n_0000000000) [n:127.0.0.1:49567_solr    ] o.a.s.c.a.OverseerTriggerThread -- clean old nodeLost markers
   [junit4]   2> 2715890 DEBUG (OverseerAutoScalingTriggerThread-99179839181225987-127.0.0.1:49567_solr-n_0000000000) [n:127.0.0.1:49567_solr    ] o.a.s.c.a.OverseerTriggerThread -- clean old nodeAdded markers
   [junit4]   2> 2715890 DEBUG (OverseerAutoScalingTriggerThread-99179839181225987-127.0.0.1:49567_solr-n_0000000000) [n:127.0.0.1:49567_solr    ] o.a.s.c.a.OverseerTriggerThread Current znodeVersion 4, lastZnodeVersion 4
   [junit4]   2> 2715892 INFO  (qtp369983572-29725) [n:127.0.0.1:49567_solr    ] o.a.s.s.HttpSolrCall [admin] webapp=null path=/admin/metrics params={prefix=CONTAINER.fs.usableSpace,CORE.coreName&wt=javabin&version=2&group=solr.node,solr.core} status=0 QTime=1
   [junit4]   2> 2715895 DEBUG (qtp369983572-29721) [n:127.0.0.1:49567_solr    ] o.a.s.c.a.AutoScalingHandler Verified autoscaling configuration
   [junit4]   2> 2715895 INFO  (qtp369983572-29721) [n:127.0.0.1:49567_solr    ] o.a.s.s.HttpSolrCall [admin] webapp=null path=/admin/autoscaling params={wt=javabin&version=2} status=0 QTime=4
   [junit4]   2> 2715896 DEBUG (zkCallback-8507-thread-1-processing-n:127.0.0.1:49567_solr) [n:127.0.0.1:49567_solr    ] o.a.s.c.a.OverseerTriggerThread Refreshing /autoscaling.json with znode version 5
   [junit4]   2> 2715897 DEBUG (zkCallback-8507-thread-1-processing-n:127.0.0.1:49567_solr) [n:127.0.0.1:49567_solr    ] o.a.s.c.a.NodeAddedTrigger Initial livenodes: [127.0.0.1:49567_solr]
   [junit4]   2> 2715897 DEBUG (zkCallback-8507-thread-1-processing-n:127.0.0.1:49567_solr) [n:127.0.0.1:49567_solr    ] o.a.s.c.a.NodeAddedTrigger NodeAddedTrigger node_added_trigger instantiated with properties: {event=nodeAdded, waitFor=1, actions=[{name=compute_plan, class=solr.ComputePlanAction}, {name=test, class=org.apache.solr.cloud.autoscaling.ComputePlanActionTest$AssertingTriggerAction}], enabled=true}
   [junit4]   2> 2715897 DEBUG (OverseerAutoScalingTriggerThread-99179839181225987-127.0.0.1:49567_solr-n_0000000000) [n:127.0.0.1:49567_solr    ] o.a.s.c.a.OverseerTriggerThread Processed trigger updates upto znodeVersion 5
   [junit4]   2> 2715899 DEBUG (OverseerAutoScalingTriggerThread-99179839181225987-127.0.0.1:49567_solr-n_0000000000) [n:127.0.0.1:49567_solr    ] o.a.s.c.a.OverseerTriggerThread -- clean old nodeLost markers
   [junit4]   2> 2715899 DEBUG (ScheduledTrigger-11175-thread-1) [n:127.0.0.1:49567_solr    ] o.a.s.c.a.NodeAddedTrigger Running NodeAddedTrigger node_added_trigger
   [junit4]   2> 2715900 DEBUG (ScheduledTrigger-11175-thread-1) [n:127.0.0.1:49567_solr    ] o.a.s.c.a.NodeAddedTrigger Found livenodes: 1
   [junit4]   2> 2715900 INFO  (qtp369983572-29726) [n:127.0.0.1:49567_solr    ] o.a.s.s.HttpSolrCall [admin] webapp=null path=/admin/metrics params={prefix=CONTAINER.fs.usableSpace,CORE.coreName&wt=javabin&version=2&group=solr.node,solr.core} status=0 QTime=1
   [junit4]   2> 2715900 DEBUG (OverseerAutoScalingTriggerThread-99179839181225987-127.0.0.1:49567_solr-n_0000000000) [n:127.0.0.1:49567_solr    ] o.a.s.c.a.OverseerTriggerThread Current znodeVersion 5, lastZnodeVersion 5
   [junit4]   2> 2715900 DEBUG (qtp369983572-29723) [n:127.0.0.1:49567_solr    ] o.a.s.c.a.AutoScalingHandler Verified autoscaling configuration
   [junit4]   2> 2715900 INFO  (qtp369983572-29723) [n:127.0.0.1:49567_solr    ] o.a.s.s.HttpSolrCall [admin] webapp=null path=/admin/autoscaling params={wt=javabin&version=2} status=0 QTime=3
   [junit4]   2> 2715901 DEBUG (zkCallback-8507-thread-1-processing-n:127.0.0.1:49567_solr) [n:127.0.0.1:49567_solr    ] o.a.s.c.a.OverseerTriggerThread Refreshing /autoscaling.json with znode version 6
   [junit4]   2> 2715901 INFO  (qtp369983572-29727) [n:127.0.0.1:49567_solr    ] o.a.s.h.a.CollectionsHandler Invoked Collection Action :create with params replicationFactor=2&collection.configName=conf&name=testNodeAdded&nrtReplicas=2&action=CREATE&numShards=1&wt=javabin&version=2 and sendToOCPQueue=true
   [junit4]   2> 2715901 DEBUG (zkCallback-8507-thread-1-processing-n:127.0.0.1:49567_solr) [n:127.0.0.1:49567_solr    ] o.a.s.c.a.NodeAddedTrigger Initial livenodes: [127.0.0.1:49567_solr]
   [junit4]   2> 2715901 DEBUG (zkCallback-8507-thread-1-processing-n:127.0.0.1:49567_solr) [n:127.0.0.1:49567_solr    ] o.a.s.c.a.NodeAddedTrigger NodeAddedTrigger node_added_trigger instantiated with properties: {event=nodeAdded, waitFor=1, actions=[{name=compute_plan, class=solr.ComputePlanAction}, {name=test, class=org.apache.solr.cloud.autoscaling.ComputePlanActionTest$AssertingTriggerAction}], enabled=true}
   [junit4]   2> 2715901 DEBUG (OverseerAutoScalingTriggerThread-99179839181225987-127.0.0.1:49567_solr-n_0000000000) [n:127.0.0.1:49567_solr    ] o.a.s.c.a.OverseerTriggerThread Processed trigger updates upto znodeVersion 6
   [junit4]   2> 2715902 DEBUG (OverseerAutoScalingTriggerThread-99179839181225987-127.0.0.1:49567_solr-n_0000000000) [n:127.0.0.1:49567_solr    ] o.a.s.c.a.OverseerTriggerThread -- clean old nodeLost markers
   [junit4]   2> 2715902 DEBUG (OverseerAutoScalingTriggerThread-99179839181225987-127.0.0.1:49567_solr-n_0000000000) [n:127.0.0.1:49567_solr    ] o.a.s.c.a.OverseerTriggerThread Current znodeVersion 6, lastZnodeVersion 6
   [junit4]   2> 2715903 INFO  (OverseerThreadFactory-11177-thread-4-processing-n:127.0.0.1:49567_solr) [n:127.0.0.1:49567_solr    ] o.a.s.c.CreateCollectionCmd Create collection testNodeAdded
   [junit4]   2> 2715903 INFO  (OverseerCollectionConfigSetProcessor-99179839181225987-127.0.0.1:49567_solr-n_0000000000) [n:127.0.0.1:49567_solr    ] o.a.s.c.OverseerTaskQueue Response ZK path: /overseer/collection-queue-work/qnr-0000000004 doesn't exist.  Requestor may have disconnected from ZooKeeper
   [junit4]   2> 2715904 WARN  (OverseerThreadFactory-11177-thread-4-processing-n:127.0.0.1:49567_solr) [n:127.0.0.1:49567_solr    ] o.a.s.c.CreateCollectionCmd Specified number of replicas of 2 on collection testNodeAdded is higher than the number of Solr instances currently live or live and part of your createNodeSet(1). It's unusual to run two replica of the same slice on the same Solr-instance.
   [junit4]   2> 2715907 INFO  (qtp369983572-29732) [n:127.0.0.1:49567_solr    ] o.a.s.s.HttpSolrCall [admin] webapp=null path=/admin/metrics params={prefix=CONTAINER.fs.usableSpace,CORE.coreName&wt=javabin&version=2&group=solr.node,solr.core} status=0 QTime=1
   [junit4]   2> 2715907 INFO  (OverseerThreadFactory-11177-thread-4-processing-n:127.0.0.1:49567_solr) [n:127.0.0.1:49567_solr    ] o.a.s.c.s.c.a.PolicyHelper returnSession, curr-time 1065380080 sessionWrapper.createTime 1065380079810298, this.sessionWrapper.createTime 1065380079810298 
   [junit4]   2> 2715911 DEBUG (OverseerStateUpdate-99179839181225987-127.0.0.1:49567_solr-n_0000000000) [n:127.0.0.1:49567_solr    ] o.a.s.c.Overseer processMessage: queueSize: 1, message = {
   [junit4]   2>   "name":"testNodeAdded",
   [junit4]   2>   "fromApi":"true",
   [junit4]   2>   "replicationFactor":"2",
   [junit4]   2>   "collection.configName":"conf",
   [junit4]   2>   "numShards":"1",
   [junit4]   2>   "nrtReplicas":"2",
   [junit4]   2>   "stateFormat":"2",
   [junit4]   2>   "operation":"create"} current state version: 0
   [junit4]   2> 2715911 DEBUG (OverseerStateUpdate-99179839181225987-127.0.0.1:49567_solr-n_0000000000) [n:127.0.0.1:49567_solr    ] o.a.s.c.o.ClusterStateMutator building a new cName: testNodeAdded
   [junit4]   2> 2715912 DEBUG (OverseerStateUpdate-99179839181225987-127.0.0.1:49567_solr-n_0000000000) [n:127.0.0.1:49567_solr    ] o.a.s.c.o.ZkStateWriter going to create_collection /collections/testNodeAdded/state.json
   [junit4]   2> 2716015 DEBUG (OverseerStateUpdate-99179839181225987-127.0.0.1:49567_solr-n_0000000000) [n:127.0.0.1:49567_solr    ] o.a.s.c.Overseer processMessage: queueSize: 1, message = {
   [junit4]   2>   "operation":"ADDREPLICA",
   [junit4]   2>   "collection":"testNodeAdded",
   [junit4]   2>   "shard":"shard1",
   [junit4]   2>   "core":"testNodeAdded_shard1_replica_n1",
   [junit4]   2>   "state":"down",
   [junit4]   2>   "base_url":"http://127.0.0.1:49567/solr",
   [junit4]   2>   "type":"NRT",
   [junit4]   2>   "waitForFinalState":"false"} current state version: 0
   [junit4]   2> 2716016 INFO  (OverseerStateUpdate-99179839181225987-127.0.0.1:49567_solr-n_0000000000) [n:127.0.0.1:49567_solr    ] o.a.s.c.o.SliceMutator createReplica() {
   [junit4]   2>   "operation":"ADDREPLICA",
   [junit4]   2>   "collection":"testNodeAdded",
   [junit4]   2>   "shard":"shard1",
   [junit4]   2>   "core":"testNodeAdded_shard1_replica_n1",
   [junit4]   2>   "state":"down",
   [junit4]   2>   "base_url":"http://127.0.0.1:49567/solr",
   [junit4]   2>   "type":"NRT",
   [junit4]   2>   "waitForFinalState":"false"} 
   [junit4]   2> 2716017 DEBUG (OverseerStateUpdate-99179839181225987-127.0.0.1:49567_solr-n_0000000000) [n:127.0.0.1:49567_solr    ] o.a.s.c.o.SliceMutator Old Slice: shard1:{
   [junit4]   2>   "range":"80000000-7fffffff",
   [junit4]   2>   "state":"active",
   [junit4]   2>   "replicas":{}}
   [junit4]   2> 2716017 DEBUG (OverseerStateUpdate-99179839181225987-127.0.0.1:49567_solr-n_0000000000) [n:127.0.0.1:49567_solr    ] o.a.s.c.o.SliceMutator New Slice: shard1:{
   [junit4]   2>   "range":"80000000-7fffffff",
   [junit4]   2>   "state":"active",
   [junit4]   2>   "replicas":{"core_node3":{
   [junit4]   2>       "core":"testNodeAdded_shard1_replica_n1",
   [junit4]   2>       "base_url":"http://127.0.0.1:49567/solr",
   [junit4]   2>       "state":"down",
   [junit4]   2>       "node_name":null,
   [junit4]   2>       "type":"NRT"}}}
   [junit4]   2> 2716018 DEBUG (OverseerStateUpdate-99179839181225987-127.0.0.1:49567_solr-n_0000000000) [n:127.0.0.1:49567_solr    ] o.a.s.c.Overseer processMessage: queueSize: 2, message = {
   [junit4]   2>   "operation":"ADDREPLICA",
   [junit4]   2>   "collection":"testNodeAdded",
   [junit4]   2>   "shard":"shard1",
   [junit4]   2>   "core":"testNodeAdded_shard1_replica_n2",
   [junit4]   2>   "state":"down",
   [junit4]   2>   "base_url":"http://127.0.0.1:49567/solr",
   [junit4]   2>   "type":"NRT",
   [junit4]   2>   "waitForFinalState":"false"} current state version: 0
   [junit4]   2> 2716018 INFO  (OverseerStateUpdate-99179839181225987-127.0.0.1:49567_solr-n_0000000000) [n:127.0.0.1:49567_solr    ] o.a.s.c.o.SliceMutator createReplica() {
   [junit4]   2>   "operation":"ADDREPLICA",
   [junit4]   2>   "collection":"testNodeAdded",
   [junit4]   2>   "shard":"shard1",
   [junit4]   2>   "core":"testNodeAdded_shard1_replica_n2",
   [junit4]   2>   "state":"down",
   [junit4]   2>   "base_url":"http://127.0.0.1:49567/solr",
   [junit4]   2>   "type":"NRT",
   [junit4]   2>   "waitForFinalState":"false"} 
   [junit4]   2> 2716019 DEBUG (OverseerStateUpdate-99179839181225987-127.0.0.1:49567_solr-n_0000000000) [n:127.0.0.1:49567_solr    ] o.a.s.c.o.SliceMutator Old Slice: shard1:{
   [junit4]   2>   "range":"80000000-7fffffff",
   [junit4]   2>   "state":"active",
   [junit4]   2>   "replicas":{"core_node3":{
   [junit4]   2>       "core":"testNodeAdded_shard1_replica_n1",
   [junit4]   2>       "base_url":"http://127.0.0.1:49567/solr",
   [junit4]   2>       "state":"down",
   [junit4]   2>       "node_name":null,
   [junit4]   2>       "type":"NRT"}}}
   [junit4]   2> 2716019 DEBUG (OverseerStateUpdate-99179839181225987-127.0.0.1:49567_solr-n_0000000000) [n:127.0.0.1:49567_solr    ] o.a.s.c.o.SliceMutator New Slice: shard1:{
   [junit4]   2>   "range":"80000000-7fffffff",
   [junit4]   2>   "state":"active",
   [junit4]   2>   "replicas":{
   [junit4]   2>     "core_node3":{
   [junit4]   2>       "core":"testNodeAdded_shard1_replica_n1",
   [junit4]   2>       "base_url":"http://127.0.0.1:49567/solr",
   [junit4]   2>       "state":"down",
   [junit4]   2>       "node_name":null,
   [junit4]   2>       "type":"NRT"},
   [junit4]   2>     "core_node4":{
   [junit4]   2>       "core":"testNodeAdded_shard1_replica_n2",
   [junit4]   2>       "base_url":"http://127.0.0.1:49567/solr",
   [junit4]   2>       "state":"down",
   [junit4]   2>       "node_name":null,
   [junit4]   2>       "type":"NRT"}}}
   [junit4]   2> 2716120 DEBUG (OverseerStateUpdate-99179839181225987-127.0.0.1:49567_solr-n_0000000000) [n:127.0.0.1:49567_solr    ] o.a.s.c.o.ZkStateWriter going to update_collection /collections/testNodeAdded/state.json version: 0
   [junit4]   2> 2716221 INFO  (qtp369983572-29728) [n:127.0.0.1:49567_solr    ] o.a.s.h.a.CoreAdminOperation core create command qt=/admin/cores&coreNodeName=core_node4&collection.configName=conf&newCollection=true&name=testNodeAdded_shard1_replica_n2&action=CREATE&numShards=1&collection=testNodeAdded&shard=shard1&wt=javabin&version=2&replicaType=NRT
   [junit4]   2> 2716221 INFO  (qtp369983572-29734) [n:127.0.0.1:49567_solr    ] o.a.s.h.a.CoreAdminOperation core create command qt=/admin/cores&coreNodeName=core_node3&collection.configName=conf&newCollection=true&name=testNodeAdded_shard1_replica_n1&action=CREATE&numShards=1&collection=testNodeAdded&shard=shard1&wt=javabin&version=2&replicaType=NRT
   [junit4]   2> 2716222 INFO  (qtp369983572-29734) [n:127.0.0.1:49567_solr    ] o.a.s.c.TransientSolrCoreCacheDefault Allocating transient cache for 2147483647 transient cores
   [junit4]   2> 2716225 DEBUG (OverseerStateUpdate-99179839181225987-127.0.0.1:49567_solr-n_0000000000) [n:127.0.0.1:49567_solr    ] o.a.s.c.Overseer processMessage: queueSize: 2, message = {
   [junit4]   2>   "core":"testNodeAdded_shard1_replica_n2",
   [junit4]   2>   "core_node_name":"core_node4",
   [junit4]   2>   "roles":null,
   [junit4]   2>   "base_url":"http://127.0.0.1:49567/solr",
   [junit4]   2>   "node_name":"127.0.0.1:49567_solr",
   [junit4]   2>   "numShards":"1",
   [junit4]   2>   "state":"down",
   [junit4]   2>   "shard":"shard1",
   [junit4]   2>   "collection":"testNodeAdded",
   [junit4]   2>   "type":"NRT",
   [junit4]   2>   "operation":"state"} current state version: 0
   [junit4]   2> 2716225 DEBUG (OverseerStateUpdate-99179839181225987-127.0.0.1:49567_solr-n_0000000000) [n:127.0.0.1:49567_solr    ] o.a.s.c.o.ReplicaMutator Update state numShards=1 message={
   [junit4]   2>   "core":"testNodeAdded_shard1_replica_n2",
   [junit4]   2>   "core_node_name":"core_node4",
   [junit4]   2>   "roles":null,
   [junit4]   2>   "base_url":"http://127.0.0.1:49567/solr",
   [junit4]   2>   "node_name":"127.0.0.1:49567_solr",
   [junit4]   2>   "numShards":"1",
   [junit4]   2>   "state":"down",
   [junit4]   2>   "shard":"shard1",
   [junit4]   2>   "collection":"testNodeAdded",
   [junit4]   2>   "type":"NRT",
   [junit4]   2>   "operation":"state"}
   [junit4]   2> 2716225 DEBUG (OverseerStateUpdate-99179839181225987-127.0.0.1:49567_solr-n_0000000000) [n:127.0.0.1:49567_solr    ] o.a.s.c.o.ReplicaMutator Will update state for replica: core_node4:{"core":"testNodeAdded_shard1_replica_n2","base_url":"http://127.0.0.1:49567/solr","node_name":"127.0.0.1:49567_solr","state":"down","type":"NRT"}
   [junit4]   2> 2716225 DEBUG (OverseerStateUpdate-99179839181225987-127.0.0.1:49567_solr-n_0000000000) [n:127.0.0.1:49567_solr    ] o.a.s.c.o.ReplicaMutator Collection is now: DocCollection(testNodeAdded//collections/testNodeAdded/state.json/1)={
   [junit4]   2>   "pullReplicas":"0",
   [junit4]   2>   "replicationFactor":"2",
   [junit4]   2>   "router":{"name":"compositeId"},
   [junit4]   2>   "maxShardsPerNode":"1",
   [junit4]   2>   "autoAddReplicas":"false",
   [junit4]   2>   "nrtReplicas":"2",
   [junit4]   2>   "tlogReplicas":"0",
   [junit4]   2>   "shards":{"shard1":{
   [junit4]   2>       "range":"80000000-7fffffff",
   [junit4]   2>       "state":"active",
   [junit4]   2>       "replicas":{
   [junit4]   2>         "core_node3":{
   [junit4]   2>           "core":"testNodeAdded_shard1_replica_n1",
   [junit4]   2>           "base_url":"http://127.0.0.1:49567/solr",
   [junit4]   2>           "state":"down",
   [junit4]   2>           "node_name":null,
   [junit4]   2>           "type":"NRT"},
   [junit4]   2>         "core_node4":{
   [junit4]   2>           "core":"testNodeAdded_shard1_replica_n2",
   [junit4]   2>           "base_url":"http://127.0.0.1:49567/solr",
   [junit4]   2>           "node_name":"127.0.0.1:49567_solr",
   [junit4]   2>           "state":"down",
   [junit4]   2>           "type":"NRT"}}}}}
   [junit4]   2> 2716225 DEBUG (OverseerStateUpdate-99179839181225987-127.0.0.1:49567_solr-n_0000000000) [n:127.0.0.1:49567_solr    ] o.a.s.c.Overseer processMessage: queueSize: 2, message = {
   [junit4]   2>   "core":"testNodeAdded_shard1_replica_n1",
   [junit4]   2>   "core_node_name":"core_node3",
   [junit4]   2>   "roles":null,
   [junit4]   2>   "base_url":"http://127.0.0.1:49567/solr",
   [junit4]   2>   "node_name":"127.0.0.1:49567_solr",
   [junit4]   2>   "numShards":"1",
   [junit4]   2>   "state":"down",
   [junit4]   2>   "shard":"shard1",
   [junit4]   2>   "collection":"testNodeAdded",
   [junit4]   2>   "type":"NRT",
   [junit4]   2>   "operation":"state"} current state version: 0
   [junit4]   2> 2716225 DEBUG (OverseerStateUpdate-99179839181225987-127.0.0.1:49567_solr-n_0000000000) [n:127.0.0.1:49567_solr    ] o.a.s.c.o.ReplicaMutator Update state numShards=1 message={
   [junit4]   2>   "core":"testNodeAdded_shard1_replica_n1",
   [junit4]   2>   "core_node_name":"core_node3",
   [junit4]   2>   "roles":null,
   [junit4]   2>   "base_url":"http://127.0.0.1:49567/solr",
   [junit4]   2>   "node_name":"127.0.0.1:49567_solr",
   [junit4]   2>   "numShards":"1",
   [junit4]   2>   "state":"down",
   [junit4]   2>   "shard":"shard1",
   [junit4]   2>   "collection":"testNodeAdded",
   [junit4]   2>   "type":"NRT",
   [junit4]   2>   "operation":"state"}
   [junit4]   2> 2716225 DEBUG (OverseerStateUpdate-99179839181225987-127.0.0.1:49567_solr-n_0000000000) [n:127.0.0.1:49567_solr    ] o.a.s.c.o.ReplicaMutator Will update state for replica: core_node3:{"core":"testNodeAdded_shard1_replica_n1","base_url":"http://127.0.0.1:49567/solr","node_name":"127.0.0.1:49567_solr","state":"down","type":"NRT"}
   [junit4]   2> 2716225 DEBUG (OverseerStateUpdate-99179839181225987-127.0.0.1:49567_solr-n_0000000000) [n:127.0.0.1:49567_solr    ] o.a.s.c.o.ReplicaMutator Collection is now: DocCollection(testNodeAdded//collections/testNodeAdded/state.json/1)={
   [junit4]   2>   "pullReplicas":"0",
   [junit4]   2>   "replicationFactor":"2",
   [junit4]   2>   "router":{"name":"compositeId"},
   [junit4]   2>   "maxShardsPerNode":"1",
   [junit4]   2>   "autoAddReplicas":"false",
   [junit4]   2>   "nrtReplicas":"2",
   [junit4]   2>   "tlogReplicas":"0",
   [junit4]   2>   "shards":{"shard1":{
   [junit4]   2>       "range":"80000000-7fffffff",
   [junit4]   2>       "state":"active",
   [junit4]   2>       "replicas":{
   [junit4]   2>         "core_node3":{
   [junit4]   2>           "core":"testNodeAdded_shard1_replica_n1",
   [junit4]   2>           "base_url":"http://127.0.0.1:49567/solr",
   [junit4]   2>           "node_name":"127.0.0.1:49567_solr",
   [junit4]   2>           "state":"down",
   [junit4]   2>           "type":"NRT"},
   [junit4]   2>         "core_node4":{
   [junit4]   2>           "core":"testNodeAdded_shard1_replica_n2",
   [junit4]   2>           "base_url":"http://127.0.0.1:49567/solr",
   [junit4]   2>           "node_name":"127.0.0.1:49567_solr",
   [junit4]   2>           "state":"down",
   [junit4]   2>           "type":"NRT"}}}}}
   [junit4]   2> 2716327 DEBUG (OverseerStateUpdate-99179839181225987-127.0.0.1:49567_solr-n_0000000000) [n:127.0.0.1:49567_solr    ] o.a.s.c.o.ZkStateWriter going to update_collection /collections/testNodeAdded/state.json version: 1
   [junit4]   2> 2716328 INFO  (zkCallback-8507-thread-1-processing-n:127.0.0.1:49567_solr) [n:127.0.0.1:49567_solr    ] o.a.s.c.c.ZkStateReader A cluster state change: [WatchedEvent state:SyncConnected type:NodeDataChanged path:/collections/testNodeAdded/state.json] for collection [testNodeAdded] has occurred - updating... (live nodes size: [1])
   [junit4]   2> 2716328 INFO  (zkCallback-8507-thread-2-processing-n:127.0.0.1:49567_solr) [n:127.0.0.1:49567_solr    ] o.a.s.c.c.ZkStateReader A cluster state change: [WatchedEvent state:SyncConnected type:NodeDataChanged path:/collections/testNodeAdded/state.json] for collection [testNodeAdded] has occurred - updating... (live nodes size: [1])
   [junit4]   2> 2716901 DEBUG (ScheduledTrigger-11175-thread-1) [n:127.0.0.1:49567_solr    ] o.a.s.c.a.NodeAddedTrigger Running NodeAddedTrigger node_added_trigger
   [junit4]   2> 2716901 DEBUG (ScheduledTrigger-11175-thread-1) [n:127.0.0.1:49567_solr    ] o.a.s.c.a.NodeAddedTrigger Found livenodes: 1
   [junit4]   2> 2717234 INFO  (qtp369983572-29734) [n:127.0.0.1:49567_solr c:testNodeAdded s:shard1 r:core_node3 x:testNodeAdded_shard1_replica_n1] o.a.s.c.SolrConfig Using Lucene MatchVersion: 7.3.0
   [junit4]   2> 2717244 INFO  (qtp369983572-29728) [n:127.0.0.1:49567_solr c:testNodeAdded s:shard1 r:core_node4 x:testNodeAdded_shard1_replica_n2] o.a.s.c.SolrConfig Using Lucene MatchVersion: 7.3.0
   [junit4]   2> 2717248 INFO  (qtp369983572-29734) [n:127.0.0.1:49567_solr c:testNodeAdded s:shard1 r:core_node3 x:testNodeAdded_shard1_replica_n1] o.a.s.s.IndexSchema [testNodeAdded_shard1_replica_n1] Schema name=minimal
   [junit4]   2> 2717249 INFO  (qtp369983572-29728) [n:127.0.0.1:49567_solr c:testNodeAdded s:shard1 r:core_node4 x:testNodeAdded_shard1_replica_n2] o.a.s.s.IndexSchema [testNodeAdded_shard1_replica_n2] Schema name=minimal
   [junit4]   2> 2717250 INFO  (qtp369983572-29734) [n:127.0.0.1:49567_solr c:testNodeAdded s:shard1 r:core_node3 x:testNodeAdded_shard1_replica_n1] o.a.s.s.IndexSchema Loaded schema minimal/1.1 with uniqueid field id
   [junit4]   2> 2717250 INFO  (qtp369983572-29734) [n:127.0.0.1:49567_solr c:testNodeAdded s:shard1 r:core_node3 x:testNodeAdded_shard1_replica_n1] o.a.s.c.CoreContainer Creating SolrCore 'testNodeAdded_shard1_replica_n1' using configuration from collection testNodeAdded, trusted=true
   [junit4]   2> 2717250 INFO  (qtp369983572-29728) [n:127.0.0.1:49567_solr c:testNodeAdded s:shard1 r:core_node4 x:testNodeAdded_shard1_replica_n2] o.a.s.s.IndexSchema Loaded schema minimal/1.1 with uniqueid field id
   [junit4]   2> 2717251 INFO  (qtp369983572-29728) [n:127.0.0.1:49567_solr c:testNodeAdded s:shard1 r:core_node4 x:testNodeAdded_shard1_replica_n2] o.a.s.c.CoreContainer Creating SolrCore 'testNodeAdded_shard1_replica_n2' using configuration from collection testNodeAdded, trusted=true
   [junit4]   2> 2717251 INFO  (qtp369983572-29728) [n:127.0.0.1:49567_solr c:testNodeAdded s:shard1 r:core_node4 x:testNodeAdded_shard1_replica_n2] o.a.s.m.r.SolrJmxReporter JMX monitoring for 'solr_49567.solr.core.testNodeAdded.shard1.replica_n2' (registry 'solr.core.testNodeAdded.shard1.replica_n2') enabled at server: com.sun.jmx.mbeanserver.JmxMBeanServer@171d5e6b
   [junit4]   2> 2717251 INFO  (qtp369983572-29734) [n:127.0.0.1:49567_solr c:testNodeAdded s:shard1 r:core_node3 x:testNodeAdded_shard1_replica_n1] o.a.s.m.r.SolrJmxReporter JMX monitoring for 'solr_49567.solr.core.testNodeAdded.shard1.replica_n1' (registry 'solr.core.testNodeAdded.shard1.replica_n1') enabled at server: com.sun.jmx.mbeanserver.JmxMBeanServer@171d5e6b
   [junit4]   2> 2717251 INFO  (qtp369983572-29728) [n:127.0.0.1:49567_solr c:testNodeAdded s:shard1 r:core_node4 x:testNodeAdded_shard1_replica_n2] o.a.s.c.SolrCore solr.RecoveryStrategy.Builder
   [junit4]   2> 2717251 INFO  (qtp369983572-29734) [n:127.0.0.1:49567_solr c:testNodeAdded s:shard1 r:core_node3 x:testNodeAdded_shard1_replica_n1] o.a.s.c.SolrCore solr.RecoveryStrategy.Builder
   [junit4]   2> 2717251 INFO  (qtp369983572-29728) [n:127.0.0.1:49567_solr c:testNodeAdded s:shard1 r:core_node4 x:testNodeAdded_shard1_replica_n2] o.a.s.c.SolrCore [[testNodeAdded_shard1_replica_n2] ] Opening new SolrCore at [C:\Users\jenkins\workspace\Lucene-Solr-7.x-Windows\solr\build\solr-core\test\J1\temp\solr.cloud.autoscaling.ComputePlanActionTest_CD3A0C682D81610A-001\tempDir-001\node1\testNodeAdded_shard1_replica_n2], dataDir=[C:\Users\jenkins\workspace\Lucene-Solr-7.x-Windows\solr\build\solr-core\test\J1\temp\solr.cloud.autoscaling.ComputePlanActionTest_CD3A0C682D81610A-001\tempDir-001\node1\.\testNodeAdded_shard1_replica_n2\data\]
   [junit4]   2> 2717251 INFO  (qtp369983572-29734) [n:127.0.0.1:49567_solr c:testNodeAdded s:shard1 r:core_node3 x:testNodeAdded_shard1_replica_n1] o.a.s.c.SolrCore [[testNodeAdded_shard1_replica_n1] ] Opening new SolrCore at [C:\Users\jenkins\workspace\Lucene-Solr-7.x-Windows\solr\build\solr-core\test\J1\temp\solr.cloud.autoscaling.ComputePlanActionTest_CD3A0C682D81610A-001\tempDir-001\node1\testNodeAdded_shard1_replica_n1], dataDir=[C:\Users\jenkins\workspace\Lucene-Solr-7.x-Windows\solr\build\solr-core\test\J1\temp\solr.cloud.autoscaling.ComputePlanActionTest_CD3A0C682D81610A-001\tempDir-001\node1\.\testNodeAdded_shard1_replica_n1\data\]
   [junit4]   2> 2717307 INFO  (qtp369983572-29734) [n:127.0.0.1:49567_solr c:testNodeAdded s:shard1 r:core_node3 x:testNodeAdded_shard1_replica_n1] o.a.s.u.UpdateHandler Using UpdateLog implementation: org.apache.solr.update.UpdateLog
   [junit4]   2> 2717307 INFO  (qtp369983572-29734) [n:127.0.0.1:49567_solr c:testNodeAdded s:shard1 r:core_node3 x:testNodeAdded_shard1_replica_n1] o.a.s.u.UpdateLog Initializing UpdateLog: dataDir=null defaultSyncLevel=FLUSH numRecordsToKeep=100 maxNumLogsToKeep=10 numVersionBuckets=65536
   [junit4]   2> 2717307 INFO  (qtp369983572-29728) [n:127.0.0.1:49567_solr c:testNodeAdded s:shard1 r:core_node4 x:testNodeAdded_shard1_replica_n2] o.a.s.u.UpdateHandler Using UpdateLog implementation: org.apache.solr.update.UpdateLog
   [junit4]   2> 2717308 INFO  (qtp369983572-29728) [n:127.0.0.1:49567_solr c:testNodeAdded s:shard1 r:core_node4 x:testNodeAdded_shard1_replica_n2] o.a.s.u.UpdateLog Initializing UpdateLog: dataDir=null defaultSyncLevel=FLUSH numRecordsToKeep=100 maxNumLogsToKeep=10 numVersionBuckets=65536
   [junit4]   2> 2717309 INFO  (qtp369983572-29734) [n:127.0.0.1:49567_solr c:testNodeAdded s:shard1 r:core_node3 x:testNodeAdded_shard1_replica_n1] o.a.s.u.CommitTracker Hard AutoCommit: disabled
   [junit4]   2> 2717309 INFO  (qtp369983572-29734) [n:127.0.0.1:49567_solr c:testNodeAdded s:shard1 r:core_node3 x:testNodeAdded_shard1_replica_n1] o.a.s.u.CommitTracker Soft AutoCommit: disabled
   [junit4]   2> 2717309 INFO  (qtp369983572-29728) [n:127.0.0.1:49567_solr c:testNodeAdded s:shard1 r:core_node4 x:testNodeAdded_shard1_replica_n2] o.a.s.u.CommitTracker Hard AutoCommit: disabled
   [junit4]   2> 2717309 INFO  (qtp369983572-29728) [n:127.0.0.1:49567_solr c:testNodeAdded s:shard1 r:core_node4 x:testNodeAdded_shard1_replica_n2] o.a.s.u.CommitTracker Soft AutoCommit: disabled
   [junit4]   2> 2717310 INFO  (qtp369983572-29734) [n:127.0.0.1:49567_solr c:testNodeAdded s:shard1 r:core_node3 x:testNodeAdded_shard1_replica_n1] o.a.s.s.SolrIndexSearcher Opening [Searcher@63b3c7bc[testNodeAdded_shard1_replica_n1] main]
   [junit4]   2> 2717311 INFO  (qtp369983572-29728) [n:127.0.0.1:49567_solr c:testNodeAdded s:shard1 r:core_node4 x:testNodeAdded_shard1_replica_n2] o.a.s.s.SolrIndexSearcher Opening [Searcher@4a4e5e6a[testNodeAdded_shard1_replica_n2] main]
   [junit4]   2> 2717311 INFO  (qtp369983572-29734) [n:127.

[...truncated too long message...]

ze=128), id=BlockTreeOrds(blocksize=128)}, docValues:{_version_=DocValuesFormat(name=Memory), multiDefault=DocValuesFormat(name=Lucene70), from_s=DocValuesFormat(name=Memory), predicate_s=DocValuesFormat(name=Asserting), to_s=DocValuesFormat(name=Asserting), intDefault=DocValuesFormat(name=Memory), id=DocValuesFormat(name=Asserting), timestamp=DocValuesFormat(name=Memory)}, maxPointsInLeafNode=1065, maxMBSortInHeap=6.014770026973815, sim=RandomSimilarity(queryNorm=false): {}, locale=smn-FI, timezone=America/Yakutat
   [junit4]   2> NOTE: Windows 10 10.0 amd64/Oracle Corporation 9.0.1 (64-bit)/cpus=3,threads=1,free=179810800,total=284688384
   [junit4]   2> NOTE: All tests run in this JVM: [ConcurrentUpdateSolrClientBuilderTest, TestUpdateRequestCodec, CommonAdminParamsTest, NotEvaluatorTest, TestCoreAdmin, CloudSolrClientMultiConstructorTest, NoOpResponseParserTest, GraphTest]
   [junit4]   2> NOTE: reproduce with: ant test  -Dtestcase=GraphTest -Dtests.seed=781EAD5C035E93E5 -Dtests.slow=true -Dtests.locale=smn-FI -Dtests.timezone=America/Yakutat -Dtests.asserts=true -Dtests.file.encoding=ISO-8859-1
   [junit4] ERROR   0.00s J0 | GraphTest (suite) <<<
   [junit4]    > Throwable #1: java.io.IOException: Could not remove the following files (in the order of attempts):
   [junit4]    >    C:\Users\jenkins\workspace\Lucene-Solr-7.x-Windows\solr\build\solr-solrj\test\J0\temp\solr.client.solrj.io.graph.GraphTest_781EAD5C035E93E5-001\tempDir-001\node1\collection1_shard2_replica_n2\data\tlog: java.nio.file.DirectoryNotEmptyException: C:\Users\jenkins\workspace\Lucene-Solr-7.x-Windows\solr\build\solr-solrj\test\J0\temp\solr.client.solrj.io.graph.GraphTest_781EAD5C035E93E5-001\tempDir-001\node1\collection1_shard2_replica_n2\data\tlog
   [junit4]    >    C:\Users\jenkins\workspace\Lucene-Solr-7.x-Windows\solr\build\solr-solrj\test\J0\temp\solr.client.solrj.io.graph.GraphTest_781EAD5C035E93E5-001\tempDir-001\node1\collection1_shard2_replica_n2\data: java.nio.file.DirectoryNotEmptyException: C:\Users\jenkins\workspace\Lucene-Solr-7.x-Windows\solr\build\solr-solrj\test\J0\temp\solr.client.solrj.io.graph.GraphTest_781EAD5C035E93E5-001\tempDir-001\node1\collection1_shard2_replica_n2\data
   [junit4]    >    C:\Users\jenkins\workspace\Lucene-Solr-7.x-Windows\solr\build\solr-solrj\test\J0\temp\solr.client.solrj.io.graph.GraphTest_781EAD5C035E93E5-001\tempDir-001\node1\collection1_shard2_replica_n2: java.nio.file.DirectoryNotEmptyException: C:\Users\jenkins\workspace\Lucene-Solr-7.x-Windows\solr\build\solr-solrj\test\J0\temp\solr.client.solrj.io.graph.GraphTest_781EAD5C035E93E5-001\tempDir-001\node1\collection1_shard2_replica_n2
   [junit4]    >    C:\Users\jenkins\workspace\Lucene-Solr-7.x-Windows\solr\build\solr-solrj\test\J0\temp\solr.client.solrj.io.graph.GraphTest_781EAD5C035E93E5-001\tempDir-001\node1: java.nio.file.DirectoryNotEmptyException: C:\Users\jenkins\workspace\Lucene-Solr-7.x-Windows\solr\build\solr-solrj\test\J0\temp\solr.client.solrj.io.graph.GraphTest_781EAD5C035E93E5-001\tempDir-001\node1
   [junit4]    >    C:\Users\jenkins\workspace\Lucene-Solr-7.x-Windows\solr\build\solr-solrj\test\J0\temp\solr.client.solrj.io.graph.GraphTest_781EAD5C035E93E5-001\tempDir-001: java.nio.file.DirectoryNotEmptyException: C:\Users\jenkins\workspace\Lucene-Solr-7.x-Windows\solr\build\solr-solrj\test\J0\temp\solr.client.solrj.io.graph.GraphTest_781EAD5C035E93E5-001\tempDir-001
   [junit4]    >    C:\Users\jenkins\workspace\Lucene-Solr-7.x-Windows\solr\build\solr-solrj\test\J0\temp\solr.client.solrj.io.graph.GraphTest_781EAD5C035E93E5-001\tempDir-001\node1\collection1_shard2_replica_n2\data\tlog\tlog.0000000000000000001: java.nio.file.AccessDeniedException: C:\Users\jenkins\workspace\Lucene-Solr-7.x-Windows\solr\build\solr-solrj\test\J0\temp\solr.client.solrj.io.graph.GraphTest_781EAD5C035E93E5-001\tempDir-001\node1\collection1_shard2_replica_n2\data\tlog\tlog.0000000000000000001
   [junit4]    >    C:\Users\jenkins\workspace\Lucene-Solr-7.x-Windows\solr\build\solr-solrj\test\J0\temp\solr.client.solrj.io.graph.GraphTest_781EAD5C035E93E5-001: java.nio.file.DirectoryNotEmptyException: C:\Users\jenkins\workspace\Lucene-Solr-7.x-Windows\solr\build\solr-solrj\test\J0\temp\solr.client.solrj.io.graph.GraphTest_781EAD5C035E93E5-001
   [junit4]    > 	at __randomizedtesting.SeedInfo.seed([781EAD5C035E93E5]:0)
   [junit4]    > 	at org.apache.lucene.util.IOUtils.rm(IOUtils.java:329)
   [junit4]    > 	at java.base/java.lang.Thread.run(Thread.java:844)
   [junit4] Completed [15/146 (1!)] on J0 in 6.36s, 1 test, 1 error <<< FAILURES!

[...truncated 1860 lines...]
   [junit4] Suite: org.apache.solr.update.processor.TestOpenNLPExtractNamedEntitiesUpdateProcessorFactory
   [junit4]   2> Creating dataDir: C:\Users\jenkins\workspace\Lucene-Solr-7.x-Windows\solr\build\contrib\solr-analysis-extras\test\J0\temp\solr.update.processor.TestOpenNLPExtractNamedEntitiesUpdateProcessorFactory_56F702A965DD307C-001\init-core-data-001
   [junit4]   2> NOTE: test params are: codec=Asserting(Lucene70): {}, docValues:{}, maxPointsInLeafNode=1653, maxMBSortInHeap=5.527330990502485, sim=RandomSimilarity(queryNorm=true): {}, locale=bn-BD, timezone=Asia/Sakhalin
   [junit4]   2> NOTE: Windows 10 10.0 amd64/Oracle Corporation 9.0.1 (64-bit)/cpus=3,threads=1,free=73364112,total=233308160
   [junit4]   2> NOTE: All tests run in this JVM: [TestICUCollationFieldDocValues, TestICUCollationField, TestOpenNLPExtractNamedEntitiesUpdateProcessorFactory]
   [junit4]   2> NOTE: reproduce with: ant test  -Dtestcase=TestOpenNLPExtractNamedEntitiesUpdateProcessorFactory -Dtests.seed=56F702A965DD307C -Dtests.slow=true -Dtests.locale=bn-BD -Dtests.timezone=Asia/Sakhalin -Dtests.asserts=true -Dtests.file.encoding=US-ASCII
   [junit4] ERROR   0.00s J0 | TestOpenNLPExtractNamedEntitiesUpdateProcessorFactory (suite) <<<
   [junit4]    > Throwable #1: java.io.IOException: Could not remove the following files (in the order of attempts):
   [junit4]    >    C:\Users\jenkins\workspace\Lucene-Solr-7.x-Windows\solr\build\contrib\solr-analysis-extras\test\J0\temp\solr.update.processor.TestOpenNLPExtractNamedEntitiesUpdateProcessorFactory_56F702A965DD307C-001\tempDir-001\collection1\conf: java.nio.file.DirectoryNotEmptyException: C:\Users\jenkins\workspace\Lucene-Solr-7.x-Windows\solr\build\contrib\solr-analysis-extras\test\J0\temp\solr.update.processor.TestOpenNLPExtractNamedEntitiesUpdateProcessorFactory_56F702A965DD307C-001\tempDir-001\collection1\conf
   [junit4]    >    C:\Users\jenkins\workspace\Lucene-Solr-7.x-Windows\solr\build\contrib\solr-analysis-extras\test\J0\temp\solr.update.processor.TestOpenNLPExtractNamedEntitiesUpdateProcessorFactory_56F702A965DD307C-001\tempDir-001\collection1: java.nio.file.DirectoryNotEmptyException: C:\Users\jenkins\workspace\Lucene-Solr-7.x-Windows\solr\build\contrib\solr-analysis-extras\test\J0\temp\solr.update.processor.TestOpenNLPExtractNamedEntitiesUpdateProcessorFactory_56F702A965DD307C-001\tempDir-001\collection1
   [junit4]    >    C:\Users\jenkins\workspace\Lucene-Solr-7.x-Windows\solr\build\contrib\solr-analysis-extras\test\J0\temp\solr.update.processor.TestOpenNLPExtractNamedEntitiesUpdateProcessorFactory_56F702A965DD307C-001\tempDir-001: java.nio.file.DirectoryNotEmptyException: C:\Users\jenkins\workspace\Lucene-Solr-7.x-Windows\solr\build\contrib\solr-analysis-extras\test\J0\temp\solr.update.processor.TestOpenNLPExtractNamedEntitiesUpdateProcessorFactory_56F702A965DD307C-001\tempDir-001
   [junit4]    >    C:\Users\jenkins\workspace\Lucene-Solr-7.x-Windows\solr\build\contrib\solr-analysis-extras\test\J0\temp\solr.update.processor.TestOpenNLPExtractNamedEntitiesUpdateProcessorFactory_56F702A965DD307C-001\tempDir-001\collection1\conf\en-test-tokenizer.bin: java.nio.file.AccessDeniedException: C:\Users\jenkins\workspace\Lucene-Solr-7.x-Windows\solr\build\contrib\solr-analysis-extras\test\J0\temp\solr.update.processor.TestOpenNLPExtractNamedEntitiesUpdateProcessorFactory_56F702A965DD307C-001\tempDir-001\collection1\conf\en-test-tokenizer.bin
   [junit4]    >    C:\Users\jenkins\workspace\Lucene-Solr-7.x-Windows\solr\build\contrib\solr-analysis-extras\test\J0\temp\solr.update.processor.TestOpenNLPExtractNamedEntitiesUpdateProcessorFactory_56F702A965DD307C-001\tempDir-001\collection1\conf\en-test-sent.bin: java.nio.file.AccessDeniedException: C:\Users\jenkins\workspace\Lucene-Solr-7.x-Windows\solr\build\contrib\solr-analysis-extras\test\J0\temp\solr.update.processor.TestOpenNLPExtractNamedEntitiesUpdateProcessorFactory_56F702A965DD307C-001\tempDir-001\collection1\conf\en-test-sent.bin
   [junit4]    >    C:\Users\jenkins\workspace\Lucene-Solr-7.x-Windows\solr\build\contrib\solr-analysis-extras\test\J0\temp\solr.update.processor.TestOpenNLPExtractNamedEntitiesUpdateProcessorFactory_56F702A965DD307C-001\tempDir-001\collection1\conf\en-test-ner-person.bin: java.nio.file.AccessDeniedException: C:\Users\jenkins\workspace\Lucene-Solr-7.x-Windows\solr\build\contrib\solr-analysis-extras\test\J0\temp\solr.update.processor.TestOpenNLPExtractNamedEntitiesUpdateProcessorFactory_56F702A965DD307C-001\tempDir-001\collection1\conf\en-test-ner-person.bin
   [junit4]    >    C:\Users\jenkins\workspace\Lucene-Solr-7.x-Windows\solr\build\contrib\solr-analysis-extras\test\J0\temp\solr.update.processor.TestOpenNLPExtractNamedEntitiesUpdateProcessorFactory_56F702A965DD307C-001: java.nio.file.DirectoryNotEmptyException: C:\Users\jenkins\workspace\Lucene-Solr-7.x-Windows\solr\build\contrib\solr-analysis-extras\test\J0\temp\solr.update.processor.TestOpenNLPExtractNamedEntitiesUpdateProcessorFactory_56F702A965DD307C-001
   [junit4]    > 	at __randomizedtesting.SeedInfo.seed([56F702A965DD307C]:0)
   [junit4]    > 	at org.apache.lucene.util.IOUtils.rm(IOUtils.java:329)
   [junit4]    > 	at java.base/java.lang.Thread.run(Thread.java:844)
   [junit4] Completed [5/5 (1!)] on J0 in 1.28s, 8 tests, 1 error <<< FAILURES!

[...truncated 38434 lines...]

Mime
View raw message