lucene-dev mailing list archives

Site index · List index
Message view « Date » · « Thread »
Top « Date » · « Thread »
From Policeman Jenkins Server <jenk...@thetaphi.de>
Subject [JENKINS] Lucene-Solr-master-Windows (32bit/jdk1.8.0_144) - Build # 7066 - Still Unstable!
Date Sat, 23 Dec 2017 01:04:07 GMT
Build: https://jenkins.thetaphi.de/job/Lucene-Solr-master-Windows/7066/
Java: 32bit/jdk1.8.0_144 -client -XX:+UseParallelGC

5 tests failed.
FAILED:  junit.framework.TestSuite.org.apache.lucene.index.TestFieldsReader

Error Message:
Could not remove the following files (in the order of attempts):    C:\Users\jenkins\workspace\Lucene-Solr-master-Windows\lucene\build\core\test\J1\temp\lucene.index.TestFieldsReader_375045B73E749E22-001\testfieldswriterexceptions-001: java.nio.file.DirectoryNotEmptyException: C:\Users\jenkins\workspace\Lucene-Solr-master-Windows\lucene\build\core\test\J1\temp\lucene.index.TestFieldsReader_375045B73E749E22-001\testfieldswriterexceptions-001    C:\Users\jenkins\workspace\Lucene-Solr-master-Windows\lucene\build\core\test\J1\temp\lucene.index.TestFieldsReader_375045B73E749E22-001\testfieldswriterexceptions-001\_0.fnm: java.nio.file.AccessDeniedException: C:\Users\jenkins\workspace\Lucene-Solr-master-Windows\lucene\build\core\test\J1\temp\lucene.index.TestFieldsReader_375045B73E749E22-001\testfieldswriterexceptions-001\_0.fnm    C:\Users\jenkins\workspace\Lucene-Solr-master-Windows\lucene\build\core\test\J1\temp\lucene.index.TestFieldsReader_375045B73E749E22-001: java.nio.file.DirectoryNotEmptyException: C:\Users\jenkins\workspace\Lucene-Solr-master-Windows\lucene\build\core\test\J1\temp\lucene.index.TestFieldsReader_375045B73E749E22-001 

Stack Trace:
java.io.IOException: Could not remove the following files (in the order of attempts):
   C:\Users\jenkins\workspace\Lucene-Solr-master-Windows\lucene\build\core\test\J1\temp\lucene.index.TestFieldsReader_375045B73E749E22-001\testfieldswriterexceptions-001: java.nio.file.DirectoryNotEmptyException: C:\Users\jenkins\workspace\Lucene-Solr-master-Windows\lucene\build\core\test\J1\temp\lucene.index.TestFieldsReader_375045B73E749E22-001\testfieldswriterexceptions-001
   C:\Users\jenkins\workspace\Lucene-Solr-master-Windows\lucene\build\core\test\J1\temp\lucene.index.TestFieldsReader_375045B73E749E22-001\testfieldswriterexceptions-001\_0.fnm: java.nio.file.AccessDeniedException: C:\Users\jenkins\workspace\Lucene-Solr-master-Windows\lucene\build\core\test\J1\temp\lucene.index.TestFieldsReader_375045B73E749E22-001\testfieldswriterexceptions-001\_0.fnm
   C:\Users\jenkins\workspace\Lucene-Solr-master-Windows\lucene\build\core\test\J1\temp\lucene.index.TestFieldsReader_375045B73E749E22-001: java.nio.file.DirectoryNotEmptyException: C:\Users\jenkins\workspace\Lucene-Solr-master-Windows\lucene\build\core\test\J1\temp\lucene.index.TestFieldsReader_375045B73E749E22-001

	at __randomizedtesting.SeedInfo.seed([375045B73E749E22]:0)
	at org.apache.lucene.util.IOUtils.rm(IOUtils.java:329)
	at org.apache.lucene.util.TestRuleTemporaryFilesCleanup.afterAlways(TestRuleTemporaryFilesCleanup.java:216)
	at com.carrotsearch.randomizedtesting.rules.TestRuleAdapter$1.afterAlways(TestRuleAdapter.java:31)
	at com.carrotsearch.randomizedtesting.rules.StatementAdapter.evaluate(StatementAdapter.java:43)
	at com.carrotsearch.randomizedtesting.rules.StatementAdapter.evaluate(StatementAdapter.java:36)
	at org.apache.lucene.util.TestRuleAssertionsRequired$1.evaluate(TestRuleAssertionsRequired.java:53)
	at org.apache.lucene.util.TestRuleMarkFailure$1.evaluate(TestRuleMarkFailure.java:47)
	at org.apache.lucene.util.TestRuleIgnoreAfterMaxFailures$1.evaluate(TestRuleIgnoreAfterMaxFailures.java:64)
	at org.apache.lucene.util.TestRuleIgnoreTestSuites$1.evaluate(TestRuleIgnoreTestSuites.java:54)
	at com.carrotsearch.randomizedtesting.rules.StatementAdapter.evaluate(StatementAdapter.java:36)
	at com.carrotsearch.randomizedtesting.ThreadLeakControl$StatementRunner.run(ThreadLeakControl.java:368)
	at java.lang.Thread.run(Thread.java:748)


FAILED:  org.apache.lucene.util.bkd.TestDocIdsWriter.testSorted

Error Message:
C:\Users\jenkins\workspace\Lucene-Solr-master-Windows\lucene\build\core\test\J0\temp\lucene.util.bkd.TestDocIdsWriter_375045B73E749E22-001\index-SimpleFSDirectory-001\tmp

Stack Trace:
java.nio.file.AccessDeniedException: C:\Users\jenkins\workspace\Lucene-Solr-master-Windows\lucene\build\core\test\J0\temp\lucene.util.bkd.TestDocIdsWriter_375045B73E749E22-001\index-SimpleFSDirectory-001\tmp
	at __randomizedtesting.SeedInfo.seed([375045B73E749E22:7CDBF3FE5038315C]:0)
	at sun.nio.fs.WindowsException.translateToIOException(WindowsException.java:83)
	at sun.nio.fs.WindowsException.rethrowAsIOException(WindowsException.java:97)
	at sun.nio.fs.WindowsException.rethrowAsIOException(WindowsException.java:102)
	at sun.nio.fs.WindowsFileSystemProvider.newByteChannel(WindowsFileSystemProvider.java:230)
	at java.nio.file.spi.FileSystemProvider.newOutputStream(FileSystemProvider.java:434)
	at org.apache.lucene.mockfile.FilterFileSystemProvider.newOutputStream(FilterFileSystemProvider.java:197)
	at org.apache.lucene.mockfile.FilterFileSystemProvider.newOutputStream(FilterFileSystemProvider.java:197)
	at org.apache.lucene.mockfile.HandleTrackingFS.newOutputStream(HandleTrackingFS.java:129)
	at org.apache.lucene.mockfile.HandleTrackingFS.newOutputStream(HandleTrackingFS.java:129)
	at org.apache.lucene.mockfile.FilterFileSystemProvider.newOutputStream(FilterFileSystemProvider.java:197)
	at java.nio.file.Files.newOutputStream(Files.java:216)
	at org.apache.lucene.store.FSDirectory$FSIndexOutput.<init>(FSDirectory.java:413)
	at org.apache.lucene.store.FSDirectory$FSIndexOutput.<init>(FSDirectory.java:409)
	at org.apache.lucene.store.FSDirectory.createOutput(FSDirectory.java:253)
	at org.apache.lucene.store.MockDirectoryWrapper.createOutput(MockDirectoryWrapper.java:665)
	at org.apache.lucene.util.bkd.TestDocIdsWriter.test(TestDocIdsWriter.java:62)
	at org.apache.lucene.util.bkd.TestDocIdsWriter.testSorted(TestDocIdsWriter.java:55)
	at sun.reflect.NativeMethodAccessorImpl.invoke0(Native Method)
	at sun.reflect.NativeMethodAccessorImpl.invoke(NativeMethodAccessorImpl.java:62)
	at sun.reflect.DelegatingMethodAccessorImpl.invoke(DelegatingMethodAccessorImpl.java:43)
	at java.lang.reflect.Method.invoke(Method.java:498)
	at com.carrotsearch.randomizedtesting.RandomizedRunner.invoke(RandomizedRunner.java:1737)
	at com.carrotsearch.randomizedtesting.RandomizedRunner$8.evaluate(RandomizedRunner.java:934)
	at com.carrotsearch.randomizedtesting.RandomizedRunner$9.evaluate(RandomizedRunner.java:970)
	at com.carrotsearch.randomizedtesting.RandomizedRunner$10.evaluate(RandomizedRunner.java:984)
	at org.apache.lucene.util.TestRuleSetupTeardownChained$1.evaluate(TestRuleSetupTeardownChained.java:49)
	at org.apache.lucene.util.AbstractBeforeAfterRule$1.evaluate(AbstractBeforeAfterRule.java:45)
	at org.apache.lucene.util.TestRuleThreadAndTestName$1.evaluate(TestRuleThreadAndTestName.java:48)
	at org.apache.lucene.util.TestRuleIgnoreAfterMaxFailures$1.evaluate(TestRuleIgnoreAfterMaxFailures.java:64)
	at org.apache.lucene.util.TestRuleMarkFailure$1.evaluate(TestRuleMarkFailure.java:47)
	at com.carrotsearch.randomizedtesting.rules.StatementAdapter.evaluate(StatementAdapter.java:36)
	at com.carrotsearch.randomizedtesting.ThreadLeakControl$StatementRunner.run(ThreadLeakControl.java:368)
	at com.carrotsearch.randomizedtesting.ThreadLeakControl.forkTimeoutingTask(ThreadLeakControl.java:817)
	at com.carrotsearch.randomizedtesting.ThreadLeakControl$3.evaluate(ThreadLeakControl.java:468)
	at com.carrotsearch.randomizedtesting.RandomizedRunner.runSingleTest(RandomizedRunner.java:943)
	at com.carrotsearch.randomizedtesting.RandomizedRunner$5.evaluate(RandomizedRunner.java:829)
	at com.carrotsearch.randomizedtesting.RandomizedRunner$6.evaluate(RandomizedRunner.java:879)
	at com.carrotsearch.randomizedtesting.RandomizedRunner$7.evaluate(RandomizedRunner.java:890)
	at org.apache.lucene.util.AbstractBeforeAfterRule$1.evaluate(AbstractBeforeAfterRule.java:45)
	at com.carrotsearch.randomizedtesting.rules.StatementAdapter.evaluate(StatementAdapter.java:36)
	at org.apache.lucene.util.TestRuleStoreClassName$1.evaluate(TestRuleStoreClassName.java:41)
	at com.carrotsearch.randomizedtesting.rules.NoShadowingOrOverridesOnMethodsRule$1.evaluate(NoShadowingOrOverridesOnMethodsRule.java:40)
	at com.carrotsearch.randomizedtesting.rules.NoShadowingOrOverridesOnMethodsRule$1.evaluate(NoShadowingOrOverridesOnMethodsRule.java:40)
	at com.carrotsearch.randomizedtesting.rules.StatementAdapter.evaluate(StatementAdapter.java:36)
	at com.carrotsearch.randomizedtesting.rules.StatementAdapter.evaluate(StatementAdapter.java:36)
	at com.carrotsearch.randomizedtesting.rules.StatementAdapter.evaluate(StatementAdapter.java:36)
	at org.apache.lucene.util.TestRuleAssertionsRequired$1.evaluate(TestRuleAssertionsRequired.java:53)
	at org.apache.lucene.util.TestRuleMarkFailure$1.evaluate(TestRuleMarkFailure.java:47)
	at org.apache.lucene.util.TestRuleIgnoreAfterMaxFailures$1.evaluate(TestRuleIgnoreAfterMaxFailures.java:64)
	at org.apache.lucene.util.TestRuleIgnoreTestSuites$1.evaluate(TestRuleIgnoreTestSuites.java:54)
	at com.carrotsearch.randomizedtesting.rules.StatementAdapter.evaluate(StatementAdapter.java:36)
	at com.carrotsearch.randomizedtesting.ThreadLeakControl$StatementRunner.run(ThreadLeakControl.java:368)
	at java.lang.Thread.run(Thread.java:748)


FAILED:  junit.framework.TestSuite.org.apache.lucene.store.TestHardLinkCopyDirectoryWrapper

Error Message:
Could not remove the following files (in the order of attempts):    C:\Users\jenkins\workspace\Lucene-Solr-master-Windows\lucene\build\misc\test\J0\temp\lucene.store.TestHardLinkCopyDirectoryWrapper_FA792A2A5E97E394-001: java.nio.file.DirectoryNotEmptyException: C:\Users\jenkins\workspace\Lucene-Solr-master-Windows\lucene\build\misc\test\J0\temp\lucene.store.TestHardLinkCopyDirectoryWrapper_FA792A2A5E97E394-001 

Stack Trace:
java.io.IOException: Could not remove the following files (in the order of attempts):
   C:\Users\jenkins\workspace\Lucene-Solr-master-Windows\lucene\build\misc\test\J0\temp\lucene.store.TestHardLinkCopyDirectoryWrapper_FA792A2A5E97E394-001: java.nio.file.DirectoryNotEmptyException: C:\Users\jenkins\workspace\Lucene-Solr-master-Windows\lucene\build\misc\test\J0\temp\lucene.store.TestHardLinkCopyDirectoryWrapper_FA792A2A5E97E394-001

	at __randomizedtesting.SeedInfo.seed([FA792A2A5E97E394]:0)
	at org.apache.lucene.util.IOUtils.rm(IOUtils.java:329)
	at org.apache.lucene.util.TestRuleTemporaryFilesCleanup.afterAlways(TestRuleTemporaryFilesCleanup.java:216)
	at com.carrotsearch.randomizedtesting.rules.TestRuleAdapter$1.afterAlways(TestRuleAdapter.java:31)
	at com.carrotsearch.randomizedtesting.rules.StatementAdapter.evaluate(StatementAdapter.java:43)
	at com.carrotsearch.randomizedtesting.rules.StatementAdapter.evaluate(StatementAdapter.java:36)
	at org.apache.lucene.util.TestRuleAssertionsRequired$1.evaluate(TestRuleAssertionsRequired.java:53)
	at org.apache.lucene.util.TestRuleMarkFailure$1.evaluate(TestRuleMarkFailure.java:47)
	at org.apache.lucene.util.TestRuleIgnoreAfterMaxFailures$1.evaluate(TestRuleIgnoreAfterMaxFailures.java:64)
	at org.apache.lucene.util.TestRuleIgnoreTestSuites$1.evaluate(TestRuleIgnoreTestSuites.java:54)
	at com.carrotsearch.randomizedtesting.rules.StatementAdapter.evaluate(StatementAdapter.java:36)
	at com.carrotsearch.randomizedtesting.ThreadLeakControl$StatementRunner.run(ThreadLeakControl.java:368)
	at java.lang.Thread.run(Thread.java:748)


FAILED:  org.apache.solr.cloud.TestCollectionAPI.test

Error Message:
Timeout occured while waiting response from server at: https://127.0.0.1:59889

Stack Trace:
org.apache.solr.client.solrj.SolrServerException: Timeout occured while waiting response from server at: https://127.0.0.1:59889
	at __randomizedtesting.SeedInfo.seed([791333F26452344:8FC50CE588B94EBC]:0)
	at org.apache.solr.client.solrj.impl.HttpSolrClient.executeMethod(HttpSolrClient.java:654)
	at org.apache.solr.client.solrj.impl.HttpSolrClient.request(HttpSolrClient.java:255)
	at org.apache.solr.client.solrj.impl.HttpSolrClient.request(HttpSolrClient.java:244)
	at org.apache.solr.client.solrj.impl.LBHttpSolrClient.doRequest(LBHttpSolrClient.java:483)
	at org.apache.solr.client.solrj.impl.LBHttpSolrClient.request(LBHttpSolrClient.java:413)
	at org.apache.solr.client.solrj.impl.CloudSolrClient.sendRequest(CloudSolrClient.java:1104)
	at org.apache.solr.client.solrj.impl.CloudSolrClient.requestWithRetryOnStaleState(CloudSolrClient.java:884)
	at org.apache.solr.client.solrj.impl.CloudSolrClient.request(CloudSolrClient.java:817)
	at org.apache.solr.client.solrj.SolrRequest.process(SolrRequest.java:194)
	at org.apache.solr.client.solrj.SolrRequest.process(SolrRequest.java:211)
	at org.apache.solr.cloud.AbstractFullDistribZkTestBase.createServers(AbstractFullDistribZkTestBase.java:315)
	at org.apache.solr.BaseDistributedSearchTestCase$ShardsRepeatRule$ShardsFixedStatement.callStatement(BaseDistributedSearchTestCase.java:991)
	at org.apache.solr.BaseDistributedSearchTestCase$ShardsRepeatRule$ShardsStatement.evaluate(BaseDistributedSearchTestCase.java:968)
	at com.carrotsearch.randomizedtesting.rules.SystemPropertiesRestoreRule$1.evaluate(SystemPropertiesRestoreRule.java:57)
	at org.apache.lucene.util.TestRuleSetupTeardownChained$1.evaluate(TestRuleSetupTeardownChained.java:49)
	at org.apache.lucene.util.AbstractBeforeAfterRule$1.evaluate(AbstractBeforeAfterRule.java:45)
	at org.apache.lucene.util.TestRuleThreadAndTestName$1.evaluate(TestRuleThreadAndTestName.java:48)
	at org.apache.lucene.util.TestRuleIgnoreAfterMaxFailures$1.evaluate(TestRuleIgnoreAfterMaxFailures.java:64)
	at org.apache.lucene.util.TestRuleMarkFailure$1.evaluate(TestRuleMarkFailure.java:47)
	at com.carrotsearch.randomizedtesting.rules.StatementAdapter.evaluate(StatementAdapter.java:36)
	at com.carrotsearch.randomizedtesting.ThreadLeakControl$StatementRunner.run(ThreadLeakControl.java:368)
	at com.carrotsearch.randomizedtesting.ThreadLeakControl.forkTimeoutingTask(ThreadLeakControl.java:817)
	at com.carrotsearch.randomizedtesting.ThreadLeakControl$3.evaluate(ThreadLeakControl.java:468)
	at com.carrotsearch.randomizedtesting.RandomizedRunner.runSingleTest(RandomizedRunner.java:943)
	at com.carrotsearch.randomizedtesting.RandomizedRunner$5.evaluate(RandomizedRunner.java:829)
	at com.carrotsearch.randomizedtesting.RandomizedRunner$6.evaluate(RandomizedRunner.java:879)
	at com.carrotsearch.randomizedtesting.RandomizedRunner$7.evaluate(RandomizedRunner.java:890)
	at com.carrotsearch.randomizedtesting.rules.StatementAdapter.evaluate(StatementAdapter.java:36)
	at com.carrotsearch.randomizedtesting.rules.SystemPropertiesRestoreRule$1.evaluate(SystemPropertiesRestoreRule.java:57)
	at org.apache.lucene.util.AbstractBeforeAfterRule$1.evaluate(AbstractBeforeAfterRule.java:45)
	at com.carrotsearch.randomizedtesting.rules.StatementAdapter.evaluate(StatementAdapter.java:36)
	at org.apache.lucene.util.TestRuleStoreClassName$1.evaluate(TestRuleStoreClassName.java:41)
	at com.carrotsearch.randomizedtesting.rules.NoShadowingOrOverridesOnMethodsRule$1.evaluate(NoShadowingOrOverridesOnMethodsRule.java:40)
	at com.carrotsearch.randomizedtesting.rules.NoShadowingOrOverridesOnMethodsRule$1.evaluate(NoShadowingOrOverridesOnMethodsRule.java:40)
	at com.carrotsearch.randomizedtesting.rules.StatementAdapter.evaluate(StatementAdapter.java:36)
	at com.carrotsearch.randomizedtesting.rules.StatementAdapter.evaluate(StatementAdapter.java:36)
	at com.carrotsearch.randomizedtesting.rules.StatementAdapter.evaluate(StatementAdapter.java:36)
	at org.apache.lucene.util.TestRuleAssertionsRequired$1.evaluate(TestRuleAssertionsRequired.java:53)
	at org.apache.lucene.util.TestRuleMarkFailure$1.evaluate(TestRuleMarkFailure.java:47)
	at org.apache.lucene.util.TestRuleIgnoreAfterMaxFailures$1.evaluate(TestRuleIgnoreAfterMaxFailures.java:64)
	at org.apache.lucene.util.TestRuleIgnoreTestSuites$1.evaluate(TestRuleIgnoreTestSuites.java:54)
	at com.carrotsearch.randomizedtesting.rules.StatementAdapter.evaluate(StatementAdapter.java:36)
	at com.carrotsearch.randomizedtesting.ThreadLeakControl$StatementRunner.run(ThreadLeakControl.java:368)
	at java.lang.Thread.run(Thread.java:748)
Caused by: java.net.SocketTimeoutException: Read timed out
	at java.net.SocketInputStream.socketRead0(Native Method)
	at java.net.SocketInputStream.socketRead(SocketInputStream.java:116)
	at java.net.SocketInputStream.read(SocketInputStream.java:171)
	at java.net.SocketInputStream.read(SocketInputStream.java:141)
	at sun.security.ssl.InputRecord.readFully(InputRecord.java:465)
	at sun.security.ssl.InputRecord.read(InputRecord.java:503)
	at sun.security.ssl.SSLSocketImpl.readRecord(SSLSocketImpl.java:983)
	at sun.security.ssl.SSLSocketImpl.readDataRecord(SSLSocketImpl.java:940)
	at sun.security.ssl.AppInputStream.read(AppInputStream.java:105)
	at org.apache.http.impl.io.SessionInputBufferImpl.streamRead(SessionInputBufferImpl.java:137)
	at org.apache.http.impl.io.SessionInputBufferImpl.fillBuffer(SessionInputBufferImpl.java:153)
	at org.apache.http.impl.io.SessionInputBufferImpl.readLine(SessionInputBufferImpl.java:282)
	at org.apache.http.impl.conn.DefaultHttpResponseParser.parseHead(DefaultHttpResponseParser.java:138)
	at org.apache.http.impl.conn.DefaultHttpResponseParser.parseHead(DefaultHttpResponseParser.java:56)
	at org.apache.http.impl.io.AbstractMessageParser.parse(AbstractMessageParser.java:259)
	at org.apache.http.impl.DefaultBHttpClientConnection.receiveResponseHeader(DefaultBHttpClientConnection.java:163)
	at org.apache.http.impl.conn.CPoolProxy.receiveResponseHeader(CPoolProxy.java:165)
	at org.apache.http.protocol.HttpRequestExecutor.doReceiveResponse(HttpRequestExecutor.java:273)
	at org.apache.http.protocol.HttpRequestExecutor.execute(HttpRequestExecutor.java:125)
	at org.apache.http.impl.execchain.MainClientExec.execute(MainClientExec.java:272)
	at org.apache.http.impl.execchain.ProtocolExec.execute(ProtocolExec.java:185)
	at org.apache.http.impl.execchain.RetryExec.execute(RetryExec.java:89)
	at org.apache.http.impl.execchain.RedirectExec.execute(RedirectExec.java:111)
	at org.apache.http.impl.client.InternalHttpClient.doExecute(InternalHttpClient.java:185)
	at org.apache.http.impl.client.CloseableHttpClient.execute(CloseableHttpClient.java:83)
	at org.apache.http.impl.client.CloseableHttpClient.execute(CloseableHttpClient.java:56)
	at org.apache.solr.client.solrj.impl.HttpSolrClient.executeMethod(HttpSolrClient.java:542)
	... 43 more


FAILED:  junit.framework.TestSuite.org.apache.solr.update.processor.TestOpenNLPExtractNamedEntitiesUpdateProcessorFactory

Error Message:
Could not remove the following files (in the order of attempts):    C:\Users\jenkins\workspace\Lucene-Solr-master-Windows\solr\build\contrib\solr-analysis-extras\test\J1\temp\solr.update.processor.TestOpenNLPExtractNamedEntitiesUpdateProcessorFactory_DB71705CDF293114-001\tempDir-001\collection1\conf: java.nio.file.DirectoryNotEmptyException: C:\Users\jenkins\workspace\Lucene-Solr-master-Windows\solr\build\contrib\solr-analysis-extras\test\J1\temp\solr.update.processor.TestOpenNLPExtractNamedEntitiesUpdateProcessorFactory_DB71705CDF293114-001\tempDir-001\collection1\conf    C:\Users\jenkins\workspace\Lucene-Solr-master-Windows\solr\build\contrib\solr-analysis-extras\test\J1\temp\solr.update.processor.TestOpenNLPExtractNamedEntitiesUpdateProcessorFactory_DB71705CDF293114-001\tempDir-001\collection1: java.nio.file.DirectoryNotEmptyException: C:\Users\jenkins\workspace\Lucene-Solr-master-Windows\solr\build\contrib\solr-analysis-extras\test\J1\temp\solr.update.processor.TestOpenNLPExtractNamedEntitiesUpdateProcessorFactory_DB71705CDF293114-001\tempDir-001\collection1    C:\Users\jenkins\workspace\Lucene-Solr-master-Windows\solr\build\contrib\solr-analysis-extras\test\J1\temp\solr.update.processor.TestOpenNLPExtractNamedEntitiesUpdateProcessorFactory_DB71705CDF293114-001\tempDir-001: java.nio.file.DirectoryNotEmptyException: C:\Users\jenkins\workspace\Lucene-Solr-master-Windows\solr\build\contrib\solr-analysis-extras\test\J1\temp\solr.update.processor.TestOpenNLPExtractNamedEntitiesUpdateProcessorFactory_DB71705CDF293114-001\tempDir-001    C:\Users\jenkins\workspace\Lucene-Solr-master-Windows\solr\build\contrib\solr-analysis-extras\test\J1\temp\solr.update.processor.TestOpenNLPExtractNamedEntitiesUpdateProcessorFactory_DB71705CDF293114-001\tempDir-001\collection1\conf\en-test-tokenizer.bin: java.nio.file.AccessDeniedException: C:\Users\jenkins\workspace\Lucene-Solr-master-Windows\solr\build\contrib\solr-analysis-extras\test\J1\temp\solr.update.processor.TestOpenNLPExtractNamedEntitiesUpdateProcessorFactory_DB71705CDF293114-001\tempDir-001\collection1\conf\en-test-tokenizer.bin    C:\Users\jenkins\workspace\Lucene-Solr-master-Windows\solr\build\contrib\solr-analysis-extras\test\J1\temp\solr.update.processor.TestOpenNLPExtractNamedEntitiesUpdateProcessorFactory_DB71705CDF293114-001\tempDir-001\collection1\conf\en-test-ner-person.bin: java.nio.file.AccessDeniedException: C:\Users\jenkins\workspace\Lucene-Solr-master-Windows\solr\build\contrib\solr-analysis-extras\test\J1\temp\solr.update.processor.TestOpenNLPExtractNamedEntitiesUpdateProcessorFactory_DB71705CDF293114-001\tempDir-001\collection1\conf\en-test-ner-person.bin    C:\Users\jenkins\workspace\Lucene-Solr-master-Windows\solr\build\contrib\solr-analysis-extras\test\J1\temp\solr.update.processor.TestOpenNLPExtractNamedEntitiesUpdateProcessorFactory_DB71705CDF293114-001\tempDir-001\collection1\conf\en-test-sent.bin: java.nio.file.AccessDeniedException: C:\Users\jenkins\workspace\Lucene-Solr-master-Windows\solr\build\contrib\solr-analysis-extras\test\J1\temp\solr.update.processor.TestOpenNLPExtractNamedEntitiesUpdateProcessorFactory_DB71705CDF293114-001\tempDir-001\collection1\conf\en-test-sent.bin    C:\Users\jenkins\workspace\Lucene-Solr-master-Windows\solr\build\contrib\solr-analysis-extras\test\J1\temp\solr.update.processor.TestOpenNLPExtractNamedEntitiesUpdateProcessorFactory_DB71705CDF293114-001: java.nio.file.DirectoryNotEmptyException: C:\Users\jenkins\workspace\Lucene-Solr-master-Windows\solr\build\contrib\solr-analysis-extras\test\J1\temp\solr.update.processor.TestOpenNLPExtractNamedEntitiesUpdateProcessorFactory_DB71705CDF293114-001 

Stack Trace:
java.io.IOException: Could not remove the following files (in the order of attempts):
   C:\Users\jenkins\workspace\Lucene-Solr-master-Windows\solr\build\contrib\solr-analysis-extras\test\J1\temp\solr.update.processor.TestOpenNLPExtractNamedEntitiesUpdateProcessorFactory_DB71705CDF293114-001\tempDir-001\collection1\conf: java.nio.file.DirectoryNotEmptyException: C:\Users\jenkins\workspace\Lucene-Solr-master-Windows\solr\build\contrib\solr-analysis-extras\test\J1\temp\solr.update.processor.TestOpenNLPExtractNamedEntitiesUpdateProcessorFactory_DB71705CDF293114-001\tempDir-001\collection1\conf
   C:\Users\jenkins\workspace\Lucene-Solr-master-Windows\solr\build\contrib\solr-analysis-extras\test\J1\temp\solr.update.processor.TestOpenNLPExtractNamedEntitiesUpdateProcessorFactory_DB71705CDF293114-001\tempDir-001\collection1: java.nio.file.DirectoryNotEmptyException: C:\Users\jenkins\workspace\Lucene-Solr-master-Windows\solr\build\contrib\solr-analysis-extras\test\J1\temp\solr.update.processor.TestOpenNLPExtractNamedEntitiesUpdateProcessorFactory_DB71705CDF293114-001\tempDir-001\collection1
   C:\Users\jenkins\workspace\Lucene-Solr-master-Windows\solr\build\contrib\solr-analysis-extras\test\J1\temp\solr.update.processor.TestOpenNLPExtractNamedEntitiesUpdateProcessorFactory_DB71705CDF293114-001\tempDir-001: java.nio.file.DirectoryNotEmptyException: C:\Users\jenkins\workspace\Lucene-Solr-master-Windows\solr\build\contrib\solr-analysis-extras\test\J1\temp\solr.update.processor.TestOpenNLPExtractNamedEntitiesUpdateProcessorFactory_DB71705CDF293114-001\tempDir-001
   C:\Users\jenkins\workspace\Lucene-Solr-master-Windows\solr\build\contrib\solr-analysis-extras\test\J1\temp\solr.update.processor.TestOpenNLPExtractNamedEntitiesUpdateProcessorFactory_DB71705CDF293114-001\tempDir-001\collection1\conf\en-test-tokenizer.bin: java.nio.file.AccessDeniedException: C:\Users\jenkins\workspace\Lucene-Solr-master-Windows\solr\build\contrib\solr-analysis-extras\test\J1\temp\solr.update.processor.TestOpenNLPExtractNamedEntitiesUpdateProcessorFactory_DB71705CDF293114-001\tempDir-001\collection1\conf\en-test-tokenizer.bin
   C:\Users\jenkins\workspace\Lucene-Solr-master-Windows\solr\build\contrib\solr-analysis-extras\test\J1\temp\solr.update.processor.TestOpenNLPExtractNamedEntitiesUpdateProcessorFactory_DB71705CDF293114-001\tempDir-001\collection1\conf\en-test-ner-person.bin: java.nio.file.AccessDeniedException: C:\Users\jenkins\workspace\Lucene-Solr-master-Windows\solr\build\contrib\solr-analysis-extras\test\J1\temp\solr.update.processor.TestOpenNLPExtractNamedEntitiesUpdateProcessorFactory_DB71705CDF293114-001\tempDir-001\collection1\conf\en-test-ner-person.bin
   C:\Users\jenkins\workspace\Lucene-Solr-master-Windows\solr\build\contrib\solr-analysis-extras\test\J1\temp\solr.update.processor.TestOpenNLPExtractNamedEntitiesUpdateProcessorFactory_DB71705CDF293114-001\tempDir-001\collection1\conf\en-test-sent.bin: java.nio.file.AccessDeniedException: C:\Users\jenkins\workspace\Lucene-Solr-master-Windows\solr\build\contrib\solr-analysis-extras\test\J1\temp\solr.update.processor.TestOpenNLPExtractNamedEntitiesUpdateProcessorFactory_DB71705CDF293114-001\tempDir-001\collection1\conf\en-test-sent.bin
   C:\Users\jenkins\workspace\Lucene-Solr-master-Windows\solr\build\contrib\solr-analysis-extras\test\J1\temp\solr.update.processor.TestOpenNLPExtractNamedEntitiesUpdateProcessorFactory_DB71705CDF293114-001: java.nio.file.DirectoryNotEmptyException: C:\Users\jenkins\workspace\Lucene-Solr-master-Windows\solr\build\contrib\solr-analysis-extras\test\J1\temp\solr.update.processor.TestOpenNLPExtractNamedEntitiesUpdateProcessorFactory_DB71705CDF293114-001

	at __randomizedtesting.SeedInfo.seed([DB71705CDF293114]:0)
	at org.apache.lucene.util.IOUtils.rm(IOUtils.java:329)
	at org.apache.lucene.util.TestRuleTemporaryFilesCleanup.afterAlways(TestRuleTemporaryFilesCleanup.java:216)
	at com.carrotsearch.randomizedtesting.rules.TestRuleAdapter$1.afterAlways(TestRuleAdapter.java:31)
	at com.carrotsearch.randomizedtesting.rules.StatementAdapter.evaluate(StatementAdapter.java:43)
	at com.carrotsearch.randomizedtesting.rules.StatementAdapter.evaluate(StatementAdapter.java:36)
	at org.apache.lucene.util.TestRuleAssertionsRequired$1.evaluate(TestRuleAssertionsRequired.java:53)
	at org.apache.lucene.util.TestRuleMarkFailure$1.evaluate(TestRuleMarkFailure.java:47)
	at org.apache.lucene.util.TestRuleIgnoreAfterMaxFailures$1.evaluate(TestRuleIgnoreAfterMaxFailures.java:64)
	at org.apache.lucene.util.TestRuleIgnoreTestSuites$1.evaluate(TestRuleIgnoreTestSuites.java:54)
	at com.carrotsearch.randomizedtesting.rules.StatementAdapter.evaluate(StatementAdapter.java:36)
	at com.carrotsearch.randomizedtesting.ThreadLeakControl$StatementRunner.run(ThreadLeakControl.java:368)
	at java.lang.Thread.run(Thread.java:748)




Build Log:
[...truncated 1144 lines...]
   [junit4] Suite: org.apache.lucene.index.TestFieldsReader
   [junit4]   2> NOTE: test params are: codec=DummyCompressingStoredFields(storedFieldsFormat=CompressingStoredFieldsFormat(compressionMode=DUMMY, chunkSize=10, maxDocsPerChunk=9, blockSize=768), termVectorsFormat=CompressingTermVectorsFormat(compressionMode=DUMMY, chunkSize=10, blockSize=768)), sim=Asserting(org.apache.lucene.search.similarities.AssertingSimilarity@1342981), locale=es-PA, timezone=Australia/Perth
   [junit4]   2> NOTE: Windows 10 10.0 x86/Oracle Corporation 1.8.0_144 (32-bit)/cpus=3,threads=1,free=67328456,total=244056064
   [junit4]   2> NOTE: All tests run in this JVM: [TermInSetQueryTest, TestTimSorter, TestFlex, TestSegmentCacheables, TestSubScorerFreqs, TestBooleanScorer, Test2BPostingsBytes, TestOrdinalMap, TestUpgradeIndexMergePolicy, Test2BPagedBytes, TestNormsFieldExistsQuery, Test2BDocs, TestSegmentTermDocs, TestIndexCommit, TestMutablePointsReaderUtils, TestBasicModelIF, TestIndexWriterReader, TestSimilarityBase, TestPrefixCodedTerms, TestSloppyPhraseQuery2, TestGeoUtils, TestSortRescorer, TestMultiLevelSkipList, TestNRTReaderWithThreads, TestDisjunctionMaxQuery, TestFieldMaskingSpanQuery, TestPayloads, TestIndexReaderClose, TestTermRangeQuery, TestSimpleFSDirectory, TestSizeBoundedForceMerge, TestSingleInstanceLockFactory, TestBlockPostingsFormat, TestDeterminism, TestNearSpansOrdered, TestTopFieldCollectorEarlyTermination, TestRollback, TestMatchNoDocsQuery, TestNot, TestPersistentSnapshotDeletionPolicy, TestDocumentsWriterStallControl, TestTransactions, TestComplexExplanationsOfNonMatches, TestSparseFixedBitDocIdSet, TestAutomaton, TestFileSwitchDirectory, TestSmallFloat, TestDirectory, TestPositiveScoresOnlyCollector, TestDocValues, TestConcurrentMergeScheduler, TestSpansEnum, TestFixedBitDocIdSet, TestFilterDirectoryReader, TestTermVectorsReader, TestAutomatonQueryUnicode, TestIndexWriterConfig, TestClassicSimilarity, TestMultiDocValues, TestNumericDocValuesUpdates, TestPackedInts, TestStringHelper, TestDoubleRangeFieldQueries, TestSynonymQuery, TestNotDocIdSet, TestNRTThreads, TestPhraseQuery, TestCharsRefBuilder, TestForTooMuchCloning, TestBytesStore, TestAxiomaticF1LOG, TestAllFilesCheckIndexHeader, TestMathUtil, TestOmitNorms, TestCharsRef, TestPostingsOffsets, TestMultiPhraseQuery, TestDeletionPolicy, TestElevationComparator, TestGraphTokenizers, TestIntArrayDocIdSet, TestDirectPacked, TestTragicIndexWriterDeadlock, TestBlockPostingsFormat3, TestNoDeletionPolicy, TestSpanMultiTermQueryWrapper, TestTotalHitCountCollector, TestCharTermAttributeImpl, TestBasicModelIne, TestLucene50StoredFieldsFormatHighCompression, TestSPIClassIterator, TestSimilarity, TestReadOnlyIndex, TestTermVectorsWriter, TestFilterWeight, TestCustomSearcherSort, TestWildcard, TestPerSegmentDeletes, TestTermVectors, Test2BSortedDocValuesFixedSorted, TestAllFilesHaveChecksumFooter, TestIndexWriterCommit, TestLucene50CompoundFormat, TestSpanOrQuery, TestBM25Similarity, TestIndexTooManyDocs, TestCheckIndex, TestTermsEnum2, TestMultiset, TestDemo, TestPagedBytes, TestSegmentInfos, TestNGramPhraseQuery, TestIndexWriterExceptions2, TestIndexWriterOutOfFileDescriptors, TestDelegatingAnalyzerWrapper, TestIndependenceSaturated, TestIntroSorter, TestIndexingSequenceNumbers, TestIndexWriter, TestPerFieldDocValuesFormat, TestFSTs, TestIndexWriterWithThreads, TestAddIndexes, TestSearcherManager, TestIndexWriterDelete, TestAtomicUpdate, TestNorms, TestDirectoryReaderReopen, TestSearchAfter, TestLongPostings, TestMinimize, TestSnapshotDeletionPolicy, TestPerFieldPostingsFormat, TestBufferedIndexInput, TestTermsEnum, TestNRTCachingDirectory, TestSegmentReader, TestFastDecompressionMode, TestIndexWriterNRTIsCurrent, TestSort, TestFieldsReader]
   [junit4]   2> NOTE: reproduce with: ant test  -Dtestcase=TestFieldsReader -Dtests.seed=375045B73E749E22 -Dtests.slow=true -Dtests.locale=es-PA -Dtests.timezone=Australia/Perth -Dtests.asserts=true -Dtests.file.encoding=UTF-8
   [junit4] ERROR   0.00s J1 | TestFieldsReader (suite) <<<
   [junit4]    > Throwable #1: java.io.IOException: Could not remove the following files (in the order of attempts):
   [junit4]    >    C:\Users\jenkins\workspace\Lucene-Solr-master-Windows\lucene\build\core\test\J1\temp\lucene.index.TestFieldsReader_375045B73E749E22-001\testfieldswriterexceptions-001: java.nio.file.DirectoryNotEmptyException: C:\Users\jenkins\workspace\Lucene-Solr-master-Windows\lucene\build\core\test\J1\temp\lucene.index.TestFieldsReader_375045B73E749E22-001\testfieldswriterexceptions-001
   [junit4]    >    C:\Users\jenkins\workspace\Lucene-Solr-master-Windows\lucene\build\core\test\J1\temp\lucene.index.TestFieldsReader_375045B73E749E22-001\testfieldswriterexceptions-001\_0.fnm: java.nio.file.AccessDeniedException: C:\Users\jenkins\workspace\Lucene-Solr-master-Windows\lucene\build\core\test\J1\temp\lucene.index.TestFieldsReader_375045B73E749E22-001\testfieldswriterexceptions-001\_0.fnm
   [junit4]    >    C:\Users\jenkins\workspace\Lucene-Solr-master-Windows\lucene\build\core\test\J1\temp\lucene.index.TestFieldsReader_375045B73E749E22-001: java.nio.file.DirectoryNotEmptyException: C:\Users\jenkins\workspace\Lucene-Solr-master-Windows\lucene\build\core\test\J1\temp\lucene.index.TestFieldsReader_375045B73E749E22-001
   [junit4]    > 	at __randomizedtesting.SeedInfo.seed([375045B73E749E22]:0)
   [junit4]    > 	at org.apache.lucene.util.IOUtils.rm(IOUtils.java:329)
   [junit4]    > 	at java.lang.Thread.run(Thread.java:748)
   [junit4] Completed [282/475 (1!)] on J1 in 0.69s, 2 tests, 1 error <<< FAILURES!

[...truncated 642 lines...]
   [junit4] Suite: org.apache.lucene.util.bkd.TestDocIdsWriter
   [junit4]   2> NOTE: reproduce with: ant test  -Dtestcase=TestDocIdsWriter -Dtests.method=testSorted -Dtests.seed=375045B73E749E22 -Dtests.slow=true -Dtests.locale=sv -Dtests.timezone=Asia/Dubai -Dtests.asserts=true -Dtests.file.encoding=UTF-8
   [junit4] ERROR   1.17s J0 | TestDocIdsWriter.testSorted <<<
   [junit4]    > Throwable #1: java.nio.file.AccessDeniedException: C:\Users\jenkins\workspace\Lucene-Solr-master-Windows\lucene\build\core\test\J0\temp\lucene.util.bkd.TestDocIdsWriter_375045B73E749E22-001\index-SimpleFSDirectory-001\tmp
   [junit4]    > 	at __randomizedtesting.SeedInfo.seed([375045B73E749E22:7CDBF3FE5038315C]:0)
   [junit4]    > 	at sun.nio.fs.WindowsException.translateToIOException(WindowsException.java:83)
   [junit4]    > 	at sun.nio.fs.WindowsException.rethrowAsIOException(WindowsException.java:97)
   [junit4]    > 	at sun.nio.fs.WindowsException.rethrowAsIOException(WindowsException.java:102)
   [junit4]    > 	at sun.nio.fs.WindowsFileSystemProvider.newByteChannel(WindowsFileSystemProvider.java:230)
   [junit4]    > 	at java.nio.file.spi.FileSystemProvider.newOutputStream(FileSystemProvider.java:434)
   [junit4]    > 	at org.apache.lucene.mockfile.FilterFileSystemProvider.newOutputStream(FilterFileSystemProvider.java:197)
   [junit4]    > 	at org.apache.lucene.mockfile.FilterFileSystemProvider.newOutputStream(FilterFileSystemProvider.java:197)
   [junit4]    > 	at org.apache.lucene.mockfile.HandleTrackingFS.newOutputStream(HandleTrackingFS.java:129)
   [junit4]    > 	at org.apache.lucene.mockfile.HandleTrackingFS.newOutputStream(HandleTrackingFS.java:129)
   [junit4]    > 	at org.apache.lucene.mockfile.FilterFileSystemProvider.newOutputStream(FilterFileSystemProvider.java:197)
   [junit4]    > 	at java.nio.file.Files.newOutputStream(Files.java:216)
   [junit4]    > 	at org.apache.lucene.store.FSDirectory$FSIndexOutput.<init>(FSDirectory.java:413)
   [junit4]    > 	at org.apache.lucene.store.FSDirectory$FSIndexOutput.<init>(FSDirectory.java:409)
   [junit4]    > 	at org.apache.lucene.store.FSDirectory.createOutput(FSDirectory.java:253)
   [junit4]    > 	at org.apache.lucene.store.MockDirectoryWrapper.createOutput(MockDirectoryWrapper.java:665)
   [junit4]    > 	at org.apache.lucene.util.bkd.TestDocIdsWriter.test(TestDocIdsWriter.java:62)
   [junit4]    > 	at org.apache.lucene.util.bkd.TestDocIdsWriter.testSorted(TestDocIdsWriter.java:55)
   [junit4]    > 	at java.lang.Thread.run(Thread.java:748)
   [junit4]   2> NOTE: leaving temporary files on disk at: C:\Users\jenkins\workspace\Lucene-Solr-master-Windows\lucene\build\core\test\J0\temp\lucene.util.bkd.TestDocIdsWriter_375045B73E749E22-001
   [junit4]   2> NOTE: test params are: codec=Asserting(Lucene70), sim=Asserting(org.apache.lucene.search.similarities.AssertingSimilarity@1e53f40), locale=sv, timezone=Asia/Dubai
   [junit4]   2> NOTE: Windows 10 10.0 x86/Oracle Corporation 1.8.0_144 (32-bit)/cpus=3,threads=1,free=171359592,total=266338304
   [junit4]   2> NOTE: All tests run in this JVM: [TestBagOfPostings, TestFixedLengthBytesRefArray, TestToken, TestHugeRamFile, TestLockFactory, TestSortedNumericSortField, TestInPlaceMergeSorter, TestNewestSegment, TestGeoEncodingUtils, TestParallelLeafReader, TestNRTReaderCleanup, TestIndependenceStandardized, TestLSBRadixSorter, TestCustomNorms, TestMatchAllDocsQuery, TestSearch, TestFloatRangeFieldQueries, TestGraphTokenStreamFiniteStrings, TestSleepingLockWrapper, TestMergePolicyWrapper, TestParallelCompositeReader, TestPrefixQuery, TestIndexWriterMergePolicy, TestSparseFixedBitSet, TestFieldValueQuery, TestVirtualMethod, TestDocCount, TestLazyProxSkipping, TestApproximationSearchEquivalence, TestPriorityQueue, TestDocValuesIndexing, TestCharacterUtils, TestNeedsScores, TestSloppyPhraseQuery, TestIndexWriterThreadsToSegments, TestBooleanQueryVisitSubscorers, TestHighCompressionMode, TestMinShouldMatch2, TestMultiMMap, TestSimilarity2, TestConjunctions, TestFieldCacheRewriteMethod, TestSwappedIndexFiles, TestOperations, TestSpanBoostQuery, TestConsistentFieldNumbers, TestWildcardRandom, TestBufferedChecksum, TestSpanContainQuery, TestTieredMergePolicy, TestIndependenceChiSquared, TestIndexWriterFromReader, TestFilterCodecReader, TestRamUsageEstimator, TestBinaryDocument, TestFilterLeafReader, TestIndexInput, TestNeverDelete, TestNamedSPILoader, TestDateSort, TestDocInverterPerFieldErrorInfo, TestStandardAnalyzer, TestMultiThreadTermVectors, TestRecyclingIntBlockAllocator, TestGrowableByteArrayDataOutput, TestLucene70SegmentInfoFormat, TestLMJelinekMercerSimilarity, TestExceedMaxTermLength, TestDocument, TestDocIdSetBuilder, TestIndexManyDocuments, TestIndexableField, LimitedFiniteStringsIteratorTest, TestQueryBuilder, TestSpanExplanations, TestDistributionLL, TestMergedIterator, TestDocsAndPositions, TestSimpleExplanationsWithFillerDocs, TestDirectoryReader, TestSimpleFSLockFactory, TestTimSorterWorstCase, Test2BSortedDocValuesOrds, Test2BPoints, TestSegmentTermEnum, TestSimpleExplanationsOfNonMatches, TestIndexSearcher, TestIOUtils, TestSameTokenSamePosition, TestBasicModelIn, TestCloseableThreadLocal, TestLevenshteinAutomata, TestInfoStream, TestAxiomaticF3EXP, TestIndexWriterUnicode, TestTryDelete, TestSameScoresWithThreads, TestIntroSelector, TestPointQueries, TestNIOFSDirectory, TestPayloadsOnVectors, TestLucene50StoredFieldsFormat, TestPolygon, TestByteArrayDataInput, TestRegexpRandom2, TestSearchWithThreads, TestSumDocFreq, TestTermScorer, TestLiveFieldValues, TestAttributeSource, TestAllFilesHaveCodecHeader, FuzzyTermOnShortTermsTest, TestComplexExplanations, TestRAMDirectory, TestTermQuery, TestDuelingCodecs, TestTopDocsMerge, TestForUtil, TestIndexWriterMerging, TestShardSearching, TestIndexWriterExceptions, TestBooleanOr, TestBasics, TestFlushByRamOrCountsPolicy, TestBoolean2, TestStressAdvance, TestTimeLimitingCollector, TestStressIndexing, TestRollingUpdates, TestIndexWriterForceMerge, TestArrayUtil, TestByteSlices, TestWeakIdentityMap, TestSimpleExplanations, TestSegmentMerger, TestCollectionUtil, TestBagOfPositions, TestFixedBitSet, TestCrash, TestPerFieldPostingsFormat2, TestBooleanMinShouldMatch, TestSpans, TestUTF32ToUTF8, TestOmitPositions, TestThreadedForceMerge, TestStressNRT, TestForceMergeForever, TestMultiFields, TestDocumentWriter, TestScorerPerf, TestFuzzyQuery, TestPrefixInBooleanQuery, TestUnicodeUtil, TestAutomatonQuery, TestPrefixRandom, TestSearchForDuplicates, TestCompiledAutomaton, TestConstantScoreQuery, TestBinaryTerms, TestPositionIncrement, TestSpanExplanationsOfNonMatches, TestSimilarityProvider, TestCachingTokenFilter, TestDateTools, TestCachingCollector, TestSpanFirstQuery, TestNoMergePolicy, TestIndexWriterLockRelease, TestByteBlockPool, TestAssertions, TestTwoPhaseCommitTool, TestVersion, TestCodecHoldsOpenFiles, MultiCollectorTest, TestIntsRef, TestTermdocPerf, TestTerm, Test2BNumericDocValues, TestCharArrayMap, TestReusableStringReader, TestWordlistLoader, TestPackedTokenAttributeImpl, TestCodecUtil, TestBlockPostingsFormat2, TestLucene60FieldInfoFormat, TestLucene60PointsFormat, TestIndexedDISI, TestLucene70NormsFormat, TestFieldType, TestPolygon2D, TestAllFilesDetectTruncation, TestBinaryDocValuesUpdates, TestCustomTermFreq, TestDemoParallelLeafReader, TestDocIDMerger, TestDocsWithFieldSet, TestDuelingCodecsAtNight, TestExitableDirectoryReader, TestFieldInvertState, TestFieldReuse, TestIndexSorting, TestIndexWriterDeleteByQuery, TestIndexWriterMaxDocs, TestIndexWriterOnVMError, TestLogMergePolicy, TestManyFields, TestMaxPosition, TestMergeRateLimiter, TestMixedDocValuesUpdates, TestMultiTermsEnum, TestOneMergeWrappingMergePolicy, TestPointValues, TestReaderWrapperDVTypeCheck, TestSortedSetDocValues, TestStressDeletes, TestTerms, TestBlendedTermQuery, TestBoolean2ScorerSupplier, TestBooleanRewrites, TestBoostQuery, TestConjunctionDISI, TestControlledRealTimeReopenThread, TestDocValuesQueries, TestDocValuesRewriteMethod, TestEarlyTermination, TestIndexOrDocValuesQuery, TestIntRangeFieldQueries, TestLRUQueryCache, TestMultiCollector, TestQueryRescorer, TestSortedSetSortField, TestWANDScorer, TestAxiomaticF2LOG, TestAxiomaticSimilarity, TestBooleanSimilarity, TestDistributionSPL, TestLMDirichletSimilarity, TestFilterSpans, TestSpanCollection, TestSpanNearQuery, TestSpanNotQuery, TestSpanTermQuery, TestFilterDirectory, TestMmapDirectory, TestNativeFSLockFactory, TestRateLimiter, TestTrackingDirectoryWrapper, TestBytesRefArray, TestFrequencyTrackingRingBuffer, TestLongBitSet, TestMSBRadixSorter, TestOfflineSorter, Test2BBKDPoints, TestDocIdsWriter]
   [junit4] Completed [472/475 (2!)] on J0 in 3.80s, 2 tests, 1 error <<< FAILURES!

[...truncated 6357 lines...]
   [junit4] Suite: org.apache.lucene.store.TestHardLinkCopyDirectoryWrapper
   [junit4] IGNOR/A 0.00s J0 | TestHardLinkCopyDirectoryWrapper.testFsyncDoesntCreateNewFiles
   [junit4]    > Assumption #1: test only works for FSDirectory subclasses
   [junit4] IGNOR/A 0.01s J0 | TestHardLinkCopyDirectoryWrapper.testCopyHardLinks
   [junit4]    > Assumption #1: hardlinks are not supported
   [junit4] IGNOR/A 0.00s J0 | TestHardLinkCopyDirectoryWrapper.testPendingDeletions
   [junit4]    > Assumption #1: we can only install VirusCheckingFS on an FSDirectory
   [junit4]   2> NOTE: test params are: codec=Asserting(Lucene70): {}, docValues:{}, maxPointsInLeafNode=535, maxMBSortInHeap=5.181882573827997, sim=Asserting(org.apache.lucene.search.similarities.AssertingSimilarity@134c02d), locale=fr-FR, timezone=Europe/Kiev
   [junit4]   2> NOTE: Windows 10 10.0 x86/Oracle Corporation 1.8.0_144 (32-bit)/cpus=3,threads=1,free=17966880,total=178520064
   [junit4]   2> NOTE: All tests run in this JVM: [TestFSTsMisc, TestInetAddressPoint, TestMultiPassIndexSplitter, TestInetAddressRangeQueries, TestDiversifiedTopDocsCollector, TestHardLinkCopyDirectoryWrapper]
   [junit4]   2> NOTE: reproduce with: ant test  -Dtestcase=TestHardLinkCopyDirectoryWrapper -Dtests.seed=FA792A2A5E97E394 -Dtests.slow=true -Dtests.locale=fr-FR -Dtests.timezone=Europe/Kiev -Dtests.asserts=true -Dtests.file.encoding=ISO-8859-1
   [junit4] ERROR   0.00s J0 | TestHardLinkCopyDirectoryWrapper (suite) <<<
   [junit4]    > Throwable #1: java.io.IOException: Could not remove the following files (in the order of attempts):
   [junit4]    >    C:\Users\jenkins\workspace\Lucene-Solr-master-Windows\lucene\build\misc\test\J0\temp\lucene.store.TestHardLinkCopyDirectoryWrapper_FA792A2A5E97E394-001: java.nio.file.DirectoryNotEmptyException: C:\Users\jenkins\workspace\Lucene-Solr-master-Windows\lucene\build\misc\test\J0\temp\lucene.store.TestHardLinkCopyDirectoryWrapper_FA792A2A5E97E394-001
   [junit4]    > 	at __randomizedtesting.SeedInfo.seed([FA792A2A5E97E394]:0)
   [junit4]    > 	at org.apache.lucene.util.IOUtils.rm(IOUtils.java:329)
   [junit4]    > 	at java.lang.Thread.run(Thread.java:748)
   [junit4] Completed [11/13 (1!)] on J0 in 1.80s, 43 tests, 1 error, 3 skipped <<< FAILURES!

[...truncated 4177 lines...]
   [junit4] Suite: org.apache.solr.cloud.TestCollectionAPI
   [junit4]   2> 1153733 INFO  (SUITE-TestCollectionAPI-seed#[791333F26452344]-worker) [    ] o.a.s.SolrTestCaseJ4 SecureRandom sanity checks: test.solr.allowed.securerandom=null & java.security.egd=file:/dev/./urandom
   [junit4]   2> Creating dataDir: C:\Users\jenkins\workspace\Lucene-Solr-master-Windows\solr\build\solr-core\test\J1\temp\solr.cloud.TestCollectionAPI_791333F26452344-001\init-core-data-001
   [junit4]   2> 1153734 WARN  (SUITE-TestCollectionAPI-seed#[791333F26452344]-worker) [    ] o.a.s.SolrTestCaseJ4 startTrackingSearchers: numOpens=1 numCloses=1
   [junit4]   2> 1153735 INFO  (SUITE-TestCollectionAPI-seed#[791333F26452344]-worker) [    ] o.a.s.SolrTestCaseJ4 Using PointFields (NUMERIC_POINTS_SYSPROP=true) w/NUMERIC_DOCVALUES_SYSPROP=true
   [junit4]   2> 1153739 INFO  (SUITE-TestCollectionAPI-seed#[791333F26452344]-worker) [    ] o.a.s.SolrTestCaseJ4 Randomized ssl (true) and clientAuth (true) via: @org.apache.solr.util.RandomizeSSL(reason=, value=NaN, ssl=NaN, clientAuth=NaN)
   [junit4]   2> 1153740 INFO  (SUITE-TestCollectionAPI-seed#[791333F26452344]-worker) [    ] o.a.s.BaseDistributedSearchTestCase Setting hostContext system property: /
   [junit4]   2> 1153744 INFO  (TEST-TestCollectionAPI.test-seed#[791333F26452344]) [    ] o.a.s.c.ZkTestServer STARTING ZK TEST SERVER
   [junit4]   2> 1153744 INFO  (Thread-2297) [    ] o.a.s.c.ZkTestServer client port:0.0.0.0/0.0.0.0:0
   [junit4]   2> 1153744 INFO  (Thread-2297) [    ] o.a.s.c.ZkTestServer Starting server
   [junit4]   2> 1153750 ERROR (Thread-2297) [    ] o.a.z.s.ZooKeeperServer ZKShutdownHandler is not registered, so ZooKeeper server won't take any action on ERROR or SHUTDOWN server state changes
   [junit4]   2> 1153844 INFO  (TEST-TestCollectionAPI.test-seed#[791333F26452344]) [    ] o.a.s.c.ZkTestServer start zk server on port:59879
   [junit4]   2> 1153856 INFO  (zkConnectionManagerCallback-4754-thread-1) [    ] o.a.s.c.c.ConnectionManager zkClient has connected
   [junit4]   2> 1153872 INFO  (zkConnectionManagerCallback-4756-thread-1) [    ] o.a.s.c.c.ConnectionManager zkClient has connected
   [junit4]   2> 1153893 INFO  (TEST-TestCollectionAPI.test-seed#[791333F26452344]) [    ] o.a.s.c.AbstractZkTestCase put C:\Users\jenkins\workspace\Lucene-Solr-master-Windows\solr\core\src\test-files\solr\collection1\conf\solrconfig-tlog.xml to /configs/conf1/solrconfig.xml
   [junit4]   2> 1153901 INFO  (TEST-TestCollectionAPI.test-seed#[791333F26452344]) [    ] o.a.s.c.AbstractZkTestCase put C:\Users\jenkins\workspace\Lucene-Solr-master-Windows\solr\core\src\test-files\solr\collection1\conf\schema15.xml to /configs/conf1/schema.xml
   [junit4]   2> 1153906 INFO  (TEST-TestCollectionAPI.test-seed#[791333F26452344]) [    ] o.a.s.c.AbstractZkTestCase put C:\Users\jenkins\workspace\Lucene-Solr-master-Windows\solr\core\src\test-files\solr\collection1\conf\solrconfig.snippet.randomindexconfig.xml to /configs/conf1/solrconfig.snippet.randomindexconfig.xml
   [junit4]   2> 1153910 INFO  (TEST-TestCollectionAPI.test-seed#[791333F26452344]) [    ] o.a.s.c.AbstractZkTestCase put C:\Users\jenkins\workspace\Lucene-Solr-master-Windows\solr\core\src\test-files\solr\collection1\conf\stopwords.txt to /configs/conf1/stopwords.txt
   [junit4]   2> 1153915 INFO  (TEST-TestCollectionAPI.test-seed#[791333F26452344]) [    ] o.a.s.c.AbstractZkTestCase put C:\Users\jenkins\workspace\Lucene-Solr-master-Windows\solr\core\src\test-files\solr\collection1\conf\protwords.txt to /configs/conf1/protwords.txt
   [junit4]   2> 1153918 INFO  (TEST-TestCollectionAPI.test-seed#[791333F26452344]) [    ] o.a.s.c.AbstractZkTestCase put C:\Users\jenkins\workspace\Lucene-Solr-master-Windows\solr\core\src\test-files\solr\collection1\conf\currency.xml to /configs/conf1/currency.xml
   [junit4]   2> 1153921 INFO  (TEST-TestCollectionAPI.test-seed#[791333F26452344]) [    ] o.a.s.c.AbstractZkTestCase put C:\Users\jenkins\workspace\Lucene-Solr-master-Windows\solr\core\src\test-files\solr\collection1\conf\enumsConfig.xml to /configs/conf1/enumsConfig.xml
   [junit4]   2> 1153924 INFO  (TEST-TestCollectionAPI.test-seed#[791333F26452344]) [    ] o.a.s.c.AbstractZkTestCase put C:\Users\jenkins\workspace\Lucene-Solr-master-Windows\solr\core\src\test-files\solr\collection1\conf\open-exchange-rates.json to /configs/conf1/open-exchange-rates.json
   [junit4]   2> 1153926 INFO  (TEST-TestCollectionAPI.test-seed#[791333F26452344]) [    ] o.a.s.c.AbstractZkTestCase put C:\Users\jenkins\workspace\Lucene-Solr-master-Windows\solr\core\src\test-files\solr\collection1\conf\mapping-ISOLatin1Accent.txt to /configs/conf1/mapping-ISOLatin1Accent.txt
   [junit4]   2> 1153928 INFO  (TEST-TestCollectionAPI.test-seed#[791333F26452344]) [    ] o.a.s.c.AbstractZkTestCase put C:\Users\jenkins\workspace\Lucene-Solr-master-Windows\solr\core\src\test-files\solr\collection1\conf\old_synonyms.txt to /configs/conf1/old_synonyms.txt
   [junit4]   2> 1153931 INFO  (TEST-TestCollectionAPI.test-seed#[791333F26452344]) [    ] o.a.s.c.AbstractZkTestCase put C:\Users\jenkins\workspace\Lucene-Solr-master-Windows\solr\core\src\test-files\solr\collection1\conf\synonyms.txt to /configs/conf1/synonyms.txt
   [junit4]   2> 1153936 INFO  (zkConnectionManagerCallback-4759-thread-1) [    ] o.a.s.c.c.ConnectionManager zkClient has connected
   [junit4]   2> 1153938 INFO  (TEST-TestCollectionAPI.test-seed#[791333F26452344]) [    ] o.a.s.c.AbstractFullDistribZkTestBase Will use NRT replicas unless explicitly asked otherwise
   [junit4]   2> 1154429 INFO  (TEST-TestCollectionAPI.test-seed#[791333F26452344]) [    ] o.e.j.s.Server jetty-9.3.20.v20170531
   [junit4]   2> 1154430 INFO  (TEST-TestCollectionAPI.test-seed#[791333F26452344]) [    ] o.e.j.s.h.ContextHandler Started o.e.j.s.ServletContextHandler@31fa5d{/,null,AVAILABLE}
   [junit4]   2> 1154436 INFO  (TEST-TestCollectionAPI.test-seed#[791333F26452344]) [    ] o.e.j.s.AbstractConnector Started ServerConnector@1b336e0{SSL,[ssl, http/1.1]}{127.0.0.1:59889}
   [junit4]   2> 1154436 INFO  (TEST-TestCollectionAPI.test-seed#[791333F26452344]) [    ] o.e.j.s.Server Started @1161836ms
   [junit4]   2> 1154436 INFO  (TEST-TestCollectionAPI.test-seed#[791333F26452344]) [    ] o.a.s.c.s.e.JettySolrRunner Jetty properties: {solr.data.dir=C:\Users\jenkins\workspace\Lucene-Solr-master-Windows\solr\build\solr-core\test\J1\temp\solr.cloud.TestCollectionAPI_791333F26452344-001\tempDir-001/control/data, replicaType=NRT, hostContext=/, hostPort=59889, coreRootDirectory=C:\Users\jenkins\workspace\Lucene-Solr-master-Windows\solr\build\solr-core\test\J1\temp\solr.cloud.TestCollectionAPI_791333F26452344-001\control-001\cores}
   [junit4]   2> 1154437 ERROR (TEST-TestCollectionAPI.test-seed#[791333F26452344]) [    ] o.a.s.u.StartupLoggingUtils Missing Java Option solr.log.dir. Logging may be missing or incomplete.
   [junit4]   2> 1154437 INFO  (TEST-TestCollectionAPI.test-seed#[791333F26452344]) [    ] o.a.s.s.SolrDispatchFilter  ___      _       Welcome to Apache Solr™ version 8.0.0
   [junit4]   2> 1154437 INFO  (TEST-TestCollectionAPI.test-seed#[791333F26452344]) [    ] o.a.s.s.SolrDispatchFilter / __| ___| |_ _   Starting in cloud mode on port null
   [junit4]   2> 1154437 INFO  (TEST-TestCollectionAPI.test-seed#[791333F26452344]) [    ] o.a.s.s.SolrDispatchFilter \__ \/ _ \ | '_|  Install dir: null
   [junit4]   2> 1154437 INFO  (TEST-TestCollectionAPI.test-seed#[791333F26452344]) [    ] o.a.s.s.SolrDispatchFilter |___/\___/_|_|    Start time: 2017-12-22T23:54:09.881Z
   [junit4]   2> 1154441 INFO  (zkConnectionManagerCallback-4761-thread-1) [    ] o.a.s.c.c.ConnectionManager zkClient has connected
   [junit4]   2> 1154441 INFO  (TEST-TestCollectionAPI.test-seed#[791333F26452344]) [    ] o.a.s.s.SolrDispatchFilter Loading solr.xml from SolrHome (not found in ZooKeeper)
   [junit4]   2> 1154441 INFO  (TEST-TestCollectionAPI.test-seed#[791333F26452344]) [    ] o.a.s.c.SolrXmlConfig Loading container configuration from C:\Users\jenkins\workspace\Lucene-Solr-master-Windows\solr\build\solr-core\test\J1\temp\solr.cloud.TestCollectionAPI_791333F26452344-001\control-001\solr.xml
   [junit4]   2> 1154450 INFO  (TEST-TestCollectionAPI.test-seed#[791333F26452344]) [    ] o.a.s.c.SolrXmlConfig Configuration parameter autoReplicaFailoverWorkLoopDelay is ignored
   [junit4]   2> 1154450 INFO  (TEST-TestCollectionAPI.test-seed#[791333F26452344]) [    ] o.a.s.c.SolrXmlConfig Configuration parameter autoReplicaFailoverBadNodeExpiration is ignored
   [junit4]   2> 1154451 INFO  (TEST-TestCollectionAPI.test-seed#[791333F26452344]) [    ] o.a.s.c.SolrXmlConfig MBean server found: com.sun.jmx.mbeanserver.JmxMBeanServer@1c793a3, but no JMX reporters were configured - adding default JMX reporter.
   [junit4]   2> 1154456 INFO  (TEST-TestCollectionAPI.test-seed#[791333F26452344]) [    ] o.a.s.c.ZkContainer Zookeeper client=127.0.0.1:59879/solr
   [junit4]   2> 1154458 INFO  (zkConnectionManagerCallback-4765-thread-1) [    ] o.a.s.c.c.ConnectionManager zkClient has connected
   [junit4]   2> 1154463 INFO  (zkConnectionManagerCallback-4767-thread-1-processing-n:127.0.0.1:59889_) [n:127.0.0.1:59889_    ] o.a.s.c.c.ConnectionManager zkClient has connected
   [junit4]   2> 1154588 INFO  (TEST-TestCollectionAPI.test-seed#[791333F26452344]) [n:127.0.0.1:59889_    ] o.a.s.c.Overseer Overseer (id=null) closing
   [junit4]   2> 1154589 INFO  (TEST-TestCollectionAPI.test-seed#[791333F26452344]) [n:127.0.0.1:59889_    ] o.a.s.c.OverseerElectionContext I am going to be the leader 127.0.0.1:59889_
   [junit4]   2> 1154590 INFO  (TEST-TestCollectionAPI.test-seed#[791333F26452344]) [n:127.0.0.1:59889_    ] o.a.s.c.Overseer Overseer (id=99220642148581381-127.0.0.1:59889_-n_0000000000) starting
   [junit4]   2> 1154602 INFO  (TEST-TestCollectionAPI.test-seed#[791333F26452344]) [n:127.0.0.1:59889_    ] o.a.s.c.ZkController Register node as live in ZooKeeper:/live_nodes/127.0.0.1:59889_
   [junit4]   2> 1154608 INFO  (OverseerStateUpdate-99220642148581381-127.0.0.1:59889_-n_0000000000) [n:127.0.0.1:59889_    ] o.a.s.c.c.ZkStateReader Updated live nodes from ZooKeeper... (0) -> (1)
   [junit4]   2> 1154815 INFO  (TEST-TestCollectionAPI.test-seed#[791333F26452344]) [n:127.0.0.1:59889_    ] o.a.s.m.r.SolrJmxReporter JMX monitoring for 'solr.node' (registry 'solr.node') enabled at server: com.sun.jmx.mbeanserver.JmxMBeanServer@1c793a3
   [junit4]   2> 1154824 INFO  (TEST-TestCollectionAPI.test-seed#[791333F26452344]) [n:127.0.0.1:59889_    ] o.a.s.m.r.SolrJmxReporter JMX monitoring for 'solr.jvm' (registry 'solr.jvm') enabled at server: com.sun.jmx.mbeanserver.JmxMBeanServer@1c793a3
   [junit4]   2> 1154824 INFO  (TEST-TestCollectionAPI.test-seed#[791333F26452344]) [n:127.0.0.1:59889_    ] o.a.s.m.r.SolrJmxReporter JMX monitoring for 'solr.jetty' (registry 'solr.jetty') enabled at server: com.sun.jmx.mbeanserver.JmxMBeanServer@1c793a3
   [junit4]   2> 1154826 INFO  (TEST-TestCollectionAPI.test-seed#[791333F26452344]) [n:127.0.0.1:59889_    ] o.a.s.c.CorePropertiesLocator Found 0 core definitions underneath C:\Users\jenkins\workspace\Lucene-Solr-master-Windows\solr\build\solr-core\test\J1\temp\solr.cloud.TestCollectionAPI_791333F26452344-001\control-001\cores
   [junit4]   2> 1154863 INFO  (zkConnectionManagerCallback-4773-thread-1) [    ] o.a.s.c.c.ConnectionManager zkClient has connected
   [junit4]   2> 1154864 INFO  (TEST-TestCollectionAPI.test-seed#[791333F26452344]) [    ] o.a.s.c.c.ZkStateReader Updated live nodes from ZooKeeper... (0) -> (1)
   [junit4]   2> 1154865 INFO  (TEST-TestCollectionAPI.test-seed#[791333F26452344]) [    ] o.a.s.c.s.i.ZkClientClusterStateProvider Cluster at 127.0.0.1:59879/solr ready
   [junit4]   2> 1154940 INFO  (qtp13779039-14553) [n:127.0.0.1:59889_    ] o.a.s.h.a.CollectionsHandler Invoked Collection Action :create with params replicationFactor=1&collection.configName=conf1&name=control_collection&nrtReplicas=1&action=CREATE&numShards=1&createNodeSet=127.0.0.1:59889_&wt=javabin&version=2 and sendToOCPQueue=true
   [junit4]   2> 1154942 INFO  (OverseerThreadFactory-4490-thread-1-processing-n:127.0.0.1:59889_) [n:127.0.0.1:59889_    ] o.a.s.c.CreateCollectionCmd Create collection control_collection
   [junit4]   2> 1155054 INFO  (qtp13779039-14548) [n:127.0.0.1:59889_    ] o.a.s.h.a.CoreAdminOperation core create command qt=/admin/cores&collection.configName=conf1&newCollection=true&name=control_collection_shard1_replica_n1&action=CREATE&numShards=1&collection=control_collection&shard=shard1&wt=javabin&version=2&replicaType=NRT
   [junit4]   2> 1155055 INFO  (qtp13779039-14548) [n:127.0.0.1:59889_    ] o.a.s.c.TransientSolrCoreCacheDefault Allocating transient cache for 4 transient cores
   [junit4]   2> 1155162 INFO  (zkCallback-4766-thread-1-processing-n:127.0.0.1:59889_) [n:127.0.0.1:59889_    ] o.a.s.c.c.ZkStateReader A cluster state change: [WatchedEvent state:SyncConnected type:NodeDataChanged path:/collections/control_collection/state.json] for collection [control_collection] has occurred - updating... (live nodes size: [1])
   [junit4]   2> 1156085 INFO  (qtp13779039-14548) [n:127.0.0.1:59889_ c:control_collection s:shard1  x:control_collection_shard1_replica_n1] o.a.s.c.SolrConfig Using Lucene MatchVersion: 8.0.0
   [junit4]   2> 1156102 INFO  (qtp13779039-14548) [n:127.0.0.1:59889_ c:control_collection s:shard1  x:control_collection_shard1_replica_n1] o.a.s.s.IndexSchema [control_collection_shard1_replica_n1] Schema name=test
   [junit4]   2> 1156171 INFO  (qtp13779039-14548) [n:127.0.0.1:59889_ c:control_collection s:shard1  x:control_collection_shard1_replica_n1] o.a.s.s.IndexSchema Loaded schema test/1.6 with uniqueid field id
   [junit4]   2> 1156196 INFO  (qtp13779039-14548) [n:127.0.0.1:59889_ c:control_collection s:shard1  x:control_collection_shard1_replica_n1] o.a.s.c.CoreContainer Creating SolrCore 'control_collection_shard1_replica_n1' using configuration from collection control_collection, trusted=true
   [junit4]   2> 1156202 INFO  (qtp13779039-14548) [n:127.0.0.1:59889_ c:control_collection s:shard1  x:control_collection_shard1_replica_n1] o.a.s.m.r.SolrJmxReporter JMX monitoring for 'solr.core.control_collection.shard1.replica_n1' (registry 'solr.core.control_collection.shard1.replica_n1') enabled at server: com.sun.jmx.mbeanserver.JmxMBeanServer@1c793a3
   [junit4]   2> 1156202 INFO  (qtp13779039-14548) [n:127.0.0.1:59889_ c:control_collection s:shard1  x:control_collection_shard1_replica_n1] o.a.s.c.SolrCore solr.RecoveryStrategy.Builder
   [junit4]   2> 1156203 INFO  (qtp13779039-14548) [n:127.0.0.1:59889_ c:control_collection s:shard1  x:control_collection_shard1_replica_n1] o.a.s.c.SolrCore [[control_collection_shard1_replica_n1] ] Opening new SolrCore at [C:\Users\jenkins\workspace\Lucene-Solr-master-Windows\solr\build\solr-core\test\J1\temp\solr.cloud.TestCollectionAPI_791333F26452344-001\control-001\cores\control_collection_shard1_replica_n1], dataDir=[C:\Users\jenkins\workspace\Lucene-Solr-master-Windows\solr\build\solr-core\test\J1\temp\solr.cloud.TestCollectionAPI_791333F26452344-001\control-001\cores\control_collection_shard1_replica_n1\data\]
   [junit4]   2> 1156206 INFO  (qtp13779039-14548) [n:127.0.0.1:59889_ c:control_collection s:shard1  x:control_collection_shard1_replica_n1] o.a.s.u.RandomMergePolicy RandomMergePolicy wrapping class org.apache.lucene.index.TieredMergePolicy: [TieredMergePolicy: maxMergeAtOnce=10, maxMergeAtOnceExplicit=49, maxMergedSegmentMB=93.640625, floorSegmentMB=0.59375, forceMergeDeletesPctAllowed=16.436047750056737, segmentsPerTier=49.0, maxCFSSegmentSizeMB=8.796093022207999E12, noCFSRatio=1.0
   [junit4]   2> 1156209 WARN  (qtp13779039-14548) [n:127.0.0.1:59889_ c:control_collection s:shard1  x:control_collection_shard1_replica_n1] o.a.s.c.RequestHandlers INVALID paramSet a in requestHandler {type = requestHandler,name = /dump,class = DumpRequestHandler,attributes = {initParams=a, name=/dump, class=DumpRequestHandler},args = {defaults={a=A,b=B}}}
   [junit4]   2> 1156291 INFO  (qtp13779039-14548) [n:127.0.0.1:59889_ c:control_collection s:shard1  x:control_collection_shard1_replica_n1] o.a.s.u.UpdateHandler Using UpdateLog implementation: org.apache.solr.update.UpdateLog
   [junit4]   2> 1156291 INFO  (qtp13779039-14548) [n:127.0.0.1:59889_ c:control_collection s:shard1  x:control_collection_shard1_replica_n1] o.a.s.u.UpdateLog Initializing UpdateLog: dataDir= defaultSyncLevel=FLUSH numRecordsToKeep=100 maxNumLogsToKeep=10 numVersionBuckets=65536
   [junit4]   2> 1156293 INFO  (qtp13779039-14548) [n:127.0.0.1:59889_ c:control_collection s:shard1  x:control_collection_shard1_replica_n1] o.a.s.u.CommitTracker Hard AutoCommit: disabled
   [junit4]   2> 1156294 INFO  (qtp13779039-14548) [n:127.0.0.1:59889_ c:control_collection s:shard1  x:control_collection_shard1_replica_n1] o.a.s.u.CommitTracker Soft AutoCommit: disabled
   [junit4]   2> 1156295 INFO  (qtp13779039-14548) [n:127.0.0.1:59889_ c:control_collection s:shard1  x:control_collection_shard1_replica_n1] o.a.s.u.RandomMergePolicy RandomMergePolicy wrapping class org.apache.lucene.index.LogByteSizeMergePolicy: [LogByteSizeMergePolicy: minMergeSize=1677721, mergeFactor=28, maxMergeSize=2147483648, maxMergeSizeForForcedMerge=9223372036854775807, calibrateSizeByDeletes=false, maxMergeDocs=2147483647, maxCFSSegmentSizeMB=8.796093022207999E12, noCFSRatio=0.0]
   [junit4]   2> 1156295 INFO  (qtp13779039-14548) [n:127.0.0.1:59889_ c:control_collection s:shard1  x:control_collection_shard1_replica_n1] o.a.s.s.SolrIndexSearcher Opening [Searcher@1343bf8[control_collection_shard1_replica_n1] main]
   [junit4]   2> 1156297 INFO  (qtp13779039-14548) [n:127.0.0.1:59889_ c:control_collection s:shard1  x:control_collection_shard1_replica_n1] o.a.s.r.ManagedResourceStorage Configured ZooKeeperStorageIO with znodeBase: /configs/conf1
   [junit4]   2> 1156297 INFO  (qtp13779039-14548) [n:127.0.0.1:59889_ c:control_collection s:shard1  x:control_collection_shard1_replica_n1] o.a.s.r.ManagedResourceStorage Loaded null at path _rest_managed.json using ZooKeeperStorageIO:path=/configs/conf1
   [junit4]   2> 1156298 INFO  (qtp13779039-14548) [n:127.0.0.1:59889_ c:control_collection s:shard1  x:control_collection_shard1_replica_n1] o.a.s.h.ReplicationHandler Commits will be reserved for 10000ms.
   [junit4]   2> 1156300 INFO  (searcherExecutor-4493-thread-1-processing-n:127.0.0.1:59889_ x:control_collection_shard1_replica_n1 s:shard1 c:control_collection) [n:127.0.0.1:59889_ c:control_collection s:shard1  x:control_collection_shard1_replica_n1] o.a.s.c.SolrCore [control_collection_shard1_replica_n1] Registered new searcher Searcher@1343bf8[control_collection_shard1_replica_n1] main{ExitableDirectoryReader(UninvertingDirectoryReader())}
   [junit4]   2> 1156300 INFO  (qtp13779039-14548) [n:127.0.0.1:59889_ c:control_collection s:shard1  x:control_collection_shard1_replica_n1] o.a.s.u.UpdateLog Could not find max version in index or recent updates, using new clock 1587530277054316544
   [junit4]   2> 1156306 INFO  (qtp13779039-14548) [n:127.0.0.1:59889_ c:control_collection s:shard1  x:control_collection_shard1_replica_n1] o.a.s.c.ShardLeaderElectionContext Enough replicas found to continue.
   [junit4]   2> 1156306 INFO  (qtp13779039-14548) [n:127.0.0.1:59889_ c:control_collection s:shard1  x:control_collection_shard1_replica_n1] o.a.s.c.ShardLeaderElectionContext I may be the new leader - try and sync
   [junit4]   2> 1156306 INFO  (qtp13779039-14548) [n:127.0.0.1:59889_ c:control_collection s:shard1  x:control_collection_shard1_replica_n1] o.a.s.c.SyncStrategy Sync replicas to https://127.0.0.1:59889/control_collection_shard1_replica_n1/
   [junit4]   2> 1156306 INFO  (qtp13779039-14548) [n:127.0.0.1:59889_ c:control_collection s:shard1  x:control_collection_shard1_replica_n1] o.a.s.c.SyncStrategy Sync Success - now sync replicas to me
   [junit4]   2> 1156306 INFO  (qtp13779039-14548) [n:127.0.0.1:59889_ c:control_collection s:shard1  x:control_collection_shard1_replica_n1] o.a.s.c.SyncStrategy https://127.0.0.1:59889/control_collection_shard1_replica_n1/ has no replicas
   [junit4]   2> 1156306 INFO  (qtp13779039-14548) [n:127.0.0.1:59889_ c:control_collection s:shard1  x:control_collection_shard1_replica_n1] o.a.s.c.ShardLeaderElectionContext Found all replicas participating in election, clear LIR
   [junit4]   2> 1156310 INFO  (qtp13779039-14548) [n:127.0.0.1:59889_ c:control_collection s:shard1  x:control_collection_shard1_replica_n1] o.a.s.c.ShardLeaderElectionContext I am the new leader: https://127.0.0.1:59889/control_collection_shard1_replica_n1/ shard1
   [junit4]   2> 1214941 INFO  (TEST-TestCollectionAPI.test-seed#[791333F26452344]) [    ] o.a.s.c.ChaosMonkey monkey: stop jetty! 59889
   [junit4]   2> 1214942 INFO  (TEST-TestCollectionAPI.test-seed#[791333F26452344]) [    ] o.a.s.c.CoreContainer Shutting down CoreContainer instance=10339434
   [junit4]   2> 1214942 INFO  (TEST-TestCollectionAPI.test-seed#[791333F26452344]) [    ] o.a.s.m.SolrMetricManager Closing metric reporters for registry=solr.node, tag=null
   [junit4]   2> 1214942 INFO  (TEST-TestCollectionAPI.test-seed#[791333F26452344]) [    ] o.a.s.m.r.SolrJmxReporter Closing reporter [org.apache.solr.metrics.reporters.SolrJmxReporter@525407: rootName = null, domain = solr.node, service url = null, agent id = null] for registry solr.node / com.codahale.metrics.MetricRegistry@b145f3
   [junit4]   2> 1214952 INFO  (TEST-TestCollectionAPI.test-seed#[791333F26452344]) [    ] o.a.s.m.SolrMetricManager Closing metric reporters for registry=solr.jvm, tag=null
   [junit4]   2> 1214952 INFO  (TEST-TestCollectionAPI.test-seed#[791333F26452344]) [    ] o.a.s.m.r.SolrJmxReporter Closing reporter [org.apache.solr.metrics.reporters.SolrJmxReporter@54c423: rootName = null, domain = solr.jvm, service url = null, agent id = null] for registry solr.jvm / com.codahale.metrics.MetricRegistry@432f33
   [junit4]   2> 1214963 INFO  (TEST-TestCollectionAPI.test-seed#[791333F26452344]) [    ] o.a.s.m.SolrMetricManager Closing metric reporters for registry=solr.jetty, tag=null
   [junit4]   2> 1214963 INFO  (TEST-TestCollectionAPI.test-seed#[791333F26452344]) [    ] o.a.s.m.r.SolrJmxReporter Closing reporter [org.apache.solr.metrics.reporters.SolrJmxReporter@1201961: rootName = null, domain = solr.jetty, service url = null, agent id = null] for registry solr.jetty / com.codahale.metrics.MetricRegistry@17fa4e9
   [junit4]   2> 1214967 INFO  (TEST-TestCollectionAPI.test-seed#[791333F26452344]) [    ] o.a.s.c.ZkController Remove node as live in ZooKeeper:/live_nodes/127.0.0.1:59889_
   [junit4]   2> 1214969 INFO  (TEST-TestCollectionAPI.test-seed#[791333F26452344]) [    ] o.a.s.m.SolrMetricManager Closing metric reporters for registry=solr.cluster, tag=null
   [junit4]   2> 1214973 INFO  (zkCallback-4766-thread-2-processing-n:127.0.0.1:59889_) [n:127.0.0.1:59889_    ] o.a.s.c.c.ZkStateReader Updated live nodes from ZooKeeper... (1) -> (0)
   [junit4]   2> 1214973 INFO  (coreCloseExecutor-4498-thread-1) [n:127.0.0.1:59889_ c:control_collection s:shard1 r:core_node2 x:control_collection_shard1_replica_n1] o.a.s.c.SolrCore [control_collection_shard1_replica_n1]  CLOSING SolrCore org.apache.solr.core.SolrCore@26bb33
   [junit4]   2> 1214974 INFO  (coreCloseExecutor-4498-thread-1) [n:127.0.0.1:59889_ c:control_collection s:shard1 r:core_node2 x:control_collection_shard1_replica_n1] o.a.s.m.SolrMetricManager Closing metric reporters for registry=solr.core.control_collection.shard1.replica_n1, tag=2538291
   [junit4]   2> 1214974 INFO  (coreCloseExecutor-4498-thread-1) [n:127.0.0.1:59889_ c:control_collection s:shard1 r:core_node2 x:control_collection_shard1_replica_n1] o.a.s.m.r.SolrJmxReporter Closing reporter [org.apache.solr.metrics.reporters.SolrJmxReporter@183052b: rootName = null, domain = solr.core.control_collection.shard1.replica_n1, service url = null, agent id = null] for registry solr.core.control_collection.shard1.replica_n1 / com.codahale.metrics.MetricRegistry@9e590e
   [junit4]   2> 1214987 INFO  (coreCloseExecutor-4498-thread-1) [n:127.0.0.1:59889_ c:control_collection s:shard1 r:core_node2 x:control_collection_shard1_replica_n1] o.a.s.m.SolrMetricManager Closing metric reporters for registry=solr.collection.control_collection.shard1.leader, tag=2538291
   [junit4]   2> 1225689 INFO  (ScheduledTrigger-4488-thread-4) [n:127.0.0.1:59889_    ] o.a.s.c.a.SystemLogListener Collection .system does not exist, disabling logging.
   [junit4]   2> 1225692 INFO  (AutoscalingActionExecutor-4489-thread-1-processing-n:127.0.0.1:59889_) [n:127.0.0.1:59889_    ] o.a.s.c.s.c.a.PolicyHelper returnSession, curr-time 1688058838 sessionWrapper.createTime 1688058838368665, this.sessionWrapper.createTime 1688058838368665 
   [junit4]   2> 1225692 INFO  (AutoscalingActionExecutor-4489-thread-1-processing-n:127.0.0.1:59889_) [n:127.0.0.1:59889_    ] o.a.s.c.a.ExecutePlanAction No operations to execute for event: {
   [junit4]   2>   "id":"5ff457e82c478T2xadqwl6ggexznun3s9z9cz0g",
   [junit4]   2>   "source":".auto_add_replicas",
   [junit4]   2>   "eventTime":1688048823878776,
   [junit4]   2>   "eventType":"NODELOST",
   [junit4]   2>   "properties":{
   [junit4]   2>     "eventTimes":[1688048823878776],
   [junit4]   2>     "_enqueue_time_":1688058835107508,
   [junit4]   2>     "nodeNames":["127.0.0.1:59889_"]}}
   [junit4]   2> 1334944 ERROR (qtp13779039-14553) [n:127.0.0.1:59889_    ] o.a.s.h.RequestHandlerBase org.apache.solr.common.SolrException: create the collection time out:180s
   [junit4]   2> 	at org.apache.solr.handler.admin.CollectionsHandler.handleResponse(CollectionsHandler.java:314)
   [junit4]   2> 	at org.apache.solr.handler.admin.CollectionsHandler.invokeAction(CollectionsHandler.java:246)
   [junit4]   2> 	at org.apache.solr.handler.admin.CollectionsHandler.handleRequestBody(CollectionsHandler.java:224)
   [junit4]   2> 	at org.apache.solr.handler.RequestHandlerBase.handleRequest(RequestHandlerBase.java:177)
   [junit4]   2> 	at org.apache.solr.servlet.HttpSolrCall.handleAdmin(HttpSolrCall.java:736)
   [junit4]   2> 	at org.apache.solr.servlet.HttpSolrCall.handleAdminRequest(HttpSolrCall.java:717)
   [junit4]   2> 	at org.apache.solr.servlet.HttpSolrCall.call(HttpSolrCall.java:498)
   [junit4]   2> 	at org.apache.solr.servlet.SolrDispatchFilter.doFilter(SolrDispatchFilter.java:382)
   [junit4]   2> 	at org.apache.solr.servlet.SolrDispatchFilter.doFilter(SolrDispatchFilter.java:326)
   [junit4]   2> 	at org.eclipse.jetty.servlet.ServletHandler$CachedChain.doFilter(ServletHandler.java:1759)
   [junit4]   2> 	at org.apache.solr.client.solrj.embedded.JettySolrRunner$DebugFilter.doFilter(JettySolrRunner.java:139)
   [junit4]   2> 	at org.eclipse.jetty.servlet.ServletHandler$CachedChain.doFilter(ServletHandler.java:1759)
   [junit4]   2> 	at org.eclipse.jetty.servlet.ServletHandler.doHandle(ServletHandler.java:582)
   [junit4]   2> 	at org.eclipse.jetty.server.session.SessionHandler.doHandle(SessionHandler.java:224)
   [junit4]   2> 	at org.eclipse.jetty.server.handler.ContextHandler.doHandle(ContextHandler.java:1180)
   [junit4]   2> 	at org.eclipse.jetty.servlet.ServletHandler.doScope(ServletHandler.java:512)
   [junit4]   2> 	at org.eclipse.jetty.server.session.SessionHandler.doScope(SessionHandler.java:185)
   [junit4]   2> 	at org.eclipse.jetty.server.handler.ContextHandler.doScope(ContextHandler.java:1112)
   [junit4]   2> 	at org.eclipse.jetty.server.handler.ScopedHandler.handle(ScopedHandler.java:141)
   [junit4]   2> 	at org.eclipse.jetty.server.handler.gzip.GzipHandler.handle(GzipHandler.java:493)
   [junit4]   2> 	at org.eclipse.jetty.server.handler.HandlerWrapper.handle(HandlerWrapper.java:134)
   [junit4]   2> 	at org.eclipse.jetty.server.Server.handle(Server.java:534)
   [junit4]   2> 	at org.eclipse.jetty.server.HttpChannel.handle(HttpChannel.java:320)
   [junit4]   2> 	at org.eclipse.jetty.server.HttpConnection.onFillable(HttpConnection.java:251)
   [junit4]   2> 	at org.eclipse.jetty.io.AbstractConnection$ReadCallback.succeeded(AbstractConnection.java:283)
   [junit4]   2> 	at org.eclipse.jetty.io.FillInterest.fillable(FillInterest.java:108)
   [junit4]   2> 	at org.eclipse.jetty.io.ssl.SslConnection.onFillable(SslConnection.java:251)
   [junit4]   2> 	at org.eclipse.jetty.io.AbstractConnection$ReadCallback.succeeded(AbstractConnection.java:283)
   [junit4]   2> 	at org.eclipse.jetty.io.FillInterest.fillable(FillInterest.java:108)
   [junit4]   2> 	at org.eclipse.jetty.io.SelectChannelEndPoint$2.run(SelectChannelEndPoint.java:93)
   [junit4]   2> 	at org.eclipse.jetty.util.thread.strategy.ExecuteProduceConsume.executeProduceConsume(ExecuteProduceConsume.java:303)
   [junit4]   2> 	at org.eclipse.jetty.util.thread.strategy.ExecuteProduceConsume.produceConsume(ExecuteProduceConsume.java:148)
   [junit4]   2> 	at org.eclipse.jetty.util.thread.strategy.ExecuteProduceConsume.run(ExecuteProduceConsume.java:136)
   [junit4]   2> 	at org.eclipse.jetty.util.thread.QueuedThreadPool.runJob(QueuedThreadPool.java:671)
   [junit4]   2> 	at org.eclipse.jetty.util.thread.QueuedThreadPool$2.run(QueuedThreadPool.java:589)
   [junit4]   2> 	at java.lang.Thread.run(Thread.java:748)
   [junit4]   2> 
   [junit4]   2> 1334947 INFO  (qtp13779039-14553) [n:127.0.0.1:59889_    ] o.a.s.s.HttpSolrCall [admin] webapp=null path=/admin/collections params={replicationFactor=1&collection.configName=conf1&name=control_collection&nrtReplicas=1&action=CREATE&numShards=1&createNodeSet=127.0.0.1:59889_&wt=javabin&version=2} status=500 QTime=180007
   [junit4]   2> 1334948 ERROR (qtp13779039-14553) [n:127.0.0.1:59889_    ] o.a.s.s.HttpSolrCall null:org.apache.solr.common.SolrException: create the collection time out:180s
   [junit4]   2> 	at org.apache.solr.handler.admin.CollectionsHandler.handleResponse(CollectionsHandler.java:314)
   [junit4]   2> 	at org.apache.solr.handler.admin.CollectionsHandler.invokeAction(CollectionsHandler.java:246)
   [junit4]   2> 	at org.apache.solr.handler.admin.CollectionsHandler.handleRequestBody(CollectionsHandler.java:224)
   [junit4]   2> 	at org.apache.solr.handler.RequestHandlerBase.handleRequest(RequestHandlerBase.java:177)
   [junit4]   2> 	at org.apache.solr.servlet.HttpSolrCall.handleAdmin(HttpSolrCall.java:736)
   [junit4]   2> 	at org.apache.solr.servlet.HttpSolrCall.handleAdminRequest(HttpSolrCall.java:717)
   [junit4]   2> 	at org.apache.solr.servlet.HttpSolrCall.call(HttpSolrCall.java:498)
   [junit4]   2> 	at org.apache.solr.servlet.SolrDispatchFilter.doFilter(SolrDispatchFilter.java:382)
   [junit4]   2> 	at org.apache.solr.servlet.SolrDispatchFilter.doFilter(SolrDispatchFilter.java:326)
   [junit4]   2> 	at org.eclipse.jetty.servlet.ServletHandler$CachedChain.doFilter(ServletHandler.java:1759)
   [junit4]   2> 	at org.apache.solr.client.solrj.embedded.JettySolrRunner$DebugFilter.doFilter(JettySolrRunner.java:139)
   [junit4]   2> 	at org.eclipse.jetty.servlet.ServletHandler$CachedChain.doFilter(ServletHandler.java:1759)
   [junit4]   2> 	at org.eclipse.jetty.servlet.ServletHandler.doHandle(ServletHandler.java:582)
   [junit4]   2> 	at org.eclipse.jetty.server.session.SessionHandler.doHandle(SessionHandler.java:224)
   [junit4]   2> 	at org.eclipse.jetty.server.handler.ContextHandler.doHandle(ContextHandler.java:1180)
   [junit4]   2> 	at org.eclipse.jetty.servlet.ServletHandler.doScope(ServletHandler.java:512)
   [junit4]   2> 	at org.eclipse.jetty.server.session.SessionHandler.doScope(SessionHandler.java:185)
   [junit4]   2> 	at org.eclipse.jetty.server.handler.ContextHandler.doScope(ContextHandler.java:1112)
   [junit4]   2> 	at org.eclipse.jetty.server.handler.ScopedHandler.handle(ScopedHandler.java:141)
   [junit4]   2> 	at org.eclipse.jetty.server.handler.gzip.GzipHandler.handle(GzipHandler.java:493)
   [junit4]   2> 	at org.eclipse.jetty.server.handler.HandlerWrapper.handle(HandlerWrapper.java:134)
   [junit4]   2> 	at org.eclipse.jetty.server.Server.handle(Server.java:534)
   [junit4]   2> 	at org.eclipse.jetty.server.HttpChannel.handle(HttpChannel.java:320)
   [junit4]   2> 	at org.eclipse.jetty.server.HttpConnection.onFillable(HttpConnection.java:251)
   [junit4]   2> 	at org.eclipse.jetty.io.AbstractConnection$ReadCallback.succeeded(AbstractConnection.java:283)
   [junit4]   2> 	at org.eclipse.jetty.io.FillInterest.fillable(FillInterest.java:108)
   [junit4]   2> 	at org.eclipse.jetty.io.ssl.SslConnection.onFillable(SslConnection.java:251)
   [junit4]   2> 	at org.eclipse.jetty.io.AbstractConnection$ReadCallback.succeeded(AbstractConnection.java:283)
   [junit4]   2> 	at org.eclipse.jetty.io.FillInterest.fillable(FillInterest.java:108)
   [junit4]   2> 	at org.eclipse.jetty.io.SelectChannelEndPoint$2.run(SelectChannelEndPoint.java:93)
   [junit4]   2> 	at org.eclipse.jetty.util.thread.strategy.ExecuteProduceConsume.executeProduceConsume(ExecuteProduceConsume.java:303)
   [junit4]   2> 	at org.eclipse.jetty.util.thread.strategy.ExecuteProduceConsume.produceConsume(ExecuteProduceConsume.java:148)
   [junit4]   2> 	at org.eclipse.jetty.util.thread.strategy.ExecuteProduceConsume.run(ExecuteProduceConsume.java:136)
   [junit4]   2> 	at org.eclipse.jetty.util.thread.QueuedThreadPool.runJob(QueuedThreadPool.java:671)
   [junit4]   2> 	at org.eclipse.jetty.util.thread.QueuedThreadPool$2.run(QueuedThreadPool.java:589)
   [junit4]   2> 	at java.lang.Thread.run(Thread.java:748)
   [junit4]   2> 
   [junit4]   2> 1755055 ERROR (OverseerThreadFactory-4490-thread-1-processing-n:127.0.0.1:59889_) [n:127.0.0.1:59889_    ] o.a.s.c.OverseerCollectionMessageHandler Error from shard: https://127.0.0.1:59889
   [junit4]   2> org.apache.solr.client.solrj.SolrServerException: Timeout occured while waiting response from server at: https://127.0.0.1:59889
   [junit4]   2> 	at org.apache.solr.client.solrj.impl.HttpSolrClient.executeMethod(HttpSolrClient.java:654)
   [junit4]   2> 	at org.apache.solr.client.solrj.impl.HttpSolrClient.request(HttpSolrClient.java:255)
   [junit4]   2> 	at org.apache.solr.client.solrj.impl.HttpSolrClient.request(HttpSolrClient.java:244)
   [junit4]   2> 	at org.apache.solr.client.solrj.SolrClient.request(SolrClient.java:1219)
   [junit4]   2> 	at org.apache.solr.handler.component.HttpShardHandler.lambda$submit$0(HttpShardHandler.java:172)
   [junit4]   2> 	at java.util.concurrent.FutureTask.run(FutureTask.java:266)
   [junit4]   2> 	at java.util.concurrent.Executors$RunnableAdapter.call(Executors.java:511)
   [junit4]   2> 	at java.util.concurrent.FutureTask.run(FutureTask.java:266)
   [junit4]   2> 	at com.codahale.metrics.InstrumentedExecutorService$InstrumentedRunnable.run(InstrumentedExecutorService.java:176)
   [junit4]   2> 	at org.apache.solr.common.util.ExecutorUtil$MDCAwareThreadPoolExecutor.lambda$execute$0(ExecutorUtil.java:188)
   [junit4]   2> 	at java.util.concurrent.ThreadPoolExecutor.runWorker(ThreadPoolExecutor.java:1149)
   [junit4]   2> 	at java.util.concurrent.ThreadPoolExecutor$Worker.run(ThreadPoolExecutor.java:624)
   [junit4]   2> 	at java.lang.Thread.run(Thread.java:748)
   [junit4]   2> Caused by: java.net.SocketTimeoutException: Read timed out
   [junit4]   2> 	at java.net.SocketInputStream.socketRead0(Native Method)
   [junit4]   2> 	at java.net.SocketInputStream.socketRead(SocketInputStream.java:116)
   [junit4]   2> 	at java.net.SocketInputStream.read(SocketInputStream.java:171)
   [junit4]   2> 	at java.net.SocketInputStream.read(SocketInputStream.java:141)
   [junit4]   2> 	at sun.security.ssl.InputRecord.readFully(InputRecord.java:465)
   [junit4]   2> 	at sun.security.ssl.InputRecord.read(InputRecord.java:503)
   [junit4]   2> 	at sun.security.ssl.SSLSocketImpl.readRecord(SSLSocketImpl.java:983)
   [junit4]   2> 	at sun.security.ssl.SSLSocketImpl.readDataRecord(SSLSocketImpl.java:940)
   [junit4]   2> 	at sun.security.ssl.AppInputStream.read(AppInputStream.java:105)
   [junit4]   2> 	at org.apache.http.impl.io.SessionInputBufferImpl.streamRead(SessionInputBufferImpl.java:137)
   [junit4]   2> 	at org.apache.http.impl.io.SessionInputBufferImpl.fillBuffer(SessionInputBufferImpl.java:153)
   [junit4]   2> 	at org.apache.http.impl.io.SessionInputBufferImpl.readLine(SessionInputBufferImpl.java:282)
   [junit4]   2> 	at org.apache.http.impl.conn.DefaultHttpResponseParser.parseHead(DefaultHttpResponseParser.java:138)
   [junit4]   2> 	at org.apache.http.impl.conn.DefaultHttpResponseParser.parseHead(DefaultHttpResponseParser.java:56)
   [junit4]   2> 	at org.apache.http.impl.io.AbstractMessageParser.parse(AbstractMessageParser.java:259)
   [junit4]   2> 	at org.apache.http.impl.DefaultBHttpClientConnection.receiveResponseHeader(DefaultBHttpClientConnection.java:163)
   [junit4]   2> 	at org.apache.http.impl.conn.CPoolProxy.receiveResponseHeader(CPoolProxy.java:165)
   [junit4]   2> 	at org.apache.http.protocol.HttpRequestExecutor.doReceiveResponse(HttpRequestExecutor.java:273)
   [junit4]   2> 	at org.apache.http.protocol.HttpRequestExecutor.execute(HttpRequestExecutor.java:125)
   [junit4]   2> 	at org.apache.solr.util.stats.InstrumentedHttpRequestExecutor.execute(InstrumentedHttpRequestExecutor.java:118)
   [junit4]   2> 	at org.apache.http.impl.execchain.MainClientExec.execute(MainClientExec.java:272)
   [junit4]   2> 	at org.apache.http.impl.execchain.ProtocolExec.execute(ProtocolExec.java:185)
   [junit4]   2> 	at org.apache.http.impl.execchain.RetryExec.execute(RetryExec.java:89)
   [junit4]   2> 	at org.apache.http.impl.execchain.RedirectExec.execute(RedirectExec.java:111)
   [junit4]   2> 	at org.apache.http.impl.client.InternalHttpClient.doExecute(InternalHttpClient.java:185)
   [junit4]   2> 	at org.apache.http.impl.client.CloseableHttpClient.execute(CloseableHttpClient.java:83)
   [junit4]   2> 	at org.apache.http.impl.client.CloseableHttpClient.execute(CloseableHttpClient.java:56)
   [junit4]   2> 	at org.apache.solr.client.solrj.impl.HttpSolrClient.executeMethod(HttpSolrClient.java:542)
   [junit4]   2> 	... 12 more
   [junit4]   2> 1755066 ERROR (OverseerThreadFactory-4490-thread-1-processing-n:127.0.0.1:59889_) [n:127.0.0.1:59889_    ] o.a.s.c.OverseerCollectionMessageHandler Cleaning up collection [control_collection].
   [junit4]   2> 1755064 INFO  (TEST-TestCollectionAPI.test-seed#[791333F26452344]) [    ] o.a.s.c.Overseer Overseer (id=99220642148581381-127.0.0.1:59889_-n_0000000000) closing
   [junit4]   2> 1755067 INFO  (OverseerStateUpdate-99220642148581381-127.0.0.1:59889_-n_0000000000) [n:127.0.0.1:59889_    ] o.a.s.c.Overseer Overseer Loop exiting : 127.0.0.1:59889_
   [junit4]   2> 1755067 INFO  (OverseerThreadFactory-4490-thread-1-processing-n:127.0.0.1:59889_) [n:127.0.0.1:59889_    ] o.a.s.c.OverseerCollectionMessageHandler Executing Collection Cmd : action=UNLOAD&deleteInstanceDir=true&deleteDataDir=true
   [junit4]   2> 1785147 INFO  (zkCallback-4766-thread-5-processing-n:127.0.0.1:59889_) [n:127.0.0.1:59889_    ] o.a.s.c.c.ZkStateReader A cluster state change: [WatchedEvent state:SyncConnected type:NodeDeleted path:/collections/control_collection/state.json] for collection [control_collection] has occurred - updating... (live nodes size: [0])
   [junit4]   2> 1785153 ERROR (OverseerThreadFactory-4490-thread-1-processing-n:127.0.0.1:59889_) [n:127.0.0.1:59889_    ] o.a.s.c.OverseerCollectionMessageHandler Collection: control_collection operation: create failed:org.apache.solr.common.SolrException: Could not fully remove collection: control_collection
   [junit4]   2> 	at org.apache.solr.cloud.DeleteCollectionCmd.call(DeleteCollectionCmd.java:112)
   [junit4]   2> 	at org.apache.solr.cloud.OverseerCollectionMessageHandler.cleanupCollection(OverseerCollectionMessageHandler.java:688)
   [junit4]   2> 	at org.apache.solr.cloud.CreateCollectionCmd.call(CreateCollectionCmd.java:240)
   [junit4]   2> 	at org.apache.solr.cloud.OverseerCollectionMessageHandler.processMessage(OverseerCollectionMessageHandler.java:242)
   [junit4]   2> 	at org.apache.solr.cloud.OverseerTaskProcessor$Runner.run(OverseerTaskProcessor.java:464)
   [junit4]   2> 	at org.apache.solr.common.util.ExecutorUtil$MDCAwareThreadPoolExecutor.lambda$execute$0(ExecutorUtil.java:188)
   [junit4]   2> 	at java.util.concurrent.ThreadPoolExecutor.runWorker(ThreadPoolExecutor.java:1149)
   [junit4]   2> 	at java.util.concurrent.ThreadPoolExecutor$Worker.run(ThreadPoolExecutor.java:624)
   [junit4]   2> 	at java.lang.Thread.run(Thread.java:748)
   [junit4]   2> 
   [junit4]   2> 1785156 INFO  (OverseerThreadFactory-4490-thread-1-processing-n:127.0.0.1:59889_) [n:127.0.0.1:59889_    ] o.a.s.c.OverseerTaskQueue Response ZK path: /overseer/collection-queue-work/qnr-0000000000 doesn't exist.  Requestor may have disconnected from ZooKeeper
   [junit4]   2> 1785161 WARN  (OverseerAutoScalingTriggerThread-99220642148581381-127.0.0.1:59889_-n_0000000000) [n:127.0.0.1:59889_    ] o.a.s.c.a.OverseerTriggerThread OverseerTriggerThread woken up but we are closed, exiting.
   [junit4]   2> 1785173 INFO  (TEST-TestCollectionAPI.test-seed#[791333F26452344]) [    ] o.e.j.s.AbstractConnector Stopped ServerConnector@1b336e0{SSL,[ssl, http/1.1]}{127.0.0.1:0}
   [junit4]   2> 1785173 INFO  (TEST-TestCollectionAPI.test-seed#[791333F26452344]) [    ] o.e.j.s.h.ContextHandler Stopped o.e.j.s.ServletContextHandler@31fa5d{/,null,UNAVAILABLE}
   [junit4]   2> 1785213 ERROR (qtp13779039-14548) [n:127.0.0.1:59889_ c:control_collection s:shard1  x:control_collection_shard1_replica_n1] o.a.s.c.ZkController Error getting leader from zk
   [junit4]   2> org.apache.solr.common.SolrException: No registered leader was found after waiting for 1220000ms , collection: control_collection slice: shard1 saw state=null with live_nodes=[]
   [junit4]   2> 	at org.apache.solr.common.cloud.ZkStateReader.getLeaderRetry(ZkStateReader.java:771)
   [junit4]   2> 	at org.apache.solr.common.cloud.ZkStateReader.getLeaderUrl(ZkStateReader.java:736)
   [junit4]   2> 	at org.apache.solr.cloud.ZkController.getLeader(ZkController.java:1178)
   [junit4]   2> 	at org.apache.solr.cloud.ZkController.register(ZkController.java:1079)
   [junit4]   2> 	at org.apache.solr.cloud.ZkController.register(ZkController.java:1014)
   [junit4]   2> 	at org.apache.solr.core.ZkContainer.lambda$registerInZk$0(ZkContainer.java:181)
   [junit4]   2> 	at org.apache.solr.core.ZkContainer.registerInZk(ZkContainer.java:208)
   [junit4]   2> 	at org.apache.solr.core.CoreContainer.registerCore(CoreContainer.java:892)
   [junit4]   2> 	at org.apache.solr.core.CoreContainer.createFromDescriptor(CoreContainer.java:1053)
   [junit4]   2> 	at org.apache.solr.core.CoreContainer.create(CoreContainer.java:954)
   [junit4]   2> 	at org.apache.solr.handler.admin.CoreAdminOperation.lambda$static$0(CoreAdminOperation.java:91)
   [junit4]   2> 	at org.apache.solr.handler.admin.CoreAdminOperation.execute(CoreAdminOperation.java:384)
   [junit4]   2> 	at org.apache.solr.handler.admin.CoreAdminHandler$CallInfo.call(CoreAdminHandler.java:389)
   [junit4]   2> 	at org.apache.solr.handler.admin.CoreAdminHandler.handleRequestBody(CoreAdminHandler.java:174)
   [junit4]   2> 	at org.apache.solr.handler.RequestHandlerBase.handleRequest(RequestHandlerBase.java:177)
   [junit4]   2> 	at org.apache.solr.servlet.HttpSolrCall.handleAdmin(HttpSolrCall.java:736)
   [junit4]   2> 	at org.apache.solr.servlet.HttpSolrCall.handleAdminRequest(HttpSolrCall.java:717)
   [junit4]   2> 	at org.apache.solr.servlet.HttpSolrCall.call(HttpSolrCall.java:498)
   [junit4]   2> 	at org.apache.solr.servlet.SolrDispatchFilter.doFilter(SolrDispatchFilter.java:382)
   [junit4]   2> 	at org.apache.solr.servlet.SolrDispatchFilter.doFilter(SolrDispatchFilter.java:326)
   [junit4]   2> 	at org.eclipse.jetty.servlet.ServletHandler$CachedChain.doFilter(ServletHandler.java:1759)
   [junit4]   2> 	at org.apache.solr.client.solrj.embedded.JettySolrRunner$DebugFilter.doFilter(JettySolrRunner.java:139)
   [junit4]   2> 	at org.eclipse.jetty.servlet.ServletHandler$CachedChain.doFilter(ServletHandler.java:1759)
   [junit4]   2> 	at org.eclipse.jetty.servlet.ServletHandler.doHandle(ServletHandler.java:582)
   [junit4]   2> 	at org.eclipse.jetty.server.session.SessionHandler.doHandle(SessionHandler.java:224)
   [junit4]   2> 	at org.eclipse.jetty.server.handler.ContextHandler.doHandle(ContextHandler.java:1180)
   [junit4]   2> 	at org.eclipse.jetty.servlet.ServletHandler.doScope(ServletHandler.java:512)
   [junit4]   2> 	at org.eclipse.jetty.server.session.SessionHandler.doScope(SessionHandler.java:185)
   [junit4]   2> 	at org.eclipse.jetty.server.handler.ContextHandler.doScope(ContextHandler.java:1112)
   [junit4]   2> 	at org.eclipse.jetty.server.handler.ScopedHandler.handle(ScopedHandler.java:141)
   [junit4]   2> 	at org.eclipse.jetty.server.handler.gzip.GzipHandler.handle(GzipHandler.java:426)
   [junit4]   2> 	at org.eclipse.jetty.server.handler.HandlerWrapper.handle(HandlerWrapper.java:134)
   [junit4]   2> 	at org.eclipse.jetty.server.Server.handle(Server.java:534)
   [junit4]   2> 	at org.eclipse.jetty.server.HttpChannel.handle(HttpChannel.java:320)
   [junit4]   2> 	at org.eclipse.jetty.server.HttpConnection.onFillable(HttpConnection.java:251)
   [junit4]   2> 	at org.eclipse.jetty.io.AbstractConnection$ReadCallback.succeeded(AbstractConnection.java:283)
   [junit4]   2> 	at org.eclipse.jetty.io.FillInterest.fillable(FillInterest.java:108)
   [junit4]   2> 	at org.eclipse.jetty.io.ssl.SslConnection.onFillable(SslConnection.java:251)
   [junit4]   2> 	at org.eclipse.jetty.io.AbstractConnection$ReadCallback.succeeded(AbstractConnection.java:283)
   [junit4]   2> 	at org.eclipse.jetty.io.FillInterest.fillable(FillInterest.java:108)
   [junit4]   2> 	at org.eclipse.jetty.io.SelectChannelEndPoint$2.run(SelectChanne

[...truncated too long message...]

p.impl.execchain.ProtocolExec.execute(ProtocolExec.java:185)
   [junit4]    > 	at org.apache.http.impl.execchain.RetryExec.execute(RetryExec.java:89)
   [junit4]    > 	at org.apache.http.impl.execchain.RedirectExec.execute(RedirectExec.java:111)
   [junit4]    > 	at org.apache.http.impl.client.InternalHttpClient.doExecute(InternalHttpClient.java:185)
   [junit4]    > 	at org.apache.http.impl.client.CloseableHttpClient.execute(CloseableHttpClient.java:83)
   [junit4]    > 	at org.apache.http.impl.client.CloseableHttpClient.execute(CloseableHttpClient.java:56)
   [junit4]    > 	at org.apache.solr.client.solrj.impl.HttpSolrClient.executeMethod(HttpSolrClient.java:542)
   [junit4]    > 	... 43 more
   [junit4]   2> NOTE: leaving temporary files on disk at: C:\Users\jenkins\workspace\Lucene-Solr-master-Windows\solr\build\solr-core\test\J1\temp\solr.cloud.TestCollectionAPI_791333F26452344-001
   [junit4]   2> Dec 23, 2017 12:04:40 AM com.carrotsearch.randomizedtesting.ThreadLeakControl checkThreadLeaks
   [junit4]   2> WARNING: Will linger awaiting termination of 2 leaked thread(s).
   [junit4]   2> NOTE: test params are: codec=Asserting(Lucene70): {}, docValues:{}, maxPointsInLeafNode=186, maxMBSortInHeap=5.665373841949292, sim=Asserting(org.apache.lucene.search.similarities.AssertingSimilarity@19438dc), locale=es-PA, timezone=Europe/Kirov
   [junit4]   2> NOTE: Windows 10 10.0 x86/Oracle Corporation 1.8.0_144 (32-bit)/cpus=3,threads=1,free=213392064,total=357564416
   [junit4]   2> NOTE: All tests run in this JVM: [SimpleFacetsTest, TestLegacyNumericRangeQueryBuilder, TestStressReorder, TestStandardQParsers, TestInPlaceUpdatesDistrib, TestMergePolicyConfig, BooleanFieldTest, TestManagedSynonymGraphFilterFactory, TestRuleBasedAuthorizationPlugin, HdfsChaosMonkeyNothingIsSafeTest, TestSQLHandler, TestSystemCollAutoCreate, CurrencyFieldTypeTest, AssignTest, TestXmlQParserPlugin, CoreAdminCreateDiscoverTest, TestEmbeddedSolrServerConstructors, TestTolerantUpdateProcessorRandomCloud, TestAddFieldRealTimeGet, HdfsCollectionsAPIDistributedZkTest, TestSubQueryTransformer, ExecutePlanActionTest, SolrCLIZkUtilsTest, RulesTest, TestReplicaProperties, IndexSchemaRuntimeFieldTest, TestPullReplicaErrorHandling, OverseerStatusTest, TestJsonRequest, TestSolrCloudWithHadoopAuthPlugin, CdcrRequestHandlerTest, DocValuesMultiTest, SampleTest, TestLRUCache, TestTrie, TestRequestStatusCollectionAPI, DirectSolrSpellCheckerTest, TestCustomStream, HdfsRestartWhileUpdatingTest, SolrSlf4jReporterTest, PeerSyncTest, SpellingQueryConverterTest, DistributedIntervalFacetingTest, SolrMetricReporterTest, TestFastWriter, CheckHdfsIndexTest, TestBinaryResponseWriter, ReplicaListTransformerTest, TestFoldingMultitermQuery, TestExceedMaxTermLength, TestAuthorizationFramework, DistributedExpandComponentTest, AnalyticsQueryTest, TestComponentsName, SynonymTokenizerTest, DistributedQueueTest, OpenExchangeRatesOrgProviderTest, CloudExitableDirectoryReaderTest, ConcurrentDeleteAndCreateCollectionTest, TestCustomSort, ChaosMonkeySafeLeaderTest, BasicZkTest, TestAnalyzeInfixSuggestions, TestWordDelimiterFilterFactory, CollectionsAPIDistributedZkTest, TestConfigSetsAPI, LeaderElectionContextKeyTest, TestSortByMinMaxFunction, TestBM25SimilarityFactory, CoreMergeIndexesAdminHandlerTest, TestRandomRequestDistribution, SearchRateTriggerTest, TestIndexSearcher, SolrGangliaReporterTest, SpellPossibilityIteratorTest, NodeMutatorTest, TestDistributedMissingSort, TestValueSourceCache, TestPayloadCheckQParserPlugin, SimplePostToolTest, TestSolrDeletionPolicy1, PingRequestHandlerTest, JSONWriterTest, TermsComponentTest, TestBackupRepositoryFactory, TestSearcherReuse, TestSolrConfigHandlerCloud, CacheHeaderTest, DistributedFacetPivotWhiteBoxTest, JvmMetricsTest, TestSolrCloudWithSecureImpersonation, TestImplicitCoreProperties, TestFunctionQuery, TestComplexPhraseLeadingWildcard, UpdateLogTest, FieldMutatingUpdateProcessorTest, DeleteReplicaTest, SearchHandlerTest, TestConfig, TestMiniSolrCloudClusterSSL, TestSimpleTextCodec, TestDocumentBuilder, TestPerFieldSimilarity, TestSolrJ, FileUtilsTest, ExternalFileFieldSortTest, TestSmileRequest, TestPerFieldSimilarityWithDefaultOverride, TestSubQueryTransformerDistrib, TestSolrQueryParser, TestCloudDeleteByQuery, TestUninvertingReader, TestReloadAndDeleteDocs, TestSolrCoreSnapshots, TestSolrCoreParser, UpdateRequestProcessorFactoryTest, TestCloudNestedDocsSort, StressHdfsTest, TestUnifiedSolrHighlighter, TestDFISimilarityFactory, TestCollectionAPI]
   [junit4] Completed [173/765 (1!)] on J1 in 632.06s, 1 test, 1 error <<< FAILURES!

[...truncated 4304 lines...]
   [junit4] Suite: org.apache.solr.update.processor.TestOpenNLPExtractNamedEntitiesUpdateProcessorFactory
   [junit4]   2> Creating dataDir: C:\Users\jenkins\workspace\Lucene-Solr-master-Windows\solr\build\contrib\solr-analysis-extras\test\J1\temp\solr.update.processor.TestOpenNLPExtractNamedEntitiesUpdateProcessorFactory_DB71705CDF293114-001\init-core-data-001
   [junit4]   2> NOTE: test params are: codec=Lucene70, sim=Asserting(org.apache.lucene.search.similarities.AssertingSimilarity@537904), locale=sq, timezone=Europe/Zagreb
   [junit4]   2> NOTE: Windows 10 10.0 x86/Oracle Corporation 1.8.0_144 (32-bit)/cpus=3,threads=1,free=81961640,total=117702656
   [junit4]   2> NOTE: All tests run in this JVM: [TestFoldingMultitermExtrasQuery, TestICUCollationFieldOptions, TestOpenNLPExtractNamedEntitiesUpdateProcessorFactory]
   [junit4]   2> NOTE: reproduce with: ant test  -Dtestcase=TestOpenNLPExtractNamedEntitiesUpdateProcessorFactory -Dtests.seed=DB71705CDF293114 -Dtests.slow=true -Dtests.locale=sq -Dtests.timezone=Europe/Zagreb -Dtests.asserts=true -Dtests.file.encoding=Cp1252
   [junit4] ERROR   0.00s J1 | TestOpenNLPExtractNamedEntitiesUpdateProcessorFactory (suite) <<<
   [junit4]    > Throwable #1: java.io.IOException: Could not remove the following files (in the order of attempts):
   [junit4]    >    C:\Users\jenkins\workspace\Lucene-Solr-master-Windows\solr\build\contrib\solr-analysis-extras\test\J1\temp\solr.update.processor.TestOpenNLPExtractNamedEntitiesUpdateProcessorFactory_DB71705CDF293114-001\tempDir-001\collection1\conf: java.nio.file.DirectoryNotEmptyException: C:\Users\jenkins\workspace\Lucene-Solr-master-Windows\solr\build\contrib\solr-analysis-extras\test\J1\temp\solr.update.processor.TestOpenNLPExtractNamedEntitiesUpdateProcessorFactory_DB71705CDF293114-001\tempDir-001\collection1\conf
   [junit4]    >    C:\Users\jenkins\workspace\Lucene-Solr-master-Windows\solr\build\contrib\solr-analysis-extras\test\J1\temp\solr.update.processor.TestOpenNLPExtractNamedEntitiesUpdateProcessorFactory_DB71705CDF293114-001\tempDir-001\collection1: java.nio.file.DirectoryNotEmptyException: C:\Users\jenkins\workspace\Lucene-Solr-master-Windows\solr\build\contrib\solr-analysis-extras\test\J1\temp\solr.update.processor.TestOpenNLPExtractNamedEntitiesUpdateProcessorFactory_DB71705CDF293114-001\tempDir-001\collection1
   [junit4]    >    C:\Users\jenkins\workspace\Lucene-Solr-master-Windows\solr\build\contrib\solr-analysis-extras\test\J1\temp\solr.update.processor.TestOpenNLPExtractNamedEntitiesUpdateProcessorFactory_DB71705CDF293114-001\tempDir-001: java.nio.file.DirectoryNotEmptyException: C:\Users\jenkins\workspace\Lucene-Solr-master-Windows\solr\build\contrib\solr-analysis-extras\test\J1\temp\solr.update.processor.TestOpenNLPExtractNamedEntitiesUpdateProcessorFactory_DB71705CDF293114-001\tempDir-001
   [junit4]    >    C:\Users\jenkins\workspace\Lucene-Solr-master-Windows\solr\build\contrib\solr-analysis-extras\test\J1\temp\solr.update.processor.TestOpenNLPExtractNamedEntitiesUpdateProcessorFactory_DB71705CDF293114-001\tempDir-001\collection1\conf\en-test-tokenizer.bin: java.nio.file.AccessDeniedException: C:\Users\jenkins\workspace\Lucene-Solr-master-Windows\solr\build\contrib\solr-analysis-extras\test\J1\temp\solr.update.processor.TestOpenNLPExtractNamedEntitiesUpdateProcessorFactory_DB71705CDF293114-001\tempDir-001\collection1\conf\en-test-tokenizer.bin
   [junit4]    >    C:\Users\jenkins\workspace\Lucene-Solr-master-Windows\solr\build\contrib\solr-analysis-extras\test\J1\temp\solr.update.processor.TestOpenNLPExtractNamedEntitiesUpdateProcessorFactory_DB71705CDF293114-001\tempDir-001\collection1\conf\en-test-ner-person.bin: java.nio.file.AccessDeniedException: C:\Users\jenkins\workspace\Lucene-Solr-master-Windows\solr\build\contrib\solr-analysis-extras\test\J1\temp\solr.update.processor.TestOpenNLPExtractNamedEntitiesUpdateProcessorFactory_DB71705CDF293114-001\tempDir-001\collection1\conf\en-test-ner-person.bin
   [junit4]    >    C:\Users\jenkins\workspace\Lucene-Solr-master-Windows\solr\build\contrib\solr-analysis-extras\test\J1\temp\solr.update.processor.TestOpenNLPExtractNamedEntitiesUpdateProcessorFactory_DB71705CDF293114-001\tempDir-001\collection1\conf\en-test-sent.bin: java.nio.file.AccessDeniedException: C:\Users\jenkins\workspace\Lucene-Solr-master-Windows\solr\build\contrib\solr-analysis-extras\test\J1\temp\solr.update.processor.TestOpenNLPExtractNamedEntitiesUpdateProcessorFactory_DB71705CDF293114-001\tempDir-001\collection1\conf\en-test-sent.bin
   [junit4]    >    C:\Users\jenkins\workspace\Lucene-Solr-master-Windows\solr\build\contrib\solr-analysis-extras\test\J1\temp\solr.update.processor.TestOpenNLPExtractNamedEntitiesUpdateProcessorFactory_DB71705CDF293114-001: java.nio.file.DirectoryNotEmptyException: C:\Users\jenkins\workspace\Lucene-Solr-master-Windows\solr\build\contrib\solr-analysis-extras\test\J1\temp\solr.update.processor.TestOpenNLPExtractNamedEntitiesUpdateProcessorFactory_DB71705CDF293114-001
   [junit4]    > 	at __randomizedtesting.SeedInfo.seed([DB71705CDF293114]:0)
   [junit4]    > 	at org.apache.lucene.util.IOUtils.rm(IOUtils.java:329)
   [junit4]    > 	at java.lang.Thread.run(Thread.java:748)
   [junit4] Completed [5/5 (1!)] on J1 in 0.88s, 8 tests, 1 error <<< FAILURES!

[...truncated 41428 lines...]

Mime
View raw message