lucene-dev mailing list archives

Site index · List index
Message view « Date » · « Thread »
Top « Date » · « Thread »
From Policeman Jenkins Server <jenk...@thetaphi.de>
Subject [JENKINS] Lucene-Solr-master-Linux (64bit/jdk1.8.0_144) - Build # 21111 - Still Unstable!
Date Wed, 20 Dec 2017 03:48:36 GMT
Build: https://jenkins.thetaphi.de/job/Lucene-Solr-master-Linux/21111/
Java: 64bit/jdk1.8.0_144 -XX:+UseCompressedOops -XX:+UseConcMarkSweepGC

1 tests failed.
FAILED:  org.apache.solr.cloud.autoscaling.TriggerIntegrationTest.testEventQueue

Error Message:
action wasn't interrupted

Stack Trace:
java.lang.AssertionError: action wasn't interrupted
	at __randomizedtesting.SeedInfo.seed([89F3DDE657647DFE:40469F485E03BB0B]:0)
	at org.junit.Assert.fail(Assert.java:93)
	at org.junit.Assert.assertTrue(Assert.java:43)
	at org.apache.solr.cloud.autoscaling.TriggerIntegrationTest.testEventQueue(TriggerIntegrationTest.java:707)
	at sun.reflect.NativeMethodAccessorImpl.invoke0(Native Method)
	at sun.reflect.NativeMethodAccessorImpl.invoke(NativeMethodAccessorImpl.java:62)
	at sun.reflect.DelegatingMethodAccessorImpl.invoke(DelegatingMethodAccessorImpl.java:43)
	at java.lang.reflect.Method.invoke(Method.java:498)
	at com.carrotsearch.randomizedtesting.RandomizedRunner.invoke(RandomizedRunner.java:1737)
	at com.carrotsearch.randomizedtesting.RandomizedRunner$8.evaluate(RandomizedRunner.java:934)
	at com.carrotsearch.randomizedtesting.RandomizedRunner$9.evaluate(RandomizedRunner.java:970)
	at com.carrotsearch.randomizedtesting.RandomizedRunner$10.evaluate(RandomizedRunner.java:984)
	at com.carrotsearch.randomizedtesting.rules.SystemPropertiesRestoreRule$1.evaluate(SystemPropertiesRestoreRule.java:57)
	at org.apache.lucene.util.TestRuleSetupTeardownChained$1.evaluate(TestRuleSetupTeardownChained.java:49)
	at org.apache.lucene.util.AbstractBeforeAfterRule$1.evaluate(AbstractBeforeAfterRule.java:45)
	at org.apache.lucene.util.TestRuleThreadAndTestName$1.evaluate(TestRuleThreadAndTestName.java:48)
	at org.apache.lucene.util.TestRuleIgnoreAfterMaxFailures$1.evaluate(TestRuleIgnoreAfterMaxFailures.java:64)
	at org.apache.lucene.util.TestRuleMarkFailure$1.evaluate(TestRuleMarkFailure.java:47)
	at com.carrotsearch.randomizedtesting.rules.StatementAdapter.evaluate(StatementAdapter.java:36)
	at com.carrotsearch.randomizedtesting.ThreadLeakControl$StatementRunner.run(ThreadLeakControl.java:368)
	at com.carrotsearch.randomizedtesting.ThreadLeakControl.forkTimeoutingTask(ThreadLeakControl.java:817)
	at com.carrotsearch.randomizedtesting.ThreadLeakControl$3.evaluate(ThreadLeakControl.java:468)
	at com.carrotsearch.randomizedtesting.RandomizedRunner.runSingleTest(RandomizedRunner.java:943)
	at com.carrotsearch.randomizedtesting.RandomizedRunner$5.evaluate(RandomizedRunner.java:829)
	at com.carrotsearch.randomizedtesting.RandomizedRunner$6.evaluate(RandomizedRunner.java:879)
	at com.carrotsearch.randomizedtesting.RandomizedRunner$7.evaluate(RandomizedRunner.java:890)
	at com.carrotsearch.randomizedtesting.rules.StatementAdapter.evaluate(StatementAdapter.java:36)
	at com.carrotsearch.randomizedtesting.rules.SystemPropertiesRestoreRule$1.evaluate(SystemPropertiesRestoreRule.java:57)
	at org.apache.lucene.util.AbstractBeforeAfterRule$1.evaluate(AbstractBeforeAfterRule.java:45)
	at com.carrotsearch.randomizedtesting.rules.StatementAdapter.evaluate(StatementAdapter.java:36)
	at org.apache.lucene.util.TestRuleStoreClassName$1.evaluate(TestRuleStoreClassName.java:41)
	at com.carrotsearch.randomizedtesting.rules.NoShadowingOrOverridesOnMethodsRule$1.evaluate(NoShadowingOrOverridesOnMethodsRule.java:40)
	at com.carrotsearch.randomizedtesting.rules.NoShadowingOrOverridesOnMethodsRule$1.evaluate(NoShadowingOrOverridesOnMethodsRule.java:40)
	at com.carrotsearch.randomizedtesting.rules.StatementAdapter.evaluate(StatementAdapter.java:36)
	at com.carrotsearch.randomizedtesting.rules.StatementAdapter.evaluate(StatementAdapter.java:36)
	at com.carrotsearch.randomizedtesting.rules.StatementAdapter.evaluate(StatementAdapter.java:36)
	at org.apache.lucene.util.TestRuleAssertionsRequired$1.evaluate(TestRuleAssertionsRequired.java:53)
	at org.apache.lucene.util.TestRuleMarkFailure$1.evaluate(TestRuleMarkFailure.java:47)
	at org.apache.lucene.util.TestRuleIgnoreAfterMaxFailures$1.evaluate(TestRuleIgnoreAfterMaxFailures.java:64)
	at org.apache.lucene.util.TestRuleIgnoreTestSuites$1.evaluate(TestRuleIgnoreTestSuites.java:54)
	at com.carrotsearch.randomizedtesting.rules.StatementAdapter.evaluate(StatementAdapter.java:36)
	at com.carrotsearch.randomizedtesting.ThreadLeakControl$StatementRunner.run(ThreadLeakControl.java:368)
	at java.lang.Thread.run(Thread.java:748)




Build Log:
[...truncated 12970 lines...]
   [junit4] Suite: org.apache.solr.cloud.autoscaling.TriggerIntegrationTest
   [junit4]   2> 1191907 INFO  (SUITE-TriggerIntegrationTest-seed#[89F3DDE657647DFE]-worker) [    ] o.a.s.SolrTestCaseJ4 SecureRandom sanity checks: test.solr.allowed.securerandom=null & java.security.egd=file:/dev/./urandom
   [junit4]   2> Creating dataDir: /home/jenkins/workspace/Lucene-Solr-master-Linux/solr/build/solr-core/test/J0/temp/solr.cloud.autoscaling.TriggerIntegrationTest_89F3DDE657647DFE-001/init-core-data-001
   [junit4]   2> 1191908 WARN  (SUITE-TriggerIntegrationTest-seed#[89F3DDE657647DFE]-worker) [    ] o.a.s.SolrTestCaseJ4 startTrackingSearchers: numOpens=1 numCloses=1
   [junit4]   2> 1191908 INFO  (SUITE-TriggerIntegrationTest-seed#[89F3DDE657647DFE]-worker) [    ] o.a.s.SolrTestCaseJ4 Using TrieFields (NUMERIC_POINTS_SYSPROP=false) w/NUMERIC_DOCVALUES_SYSPROP=true
   [junit4]   2> 1191909 INFO  (SUITE-TriggerIntegrationTest-seed#[89F3DDE657647DFE]-worker) [    ] o.a.s.SolrTestCaseJ4 Randomized ssl (false) and clientAuth (false) via: @org.apache.solr.util.RandomizeSSL(reason=, ssl=NaN, value=NaN, clientAuth=NaN)
   [junit4]   2> 1191909 INFO  (SUITE-TriggerIntegrationTest-seed#[89F3DDE657647DFE]-worker) [    ] o.a.s.c.MiniSolrCloudCluster Starting cluster of 2 servers in /home/jenkins/workspace/Lucene-Solr-master-Linux/solr/build/solr-core/test/J0/temp/solr.cloud.autoscaling.TriggerIntegrationTest_89F3DDE657647DFE-001/tempDir-001
   [junit4]   2> 1191909 INFO  (SUITE-TriggerIntegrationTest-seed#[89F3DDE657647DFE]-worker) [    ] o.a.s.c.ZkTestServer STARTING ZK TEST SERVER
   [junit4]   2> 1191909 INFO  (Thread-3031) [    ] o.a.s.c.ZkTestServer client port:0.0.0.0/0.0.0.0:0
   [junit4]   2> 1191909 INFO  (Thread-3031) [    ] o.a.s.c.ZkTestServer Starting server
   [junit4]   2> 1191910 ERROR (Thread-3031) [    ] o.a.z.s.ZooKeeperServer ZKShutdownHandler is not registered, so ZooKeeper server won't take any action on ERROR or SHUTDOWN server state changes
   [junit4]   2> 1192010 INFO  (SUITE-TriggerIntegrationTest-seed#[89F3DDE657647DFE]-worker) [    ] o.a.s.c.ZkTestServer start zk server on port:35909
   [junit4]   2> 1192011 INFO  (zkConnectionManagerCallback-1586-thread-1) [    ] o.a.s.c.c.ConnectionManager zkClient has connected
   [junit4]   2> 1192013 INFO  (jetty-launcher-1583-thread-1) [    ] o.e.j.s.Server jetty-9.3.20.v20170531
   [junit4]   2> 1192013 INFO  (jetty-launcher-1583-thread-2) [    ] o.e.j.s.Server jetty-9.3.20.v20170531
   [junit4]   2> 1192021 INFO  (jetty-launcher-1583-thread-2) [    ] o.e.j.s.h.ContextHandler Started o.e.j.s.ServletContextHandler@397f3de3{/solr,null,AVAILABLE}
   [junit4]   2> 1192021 INFO  (jetty-launcher-1583-thread-1) [    ] o.e.j.s.h.ContextHandler Started o.e.j.s.ServletContextHandler@436c13ec{/solr,null,AVAILABLE}
   [junit4]   2> 1192022 INFO  (jetty-launcher-1583-thread-2) [    ] o.e.j.s.AbstractConnector Started ServerConnector@553c4ed7{HTTP/1.1,[http/1.1]}{127.0.0.1:38581}
   [junit4]   2> 1192022 INFO  (jetty-launcher-1583-thread-1) [    ] o.e.j.s.AbstractConnector Started ServerConnector@24743f9b{HTTP/1.1,[http/1.1]}{127.0.0.1:44641}
   [junit4]   2> 1192022 INFO  (jetty-launcher-1583-thread-2) [    ] o.e.j.s.Server Started @1193283ms
   [junit4]   2> 1192022 INFO  (jetty-launcher-1583-thread-1) [    ] o.e.j.s.Server Started @1193283ms
   [junit4]   2> 1192022 INFO  (jetty-launcher-1583-thread-2) [    ] o.a.s.c.s.e.JettySolrRunner Jetty properties: {hostContext=/solr, hostPort=38581}
   [junit4]   2> 1192022 INFO  (jetty-launcher-1583-thread-1) [    ] o.a.s.c.s.e.JettySolrRunner Jetty properties: {hostContext=/solr, hostPort=44641}
   [junit4]   2> 1192022 ERROR (jetty-launcher-1583-thread-2) [    ] o.a.s.u.StartupLoggingUtils Missing Java Option solr.log.dir. Logging may be missing or incomplete.
   [junit4]   2> 1192022 INFO  (jetty-launcher-1583-thread-2) [    ] o.a.s.s.SolrDispatchFilter  ___      _       Welcome to Apache Solr? version 8.0.0
   [junit4]   2> 1192022 ERROR (jetty-launcher-1583-thread-1) [    ] o.a.s.u.StartupLoggingUtils Missing Java Option solr.log.dir. Logging may be missing or incomplete.
   [junit4]   2> 1192023 INFO  (jetty-launcher-1583-thread-2) [    ] o.a.s.s.SolrDispatchFilter / __| ___| |_ _   Starting in cloud mode on port null
   [junit4]   2> 1192023 INFO  (jetty-launcher-1583-thread-1) [    ] o.a.s.s.SolrDispatchFilter  ___      _       Welcome to Apache Solr? version 8.0.0
   [junit4]   2> 1192023 INFO  (jetty-launcher-1583-thread-2) [    ] o.a.s.s.SolrDispatchFilter \__ \/ _ \ | '_|  Install dir: null
   [junit4]   2> 1192023 INFO  (jetty-launcher-1583-thread-1) [    ] o.a.s.s.SolrDispatchFilter / __| ___| |_ _   Starting in cloud mode on port null
   [junit4]   2> 1192023 INFO  (jetty-launcher-1583-thread-2) [    ] o.a.s.s.SolrDispatchFilter |___/\___/_|_|    Start time: 2017-12-20T03:11:59.768Z
   [junit4]   2> 1192023 INFO  (jetty-launcher-1583-thread-1) [    ] o.a.s.s.SolrDispatchFilter \__ \/ _ \ | '_|  Install dir: null
   [junit4]   2> 1192023 INFO  (jetty-launcher-1583-thread-1) [    ] o.a.s.s.SolrDispatchFilter |___/\___/_|_|    Start time: 2017-12-20T03:11:59.768Z
   [junit4]   2> 1192024 INFO  (zkConnectionManagerCallback-1590-thread-1) [    ] o.a.s.c.c.ConnectionManager zkClient has connected
   [junit4]   2> 1192024 INFO  (zkConnectionManagerCallback-1589-thread-1) [    ] o.a.s.c.c.ConnectionManager zkClient has connected
   [junit4]   2> 1192024 INFO  (jetty-launcher-1583-thread-1) [    ] o.a.s.s.SolrDispatchFilter solr.xml found in ZooKeeper. Loading...
   [junit4]   2> 1192024 INFO  (jetty-launcher-1583-thread-2) [    ] o.a.s.s.SolrDispatchFilter solr.xml found in ZooKeeper. Loading...
   [junit4]   2> 1192037 INFO  (jetty-launcher-1583-thread-1) [    ] o.a.s.c.ZkContainer Zookeeper client=127.0.0.1:35909/solr
   [junit4]   2> 1192037 INFO  (jetty-launcher-1583-thread-2) [    ] o.a.s.c.ZkContainer Zookeeper client=127.0.0.1:35909/solr
   [junit4]   2> 1192037 INFO  (zkConnectionManagerCallback-1596-thread-1) [    ] o.a.s.c.c.ConnectionManager zkClient has connected
   [junit4]   2> 1192037 INFO  (zkConnectionManagerCallback-1598-thread-1) [    ] o.a.s.c.c.ConnectionManager zkClient has connected
   [junit4]   2> 1192039 INFO  (zkConnectionManagerCallback-1600-thread-1-processing-n:127.0.0.1:44641_solr) [n:127.0.0.1:44641_solr    ] o.a.s.c.c.ConnectionManager zkClient has connected
   [junit4]   2> 1192052 INFO  (zkConnectionManagerCallback-1603-thread-1-processing-n:127.0.0.1:38581_solr) [n:127.0.0.1:38581_solr    ] o.a.s.c.c.ConnectionManager zkClient has connected
   [junit4]   2> 1192057 INFO  (jetty-launcher-1583-thread-2) [n:127.0.0.1:38581_solr    ] o.a.s.c.Overseer Overseer (id=null) closing
   [junit4]   2> 1192057 INFO  (jetty-launcher-1583-thread-2) [n:127.0.0.1:38581_solr    ] o.a.s.c.OverseerElectionContext I am going to be the leader 127.0.0.1:38581_solr
   [junit4]   2> 1192057 INFO  (jetty-launcher-1583-thread-2) [n:127.0.0.1:38581_solr    ] o.a.s.c.Overseer Overseer (id=99204433160110086-127.0.0.1:38581_solr-n_0000000000) starting
   [junit4]   2> 1192060 INFO  (jetty-launcher-1583-thread-2) [n:127.0.0.1:38581_solr    ] o.a.s.c.ZkController Register node as live in ZooKeeper:/live_nodes/127.0.0.1:38581_solr
   [junit4]   2> 1192063 DEBUG (OverseerAutoScalingTriggerThread-99204433160110086-127.0.0.1:38581_solr-n_0000000000) [n:127.0.0.1:38581_solr    ] o.a.s.c.a.OverseerTriggerThread Adding .autoAddReplicas trigger
   [junit4]   2> 1192063 DEBUG (OverseerAutoScalingTriggerThread-99204433160110086-127.0.0.1:38581_solr-n_0000000000) [n:127.0.0.1:38581_solr    ] o.a.s.c.a.OverseerTriggerThread Refreshing /autoscaling.json with znode version 1
   [junit4]   2> 1192063 DEBUG (OverseerAutoScalingTriggerThread-99204433160110086-127.0.0.1:38581_solr-n_0000000000) [n:127.0.0.1:38581_solr    ] o.a.s.c.a.NodeLostTrigger Initial livenodes: []
   [junit4]   2> 1192063 DEBUG (OverseerAutoScalingTriggerThread-99204433160110086-127.0.0.1:38581_solr-n_0000000000) [n:127.0.0.1:38581_solr    ] o.a.s.c.a.OverseerTriggerThread Current znodeVersion 1, lastZnodeVersion -1
   [junit4]   2> 1192063 DEBUG (OverseerAutoScalingTriggerThread-99204433160110086-127.0.0.1:38581_solr-n_0000000000) [n:127.0.0.1:38581_solr    ] o.a.s.c.a.OverseerTriggerThread Processed trigger updates upto znodeVersion 1
   [junit4]   2> 1192067 DEBUG (OverseerAutoScalingTriggerThread-99204433160110086-127.0.0.1:38581_solr-n_0000000000) [n:127.0.0.1:38581_solr    ] o.a.s.c.a.OverseerTriggerThread -- clean old nodeAdded markers
   [junit4]   2> 1192068 DEBUG (OverseerAutoScalingTriggerThread-99204433160110086-127.0.0.1:38581_solr-n_0000000000) [n:127.0.0.1:38581_solr    ] o.a.s.c.a.OverseerTriggerThread Current znodeVersion 1, lastZnodeVersion 1
   [junit4]   2> 1192068 INFO  (OverseerStateUpdate-99204433160110086-127.0.0.1:38581_solr-n_0000000000) [n:127.0.0.1:38581_solr    ] o.a.s.c.c.ZkStateReader Updated live nodes from ZooKeeper... (0) -> (1)
   [junit4]   2> 1192068 DEBUG (ScheduledTrigger-4430-thread-1) [n:127.0.0.1:38581_solr    ] o.a.s.c.a.NodeLostTrigger Running NodeLostTrigger: .auto_add_replicas with currently live nodes: 1
   [junit4]   2> 1192074 INFO  (jetty-launcher-1583-thread-1) [n:127.0.0.1:44641_solr    ] o.a.s.c.c.ZkStateReader Updated live nodes from ZooKeeper... (0) -> (1)
   [junit4]   2> 1192074 INFO  (jetty-launcher-1583-thread-1) [n:127.0.0.1:44641_solr    ] o.a.s.c.Overseer Overseer (id=null) closing
   [junit4]   2> 1192075 INFO  (jetty-launcher-1583-thread-1) [n:127.0.0.1:44641_solr    ] o.a.s.c.ZkController Register node as live in ZooKeeper:/live_nodes/127.0.0.1:44641_solr
   [junit4]   2> 1192079 INFO  (zkCallback-1602-thread-1-processing-n:127.0.0.1:38581_solr) [n:127.0.0.1:38581_solr    ] o.a.s.c.c.ZkStateReader Updated live nodes from ZooKeeper... (1) -> (2)
   [junit4]   2> 1192083 INFO  (zkCallback-1599-thread-1-processing-n:127.0.0.1:44641_solr) [n:127.0.0.1:44641_solr    ] o.a.s.c.c.ZkStateReader Updated live nodes from ZooKeeper... (1) -> (2)
   [junit4]   2> 1192112 INFO  (jetty-launcher-1583-thread-1) [n:127.0.0.1:44641_solr    ] o.a.s.m.r.SolrJmxReporter JMX monitoring for 'solr_44641.solr.node' (registry 'solr.node') enabled at server: com.sun.jmx.mbeanserver.JmxMBeanServer@3acf4ba2
   [junit4]   2> 1192116 INFO  (jetty-launcher-1583-thread-2) [n:127.0.0.1:38581_solr    ] o.a.s.m.r.SolrJmxReporter JMX monitoring for 'solr_38581.solr.node' (registry 'solr.node') enabled at server: com.sun.jmx.mbeanserver.JmxMBeanServer@3acf4ba2
   [junit4]   2> 1192118 INFO  (jetty-launcher-1583-thread-1) [n:127.0.0.1:44641_solr    ] o.a.s.m.r.SolrJmxReporter JMX monitoring for 'solr_44641.solr.jvm' (registry 'solr.jvm') enabled at server: com.sun.jmx.mbeanserver.JmxMBeanServer@3acf4ba2
   [junit4]   2> 1192118 INFO  (jetty-launcher-1583-thread-1) [n:127.0.0.1:44641_solr    ] o.a.s.m.r.SolrJmxReporter JMX monitoring for 'solr_44641.solr.jetty' (registry 'solr.jetty') enabled at server: com.sun.jmx.mbeanserver.JmxMBeanServer@3acf4ba2
   [junit4]   2> 1192119 INFO  (jetty-launcher-1583-thread-1) [n:127.0.0.1:44641_solr    ] o.a.s.c.CorePropertiesLocator Found 0 core definitions underneath /home/jenkins/workspace/Lucene-Solr-master-Linux/solr/build/solr-core/test/J0/temp/solr.cloud.autoscaling.TriggerIntegrationTest_89F3DDE657647DFE-001/tempDir-001/node1/.
   [junit4]   2> 1192123 INFO  (jetty-launcher-1583-thread-2) [n:127.0.0.1:38581_solr    ] o.a.s.m.r.SolrJmxReporter JMX monitoring for 'solr_38581.solr.jvm' (registry 'solr.jvm') enabled at server: com.sun.jmx.mbeanserver.JmxMBeanServer@3acf4ba2
   [junit4]   2> 1192123 INFO  (jetty-launcher-1583-thread-2) [n:127.0.0.1:38581_solr    ] o.a.s.m.r.SolrJmxReporter JMX monitoring for 'solr_38581.solr.jetty' (registry 'solr.jetty') enabled at server: com.sun.jmx.mbeanserver.JmxMBeanServer@3acf4ba2
   [junit4]   2> 1192124 INFO  (jetty-launcher-1583-thread-2) [n:127.0.0.1:38581_solr    ] o.a.s.c.CorePropertiesLocator Found 0 core definitions underneath /home/jenkins/workspace/Lucene-Solr-master-Linux/solr/build/solr-core/test/J0/temp/solr.cloud.autoscaling.TriggerIntegrationTest_89F3DDE657647DFE-001/tempDir-001/node2/.
   [junit4]   2> 1192149 INFO  (zkConnectionManagerCallback-1608-thread-1) [    ] o.a.s.c.c.ConnectionManager zkClient has connected
   [junit4]   2> 1192151 INFO  (zkConnectionManagerCallback-1612-thread-1) [    ] o.a.s.c.c.ConnectionManager zkClient has connected
   [junit4]   2> 1192152 INFO  (SUITE-TriggerIntegrationTest-seed#[89F3DDE657647DFE]-worker) [    ] o.a.s.c.c.ZkStateReader Updated live nodes from ZooKeeper... (0) -> (2)
   [junit4]   2> 1192152 INFO  (SUITE-TriggerIntegrationTest-seed#[89F3DDE657647DFE]-worker) [    ] o.a.s.c.s.i.ZkClientClusterStateProvider Cluster at 127.0.0.1:35909/solr ready
   [junit4] IGNOR/A 0.00s J0 | TriggerIntegrationTest.testSearchRate
   [junit4]    > Assumption #1: 'awaitsfix' test group is disabled (@AwaitsFix(bugUrl=https://issues.apache.org/jira/browse/SOLR-11714))
   [junit4]   2> 1192160 INFO  (TEST-TriggerIntegrationTest.testEventQueue-seed#[89F3DDE657647DFE]) [    ] o.a.s.SolrTestCaseJ4 ###Starting testEventQueue
   [junit4]   2> 1192160 INFO  (TEST-TriggerIntegrationTest.testEventQueue-seed#[89F3DDE657647DFE]) [    ] o.a.s.c.a.TriggerIntegrationTest /autoscaling.json reset, new znode version 2
   [junit4]   2> 1192161 DEBUG (zkCallback-1602-thread-1-processing-n:127.0.0.1:38581_solr) [n:127.0.0.1:38581_solr    ] o.a.s.c.a.OverseerTriggerThread Refreshing /autoscaling.json with znode version 2
   [junit4]   2> 1192161 DEBUG (OverseerAutoScalingTriggerThread-99204433160110086-127.0.0.1:38581_solr-n_0000000000) [n:127.0.0.1:38581_solr    ] o.a.s.c.a.OverseerTriggerThread Processed trigger updates upto znodeVersion 2
   [junit4]   2> 1192163 DEBUG (OverseerAutoScalingTriggerThread-99204433160110086-127.0.0.1:38581_solr-n_0000000000) [n:127.0.0.1:38581_solr    ] o.a.s.c.a.OverseerTriggerThread -- clean old nodeLost markers
   [junit4]   2> 1192163 DEBUG (OverseerAutoScalingTriggerThread-99204433160110086-127.0.0.1:38581_solr-n_0000000000) [n:127.0.0.1:38581_solr    ] o.a.s.c.a.OverseerTriggerThread -- clean old nodeAdded markers
   [junit4]   2> 1192163 DEBUG (OverseerAutoScalingTriggerThread-99204433160110086-127.0.0.1:38581_solr-n_0000000000) [n:127.0.0.1:38581_solr    ] o.a.s.c.a.OverseerTriggerThread Current znodeVersion 2, lastZnodeVersion 2
   [junit4]   2> 1192165 INFO  (qtp958693042-9881) [n:127.0.0.1:44641_solr    ] o.a.s.h.a.CollectionsHandler Invoked Collection Action :overseerstatus with params action=OVERSEERSTATUS&wt=javabin&version=2 and sendToOCPQueue=true
   [junit4]   2> 1192170 INFO  (qtp958693042-9881) [n:127.0.0.1:44641_solr    ] o.a.s.s.HttpSolrCall [admin] webapp=null path=/admin/collections params={action=OVERSEERSTATUS&wt=javabin&version=2} status=0 QTime=5
   [junit4]   2> 1192172 INFO  (qtp1575234768-9882) [n:127.0.0.1:38581_solr    ] o.a.s.s.HttpSolrCall [admin] webapp=null path=/admin/metrics params={prefix=CORE.coreName&wt=javabin&version=2&group=solr.core} status=0 QTime=0
   [junit4]   2> 1192173 INFO  (qtp958693042-9871) [n:127.0.0.1:44641_solr    ] o.a.s.s.HttpSolrCall [admin] webapp=null path=/admin/metrics params={prefix=CORE.coreName&wt=javabin&version=2&group=solr.core} status=0 QTime=0
   [junit4]   2> 1192173 DEBUG (qtp958693042-9883) [n:127.0.0.1:44641_solr    ] o.a.s.c.a.AutoScalingHandler Verified autoscaling configuration
   [junit4]   2> 1192173 INFO  (qtp958693042-9883) [n:127.0.0.1:44641_solr    ] o.a.s.s.HttpSolrCall [admin] webapp=null path=/admin/autoscaling params={wt=javabin&version=2} status=0 QTime=2
   [junit4]   2> 1192173 DEBUG (zkCallback-1602-thread-1-processing-n:127.0.0.1:38581_solr) [n:127.0.0.1:38581_solr    ] o.a.s.c.a.OverseerTriggerThread Refreshing /autoscaling.json with znode version 3
   [junit4]   2> 1192174 INFO  (zkCallback-1602-thread-1-processing-n:127.0.0.1:38581_solr) [n:127.0.0.1:38581_solr    ] o.a.s.c.a.TriggerIntegrationTest TestEventQueueAction instantiated
   [junit4]   2> 1192174 DEBUG (zkCallback-1602-thread-1-processing-n:127.0.0.1:38581_solr) [n:127.0.0.1:38581_solr    ] o.a.s.c.a.NodeAddedTrigger Initial livenodes: [127.0.0.1:44641_solr, 127.0.0.1:38581_solr]
   [junit4]   2> 1192174 DEBUG (zkCallback-1602-thread-1-processing-n:127.0.0.1:38581_solr) [n:127.0.0.1:38581_solr    ] o.a.s.c.a.NodeAddedTrigger NodeAddedTrigger node_added_trigger1 instantiated with properties: {event=nodeAdded, waitFor=1, actions=[{name=test, class=org.apache.solr.cloud.autoscaling.TriggerIntegrationTest$TestEventQueueAction}], enabled=true}
   [junit4]   2> 1192174 DEBUG (OverseerAutoScalingTriggerThread-99204433160110086-127.0.0.1:38581_solr-n_0000000000) [n:127.0.0.1:38581_solr    ] o.a.s.c.a.OverseerTriggerThread Processed trigger updates upto znodeVersion 3
   [junit4]   2> 1192174 DEBUG (OverseerAutoScalingTriggerThread-99204433160110086-127.0.0.1:38581_solr-n_0000000000) [n:127.0.0.1:38581_solr    ] o.a.s.c.a.TriggerIntegrationTest TestTriggerAction init
   [junit4]   2> 1192175 DEBUG (OverseerAutoScalingTriggerThread-99204433160110086-127.0.0.1:38581_solr-n_0000000000) [n:127.0.0.1:38581_solr    ] o.a.s.c.a.OverseerTriggerThread -- clean old nodeLost markers
   [junit4]   2> 1192175 DEBUG (OverseerAutoScalingTriggerThread-99204433160110086-127.0.0.1:38581_solr-n_0000000000) [n:127.0.0.1:38581_solr    ] o.a.s.c.a.OverseerTriggerThread Current znodeVersion 3, lastZnodeVersion 3
   [junit4]   2> 1192175 DEBUG (ScheduledTrigger-4430-thread-1) [n:127.0.0.1:38581_solr    ] o.a.s.c.a.NodeAddedTrigger Running NodeAddedTrigger node_added_trigger1
   [junit4]   2> 1192175 DEBUG (ScheduledTrigger-4430-thread-1) [n:127.0.0.1:38581_solr    ] o.a.s.c.a.NodeAddedTrigger Found livenodes: 2
   [junit4]   2> 1192175 INFO  (TEST-TriggerIntegrationTest.testEventQueue-seed#[89F3DDE657647DFE]) [    ] o.e.j.s.Server jetty-9.3.20.v20170531
   [junit4]   2> 1192176 INFO  (TEST-TriggerIntegrationTest.testEventQueue-seed#[89F3DDE657647DFE]) [    ] o.e.j.s.h.ContextHandler Started o.e.j.s.ServletContextHandler@6572fff8{/solr,null,AVAILABLE}
   [junit4]   2> 1192176 INFO  (TEST-TriggerIntegrationTest.testEventQueue-seed#[89F3DDE657647DFE]) [    ] o.e.j.s.AbstractConnector Started ServerConnector@8078072{HTTP/1.1,[http/1.1]}{127.0.0.1:39093}
   [junit4]   2> 1192176 INFO  (TEST-TriggerIntegrationTest.testEventQueue-seed#[89F3DDE657647DFE]) [    ] o.e.j.s.Server Started @1193437ms
   [junit4]   2> 1192176 INFO  (TEST-TriggerIntegrationTest.testEventQueue-seed#[89F3DDE657647DFE]) [    ] o.a.s.c.s.e.JettySolrRunner Jetty properties: {hostContext=/solr, hostPort=39093}
   [junit4]   2> 1192176 ERROR (TEST-TriggerIntegrationTest.testEventQueue-seed#[89F3DDE657647DFE]) [    ] o.a.s.u.StartupLoggingUtils Missing Java Option solr.log.dir. Logging may be missing or incomplete.
   [junit4]   2> 1192176 INFO  (TEST-TriggerIntegrationTest.testEventQueue-seed#[89F3DDE657647DFE]) [    ] o.a.s.s.SolrDispatchFilter  ___      _       Welcome to Apache Solr? version 8.0.0
   [junit4]   2> 1192176 INFO  (TEST-TriggerIntegrationTest.testEventQueue-seed#[89F3DDE657647DFE]) [    ] o.a.s.s.SolrDispatchFilter / __| ___| |_ _   Starting in cloud mode on port null
   [junit4]   2> 1192176 INFO  (TEST-TriggerIntegrationTest.testEventQueue-seed#[89F3DDE657647DFE]) [    ] o.a.s.s.SolrDispatchFilter \__ \/ _ \ | '_|  Install dir: null
   [junit4]   2> 1192176 INFO  (TEST-TriggerIntegrationTest.testEventQueue-seed#[89F3DDE657647DFE]) [    ] o.a.s.s.SolrDispatchFilter |___/\___/_|_|    Start time: 2017-12-20T03:11:59.921Z
   [junit4]   2> 1192179 INFO  (zkConnectionManagerCallback-1614-thread-1) [    ] o.a.s.c.c.ConnectionManager zkClient has connected
   [junit4]   2> 1192179 INFO  (TEST-TriggerIntegrationTest.testEventQueue-seed#[89F3DDE657647DFE]) [    ] o.a.s.s.SolrDispatchFilter solr.xml found in ZooKeeper. Loading...
   [junit4]   2> 1192184 INFO  (TEST-TriggerIntegrationTest.testEventQueue-seed#[89F3DDE657647DFE]) [    ] o.a.s.c.ZkContainer Zookeeper client=127.0.0.1:35909/solr
   [junit4]   2> 1192184 INFO  (zkConnectionManagerCallback-1618-thread-1) [    ] o.a.s.c.c.ConnectionManager zkClient has connected
   [junit4]   2> 1192186 INFO  (zkConnectionManagerCallback-1620-thread-1-processing-n:127.0.0.1:39093_solr) [n:127.0.0.1:39093_solr    ] o.a.s.c.c.ConnectionManager zkClient has connected
   [junit4]   2> 1192188 INFO  (TEST-TriggerIntegrationTest.testEventQueue-seed#[89F3DDE657647DFE]) [n:127.0.0.1:39093_solr    ] o.a.s.c.c.ZkStateReader Updated live nodes from ZooKeeper... (0) -> (2)
   [junit4]   2> 1192188 INFO  (TEST-TriggerIntegrationTest.testEventQueue-seed#[89F3DDE657647DFE]) [n:127.0.0.1:39093_solr    ] o.a.s.c.Overseer Overseer (id=null) closing
   [junit4]   2> 1192189 INFO  (TEST-TriggerIntegrationTest.testEventQueue-seed#[89F3DDE657647DFE]) [n:127.0.0.1:39093_solr    ] o.a.s.c.ZkController Register node as live in ZooKeeper:/live_nodes/127.0.0.1:39093_solr
   [junit4]   2> 1192189 INFO  (zkCallback-1602-thread-1-processing-n:127.0.0.1:38581_solr) [n:127.0.0.1:38581_solr    ] o.a.s.c.c.ZkStateReader Updated live nodes from ZooKeeper... (2) -> (3)
   [junit4]   2> 1192189 INFO  (zkCallback-1599-thread-1-processing-n:127.0.0.1:44641_solr) [n:127.0.0.1:44641_solr    ] o.a.s.c.c.ZkStateReader Updated live nodes from ZooKeeper... (2) -> (3)
   [junit4]   2> 1192191 INFO  (zkCallback-1611-thread-1) [    ] o.a.s.c.c.ZkStateReader Updated live nodes from ZooKeeper... (2) -> (3)
   [junit4]   2> 1192191 INFO  (zkCallback-1619-thread-1-processing-n:127.0.0.1:39093_solr) [n:127.0.0.1:39093_solr    ] o.a.s.c.c.ZkStateReader Updated live nodes from ZooKeeper... (2) -> (3)
   [junit4]   2> 1192270 INFO  (TEST-TriggerIntegrationTest.testEventQueue-seed#[89F3DDE657647DFE]) [n:127.0.0.1:39093_solr    ] o.a.s.m.r.SolrJmxReporter JMX monitoring for 'solr_39093.solr.node' (registry 'solr.node') enabled at server: com.sun.jmx.mbeanserver.JmxMBeanServer@3acf4ba2
   [junit4]   2> 1192277 INFO  (TEST-TriggerIntegrationTest.testEventQueue-seed#[89F3DDE657647DFE]) [n:127.0.0.1:39093_solr    ] o.a.s.m.r.SolrJmxReporter JMX monitoring for 'solr_39093.solr.jvm' (registry 'solr.jvm') enabled at server: com.sun.jmx.mbeanserver.JmxMBeanServer@3acf4ba2
   [junit4]   2> 1192277 INFO  (TEST-TriggerIntegrationTest.testEventQueue-seed#[89F3DDE657647DFE]) [n:127.0.0.1:39093_solr    ] o.a.s.m.r.SolrJmxReporter JMX monitoring for 'solr_39093.solr.jetty' (registry 'solr.jetty') enabled at server: com.sun.jmx.mbeanserver.JmxMBeanServer@3acf4ba2
   [junit4]   2> 1192278 INFO  (TEST-TriggerIntegrationTest.testEventQueue-seed#[89F3DDE657647DFE]) [n:127.0.0.1:39093_solr    ] o.a.s.c.CorePropertiesLocator Found 0 core definitions underneath /home/jenkins/workspace/Lucene-Solr-master-Linux/solr/build/solr-core/test/J0/temp/solr.cloud.autoscaling.TriggerIntegrationTest_89F3DDE657647DFE-001/tempDir-001/node3/.
   [junit4]   2> 1193176 DEBUG (ScheduledTrigger-4430-thread-2) [n:127.0.0.1:38581_solr    ] o.a.s.c.a.NodeAddedTrigger Running NodeAddedTrigger node_added_trigger1
   [junit4]   2> 1193176 DEBUG (ScheduledTrigger-4430-thread-2) [n:127.0.0.1:38581_solr    ] o.a.s.c.a.NodeAddedTrigger Found livenodes: 3
   [junit4]   2> 1193176 DEBUG (ScheduledTrigger-4430-thread-2) [n:127.0.0.1:38581_solr    ] o.a.s.c.a.NodeAddedTrigger Tracking new node: 127.0.0.1:39093_solr at time 1440662893407939
   [junit4]   2> 1194169 INFO  (OverseerCollectionConfigSetProcessor-99204433160110086-127.0.0.1:38581_solr-n_0000000000) [n:127.0.0.1:38581_solr    ] o.a.s.c.OverseerTaskQueue Response ZK path: /overseer/collection-queue-work/qnr-0000000000 doesn't exist.  Requestor may have disconnected from ZooKeeper
   [junit4]   2> 1194176 DEBUG (ScheduledTrigger-4430-thread-2) [n:127.0.0.1:38581_solr    ] o.a.s.c.a.NodeAddedTrigger Running NodeAddedTrigger node_added_trigger1
   [junit4]   2> 1194176 DEBUG (ScheduledTrigger-4430-thread-2) [n:127.0.0.1:38581_solr    ] o.a.s.c.a.NodeAddedTrigger Found livenodes: 3
   [junit4]   2> 1194176 DEBUG (ScheduledTrigger-4430-thread-2) [n:127.0.0.1:38581_solr    ] o.a.s.c.a.NodeAddedTrigger NodeAddedTrigger node_added_trigger1 firing registered processor for nodes: [127.0.0.1:39093_solr] added at times [1440662893407939], now=1440663893948350
   [junit4]   2> 1194176 DEBUG (ScheduledTrigger-4430-thread-2) [n:127.0.0.1:38581_solr    ] o.a.s.c.a.ScheduledTriggers ++++++++ Cooldown inactive - processing event: {
   [junit4]   2>   "id":"51e467800aec3Tar7pizvk479otxz1bt3m1n1w6",
   [junit4]   2>   "source":"node_added_trigger1",
   [junit4]   2>   "eventTime":1440662893407939,
   [junit4]   2>   "eventType":"NODEADDED",
   [junit4]   2>   "properties":{
   [junit4]   2>     "eventTimes":[1440662893407939],
   [junit4]   2>     "nodeNames":["127.0.0.1:39093_solr"]}}
   [junit4]   2> 1194177 INFO  (ScheduledTrigger-4430-thread-2) [n:127.0.0.1:38581_solr    ] o.a.s.c.a.SystemLogListener Collection .system does not exist, disabling logging.
   [junit4]   2> 1194177 DEBUG (AutoscalingActionExecutor-4431-thread-1-processing-n:127.0.0.1:38581_solr) [n:127.0.0.1:38581_solr    ] o.a.s.c.a.ScheduledTriggers -- processing actions for {
   [junit4]   2>   "id":"51e467800aec3Tar7pizvk479otxz1bt3m1n1w6",
   [junit4]   2>   "source":"node_added_trigger1",
   [junit4]   2>   "eventTime":1440662893407939,
   [junit4]   2>   "eventType":"NODEADDED",
   [junit4]   2>   "properties":{
   [junit4]   2>     "eventTimes":[1440662893407939],
   [junit4]   2>     "_enqueue_time_":1440663894094498,
   [junit4]   2>     "nodeNames":["127.0.0.1:39093_solr"]}}
   [junit4]   2> 1194178 INFO  (AutoscalingActionExecutor-4431-thread-1-processing-n:127.0.0.1:38581_solr) [n:127.0.0.1:38581_solr    ] o.a.s.c.a.TriggerIntegrationTest -- event: {
   [junit4]   2>   "id":"51e467800aec3Tar7pizvk479otxz1bt3m1n1w6",
   [junit4]   2>   "source":"node_added_trigger1",
   [junit4]   2>   "eventTime":1440662893407939,
   [junit4]   2>   "eventType":"NODEADDED",
   [junit4]   2>   "properties":{
   [junit4]   2>     "eventTimes":[1440662893407939],
   [junit4]   2>     "_enqueue_time_":1440663894094498,
   [junit4]   2>     "nodeNames":["127.0.0.1:39093_solr"]}}
   [junit4]   2> 1194180 INFO  (TEST-TriggerIntegrationTest.testEventQueue-seed#[89F3DDE657647DFE]) [    ] o.e.j.s.AbstractConnector Stopped ServerConnector@553c4ed7{HTTP/1.1,[http/1.1]}{127.0.0.1:0}
   [junit4]   2> 1194180 INFO  (TEST-TriggerIntegrationTest.testEventQueue-seed#[89F3DDE657647DFE]) [    ] o.a.s.c.CoreContainer Shutting down CoreContainer instance=1365701083
   [junit4]   2> 1194180 INFO  (TEST-TriggerIntegrationTest.testEventQueue-seed#[89F3DDE657647DFE]) [    ] o.a.s.m.SolrMetricManager Closing metric reporters for registry=solr.node, tag=null
   [junit4]   2> 1194180 INFO  (TEST-TriggerIntegrationTest.testEventQueue-seed#[89F3DDE657647DFE]) [    ] o.a.s.m.r.SolrJmxReporter Closing reporter [org.apache.solr.metrics.reporters.SolrJmxReporter@7d2616e: rootName = solr_38581, domain = solr.node, service url = null, agent id = null] for registry solr.node / com.codahale.metrics.MetricRegistry@9a14e2f
   [junit4]   2> 1194188 INFO  (TEST-TriggerIntegrationTest.testEventQueue-seed#[89F3DDE657647DFE]) [    ] o.a.s.m.SolrMetricManager Closing metric reporters for registry=solr.jvm, tag=null
   [junit4]   2> 1194189 INFO  (TEST-TriggerIntegrationTest.testEventQueue-seed#[89F3DDE657647DFE]) [    ] o.a.s.m.r.SolrJmxReporter Closing reporter [org.apache.solr.metrics.reporters.SolrJmxReporter@17de9a75: rootName = solr_38581, domain = solr.jvm, service url = null, agent id = null] for registry solr.jvm / com.codahale.metrics.MetricRegistry@4e64b251
   [junit4]   2> 1194191 DEBUG (AutoscalingActionExecutor-4431-thread-1-processing-n:127.0.0.1:38581_solr) [n:127.0.0.1:38581_solr    ] o.a.s.c.a.ScheduledTriggers -- processing took 13 ms for event id=51e467800aec3Tar7pizvk479otxz1bt3m1n1w6
   [junit4]   2> 1194194 INFO  (TEST-TriggerIntegrationTest.testEventQueue-seed#[89F3DDE657647DFE]) [    ] o.a.s.m.SolrMetricManager Closing metric reporters for registry=solr.jetty, tag=null
   [junit4]   2> 1194194 INFO  (TEST-TriggerIntegrationTest.testEventQueue-seed#[89F3DDE657647DFE]) [    ] o.a.s.m.r.SolrJmxReporter Closing reporter [org.apache.solr.metrics.reporters.SolrJmxReporter@6ab36631: rootName = solr_38581, domain = solr.jetty, service url = null, agent id = null] for registry solr.jetty / com.codahale.metrics.MetricRegistry@7e858ee5
   [junit4]   2> 1194195 INFO  (TEST-TriggerIntegrationTest.testEventQueue-seed#[89F3DDE657647DFE]) [    ] o.a.s.c.ZkController Remove node as live in ZooKeeper:/live_nodes/127.0.0.1:38581_solr
   [junit4]   2> 1194196 INFO  (zkCallback-1611-thread-1) [    ] o.a.s.c.c.ZkStateReader Updated live nodes from ZooKeeper... (3) -> (2)
   [junit4]   2> 1194196 INFO  (zkCallback-1599-thread-1-processing-n:127.0.0.1:44641_solr) [n:127.0.0.1:44641_solr    ] o.a.s.c.c.ZkStateReader Updated live nodes from ZooKeeper... (3) -> (2)
   [junit4]   2> 1194196 INFO  (zkCallback-1619-thread-1-processing-n:127.0.0.1:39093_solr) [n:127.0.0.1:39093_solr    ] o.a.s.c.c.ZkStateReader Updated live nodes from ZooKeeper... (3) -> (2)
   [junit4]   2> 1194196 INFO  (TEST-TriggerIntegrationTest.testEventQueue-seed#[89F3DDE657647DFE]) [    ] o.a.s.m.SolrMetricManager Closing metric reporters for registry=solr.cluster, tag=null
   [junit4]   2> 1194196 INFO  (zkCallback-1602-thread-1-processing-n:127.0.0.1:38581_solr) [n:127.0.0.1:38581_solr    ] o.a.s.c.c.ZkStateReader Updated live nodes from ZooKeeper... (3) -> (2)
   [junit4]   2> 1194196 INFO  (TEST-TriggerIntegrationTest.testEventQueue-seed#[89F3DDE657647DFE]) [    ] o.a.s.c.TransientSolrCoreCacheDefault Allocating transient cache for 2147483647 transient cores
   [junit4]   2> 1194196 INFO  (TEST-TriggerIntegrationTest.testEventQueue-seed#[89F3DDE657647DFE]) [    ] o.a.s.c.Overseer Overseer (id=99204433160110086-127.0.0.1:38581_solr-n_0000000000) closing
   [junit4]   2> 1194196 INFO  (OverseerStateUpdate-99204433160110086-127.0.0.1:38581_solr-n_0000000000) [n:127.0.0.1:38581_solr    ] o.a.s.c.Overseer Overseer Loop exiting : 127.0.0.1:38581_solr
   [junit4]   2> 1194196 WARN  (OverseerAutoScalingTriggerThread-99204433160110086-127.0.0.1:38581_solr-n_0000000000) [n:127.0.0.1:38581_solr    ] o.a.s.c.a.OverseerTriggerThread OverseerTriggerThread woken up but we are closed, exiting.
   [junit4]   2> 1194197 DEBUG (TEST-TriggerIntegrationTest.testEventQueue-seed#[89F3DDE657647DFE]) [    ] o.a.s.c.a.OverseerTriggerThread OverseerTriggerThread has been closed explicitly
   [junit4]   2> 1194198 INFO  (zkCallback-1599-thread-1-processing-n:127.0.0.1:44641_solr) [n:127.0.0.1:44641_solr    ] o.a.s.c.OverseerElectionContext I am going to be the leader 127.0.0.1:44641_solr
   [junit4]   2> 1194198 INFO  (TEST-TriggerIntegrationTest.testEventQueue-seed#[89F3DDE657647DFE]) [    ] o.e.j.s.h.ContextHandler Stopped o.e.j.s.ServletContextHandler@397f3de3{/solr,null,UNAVAILABLE}
   [junit4]   2> 1194198 INFO  (zkCallback-1599-thread-1-processing-n:127.0.0.1:44641_solr) [n:127.0.0.1:44641_solr    ] o.a.s.c.Overseer Overseer (id=99204433160110085-127.0.0.1:44641_solr-n_0000000001) starting
   [junit4]   2> 1194200 DEBUG (OverseerAutoScalingTriggerThread-99204433160110085-127.0.0.1:44641_solr-n_0000000001) [n:127.0.0.1:44641_solr    ] o.a.s.c.a.OverseerTriggerThread Adding .autoAddReplicas trigger
   [junit4]   2> 1194205 DEBUG (OverseerAutoScalingTriggerThread-99204433160110085-127.0.0.1:44641_solr-n_0000000001) [n:127.0.0.1:44641_solr    ] o.a.s.c.a.OverseerTriggerThread Refreshing /autoscaling.json with znode version 4
   [junit4]   2> 1194205 INFO  (OverseerAutoScalingTriggerThread-99204433160110085-127.0.0.1:44641_solr-n_0000000001) [n:127.0.0.1:44641_solr    ] o.a.s.c.a.TriggerIntegrationTest TestEventQueueAction instantiated
   [junit4]   2> 1194205 DEBUG (OverseerAutoScalingTriggerThread-99204433160110085-127.0.0.1:44641_solr-n_0000000001) [n:127.0.0.1:44641_solr    ] o.a.s.c.a.NodeAddedTrigger Initial livenodes: [127.0.0.1:44641_solr, 127.0.0.1:39093_solr]
   [junit4]   2> 1194205 DEBUG (OverseerAutoScalingTriggerThread-99204433160110085-127.0.0.1:44641_solr-n_0000000001) [n:127.0.0.1:44641_solr    ] o.a.s.c.a.NodeAddedTrigger NodeAddedTrigger node_added_trigger1 instantiated with properties: {event=nodeAdded, waitFor=1, actions=[{name=test, class=org.apache.solr.cloud.autoscaling.TriggerIntegrationTest$TestEventQueueAction}], enabled=true}
   [junit4]   2> 1194205 DEBUG (OverseerAutoScalingTriggerThread-99204433160110085-127.0.0.1:44641_solr-n_0000000001) [n:127.0.0.1:44641_solr    ] o.a.s.c.a.NodeLostTrigger Initial livenodes: [127.0.0.1:44641_solr, 127.0.0.1:39093_solr]
   [junit4]   2> 1194205 DEBUG (OverseerAutoScalingTriggerThread-99204433160110085-127.0.0.1:44641_solr-n_0000000001) [n:127.0.0.1:44641_solr    ] o.a.s.c.a.OverseerTriggerThread Current znodeVersion 4, lastZnodeVersion -1
   [junit4]   2> 1194205 DEBUG (OverseerAutoScalingTriggerThread-99204433160110085-127.0.0.1:44641_solr-n_0000000001) [n:127.0.0.1:44641_solr    ] o.a.s.c.a.OverseerTriggerThread Processed trigger updates upto znodeVersion 4
   [junit4]   2> 1194206 DEBUG (OverseerAutoScalingTriggerThread-99204433160110085-127.0.0.1:44641_solr-n_0000000001) [n:127.0.0.1:44641_solr    ] o.a.s.c.a.TriggerIntegrationTest TestTriggerAction init
   [junit4]   2> 1194207 DEBUG (ScheduledTrigger-4445-thread-1) [n:127.0.0.1:44641_solr    ] o.a.s.c.a.NodeLostTrigger Running NodeLostTrigger: .auto_add_replicas with currently live nodes: 2
   [junit4]   2> 1194207 DEBUG (OverseerAutoScalingTriggerThread-99204433160110085-127.0.0.1:44641_solr-n_0000000001) [n:127.0.0.1:44641_solr    ] o.a.s.c.a.OverseerTriggerThread Current znodeVersion 4, lastZnodeVersion 4
   [junit4]   2> 1194207 DEBUG (ScheduledTrigger-4445-thread-2) [n:127.0.0.1:44641_solr    ] o.a.s.c.a.NodeAddedTrigger Running NodeAddedTrigger node_added_trigger1
   [junit4]   2> 1194207 DEBUG (ScheduledTrigger-4445-thread-2) [n:127.0.0.1:44641_solr    ] o.a.s.c.a.NodeAddedTrigger Found livenodes: 2
   [junit4]   2> 1195207 DEBUG (ScheduledTrigger-4445-thread-1) [n:127.0.0.1:44641_solr    ] o.a.s.c.a.NodeLostTrigger Running NodeLostTrigger: .auto_add_replicas with currently live nodes: 2
   [junit4]   2> 1195208 DEBUG (ScheduledTrigger-4445-thread-1) [n:127.0.0.1:44641_solr    ] o.a.s.c.a.NodeAddedTrigger Running NodeAddedTrigger node_added_trigger1
   [junit4]   2> 1195208 DEBUG (ScheduledTrigger-4445-thread-1) [n:127.0.0.1:44641_solr    ] o.a.s.c.a.NodeAddedTrigger Found livenodes: 2
   [junit4]   2> 1196208 DEBUG (ScheduledTrigger-4445-thread-2) [n:127.0.0.1:44641_solr    ] o.a.s.c.a.NodeLostTrigger Running NodeLostTrigger: .auto_add_replicas with currently live nodes: 2
   [junit4]   2> 1196208 DEBUG (ScheduledTrigger-4445-thread-4) [n:127.0.0.1:44641_solr    ] o.a.s.c.a.NodeAddedTrigger Running NodeAddedTrigger node_added_trigger1
   [junit4]   2> 1196208 DEBUG (ScheduledTrigger-4445-thread-4) [n:127.0.0.1:44641_solr    ] o.a.s.c.a.NodeAddedTrigger Found livenodes: 2
   [junit4]   2> 1197208 DEBUG (ScheduledTrigger-4445-thread-3) [n:127.0.0.1:44641_solr    ] o.a.s.c.a.NodeLostTrigger Running NodeLostTrigger: .auto_add_replicas with currently live nodes: 2
   [junit4]   2> 1197208 DEBUG (ScheduledTrigger-4445-thread-1) [n:127.0.0.1:44641_solr    ] o.a.s.c.a.NodeAddedTrigger Running NodeAddedTrigger node_added_trigger1
   [junit4]   2> 1197208 DEBUG (ScheduledTrigger-4445-thread-1) [n:127.0.0.1:44641_solr    ] o.a.s.c.a.NodeAddedTrigger Found livenodes: 2
   [junit4]   2> 1198208 DEBUG (ScheduledTrigger-4445-thread-2) [n:127.0.0.1:44641_solr    ] o.a.s.c.a.NodeLostTrigger Running NodeLostTrigger: .auto_add_replicas with currently live nodes: 2
   [junit4]   2> 1198209 DEBUG (ScheduledTrigger-4445-thread-2) [n:127.0.0.1:44641_solr    ] o.a.s.c.a.NodeAddedTrigger Running NodeAddedTrigger node_added_trigger1
   [junit4]   2> 1198209 DEBUG (ScheduledTrigger-4445-thread-2) [n:127.0.0.1:44641_solr    ] o.a.s.c.a.NodeAddedTrigger Found livenodes: 2
   [junit4]   2> 1199208 DEBUG (ScheduledTrigger-4445-thread-3) [n:127.0.0.1:44641_solr    ] o.a.s.c.a.NodeLostTrigger Running NodeLostTrigger: .auto_add_replicas with currently live nodes: 2
   [junit4]   2> 1199209 DEBUG (ScheduledTrigger-4445-thread-1) [n:127.0.0.1:44641_solr    ] o.a.s.c.a.NodeAddedTrigger Running NodeAddedTrigger node_added_trigger1
   [junit4]   2> 1199209 DEBUG (ScheduledTrigger-4445-thread-1) [n:127.0.0.1:44641_solr    ] o.a.s.c.a.NodeAddedTrigger Found livenodes: 2
   [junit4]   2> 1200208 DEBUG (ScheduledTrigger-4445-thread-1) [n:127.0.0.1:44641_solr    ] o.a.s.c.a.NodeLostTrigger Running NodeLostTrigger: .auto_add_replicas with currently live nodes: 2
   [junit4]   2> 1200209 DEBUG (ScheduledTrigger-4445-thread-2) [n:127.0.0.1:44641_solr    ] o.a.s.c.a.NodeAddedTrigger Running NodeAddedTrigger node_added_trigger1
   [junit4]   2> 1200209 DEBUG (ScheduledTrigger-4445-thread-2) [n:127.0.0.1:44641_solr    ] o.a.s.c.a.NodeAddedTrigger Found livenodes: 2
   [junit4]   2> 1201209 DEBUG (ScheduledTrigger-4445-thread-3) [n:127.0.0.1:44641_solr    ] o.a.s.c.a.NodeLostTrigger Running NodeLostTrigger: .auto_add_replicas with currently live nodes: 2
   [junit4]   2> 1201209 DEBUG (ScheduledTrigger-4445-thread-4) [n:127.0.0.1:44641_solr    ] o.a.s.c.a.NodeAddedTrigger Running NodeAddedTrigger node_added_trigger1
   [junit4]   2> 1201209 DEBUG (ScheduledTrigger-4445-thread-4) [n:127.0.0.1:44641_solr    ] o.a.s.c.a.NodeAddedTrigger Found livenodes: 2
   [junit4]   2> 1202198 INFO  (TEST-TriggerIntegrationTest.testEventQueue-seed#[89F3DDE657647DFE]) [    ] o.a.s.SolrTestCaseJ4 ###Ending testEventQueue
   [junit4]   2> NOTE: reproduce with: ant test  -Dtestcase=TriggerIntegrationTest -Dtests.method=testEventQueue -Dtests.seed=89F3DDE657647DFE -Dtests.multiplier=3 -Dtests.slow=true -Dtests.locale=en-CA -Dtests.timezone=Australia/Broken_Hill -Dtests.asserts=true -Dtests.file.encoding=US-ASCII
   [junit4] FAILURE 10.0s J0 | TriggerIntegrationTest.testEventQueue <<<
   [junit4]    > Throwable #1: java.lang.AssertionError: action wasn't interrupted
   [junit4]    > 	at __randomizedtesting.SeedInfo.seed([89F3DDE657647DFE:40469F485E03BB0B]:0)
   [junit4]    > 	at org.apache.solr.cloud.autoscaling.TriggerIntegrationTest.testEventQueue(TriggerIntegrationTest.java:707)
   [junit4]    > 	at java.lang.Thread.run(Thread.java:748)
   [junit4]   2> 1202207 INFO  (TEST-TriggerIntegrationTest.testNodeAddedTriggerRestoreState-seed#[89F3DDE657647DFE]) [    ] o.a.s.SolrTestCaseJ4 ###Starting testNodeAddedTriggerRestoreState
   [junit4]   2> 1202208 INFO  (TEST-TriggerIntegrationTest.testNodeAddedTriggerRestoreState-seed#[89F3DDE657647DFE]) [    ] o.a.s.c.a.TriggerIntegrationTest /autoscaling.json reset, new znode version 5
   [junit4]   2> 1202208 DEBUG (zkCallback-1599-thread-1-processing-n:127.0.0.1:44641_solr) [n:127.0.0.1:44641_solr    ] o.a.s.c.a.OverseerTriggerThread Refreshing /autoscaling.json with znode version 5
   [junit4]   2> 1202208 DEBUG (OverseerAutoScalingTriggerThread-99204433160110085-127.0.0.1:44641_solr-n_0000000001) [n:127.0.0.1:44641_solr    ] o.a.s.c.a.OverseerTriggerThread Processed trigger updates upto znodeVersion 5
   [junit4]   2> 1202209 DEBUG (OverseerAutoScalingTriggerThread-99204433160110085-127.0.0.1:44641_solr-n_0000000001) [n:127.0.0.1:44641_solr    ] o.a.s.c.a.OverseerTriggerThread -- clean old nodeLost markers
   [junit4]   2> 1202209 DEBUG (OverseerAutoScalingTriggerThread-99204433160110085-127.0.0.1:44641_solr-n_0000000001) [n:127.0.0.1:44641_solr    ] o.a.s.c.a.OverseerTriggerThread -- clean old nodeAdded markers
   [junit4]   2> 1202209 DEBUG (OverseerAutoScalingTriggerThread-99204433160110085-127.0.0.1:44641_solr-n_0000000001) [n:127.0.0.1:44641_solr    ] o.a.s.c.a.OverseerTriggerThread Current znodeVersion 5, lastZnodeVersion 5
   [junit4]   2> 1202211 INFO  (qtp1669810802-9936) [n:127.0.0.1:39093_solr    ] o.a.s.s.HttpSolrCall [admin] webapp=null path=/admin/metrics params={prefix=CORE.coreName&wt=javabin&version=2&group=solr.core} status=0 QTime=0
   [junit4]   2> 1202211 INFO  (qtp958693042-9873) [n:127.0.0.1:44641_solr    ] o.a.s.s.HttpSolrCall [admin] webapp=null path=/admin/metrics params={prefix=CORE.coreName&wt=javabin&version=2&group=solr.core} status=0 QTime=0
   [junit4]   2> 1202211 DEBUG (qtp1669810802-9941) [n:127.0.0.1:39093_solr    ] o.a.s.c.a.AutoScalingHandler Verified autoscaling configuration
   [junit4]   2> 1202212 INFO  (qtp1669810802-9941) [n:127.0.0.1:39093_solr    ] o.a.s.s.HttpSolrCall [admin] webapp=null path=/admin/autoscaling params={wt=javabin&version=2} status=0 QTime=2
   [junit4]   2> 1202212 DEBUG (zkCallback-1599-thread-1-processing-n:127.0.0.1:44641_solr) [n:127.0.0.1:44641_solr    ] o.a.s.c.a.OverseerTriggerThread Refreshing /autoscaling.json with znode version 6
   [junit4]   2> 1202212 INFO  (TEST-TriggerIntegrationTest.testNodeAddedTriggerRestoreState-seed#[89F3DDE657647DFE]) [    ] o.e.j.s.Server jetty-9.3.20.v20170531
   [junit4]   2> 1202213 DEBUG (zkCallback-1599-thread-1-processing-n:127.0.0.1:44641_solr) [n:127.0.0.1:44641_solr    ] o.a.s.c.a.NodeAddedTrigger Initial livenodes: [127.0.0.1:44641_solr, 127.0.0.1:39093_solr]
   [junit4]   2> 1202213 DEBUG (zkCallback-1599-thread-1-processing-n:127.0.0.1:44641_solr) [n:127.0.0.1:44641_solr    ] o.a.s.c.a.NodeAddedTrigger NodeAddedTrigger node_added_restore_trigger instantiated with properties: {event=nodeAdded, waitFor=5, actions=[{name=test, class=org.apache.solr.cloud.autoscaling.TriggerIntegrationTest$TestTriggerAction}], enabled=true}
   [junit4]   2> 1202213 DEBUG (OverseerAutoScalingTriggerThread-99204433160110085-127.0.0.1:44641_solr-n_0000000001) [n:127.0.0.1:44641_solr    ] o.a.s.c.a.OverseerTriggerThread Processed trigger updates upto znodeVersion 6
   [junit4]   2> 1202214 INFO  (OverseerAutoScalingTriggerThread-99204433160110085-127.0.0.1:44641_solr-n_0000000001) [n:127.0.0.1:44641_solr    ] o.a.s.c.a.TriggerIntegrationTest TestTriggerAction init
   [junit4]   2> 1202214 DEBUG (OverseerAutoScalingTriggerThread-99204433160110085-127.0.0.1:44641_solr-n_0000000001) [n:127.0.0.1:44641_solr    ] o.a.s.c.a.OverseerTriggerThread -- clean old nodeLost markers
   [junit4]   2> 1202214 DEBUG (OverseerAutoScalingTriggerThread-99204433160110085-127.0.0.1:44641_solr-n_0000000001) [n:127.0.0.1:44641_solr    ] o.a.s.c.a.OverseerTriggerThread Current znodeVersion 6, lastZnodeVersion 6
   [junit4]   2> 1202215 DEBUG (ScheduledTrigger-4445-thread-2) [n:127.0.0.1:44641_solr    ] o.a.s.c.a.NodeAddedTrigger Running NodeAddedTrigger node_added_restore_trigger
   [junit4]   2> 1202215 DEBUG (ScheduledTrigger-4445-thread-2) [n:127.0.0.1:44641_solr    ] o.a.s.c.a.NodeAddedTrigger Found livenodes: 2
   [junit4]   2> 1202219 INFO  (TEST-TriggerIntegrationTest.testNodeAddedTriggerRestoreState-seed#[89F3DDE657647DFE]) [    ] o.e.j.s.h.ContextHandler Started o.e.j.s.ServletContextHandler@5ed749df{/solr,null,AVAILABLE}
   [junit4]   2> 1202219 INFO  (TEST-TriggerIntegrationTest.testNodeAddedTriggerRestoreState-seed#[89F3DDE657647DFE]) [    ] o.e.j.s.AbstractConnector Started ServerConnector@1578d3ea{HTTP/1.1,[http/1.1]}{127.0.0.1:33655}
   [junit4]   2> 1202220 INFO  (TEST-TriggerIntegrationTest.testNodeAddedTriggerRestoreState-seed#[89F3DDE657647DFE]) [    ] o.e.j.s.Server Started @1203480ms
   [junit4]   2> 1202220 INFO  (TEST-TriggerIntegrationTest.testNodeAddedTriggerRestoreState-seed#[89F3DDE657647DFE]) [    ] o.a.s.c.s.e.JettySolrRunner Jetty properties: {hostContext=/solr, hostPort=33655}
   [junit4]   2> 1202220 ERROR (TEST-TriggerIntegrationTest.testNodeAddedTriggerRestoreState-seed#[89F3DDE657647DFE]) [    ] o.a.s.u.StartupLoggingUtils Missing Java Option solr.log.dir. Logging may be missing or incomplete.
   [junit4]   2> 1202220 INFO  (TEST-TriggerIntegrationTest.testNodeAddedTriggerRestoreState-seed#[89F3DDE657647DFE]) [    ] o.a.s.s.SolrDispatchFilter  ___      _       Welcome to Apache Solr? version 8.0.0
   [junit4]   2> 1202220 INFO  (TEST-TriggerIntegrationTest.testNodeAddedTriggerRestoreState-seed#[89F3DDE657647DFE]) [    ] o.a.s.s.SolrDispatchFilter / __| ___| |_ _   Starting in cloud mode on port null
   [junit4]   2> 1202220 INFO  (TEST-TriggerIntegrationTest.testNodeAddedTriggerRestoreState-seed#[89F3DDE657647DFE]) [    ] o.a.s.s.SolrDispatchFilter \__ \/ _ \ | '_|  Install dir: null
   [junit4]   2> 1202220 INFO  (TEST-TriggerIntegrationTest.testNodeAddedTriggerRestoreState-seed#[89F3DDE657647DFE]) [    ] o.a.s.s.SolrDispatchFilter |___/\___/_|_|    Start time: 2017-12-20T03:12:09.965Z
   [junit4]   2> 1202221 INFO  (zkConnectionManagerCallback-1624-thread-1) [    ] o.a.s.c.c.ConnectionManager zkClient has connected
   [junit4]   2> 1202222 INFO  (TEST-TriggerIntegrationTest.testNodeAddedTriggerRestoreState-seed#[89F3DDE657647DFE]) [    ] o.a.s.s.SolrDispatchFilter solr.xml found in ZooKeeper. Loading...
   [junit4]   2> 1202228 INFO  (TEST-TriggerIntegrationTest.testNodeAddedTriggerRestoreState-seed#[89F3DDE657647DFE]) [    ] o.a.s.c.ZkContainer Zookeeper client=127.0.0.1:35909/solr
   [junit4]   2> 1202228 INFO  (zkConnectionManagerCallback-1628-thread-1) [    ] o.a.s.c.c.ConnectionManager zkClient has connected
   [junit4]   2> 1202230 INFO  (zkConnectionManagerCallback-1630-thread-1-processing-n:127.0.0.1:33655_solr) [n:127.0.0.1:33655_solr    ] o.a.s.c.c.ConnectionManager zkClient has connected
   [junit4]   2> 1202232 INFO  (TEST-TriggerIntegrationTest.testNodeAddedTriggerRestoreState-seed#[89F3DDE657647DFE]) [n:127.0.0.1:33655_solr    ] o.a.s.c.c.ZkStateReader Updated live nodes from ZooKeeper... (0) -> (2)
   [junit4]   2> 1202232 INFO  (TEST-TriggerIntegrationTest.testNodeAddedTriggerRestoreState-seed#[89F3DDE657647DFE]) [n:127.0.0.1:33655_solr    ] o.a.s.c.Overseer Overseer (id=null) closing
   [junit4]   2> 1202233 INFO  (TEST-TriggerIntegrationTest.testNodeAddedTriggerRestoreState-seed#[89F3DDE657647DFE]) [n:127.0.0.1:33655_solr    ] o.a.s.c.ZkController Register node as live in ZooKeeper:/live_nodes/127.0.0.1:33655_solr
   [junit4]   2> 1202233 INFO  (zkCallback-1619-thread-1-processing-n:127.0.0.1:39093_solr) [n:127.0.0.1:39093_solr    ] o.a.s.c.c.ZkStateReader Updated live nodes from ZooKeeper... (2) -> (3)
   [junit4]   2> 1202233 INFO  (zkCallback-1611-thread-1) [    ] o.a.s.c.c.ZkStateReader Updated live nodes from ZooKeeper... (2) -> (3)
   [junit4]   2> 1202234 INFO  (zkCallback-1629-thread-1-processing-n:127.0.0.1:33655_solr) [n:127.0.0.1:33655_solr    ] o.a.s.c.c.ZkStateReader Updated live nodes from ZooKeeper... (2) -> (3)
   [junit4]   2> 1202239 INFO  (zkCallback-1599-thread-1-processing-n:127.0.0.1:44641_solr) [n:127.0.0.1:44641_solr    ] o.a.s.c.c.ZkStateReader Updated live nodes from ZooKeeper... (2) -> (3)
   [junit4]   2> 1202301 INFO  (TEST-TriggerIntegrationTest.testNodeAddedTriggerRestoreState-seed#[89F3DDE657647DFE]) [n:127.0.0.1:33655_solr    ] o.a.s.m.r.SolrJmxReporter JMX monitoring for 'solr_33655.solr.node' (registry 'solr.node') enabled at server: com.sun.jmx.mbeanserver.JmxMBeanServer@3acf4ba2
   [junit4]   2> 1202311 INFO  (TEST-TriggerIntegrationTest.testNodeAddedTriggerRestoreState-seed#[89F3DDE657647DFE]) [n:127.0.0.1:33655_solr    ] o.a.s.m.r.SolrJmxReporter JMX monitoring for 'solr_33655.solr.jvm' (registry 'solr.jvm') enabled at server: com.sun.jmx.mbeanserver.JmxMBeanServer@3acf4ba2
   [junit4]   2> 1202311 INFO  (TEST-TriggerIntegrationTest.testNodeAddedTriggerRestoreState-seed#[89F3DDE657647DFE]) [n:127.0.0.1:33655_solr    ] o.a.s.m.r.SolrJmxReporter JMX monitoring for 'solr_33655.solr.jetty' (registry 'solr.jetty') enabled at server: com.sun.jmx.mbeanserver.JmxMBeanServer@3acf4ba2
   [junit4]   2> 1202312 INFO  (TEST-TriggerIntegrationTest.testNodeAddedTriggerRestoreState-seed#[89F3DDE657647DFE]) [n:127.0.0.1:33655_solr    ] o.a.s.c.CorePropertiesLocator Found 0 core definitions underneath /home/jenkins/workspace/Lucene-Solr-master-Linux/solr/build/solr-core/test/J0/temp/solr.cloud.autoscaling.TriggerIntegrationTest_89F3DDE657647DFE-001/tempDir-001/node4/.
   [junit4]   2> 1203216 DEBUG (ScheduledTrigger-4445-thread-3) [n:127.0.0.1:44641_solr    ] o.a.s.c.a.NodeAddedTrigger Running NodeAddedTrigger node_added_restore_trigger
   [junit4]   2> 1203216 DEBUG (ScheduledTrigger-4445-thread-3) [n:127.0.0.1:44641_solr    ] o.a.s.c.a.NodeAddedTrigger Found livenodes: 3
   [junit4]   2> 1203216 DEBUG (ScheduledTrigger-4445-thread-3) [n:127.0.0.1:44641_solr    ] o.a.s.c.a.NodeAddedTrigger Tracking new node: 127.0.0.1:33655_solr at time 1440672933346334
   [junit4]   2> 1203853 INFO  (qtp1415042707-9977) [n:127.0.0.1:33655_solr    ] o.a.s.s.HttpSolrCall [admin] webapp=null path=/admin/metrics params={prefix=CORE.coreName&wt=javabin&version=2&group=solr.core} status=0 QTime=0
   [junit4]   2> 1203854 INFO  (qtp1669810802-9935) [n:127.0.0.1:39093_solr    ] o.a.s.s.HttpSolrCall [admin] webapp=null path=/admin/metrics params={prefix=CORE.coreName&wt=javabin&version=2&group=solr.core} status=0 QTime=0
   [junit4]   2> 1203855 INFO  (qtp958693042-9881) [n:127.0.0.1:44641_solr    ] o.a.s.s.HttpSolrCall [admin] webapp=null path=/admin/metrics params={prefix=CORE.coreName&wt=javabin&version=2&group=solr.core} status=0 QTime=0
   [junit4]   2> 1203855 DEBUG (qtp958693042-9887) [n:127.0.0.1:44641_solr    ] o.a.s.c.a.AutoScalingHandler Verified autoscaling configuration
   [junit4]   2> 1203856 INFO  (qtp958693042-9887) [n:127.0.0.1:44641_solr    ] o.a.s.s.HttpSolrCall [admin] webapp=null path=/cluster/autoscaling params={wt=javabin&version=2} status=0 QTime=3
   [junit4]   2> 1203856 DEBUG (zkCallback-1599-thread-1-processing-n:127.0.0.1:44641_solr) [n:127.0.0.1:44641_solr    ] o.a.s.c.a.OverseerTriggerThread Refreshing /autoscaling.json with znode version 7
   [junit4]   2> 1203856 DEBUG (zkCallback-1599-thread-1-processing-n:127.0.0.1:44641_solr) [n:127.0.0.1:44641_solr    ] o.a.s.c.a.NodeAddedTrigger Initial livenodes: [127.0.0.1:44641_solr, 127.0.0.1:39093_solr, 127.0.0.1:33655_solr]
   [junit4]   2> 1203856 DEBUG (zkCallback-1599-thread-1-processing-n:127.0.0.1:44641_solr) [n:127.0.0.1:44641_solr    ] o.a.s.c.a.NodeAddedTrigger NodeAddedTrigger node_added_restore_trigger instantiated with properties: {event=nodeAdded, waitFor=0, actions=[{name=test, class=org.apache.solr.cloud.autoscaling.TriggerIntegrationTest$TestTriggerAction}], enabled=true}
   [junit4]   2> 1203856 DEBUG (OverseerAutoScalingTriggerThread-99204433160110085-127.0.0.1:44641_solr-n_0000000001) [n:127.0.0.1:44641_solr    ] o.a.s.c.a.OverseerTriggerThread Processed trigger updates upto znodeVersion 7
   [junit4]   2> 1203856 INFO  (OverseerAutoScalingTriggerThread-99204433160110085-127.0.0.1:44641_solr-n_0000000001) [n:127.0.0.1:44641_solr    ] o.a.s.c.a.TriggerIntegrationTest TestTriggerAction init
   [junit4]   2> 1203856 DEBUG (OverseerAutoScalingTriggerThread-99204433160110085-127.0.0.1:44641_solr-n_0000000001) [n:127.0.0.1:44641_solr    ] o.a.s.c.a.NodeAddedTrigger Adding node from marker path: 127.0.0.1:33655_solr
   [junit4]   2> 1203857 DEBUG (OverseerAutoScalingTriggerThread-99204433160110085-127.0.0.1:44641_solr-n_0000000001) [n:127.0.0.1:44641_solr    ] o.a.s.c.a.OverseerTriggerThread -- clean old nodeLost markers
   [junit4]   2> 1203857 DEBUG (ScheduledTrigger-4445-thread-4) [n:127.0.0.1:44641_solr    ] o.a.s.c.a.NodeAddedTrigger Running NodeAddedTrigger node_added_restore_trigger
   [junit4]   2> 1203857 DEBUG (ScheduledTrigger-4445-thread-4) [n:127.0.0.1:44641_solr    ] o.a.s.c.a.NodeAddedTrigger Found livenodes: 3
   [junit4]   2> 1203857 DEBUG (OverseerAutoScalingTriggerThread-99204433160110085-127.0.0.1:44641_solr-n_0000000001) [n:127.0.0.1:44641_solr    ] o.a.s.c.a.OverseerTriggerThread Current znodeVersion 7, lastZnodeVersion 7
   [junit4]   2> 1203857 DEBUG (ScheduledTrigger-4445-thread-4) [n:127.0.0.1:44641_solr    ] o.a.s.c.a.NodeAddedTrigger NodeAddedTrigger node_added_restore_trigger firing registered processor for nodes: [127.0.0.1:33655_solr] added at times [1440673573993360], now=1440673574280520
   [junit4]   2> 1203857 DEBUG (ScheduledTrigger-4445-thread-4) [n:127.0.0.1:44641_solr    ] o.a.s.c.a.ScheduledTriggers ++++++++ Cooldown inactive - processing event: {
   [junit4]   2>   "id":"51e48f49d7b90Tar7pizvk479otxz1bt3m1n1w8",
   [junit4]   2>   "source":"node_added_restore_trigger",
   [junit4]   2>   "eventTime":1440673573993360,
   [junit4]   2>   "eventType":"NODEADDED",
   [junit4]   2>   "properties":{
   [junit4]   2>     "eventTimes":[1440673573993360],
   [junit4]   2>     "nodeNames":["127.0.0.1:33655_solr"]}}
   [junit4]   2> 1203857 INFO  (ScheduledTrigger-4445-thread-4) [n:127.0.0.1:44641_solr    ] o.a.s.c.a.SystemLogListener Collection .system does not exist, disabling logging.
   [junit4]   2> 1203857 DEBUG (AutoscalingActionExecutor-4446-thread-1-processing-n:127.0.0.1:44641_solr) [n:127.0.0.1:44641_solr    ] o.a.s.c.a.ScheduledTriggers -- processing actions for {
   [junit4]   2>   "id":"51e48f49d7b90Tar7pizvk479otxz1bt3m1n1w8",
   [junit4]   2>   "source":"node_added_restore_trigger",
   [junit4]   2>   "eventTime":1440673573993360,
   [junit4]   2>   "eventType":"NODEADDED",
   [junit4]   2>   "properties":{
   [junit4]   2>     "eventTimes":[1440673573993360],
   [junit4]   2>     "_enqueue_time_":1440673574426182,
   [junit4]   2>     "nodeNames":["127.0.0.1:33655_solr"]}}
   [junit4]   2> 1203857 INFO  (TEST-TriggerIntegrationTest.testNodeAddedTriggerRestoreState-seed#[89F3DDE657647DFE]) [    ] o.a.s.SolrTestCaseJ4 ###Ending testNodeAddedTriggerRestoreState
   [junit4]   2> 1203858 DEBUG (AutoscalingActionExecutor-4446-thread-1-processing-n:127.0.0.1:44641_solr) [n:127.0.0.1:44641_solr    ] o.a.s.c.a.ScheduledTriggers -- processing took 0 ms for event id=51e48f49d7b90Tar7pizvk479otxz1bt3m1n1w8
   [junit4]   2> 1203867 INFO  (TEST-TriggerIntegrationTest.testNodeLostTriggerRestoreState-seed#[89F3DDE657647DFE]) [    ] o.a.s.SolrTestCaseJ4 ###Starting testNodeLostTriggerRestoreState
   [junit4]   2> 1203868 INFO  (TEST-TriggerIntegrationTest.testNodeLostTriggerRestoreState-seed#[89F3DDE657647DFE]) [    ] o.a.s.c.a.TriggerIntegrationTest /autoscaling.json reset, new znode version 8
   [junit4]   2> 1203868 DEBUG (zkCallback-1599-thread-1-processing-n:127.0.0.1:44641_solr) [n:127.0.0.1:44641_solr    ] o.a.s.c.a.OverseerTriggerThread Refreshing /autoscaling.json with znode version 8
   [junit4]   2> 1203868 DEBUG (OverseerAutoScalingTriggerThread-99204433160110085-127.0.0.1:44641_solr-n_0000000001) [n:127.0.0.1:44641_solr    ] o.a.s.c.a.OverseerTriggerThread Processed trigger updates upto znodeVersion 8
   [junit4]   2> 1203868 DEBUG (OverseerAutoScalingTriggerThread-99204433160110085-127.0.0.1:44641_solr-n_0000000001) [n:127.0.0.1:44641_solr    ] o.a.s.c.a.OverseerTriggerThread -- clean old nodeLost markers
   [junit4]   2> 1203868 DEBUG (OverseerAutoScalingTriggerThread-99204433160110085-127.0.0.1:44641_solr-n_0000000001) [n:127.0.0.1:44641_solr    ] o.a.s.c.a.OverseerTriggerThread -- clean old nodeAdded markers
   [junit4]   2> 1203869 DEBUG (OverseerAutoScalingTriggerThread-99204433160110085-127.0.0.1:44641_solr-n_0000000001) [n:127.0.0.1:44641_solr    ] o.a.s.c.a.OverseerTriggerThread Current znodeVersion 8, lastZnodeVersion 8
   [junit4]   2> 1203869 INFO  (TEST-TriggerIntegrationTest.testNodeLostTriggerRestoreState-seed#[89F3DDE657647DFE]) [    ] o.e.j.s.Server jetty-9.3.20.v20170531
   [junit4]   2> 1203870 INFO  (TEST-TriggerIntegrationTest.testNodeLostTriggerRestoreState-seed#[89F3DDE657647DFE]) [    ] o.e.j.s.h.ContextHandler Started o.e.j.s.ServletContextHandler@481255a4{/solr,null,AVAILABLE}
   [junit4]   2> 1203870 INFO  (TEST-TriggerIntegrationTest.testNodeLostTriggerRestoreState-seed#[89F3DDE657647DFE]) [    ] o.e.j.s.AbstractConnector Started ServerConnector@5580f26b{HTTP/1.1,[http/1.1]}{127.0.0.1:35093}
   [junit4]   2> 1203870 INFO  (TEST-TriggerIntegrationTest.testNodeLostTriggerRestoreState-seed#[89F3DDE657647DFE]) [    ] o.e.j.s.Server Started @1205131ms
   [junit4]   2> 1203870 INFO  (TEST-TriggerIntegrationTest.testNodeLostTriggerRestoreState-seed#[89F3DDE657647DFE]) [    ] o.a.s.c.s.e.JettySolrRunner Jetty properties: {hostContext=/solr, hostPort=35093}
   [junit4]   2> 1203870 ERROR (TEST-TriggerIntegrationTest.testNodeLostTriggerRestoreState-seed#[89F3DDE657647DFE]) [    ] o.a.s.u.StartupLoggingUtils Missing Java Option solr.log.dir. Logging may be missing or incomplete.
   [junit4]   2> 1203871 INFO  (TEST-TriggerIntegrationTest.testNodeLostTriggerRestoreState-seed#[89F3DDE657647DFE]) [    ] o.a.s.s.SolrDispatchFilter  ___      _       Welcome to Apache Solr? version 8.0.0
   [junit4]   2> 1203871 INFO  (TEST-TriggerIntegrationTest.testNodeLostTriggerRestoreState-seed#[89F3DDE657647DFE]) [    ] o.a.s.s.SolrDispatchFilter / __| ___| |_ _   Starting in cloud mode on port null
   [junit4]   2> 1203871 INFO  (TEST-TriggerIntegrationTest.testNodeLostTriggerRestoreState-seed#[89F3DDE657647DFE]) [    ] o.a.s.s.SolrDispatchFilter \__ \/ _ \ | '_|  Install dir: null
   [junit4]   2> 1203871 INFO  (TEST-TriggerIntegrationTest.testNodeLostTriggerRestoreState-seed#[89F3DDE657647DFE]) [    ] o.a.s.s.SolrDispatchFilter |___/\___/_|_|    Start time: 2017-12-20T03:12:11.616Z
   [junit4]   2> 1203872 INFO  (zkConnectionManagerCallback-1634-thread-1) [    ] o.a.s.c.c.ConnectionManager zkClient has connected
   [junit4]   2> 1203872 INFO  (TEST-TriggerIntegrationTest.testNodeLostTriggerRestoreState-seed#[89F3DDE657647DFE]) [    ] o.a.s.s.SolrDispatchFilter solr.xml found in ZooKeeper. Loading...
   [junit4]   2> 1203879 INFO  (TEST-TriggerIntegrationTest.testNodeLostTriggerRestoreState-seed#[89F3DDE657647DFE]) [    ] o.a.s.c.ZkContainer Zookeeper client=127.0.0.1:35909/solr
   [junit4]   2> 1203879 INFO  (zkConnectionManagerCallback-1638-thread-1) [    ] o.a.s.c.c.ConnectionManager zkClient has connected
   [junit4]   2> 1203882 INFO  (zkConnectionManagerCallback-1640-thread-1-processing-n:127.0.0.1:35093_solr) [n:127.0.0.1:35093_solr    ] o.a.s.c.c.ConnectionManager zkClient has connected
   [junit4]   2> 1203884 INFO  (TEST-TriggerIntegrationTest.testNodeLostTriggerRestoreState-seed#[89F3DDE657647DFE]) [n:127.0.0.1:35093_solr    ] o.a.s.c.c.ZkStateReader Updated live nodes from ZooKeeper... (0) -> (3)
   [junit4]   2> 1203885 INFO  (TEST-TriggerIntegrationTest.testNodeLostTriggerRestoreState-seed#[89F3DDE657647DFE]) [n:127.0.0.1:35093_solr    ] o.a.s.c.Overseer Overseer (id=null) closing
   [junit4]   2> 1203886 INFO  (TEST-TriggerIntegrationTest.testNodeLostTriggerRestoreState-seed#[89F3DDE657647DFE]) [n:127.0.0.1:35093_solr    ] o.a.s.c.ZkController Register node as live in ZooKeeper:/live_nodes/127.0.0.1:35093_solr
   [junit4]   2> 1203886 INFO  (zkCallback-1629-thread-1-processing-n:127.0.0.1:33655_solr) [n:127.0.0.1:33655_solr    ] o.a.s.c.c.ZkStateReader Updated live nodes from ZooKeeper... (3) -> (4)
   [junit4]   2> 1203886 INFO  (zkCallback-1611-thread-1) [    ] o.a.s.c.c.ZkStateReader Updated live nodes from ZooKeeper... (3) -> (4)
   [junit4]   2> 1203886 INFO  (zkCallback-1599-thread-1-processing-n:127.0.0.1:44641_solr) [n:127.0.0.1:44641_solr    ] o.a.s.c.c.ZkStateReader Updated live nodes from ZooKeeper... (3) -> (4)
   [junit4]   2> 1203886 INFO  (zkCallback-1619-thread-1-processing-n:127.0.0.1:39093_solr) [n:127.0.0.1:39093_solr    ] o.a.s.c.c.ZkStateReader Updated live nodes from ZooKeeper... (3) -> (4)
   [junit4]   2> 1203887 INFO  (zkCallback-1639-thread-1-processing-n:127.0.0.1:35093_solr) [n:127.0.0.1:35093_solr    ] o.a.s.c.c.ZkStateReader Updated live nodes from ZooKeeper... (3) -> (4)
   [junit4]   2> 1203922 INFO  (TEST-TriggerIntegrationTest.testNodeLostTriggerRestoreState-seed#[89F3DDE657647DFE]) [n:127.0.0.1:35093_solr    ] o.a.s.m.r.SolrJmxReporter JMX monitoring for 'solr_35093.solr.node' (registry 'solr.node') enabled at server: com.sun.jmx.mbeanserver.JmxMBeanServer@3acf4ba2
   [junit4]   2> 1203939 INFO  (TEST-TriggerIntegrationTest.testNodeLostTriggerRestoreState-seed#[89F3DDE657647DFE]) [n:127.0.0.1:35093_solr    ] o.a.s.m.r.SolrJmxReporter JMX monitoring for 'solr_35093.solr.jvm' (registry 'solr.jvm') enabled at server: com.sun.jmx.mbeanserver.JmxMBeanServer@3acf4ba2
   [junit4]   2> 1203939 INFO  (TEST-TriggerIntegrationTest.testNodeLostTriggerRestoreState-seed#[89F3DDE657647DFE]) [n:127.0.0.1:35093_solr    ] o.a.s.m.r.SolrJmxReporter JMX monitoring for 'solr_35093.solr.jetty' (registry 'solr.jetty') enabled at server: com.sun.jmx.mbeanserver.JmxMBeanServer@3acf4ba2
   [junit4]   2> 1203940 INFO  (TEST-TriggerIntegrationTest.testNodeLostTriggerRestoreState-seed#[89F3DDE657647DFE]) [n:127.0.0.1:35093_solr    ] o.a.s.c.CorePropertiesLocator Found 0 core definitions underneath /home/jenkins/workspace/Lucene-Solr-master-Linux/solr/build/solr-core/test/J0/temp/solr.cloud.autoscaling.TriggerIntegrationTest_89F3DDE657647DFE-001/tempDir-001/node5/.
   [junit4]   2> 1203974 INFO  (qtp1415042707-9978) [n:127.0.0.1:33655_solr    ] o.a.s.s.HttpSolrCall [admin] webapp=null path=/admin/metrics params={prefix=CORE.coreName&wt=javabin&version=2&group=solr.core} status=0 QTime=0
   [junit4]   2> 1203975 INFO  (qtp1623901016-10003) [n:127.0.0.1:35093_solr    ] o.a.s.s.HttpSolrCall [admin] webapp=null path=/admin/metrics params={prefix=CORE.coreName&wt=javabin&version=2&group=solr.core} status=0 QTime=0
   [junit4]   2> 1203975 INFO  (qtp1669810802-9941) [n:127.0.0.1:39093_solr    ] o.a.s.s.HttpSolrCall [admin] webapp=null path=/admin/metrics params={prefix=CORE.coreName&wt=javabin&version=2&group=solr.core} status=0 QTime=0
   [junit4]   2> 1203976 INFO  (qtp958693042-9873) [n:127.0.0.1:44641_solr    ] o.a.s.s.HttpSolrCall [admin] webapp=null path=/admin/metrics params={prefix=CORE.coreName&wt=javabin&version=2&group=solr.core} status=0 QTime=0
   [junit4]   2> 1203976 DEBUG (qtp1415042707-9979) [n:127.0.0.1:33655_solr    ] o.a.s.c.a.AutoScalingHandler Verified autoscaling configuration
   [junit4]   2> 1203976 INFO  (qtp1415042707-9979) [n:127.0.0.1:33655_solr    ] o.a.s.s.HttpSolrCall [admin] webapp=null path=/admin/autoscaling params={wt=javabin&version=2} status=0 QTime=2
   [junit4]   2> 1203976 DEBUG (zkCallback-1599-thread-1-processing-n:127.0.0.1:44641_solr) [n:127.0.0.1:44641_solr    ] o.a.s.c.a.OverseerTriggerThread Refreshing /autoscaling.json with znode version 9
   [junit4]   2> 1203977 DEBUG (zkCallback-1599-thread-1-processing-n:127.0.0.1:44641_solr) [n:127.0.0.1:44641_solr    ] o.a.s.c.a.NodeLostTrigger Initial livenodes: [127.0.0.1:35093_solr, 127.0.0.1:44641_solr, 127.0.0.1:39093_solr, 127.0.0.1:33655_solr]
   [junit4]   2> 1203977 DEBUG (OverseerAutoScalingTriggerThread-99204433160110085-127.0.0.1:44641_solr-n_0000000001) [n:127.0.0.1:44641_solr    ] o.a.s.c.a.OverseerTriggerThread Processed trigger updates upto znodeVersion 9
   [junit4]   2> 1203977 INFO  (TEST-TriggerIntegrationTest.testNodeLostTriggerRestoreState-seed#[89F3DDE657647DFE]) [    ] o.e.j.s.AbstractConnector Stopped ServerConnector@5580f26b{HTTP/1.1,[http/1.1]}{127.0.0.1:0}
   [junit4]   2> 1203977 INFO  (OverseerAutoScalingTriggerThread-99204433160110085-127.0.0.1:44641_solr-n_0000000001) [n:127.0.0.1:44641_solr    ] o.a.s.c.a.TriggerIntegrationTest TestTriggerAction init
   [junit4]   2> 1203977 INFO  (TEST-TriggerIntegrationTest.testNodeLostTriggerRestoreState-seed#[89F3DDE657647DFE]) [    ] o.a.s.c.CoreContainer Shutting down CoreContainer instance=1206128334
   [junit4]   2> 1203977 DEBUG (OverseerAutoScalingTriggerThread-99204433160110085-127.0.0.1:44641_solr-n_0000000001) [n:127.0.0.1:44641_solr    ] o.a.s.c.a.OverseerTriggerThread -- clean old nodeAdded markers
   [junit4]   2> 1203978 INFO  (TEST-TriggerIntegrationTest.testNodeLostTriggerRestoreState-seed#[89F3DDE657647DFE]) [    ] o.a.s.m.SolrMetricManager Closing metric reporters for registry=solr.node, tag=null
   [junit4]   2> 1203978 INFO  (TEST-TriggerIntegrationTest.testNodeLostTriggerRestoreState-seed#[89F3DDE657647DFE]) [    ] o.a.s.m.r.SolrJmxReporter Closing reporter [org.apache.solr.metrics.reporters.SolrJmxReporter@693977b9: rootName = solr_35093, domain = solr.node, service url = null, agent id = null] for registry solr.node / com.codahale.metrics.MetricRegistry@5ba06c19
   [junit4]   2> 1203978 DEBUG (OverseerAutoScalingTriggerThread-99204433160110085-127.0.0.1:44641_solr-n_0000000001) [n:127.0.0.1:44641_solr    ] o.a.s.c.a.OverseerTriggerThread Current znodeVersion 9, lastZnodeVersion 9
   [junit4]   2> 1203978 DEBUG (ScheduledTrigger-4445-thread-3) [n:127.0.0.1:44641_solr    ] o.a.s.c.a.NodeLostTrigger Running NodeLostTrigger: node_lost_restore_trigger with currently live nodes: 4
   [junit4]   2> 1203985 INFO  (TEST-TriggerIntegrationTest.testNodeLostTriggerRestoreState-seed#[89F3DDE657647DFE]) [    ] o.a.s.m.SolrMetricManager Closing metric reporters for registry=solr.jvm, tag=null
   [junit4]   2> 1203985 INFO  (TEST-TriggerIntegrationTest.testNodeLostTriggerRestoreState-seed#[89F3DDE657647DFE]) [    ] o.a.s.m.r.SolrJmxReporter Closing reporter [org.apache.solr.metrics.reporters.SolrJmxReporter@72c26cdd: rootName = solr_35093, domain = solr.jvm, service url = null, agent id = null] for registry solr.jvm / com.codahale.metrics.MetricRegistry@4e64b251
   [junit4]   2> 1203991 INFO  (TEST-TriggerIntegrationTest.testNodeLostTriggerRestoreState-seed#[89F3DDE657647DFE]) [    ] o.a.s.m.SolrMetricManager Closing metric reporters for registry=solr.jetty, tag=null
   [junit4]   2> 1203991 INFO  (TEST-TriggerIntegrationTest.testNodeLostTriggerRestoreState-seed#[89F3DDE657647DFE]) [    ] o.a.s.m.r.SolrJmxReporter Closing reporter [org.apache.solr.metrics.reporters.SolrJmxReporter@35fbff0c: rootName = solr_35093, domain = solr.jetty, service url = null, agent id = null] for registry solr.jetty / com.codahale.metrics.MetricRegistry@7e858ee5
   [junit4]   2> 1203991 INFO  (TEST-TriggerIntegrationTest.testNodeLostTriggerRestoreState-seed#[89F3DDE657647DFE]) [    ] o.a.s.c.ZkController Remove node as live in ZooKeeper:/live_nodes/127.0.0.1:35093_solr
   [junit4]   2> 1203992 INFO  (TEST-TriggerIntegrationTest.testNodeLostTriggerRestoreState-seed#[89F3DDE657647DFE]) [    ] o.a.s.m.SolrMetricManager Closing metric reporters for registry=solr.cluster, tag=null
   [junit4]   2> 1203992 INFO  (zkCallback-1611-thread-1) [    ] o.a.s.c.c.ZkStateReader Updated live nodes from ZooKeeper... (4) -> (3)
   [junit4]   2> 1203992 INFO  (TEST-TriggerIntegrationTest.testNodeLostTriggerRestoreState-seed#[89F3DDE657647DFE]) [    ] o.a.s.c.TransientSolrCoreCacheDefault Allocating transient cache for 2147483647 transient cores
   [junit4]   2> 1203992 INFO  (zkCallback-1599-thread-1-processing-n:127.0.0.1:44641_solr) [n:127.0.0.1:44641_solr    ] o.a.s.c.c.ZkStateReader Updated live nodes from ZooKeeper... (4) -> (3)
   [junit4]   2> 1203992 INFO  (zkCallback-1619-thread-1-processing-n:127.0.0.1:39093_solr) [n:127.0.0.1:39093_solr    ] o.a.s.c.c.ZkStateReader Updated live nodes from ZooKeeper... (4) -> (3)
   [junit4]   2> 1203992 INFO  (zkCallback-1629-thread-1-processing-n:127.0.0.1:33655_solr) [n:127.0.0.1:33655_solr    ] o.a.s.c.c.ZkStateReader Updated live nodes from ZooKeeper... (4) -> (3)
   [junit4]   2> 1203992 INFO  (zkCallback-1639-thread-1-processing-n:127.0.0.1:35093_solr) [n:127.0.0.1:35093_solr    ] o.a.s.c.c.ZkStateReader Updated live nodes from ZooKeeper... (4) -> (3)
   [junit4]   2> 1203993 INFO  (TEST-TriggerIntegrationTest.testNodeLostTriggerRestoreState-seed#[89F3DDE657647DFE]) [    ] o.e.j.s.h.ContextHandler Stopped o.e.j.s.ServletContextHandler@481255a4{/solr,null,UNAVAILABLE}
   [junit4]   2> 1204978 DEBUG (ScheduledTrigger-4445-thread-3) [n:127.0.0.1:44641_solr    ] o.a.s.c.a.NodeLostTrigger Running NodeLostTrigger: node_lost_restore_trigger with currently live nodes: 3
   [junit4]   2> 1204978 DEBUG (ScheduledTrigger-4445-thread-3) [n:127.0.0.1:44641_solr    ] o.a.s.c.a.NodeLostTrigger Tracking lost node: 127.0.0.1:35093_solr
   [junit4]   2> 1205494 INFO  (qtp1415042707-9972) [n:127.0.0.1:33655_solr    ] o.a.s.s.HttpSolrCall [admin] webapp=null path=/admin/metrics params={prefix=CORE.coreName&wt=javabin&version=2&group=solr.core} status=0 QTime=0
   [junit4]   2> 1205494 INFO  (qtp1669810802-9937) [n:127.0.0.1:39093_solr    ] o.a.s.s.HttpSolrCall [admin] webapp=null path=/admin/metrics params={prefix=CORE.coreName&wt=javabin&version=2&group=solr.core} status=0 QTime=0
   [junit4]   2> 1205494 INFO  (qtp958693042-9881) [n:127.0.0.1:44641_solr    ] o.a.s.s.HttpSolrCall [admin] webapp=null path=/admin/metrics params={prefix=CORE.coreName&wt=javabin&version=2&group=solr.core} status=0 QTime=0
   [junit4]   2> 1205494 DEBUG (qtp1415042707-9973) [n:127.0.0.1:33655_solr    ] o.a.s.c.a.AutoScalingHandler Verified autoscaling configuration
   [junit4]   2> 1205495 INFO  (qtp1415042707-9973) [n:127.0.0.1:33655_solr    ] o.a.s.s.HttpSolrCall [admin] webapp=null path=/admin/autoscaling params={wt=javabin&version=2} status=0 QTime=1
   [junit4]   2> 1205495 DEBUG (zkCallback-1599-thread-1-processing-n:127.0.0.1:44641_solr) [n:127.0.0.1:44641_solr    ] o.a.s.c.a.OverseerTriggerThread Refreshing /autoscaling.json with znode version 10
   [junit4]   2> 1205495 DEBUG (zkCallback-1599-thread-1-processing-n:127.0.0.1:44641_solr) [n:127.0.0.1:44641_solr    ] o.a.s.c.a.NodeLostTrigger Initial livenodes: [127.0.0.1:44641_solr, 127.0.0.1:39093_solr, 127.0.0.1:33655_solr]
   [junit4]   2> 1205495 DEBUG (OverseerAutoScalingTriggerThread-99204433160110085-127.0.0.1:44641_solr-n_0000000001) [n:127.0.0.1:44641_solr    ] o.a.s.c.a.OverseerTriggerThread Processed trigger updates upto znodeVersion 10
   [junit4]   2> 1205495 INFO  (OverseerAutoScalingTriggerThread-99204433160110085-127.0.0.1:44641_solr-n_0000000001) [n:127.0.0.1:44641_solr    ] o.a.s.c.a.TriggerIntegrationTest TestTriggerAction init
   [junit4]   2> 1205495 DEBUG (OverseerAutoScalingTriggerThread-99204433160110085-127.0.0.1:44641_solr-n_0000000001) [n:127.0.0.1:44641_solr    ] o.a.s.c.a.NodeLostTrigger Adding lost node from marker path: 127.0.0.1:35093_solr
   [junit4]   2> 1205496 DEBUG (OverseerAutoScalingTriggerThread-99204433160110085-127.0.0.1:44641_solr-n_0000000001) [n:127.0.0.1:44641_solr    ] o.a.s.c.a.OverseerTriggerThread -- clean old nodeAdded markers
   [junit4]   2> 1205496 DEBUG (ScheduledTrigger-4445-thread-1) [n:127.0.0.1:44641_solr    ] o.a.s.c.a.NodeLostTrigger Running NodeLostTrigger: node_lost_restore_trigger with currently live nodes: 3
   [junit4]   2> 1205496 DEBUG (ScheduledTrigger-4445-thread-1) [n:127.0.0.1:44641_solr    ] o.a.s.c.a.NodeLostTrigger NodeLostTrigger firing registered processor for lost nodes: [127.0.0.1:35093_solr]
   [junit4]   2> 1205496 DEBUG (OverseerAutoScalingTriggerThread-99204433160110085-127.0.0.1:44641_solr-n_0000000001) [n:127.0.0.1:44641_solr    ] o.a.s.c.a.OverseerTriggerThread Current znodeVersion 10, lastZnodeVersion 10
   [junit4]   2> 1205496 DEBUG (ScheduledTrigger-4445-thread-1) [n:127.0.0.1:44641_solr    ] o.a.s.c.a.ScheduledTriggers ++++++++ Cooldown inactive - processing event: {
   [junit4]   2>   "id":"51e49564f7526Tar7pizvk479otxz1bt3m1n1wa",
   [junit4]   2>   "source":"node_lost_restore_trigger",
   [junit4]   2>   "eventTime":1440675213047078,
   [junit4]   2>   "eventType":"NODELOST",
   [junit4]   2>   "properties":{
   [junit4]   2>     "eventTimes":[1440675213047078],
   [junit4]   2>     "nodeNames":["127.0.0.1:35093_solr"]}}
   [junit4]   2> 1205496 INFO  (ScheduledTrigger-4445-thread-1) [n:127.0.0.1:44641_solr    ] o.a.s.c.a.SystemLogListener Collection .system does not exist, disabling logging.
   [junit4]   2> 1205496 DEBUG (AutoscalingActionExecutor-4446-thread-1-processing-n:127.0.0.1:44641_solr) [n:127.0.0.1:44641_solr    ] o.a.s.c.a.ScheduledTriggers -- processing actions for {
   [junit4]   2>   "id":"51e49564f7526Tar7pizvk479otxz1bt3m1n1wa",
   [junit4]   2>   "source":"node_lost_restore_trigger",
   [junit4]   2>   "eventTime":1440675213047078,
   [junit4]   2>   "eventType":"NODELOST",
   [junit4]   2>   "properties":{
   [junit4]   2>     "eventTimes":[1440675213047078],
   [junit4]   2>     "_enqueue_time_":1440675213398785,
   [junit4]   2>     "nodeNames":["127.0.0.1:35093_solr"]}}
   [junit4]   2> 1205496 INFO  (TEST-TriggerIntegrationTest.testNodeLostTriggerRestoreState-seed#[89F3DDE657647DFE]) [    ] o.a.s.SolrTestCaseJ4 ###Ending testNodeLostTriggerRestoreState
   [junit4]   2> 1205497 DEBUG (AutoscalingActionExecutor-4446-thread-1-processing-n:127.0.0.1:44641_solr) [n:127.0.0.1:44641_solr    ] o.a.s.c.a.ScheduledTriggers -- processing took 0 ms for event id=51e49564f7526Tar7pizvk479otxz1bt3m1n1wa
   [junit4]   2> 1205506 INFO  (TEST-TriggerIntegrationTest.testNodeAddedTrigger-seed#[89F3DDE657647DFE]) [    ] o.a.s.SolrTestCaseJ4 ###Starting testNodeAddedTrigger
   [junit4]   2> 1205506 INFO  (TEST-TriggerIntegrationTest.testNodeAddedTrigger-seed#[89F3DDE657647DFE]) [    ] o.a.s.c.a.TriggerIntegrationTest /autoscaling.json reset, new znode version 11
   [junit4]   2> 1205506 DEBUG (zkCallback-1599-thread-1-processing-n:127.0.0.1:44641_solr) [n:127.0.0.1:44641_solr    ] o.a.s.c.a.OverseerTriggerThread Refreshing /autoscaling.json with znode version 11
   [junit4]   2> 1205506 DEBUG (OverseerAutoScalingTriggerThread-99204433160110085-127.0.0.1:44641_solr-n_0000000001) [n:127.0.0.1:44641_solr    ] o.a.s.c.a.OverseerTriggerThread Processed trigger updates upto znodeVersion 11
   [junit4]   2> 1205506 DEBUG (OverseerAutoScalingTriggerThread-99204433160110085-127.0.0.1:44641_solr-n_0000000001) [n:127.0.0.1:44641_solr    ] o.a.s.c.a.OverseerTriggerThread -- clean old nodeLost markers
   [junit4]   2> 1205507 DEBUG (OverseerAutoScalingTriggerThread-99204433160110085-127.0.0.1:44641_solr-n_0000000001) [n:127.0.0.1:44641_solr    ] o.a.s.c.a.OverseerTriggerThread -- clean old nodeAdded markers
   [junit4]   2> 1205507 DEBUG (OverseerAutoScalingTriggerThread-99204433160110085-127.0.0.1:44641_solr-n_0000000001) [n:127.0.0.1:44641_solr    ] o.a.s.c.a.OverseerTriggerThread Current znodeVersion 11, lastZnodeVersion 11
   [junit4]   2> 1205507 INFO  (qtp1415042707-9978) [n:127.0.0.1:33655_solr    ] o.a.s.s.HttpSolrCall [admin] webapp=null path=/admin/metrics params={prefix=CORE.coreName&wt=javabin&version=2&group=solr.core} status=0 QTime=0
   [junit4]   2> 1205507 INFO  (qtp1669810802-9935) [n:127.0.0.1:39093_solr    ] o.a.s.s.HttpSolrCall [admin] webapp=null path=/admin/metrics params={prefix=CORE.coreName&wt=javabin&version=2&group=solr.core} status=0 QTime=0
   [junit4]   2> 1205508 INFO  (qtp958693042-9887) [n:127.0.0.1:44641_solr    ] o.a.s.s.HttpSolrCall [admin] webapp=null path=/admin/metrics params={prefix=CORE.coreName&wt=javabin&version=2&group=solr.core} status=0 QTime=0
   [junit4]   2> 1205508 DEBUG (qtp1415042707-9974) [n:127.0.0.1:33655_solr    ] o.a.s.c.a.AutoScalingHandler Verified autoscaling configuration
   [junit4]   2> 1205508 INFO  (qtp1415042707-9974) [n:127.0.0.1:33655_solr    ] o.a.s.s.HttpSolrCall [admin] webapp=null path=/admin/autoscaling params={wt=javabin&version=2} status=0 QTime=1
   [junit4]   2> 1205508 DEBUG (zkCallback-1599-thread-1-processing-n:127.0.0.1:44641_solr) [n:127.0.0.1:44641_solr    ] o.a.s.c.a.OverseerTriggerThread Refreshing /autoscaling.json with znode version 12
   [junit4]   2> 1205508 DEBUG (zkCallback-1599-thread-1-processing-n:127.0.0.1:44641_solr) [n:127.0.0.1:44641_solr    ] o.a.s.c.a.NodeAddedTrigger Initial livenodes: [127.0.0.1:44641_solr, 127.0.0.1:39093_solr, 127.0.0.1:33655_solr]
   [junit4]   2> 1205508 DEBUG (zkCallback-1599-thread-1-processing-n:127.0.0.1:44641_solr) [n:127.0.0.1:44641_solr    ] o.a.s.c.a.NodeAddedTrigger NodeAddedTrigger node_added_trigger instantiated with properties: {event=nodeAdded, waitFor=1, actions=[{name=test, class=org.apache.solr.cloud.autoscaling.TriggerIntegrationTest$TestTriggerAction}], enabled=true}
   [junit4]   2> 1205508 DEBUG (OverseerAutoScalingTriggerThread-99204433160110085-127.0.0.1:44641_solr-n_0000000001) [n:127.0.0.1:44641_solr    ] o.a.s.c.a.OverseerTriggerThread Processed trigger updates upto znodeVersion 12
   [junit4]   2> 1205509 INFO  (OverseerAutoScalingTriggerThread-99204433160110085-127.0.0.1:44641_solr-n_0000000001) [n:127.0.0.1:44641_solr    ] o.a.s.c.a.TriggerIntegrationTest TestTriggerAction init
   [junit4]   2> 1205509 DEBUG (OverseerAutoScalingTriggerThread-99204433160110085-127.0.0.1:44641_solr-n_0000000001) [n:127.0.0.1:44641_solr    ] o.a.s.c.a.OverseerTriggerThread -- clean old nodeLost markers
   [junit4]   2> 1205509 DEBUG (OverseerAutoScalingTriggerThread-99204433160110085-127.0.0.1:44641_solr-n_0000000001) [n:127.0.0.1:44641_solr    ] o.a.s.c.a.OverseerTriggerThread Current znodeVersion 12, lastZnodeVersion 12
   [junit4]   2> 1205509 DEBUG (ScheduledTrigger-4445-thread-3) [n:127.0.0.1:44641_solr    ] o.a.s.c.a.NodeAddedTrigger Running NodeAddedTrigger node_added_trigger
   [junit4]   2> 1205509 DEBUG (ScheduledTrigger-4445-thread-3) [n:127.0.0.1:44641_solr    ] o.a.s.c.a.NodeAddedTrigger Found livenodes: 3
   [junit4]   2> 1205509 INFO  (TEST-TriggerIntegrationTest.testNodeAddedTrigger-seed#[89F3DDE657647DFE]) [    ] o.e.j.s.Server jetty-9.3.20.v20170531
   [junit4]   2> 1205510 INFO  (TEST-TriggerIntegrationTest.testNodeAddedTrigger-seed#[89F3DDE657647DFE]) [    ] o.e.j.s.h.ContextHandler Started o.e.j.s.ServletContextHandler@4df6b323{/solr,null,AVAILABLE}
   [junit4]   2> 1205510 INFO  (TEST-TriggerIntegrationTest.testNodeAddedTrigger-seed#[89F3DDE657647DFE]) [    ] o.e.j.s.AbstractConnector Started ServerConnector@48ae9888{HTTP/1.1,[http/1.1]}{127.0.0.1:40237}
   [junit4]   2> 1205511 INFO  (TEST-TriggerIntegrationTest.testNodeAddedTrigger-seed#[89F3DDE657647DFE]) [    ] o.e.j.s.Server Started @1206771ms
   [junit4]   2> 1205511 INFO  (TEST-TriggerIntegrationTest.testNodeAddedTrigger-seed#[89F3DDE657647DFE]) [    ] o.a.s.c.s.e.JettySolrRunner Jetty properties: {hostContext=/solr, hostPort=40237}
   [junit4]   2> 1205511 ERROR (TEST-TriggerIntegrationTest.testNodeAddedTrigger-seed#[89F3DDE657647DFE]) [    ] o.a.s.u.StartupLoggingUtils Missing Java Option solr.log.dir. Logging may be missing or incomplete.
   [junit4]   2> 1205511 INFO  (TEST-TriggerIntegrationTest.testNodeAddedTrigger-seed#[89F3DDE657647DFE]) [    ] o.a.s.s.SolrDispatchFilter  ___      _       Welcome to Apache Solr? version 8.0.0
   [junit4]   2> 1205511 INFO  (TEST-TriggerIntegrationTest.testNodeAddedTrigger-seed#[89F3DDE657647DFE]) [    ] o.a.s.s.SolrDispatchFilter / __| ___| |_ _   Starting in cloud mode on port null
   [junit4]   2> 1205511 INFO  (TEST-TriggerIntegrationTest.testNodeAddedTrigger-seed#[89F3DDE657647DFE]) [    ] o.a.s.s.SolrDispatchFilter \__ \/ _ \ | '_|  Install dir: null
   [junit4]   2> 1205511 INFO  (TEST-TriggerIntegrationTest.testNodeAddedTrigger-seed#[89F3DDE657647DFE]) [    ] o.a.s.s.SolrDispatchFilter |___/\___/_|_|    Start time: 2017-12-20T03:12:13.256Z
   [junit4]   2> 1205512 INFO  (zkConnectionManagerCallback-1644-thread-1) [    ] o.a.s.c.c.ConnectionManager zkClient has connected
   [junit4]   2> 1205513 INFO  (TEST-TriggerIntegrationTest.testNodeAddedTrigger-seed#[89F3DDE657647DFE]) [    ] o.a.s.s.SolrDispatchFilter solr.xml found in ZooKeeper. Loading...
   [junit4]   2> 1205518 INFO  (TEST-TriggerIntegrationTest.testNodeAddedTrigger-seed#[89F3DDE657647DFE]) [    ] o.a.s.c.ZkContainer Zookeeper client=127.0.0.1:35909/solr
   [junit4]   2> 1205519 INFO  (zkConnectionManagerCallback-1648-thread-1) [    ] o.a.s.c.c.ConnectionManager zkClient has connected
   [junit4]   2> 1205520 INFO  (zkConnectionManagerCallback-1650-thread-1-processing-n:127.0.0.1:40237_solr) [n:127.0.0.1:40237_solr    ] o.a.s.c.c.ConnectionManager zkClient has connected
   [junit4]   2> 1205522 INFO  (TEST-TriggerIntegrationTest.testNodeAddedTrigger-seed#[89F3DDE657647DFE]) [n:127.0.0.1:40237_solr    ] o.a.s.c.c.ZkStateReader Updated live nodes from ZooKeeper... (0) -> (3)
   [junit4]   2> 1205523 INFO  (TEST-TriggerIntegrationTest.testNodeAddedTrigger-seed#[89F3DDE657647DFE]) [n:127.0.0.1:40237_solr    ] o.a.s.c.Overseer Overseer (id=null) closing
   [junit4]   2> 1205524 INFO  (TEST-TriggerIntegrationTest.testNodeAddedTrigger-seed#[89F3DDE657647DFE]) [n:127.0.0.1:40237_solr    ] o.a.s.c.ZkController Register node as live in ZooKeeper:/live_nodes/127.0.0.1:40237_solr
   [junit4]   2> 1205525 INFO  (zkCallback-1611-thread-1) [    ] o.a.s.c.c.ZkStateReader Updated live nodes from ZooKeeper... (3) -> (4)
   [junit4]   2> 1205525 INFO  (zkCallback-1629-thread-1-processing-n:127.0.0.1:33655_solr) [n:127.0.0.1:33655_solr    ] o.a.s.c.c.ZkStateReader Updated live nodes from ZooKeeper... (3) -> (4)
   [junit4]   2> 1205525 INFO  (zkCallback-1619-thread-1-processing-n:127.0.0.1:39093_solr) [n:127.0.0.1:39093_solr    ] o.a.s.c.c.ZkStateReader Updated live nodes from ZooKeeper... (3) -> (4)
   [junit4]   2> 1205531 INFO  (zkCallback-1599-thread-1-processing-n:127.0.0.1:44641_solr) [n:127.0.0.1:44641_solr    ] o.a.s.c.c.ZkStateReader Updated live nodes from ZooKeeper... (3) -> (4)
   [junit4]   2> 1205531 INFO  (zkCallback-1649-thread-1-processing-n:127.0.0.1:40237_solr) [n:127.0.0.1:40237_solr    ] o.a.s.c.c.ZkStateReader Updated live nodes from ZooKeeper... (3) -> (4)
   [junit4]   2> 1205578 INFO  (TEST-TriggerIntegrationTest.testNodeAddedTrigger-seed#[89F3DDE657647DFE]) [n:127.0.0.1:40237_solr    ] o.a.s.m.r.SolrJmxReporter JMX monitoring for 'solr_40237.solr.node' (registry 'solr.node') enabled at server: com.sun.jmx.mbeanserver.JmxMBeanServer@3acf4ba2
   [junit4]   2> 1205589 INFO  (TEST-TriggerIntegrationTest.testNodeAddedTrigger-seed#[89F3DDE657647DFE]) [n:127.0.0.1:40237_solr    ] o.a.s.m.r.SolrJmxReporter JMX monitoring for 'solr_40237.solr.jvm' (registry 'solr.jvm') enabled at server: com.sun.jmx.mbeanserver.JmxMBeanServer@3acf4ba2
   [junit4]   2> 1205589 INFO  (TEST-TriggerIntegrationTest.testNodeAddedTrigger-seed#[89F3DDE657647DFE]) [n:127.0.0.1:40237_solr    ] o.a.s.m.r.SolrJmxReporter JMX monitoring for 'solr_40237.solr.jetty' (registry 'solr.jetty') enabled at server: com.sun.jmx.mbeanserver.JmxMBeanServer@3acf4ba2
   [junit4]   2> 1205591 INFO  (TEST-TriggerIntegrationTest.testNodeAddedTrigger-seed#[89F3DDE657647DFE]) [n:127.0.0.1:40237_solr    ] o.a.s.c.CorePropertiesLocator Found 0 core definitions underneath /home/jenkins/workspace/Lucene-Solr-master-Linux/solr/build/solr-core/test/J0/temp/solr.cloud.autoscaling.TriggerIntegrationTest_89F3DDE657647DFE-001/tempDir-001/node6/.
   [junit4]   2> 1206511 DEBUG (ScheduledTrigger-4445-thread-3) [n:127.0.0.1:44641_solr    ] o.a.s.c.a.NodeAddedTrigger Running NodeAddedTrigger node_added_trigger
   [junit4]   2> 1206511 DEBUG (ScheduledTrigger-4445-thread-3) [n:127.0.0.1:44641_solr    ] o.a.s.c.a.NodeAddedTrigger Found livenodes: 4
   [junit4]   2> 1206511 DEBUG (ScheduledTrigger-4445-thread-3) [n:127.0.0.1:44641_solr    ] o.a.s.c.a.NodeAddedTrigger Tracking new node: 127.0.0.1:40237_solr at time 1440676228506759
   [junit4]   2> 1207511 DEBUG (ScheduledTrigger-4445-thread-3) [n:127.0.0.1:44641_solr    ] o.a.s.c.a.NodeAddedTrigger Running NodeAddedTrigger node_added_trigger
   [junit4]   2> 1207511 DEBUG (ScheduledTrigger-4445-thread-3) [n:127.0.0.1:44641_solr    ] o.a.s.c.a.NodeAddedTrigger Found livenodes: 4
   [junit4]   2> 1207512 DEBUG (ScheduledTrigger-4445-thread-3) [n:127.0.0.1:44641_solr    ] o.a.s.c.a.NodeAddedTrigger NodeAddedTrigger node_added_trigger firing registered processor for nodes: [127.0.0.1:40237_solr] added at times [1440676228506759], now=1440677229103969
   [junit4]   2> 1207512 DEBUG (ScheduledTrigger-4445-thread-3) [n:127.0.0.1:44641_solr    ] o.a.s.c.a.ScheduledTriggers ++++++++ Cooldown inactive - processing event: {
   [junit4]   2>   "id":"51e4992d62487Tar7pizvk479otxz1bt3m1n1wc",
   [junit4]   2>   "source":"node_added_trigger",
   [junit4]   2>   "eventTime":1440676228506759,
   [junit4]   2>   "eventType":"NODEADDED",
   [junit4]   2>   "properties":{
   [junit4]   2>     "eventTimes":[1440676228506759],
   [junit4]   2>     "nodeNames":["127.0.0.1:40237_solr"]}}
   [junit4]   2> 1207512 INFO  (ScheduledTrigger-4445-thread-3) [n:127.0.0.1:44641_solr    ] o.a.s.c.a.SystemLogListener Collection .system does not exist, disabling logging.
   [junit4]   2> 1207512 DEBUG (AutoscalingActionExecutor-4446-thread-1-processing-n:127.0.0.1:44641_solr) [n:127.0.0.1:44641_solr    ] o.a.s.c.a.ScheduledTriggers -- processing actions for {
   [junit4]   2>   "id":"51e4992d62487Tar7pizvk479otxz1bt3m1n1wc",
   [junit4]   2>   "source":"node_added_trigger",
   [junit4]   2>   "eventTime":1440676228506759,
   [junit4]   2>   "eventType":"NODEADDED",
   [junit4]   2>   "properties":{
   [junit4]   2>     "eventTimes":[1440676228506759],
   [junit4]   2>     "_enqueue_time_":1440677229234962,
   [junit4]   2>     "nodeNames":["127.0.0.1:40237_solr"]}}
   [junit4]   2> 1207513 DEBUG (AutoscalingActionExecutor-4446-thread-1-processing-n:127.0.0.1:44641_solr) [n:127.0.0.1:44641_solr    ] o.a.s.c.a.ScheduledTriggers -- processing took 0 ms for event id=51e4992d62487Tar7pizvk479otxz1bt3m1n1wc
   [junit4]   2> 1207513 INFO  (qtp1415042707-9972) [n:127.0.0.1:33655_solr    ] o.a.s.s.HttpSolrCall [admin] webapp=null path=/admin/metrics params={prefix=CORE.coreName&wt=javabin&version=2&group=solr.core} status=0 QTime=0
   [junit4]   2> 1207513 INFO  (qtp1669

[...truncated too long message...]

ed o.e.j.s.ServletContextHandler@35dab12a{/solr,null,UNAVAILABLE}
   [junit4]   2> 1340931 INFO  (jetty-closer-1584-thread-1) [    ] o.a.s.c.ZkController Remove node as live in ZooKeeper:/live_nodes/127.0.0.1:39771_solr
   [junit4]   2> 1340931 INFO  (zkCallback-1769-thread-2-processing-n:127.0.0.1:45097_solr) [n:127.0.0.1:45097_solr    ] o.a.s.c.c.ZkStateReader Updated live nodes from ZooKeeper... (2) -> (1)
   [junit4]   2> 1340931 WARN  (NIOServerCxn.Factory:0.0.0.0/0.0.0.0:0) [    ] o.a.z.s.NIOServerCnxn caught end of stream exception
   [junit4]   2> EndOfStreamException: Unable to read additional data from client sessionid 0x16071e806a70032, likely client has closed socket
   [junit4]   2> 	at org.apache.zookeeper.server.NIOServerCnxn.doIO(NIOServerCnxn.java:239)
   [junit4]   2> 	at org.apache.zookeeper.server.NIOServerCnxnFactory.run(NIOServerCnxnFactory.java:203)
   [junit4]   2> 	at java.lang.Thread.run(Thread.java:748)
   [junit4]   2> 1340932 INFO  (jetty-closer-1584-thread-8) [    ] o.e.j.s.h.ContextHandler Stopped o.e.j.s.ServletContextHandler@8bc69bb{/solr,null,UNAVAILABLE}
   [junit4]   2> 1340932 INFO  (jetty-closer-1584-thread-10) [    ] o.a.s.m.SolrMetricManager Closing metric reporters for registry=solr.cluster, tag=null
   [junit4]   2> 1340932 INFO  (zkCallback-1719-thread-2-processing-n:127.0.0.1:40853_solr) [n:127.0.0.1:40853_solr    ] o.a.s.c.c.ZkStateReader Updated live nodes from ZooKeeper... (2) -> (1)
   [junit4]   2> 1340932 INFO  (jetty-closer-1584-thread-10) [    ] o.a.s.c.TransientSolrCoreCacheDefault Allocating transient cache for 2147483647 transient cores
   [junit4]   2> 1340932 INFO  (jetty-closer-1584-thread-1) [    ] o.a.s.m.SolrMetricManager Closing metric reporters for registry=solr.cluster, tag=null
   [junit4]   2> 1340932 INFO  (jetty-closer-1584-thread-1) [    ] o.a.s.c.TransientSolrCoreCacheDefault Allocating transient cache for 2147483647 transient cores
   [junit4]   2> 1340933 INFO  (zkCallback-1759-thread-2-processing-n:127.0.0.1:33411_solr) [n:127.0.0.1:33411_solr    ] o.a.s.c.c.ZkStateReader Updated live nodes from ZooKeeper... (1) -> (0)
   [junit4]   2> 1340933 INFO  (zkCallback-1679-thread-2-processing-n:127.0.0.1:39771_solr) [n:127.0.0.1:39771_solr    ] o.a.s.c.c.ZkStateReader Updated live nodes from ZooKeeper... (5) -> (0)
   [junit4]   2> 1340933 INFO  (zkCallback-1769-thread-2-processing-n:127.0.0.1:45097_solr) [n:127.0.0.1:45097_solr    ] o.a.s.c.c.ZkStateReader Updated live nodes from ZooKeeper... (1) -> (0)
   [junit4]   2> 1340934 INFO  (zkCallback-1739-thread-1-processing-n:127.0.0.1:46571_solr) [n:127.0.0.1:46571_solr    ] o.a.s.c.c.ZkStateReader Updated live nodes from ZooKeeper... (1) -> (0)
   [junit4]   2> 1340934 INFO  (jetty-closer-1584-thread-1) [    ] o.a.s.c.Overseer Overseer (id=99204433160110109-127.0.0.1:39771_solr-n_0000000008) closing
   [junit4]   2> 1340934 INFO  (jetty-closer-1584-thread-3) [    ] o.e.j.s.h.ContextHandler Stopped o.e.j.s.ServletContextHandler@317cef83{/solr,null,UNAVAILABLE}
   [junit4]   2> 1340934 INFO  (OverseerStateUpdate-99204433160110109-127.0.0.1:39771_solr-n_0000000008) [n:127.0.0.1:39771_solr    ] o.a.s.c.Overseer Overseer Loop exiting : 127.0.0.1:39771_solr
   [junit4]   2> 1340934 INFO  (jetty-closer-1584-thread-9) [    ] o.e.j.s.h.ContextHandler Stopped o.e.j.s.ServletContextHandler@3c4395fa{/solr,null,UNAVAILABLE}
   [junit4]   2> 1340935 WARN  (OverseerAutoScalingTriggerThread-99204433160110109-127.0.0.1:39771_solr-n_0000000008) [n:127.0.0.1:39771_solr    ] o.a.s.c.a.OverseerTriggerThread OverseerTriggerThread woken up but we are closed, exiting.
   [junit4]   2> 1340935 INFO  (jetty-closer-1584-thread-7) [    ] o.e.j.s.h.ContextHandler Stopped o.e.j.s.ServletContextHandler@107329cb{/solr,null,UNAVAILABLE}
   [junit4]   2> 1340935 DEBUG (jetty-closer-1584-thread-1) [    ] o.a.s.c.a.OverseerTriggerThread OverseerTriggerThread has been closed explicitly
   [junit4]   2> 1340935 INFO  (jetty-closer-1584-thread-5) [    ] o.e.j.s.h.ContextHandler Stopped o.e.j.s.ServletContextHandler@603e2fcf{/solr,null,UNAVAILABLE}
   [junit4]   2> 1340936 INFO  (jetty-closer-1584-thread-10) [    ] o.e.j.s.h.ContextHandler Stopped o.e.j.s.ServletContextHandler@676789c6{/solr,null,UNAVAILABLE}
   [junit4]   2> 1340936 INFO  (jetty-closer-1584-thread-1) [    ] o.e.j.s.h.ContextHandler Stopped o.e.j.s.ServletContextHandler@44efa577{/solr,null,UNAVAILABLE}
   [junit4]   2> 1340936 ERROR (SUITE-TriggerIntegrationTest-seed#[89F3DDE657647DFE]-worker) [    ] o.a.z.s.ZooKeeperServer ZKShutdownHandler is not registered, so ZooKeeper server won't take any action on ERROR or SHUTDOWN server state changes
   [junit4]   2> 1340937 INFO  (SUITE-TriggerIntegrationTest-seed#[89F3DDE657647DFE]-worker) [    ] o.a.s.c.ZkTestServer connecting to 127.0.0.1:35909 35909
   [junit4]   2> 1346044 INFO  (Thread-3031) [    ] o.a.s.c.ZkTestServer connecting to 127.0.0.1:35909 35909
   [junit4]   2> 1346045 WARN  (Thread-3031) [    ] o.a.s.c.ZkTestServer Watch limit violations: 
   [junit4]   2> Maximum concurrent create/delete watches above limit:
   [junit4]   2> 
   [junit4]   2> 	20	/solr/aliases.json
   [junit4]   2> 	20	/solr/clusterprops.json
   [junit4]   2> 	19	/solr/security.json
   [junit4]   2> 
   [junit4]   2> Maximum concurrent data watches above limit:
   [junit4]   2> 
   [junit4]   2> 	20	/solr/clusterstate.json
   [junit4]   2> 	6	/solr/autoscaling.json
   [junit4]   2> 	4	/solr/overseer_elect/election/99204433160110109-127.0.0.1:39771_solr-n_0000000008
   [junit4]   2> 	4	/solr/overseer_elect/election/99204433160110094-127.0.0.1:33655_solr-n_0000000003
   [junit4]   2> 	2	/solr/overseer_elect/election/99204433160110121-127.0.0.1:40853_solr-n_0000000012
   [junit4]   2> 	2	/solr/overseer_elect/election/99204433160110127-127.0.0.1:46571_solr-n_0000000014
   [junit4]   2> 
   [junit4]   2> Maximum concurrent children watches above limit:
   [junit4]   2> 
   [junit4]   2> 	20	/solr/live_nodes
   [junit4]   2> 	20	/solr/collections
   [junit4]   2> 	6	/solr/overseer/queue-work
   [junit4]   2> 	6	/solr/autoscaling/events/.auto_add_replicas
   [junit4]   2> 	6	/solr/overseer/queue
   [junit4]   2> 	6	/solr/overseer/collection-queue-work
   [junit4]   2> 	3	/solr/autoscaling/events/node_added_trigger
   [junit4]   2> 	2	/solr/autoscaling/events/node_added_trigger1
   [junit4]   2> 	2	/solr/autoscaling/events/node_lost_trigger
   [junit4]   2> 
   [junit4]   2> NOTE: leaving temporary files on disk at: /home/jenkins/workspace/Lucene-Solr-master-Linux/solr/build/solr-core/test/J0/temp/solr.cloud.autoscaling.TriggerIntegrationTest_89F3DDE657647DFE-001
   [junit4]   2> NOTE: test params are: codec=Lucene70, sim=Asserting(org.apache.lucene.search.similarities.AssertingSimilarity@54d8aced), locale=en-CA, timezone=Australia/Broken_Hill
   [junit4]   2> NOTE: Linux 4.10.0-40-generic amd64/Oracle Corporation 1.8.0_144 (64-bit)/cpus=8,threads=1,free=145244704,total=518979584
   [junit4]   2> NOTE: All tests run in this JVM: [TestManagedSchema, HLLUtilTest, TestQueryWrapperFilter, HdfsNNFailoverTest, HdfsRestartWhileUpdatingTest, TestRandomRequestDistribution, TestReplicationHandler, SimpleFacetsTest, TestConfigSetsAPIZkFailure, GraphQueryTest, TestXmlQParser, CursorPagingTest, TestJsonFacetRefinement, RAMDirectoryFactoryTest, TestOrdValues, TriLevelCompositeIdRoutingTest, BasicZkTest, TestHdfsCloudBackupRestore, NodeMutatorTest, DistributedMLTComponentTest, ZkStateWriterTest, TestSerializedLuceneMatchVersion, TestUnifiedSolrHighlighter, TestExpandComponent, JsonLoaderTest, AnalyticsQueryTest, TestConfig, TestManagedResource, PeerSyncTest, AutoAddReplicasIntegrationTest, TestManagedSynonymFilterFactory, SpellCheckComponentTest, StressHdfsTest, TestSort, TestSearcherReuse, CleanupOldIndexTest, HttpTriggerListenerTest, FileUtilsTest, SoftAutoCommitTest, TestImplicitCoreProperties, DistributedFacetPivotWhiteBoxTest, StatsReloadRaceTest, TestQueryUtils, MetricsConfigTest, TestSolrDeletionPolicy1, DistributedQueryElevationComponentTest, DistributedSuggestComponentTest, TestSolrCloudWithSecureImpersonation, MergeStrategyTest, TestSegmentSorting, FastVectorHighlighterTest, DateMathParserTest, TestSolrCloudWithHadoopAuthPlugin, TestCloudSearcherWarming, CloudMLTQParserTest, MigrateRouteKeyTest, CachingDirectoryFactoryTest, ClassificationUpdateProcessorTest, WrapperMergePolicyFactoryTest, CdcrReplicationDistributedZkTest, LeaderInitiatedRecoveryOnCommitTest, TestPushWriter, UpdateRequestProcessorFactoryTest, TestRequestForwarding, SliceStateTest, RecoveryAfterSoftCommitTest, HdfsTlogReplayBufferedWhileIndexingTest, TestIndexingPerformance, ComputePlanActionTest, TestSolrCloudSnapshots, TestBulkSchemaAPI, TestTestInjection, MultiTermTest, TestSchemaResource, TestSolrIndexConfig, TestFreeTextSuggestions, TestAddFieldRealTimeGet, NoCacheHeaderTest, TestPullReplica, TestMissingGroups, SolrPluginUtilsTest, TestBadConfig, TestComponentsName, TestHighlightDedupGrouping, ResourceLoaderTest, BooleanFieldTest, TestJoin, SuggestComponentContextFilterQueryTest, CacheHeaderTest, TestSha256AuthenticationProvider, SolrMetricReporterTest, BigEndianAscendingWordDeserializerTest, TestLegacyFieldReuse, TestInitQParser, TestWordDelimiterFilterFactory, TestDFISimilarityFactory, ManagedSchemaRoundRobinCloudTest, TestSolrJ, QueryParsingTest, SearchHandlerTest, TestUtils, TestCorePropertiesReload, IndexSchemaRuntimeFieldTest, LeaderElectionContextKeyTest, AtomicUpdatesTest, ResponseHeaderTest, SSLMigrationTest, DirectoryFactoryTest, TestUpdate, TestDocBasedVersionConstraints, TestInPlaceUpdatesDistrib, TestSQLHandlerNonCloud, DocumentBuilderTest, DataDrivenBlockJoinTest, TestSweetSpotSimilarityFactory, StatelessScriptUpdateProcessorFactoryTest, TestLargeCluster, DocValuesTest, MinimalSchemaTest, PropertiesRequestHandlerTest, TriggerIntegrationTest]
   [junit4] Completed [387/764 (1!)] on J0 in 154.19s, 13 tests, 1 failure, 1 skipped <<< FAILURES!

[...truncated 49258 lines...]

Mime
View raw message