lucene-dev mailing list archives

Site index · List index
Message view « Date » · « Thread »
Top « Date » · « Thread »
From Policeman Jenkins Server <jenk...@thetaphi.de>
Subject [JENKINS] Lucene-Solr-7.x-Windows (64bit/jdk1.8.0_144) - Build # 348 - Still Unstable!
Date Mon, 18 Dec 2017 10:36:50 GMT
Build: https://jenkins.thetaphi.de/job/Lucene-Solr-7.x-Windows/348/
Java: 64bit/jdk1.8.0_144 -XX:-UseCompressedOops -XX:+UseG1GC

5 tests failed.
FAILED:  org.apache.lucene.replicator.IndexAndTaxonomyReplicationClientTest.testConsistencyOnExceptions

Error Message:
Captured an uncaught exception in thread: Thread[id=18, name=ReplicationThread-indexAndTaxo, state=RUNNABLE, group=TGRP-IndexAndTaxonomyReplicationClientTest]

Stack Trace:
com.carrotsearch.randomizedtesting.UncaughtExceptionError: Captured an uncaught exception in thread: Thread[id=18, name=ReplicationThread-indexAndTaxo, state=RUNNABLE, group=TGRP-IndexAndTaxonomyReplicationClientTest]
	at __randomizedtesting.SeedInfo.seed([ECBFD4653FFEAAA3:633133C52D92595C]:0)
Caused by: java.lang.AssertionError: handler failed too many times: -1
	at __randomizedtesting.SeedInfo.seed([ECBFD4653FFEAAA3]:0)
	at org.apache.lucene.replicator.IndexAndTaxonomyReplicationClientTest$4.handleUpdateException(IndexAndTaxonomyReplicationClientTest.java:422)
	at org.apache.lucene.replicator.ReplicationClient$ReplicationThread.run(ReplicationClient.java:77)


FAILED:  org.apache.solr.handler.TestBlobHandler.doBlobHandlerTest

Error Message:
Timeout occured while waiting response from server at: http://127.0.0.1:57604

Stack Trace:
org.apache.solr.client.solrj.SolrServerException: Timeout occured while waiting response from server at: http://127.0.0.1:57604
	at __randomizedtesting.SeedInfo.seed([EAC1A3309403F2A5:A0081622FEF8457]:0)
	at org.apache.solr.client.solrj.impl.HttpSolrClient.executeMethod(HttpSolrClient.java:654)
	at org.apache.solr.client.solrj.impl.HttpSolrClient.request(HttpSolrClient.java:255)
	at org.apache.solr.client.solrj.impl.HttpSolrClient.request(HttpSolrClient.java:244)
	at org.apache.solr.client.solrj.impl.LBHttpSolrClient.doRequest(LBHttpSolrClient.java:483)
	at org.apache.solr.client.solrj.impl.LBHttpSolrClient.request(LBHttpSolrClient.java:413)
	at org.apache.solr.client.solrj.impl.CloudSolrClient.sendRequest(CloudSolrClient.java:1104)
	at org.apache.solr.client.solrj.impl.CloudSolrClient.requestWithRetryOnStaleState(CloudSolrClient.java:884)
	at org.apache.solr.client.solrj.impl.CloudSolrClient.request(CloudSolrClient.java:817)
	at org.apache.solr.client.solrj.SolrRequest.process(SolrRequest.java:194)
	at org.apache.solr.client.solrj.SolrRequest.process(SolrRequest.java:211)
	at org.apache.solr.cloud.AbstractFullDistribZkTestBase.createServers(AbstractFullDistribZkTestBase.java:315)
	at org.apache.solr.BaseDistributedSearchTestCase$ShardsRepeatRule$ShardsFixedStatement.callStatement(BaseDistributedSearchTestCase.java:991)
	at org.apache.solr.BaseDistributedSearchTestCase$ShardsRepeatRule$ShardsStatement.evaluate(BaseDistributedSearchTestCase.java:968)
	at com.carrotsearch.randomizedtesting.rules.SystemPropertiesRestoreRule$1.evaluate(SystemPropertiesRestoreRule.java:57)
	at org.apache.lucene.util.TestRuleSetupTeardownChained$1.evaluate(TestRuleSetupTeardownChained.java:49)
	at org.apache.lucene.util.AbstractBeforeAfterRule$1.evaluate(AbstractBeforeAfterRule.java:45)
	at org.apache.lucene.util.TestRuleThreadAndTestName$1.evaluate(TestRuleThreadAndTestName.java:48)
	at org.apache.lucene.util.TestRuleIgnoreAfterMaxFailures$1.evaluate(TestRuleIgnoreAfterMaxFailures.java:64)
	at org.apache.lucene.util.TestRuleMarkFailure$1.evaluate(TestRuleMarkFailure.java:47)
	at com.carrotsearch.randomizedtesting.rules.StatementAdapter.evaluate(StatementAdapter.java:36)
	at com.carrotsearch.randomizedtesting.ThreadLeakControl$StatementRunner.run(ThreadLeakControl.java:368)
	at com.carrotsearch.randomizedtesting.ThreadLeakControl.forkTimeoutingTask(ThreadLeakControl.java:817)
	at com.carrotsearch.randomizedtesting.ThreadLeakControl$3.evaluate(ThreadLeakControl.java:468)
	at com.carrotsearch.randomizedtesting.RandomizedRunner.runSingleTest(RandomizedRunner.java:943)
	at com.carrotsearch.randomizedtesting.RandomizedRunner$5.evaluate(RandomizedRunner.java:829)
	at com.carrotsearch.randomizedtesting.RandomizedRunner$6.evaluate(RandomizedRunner.java:879)
	at com.carrotsearch.randomizedtesting.RandomizedRunner$7.evaluate(RandomizedRunner.java:890)
	at com.carrotsearch.randomizedtesting.rules.StatementAdapter.evaluate(StatementAdapter.java:36)
	at com.carrotsearch.randomizedtesting.rules.SystemPropertiesRestoreRule$1.evaluate(SystemPropertiesRestoreRule.java:57)
	at org.apache.lucene.util.AbstractBeforeAfterRule$1.evaluate(AbstractBeforeAfterRule.java:45)
	at com.carrotsearch.randomizedtesting.rules.StatementAdapter.evaluate(StatementAdapter.java:36)
	at org.apache.lucene.util.TestRuleStoreClassName$1.evaluate(TestRuleStoreClassName.java:41)
	at com.carrotsearch.randomizedtesting.rules.NoShadowingOrOverridesOnMethodsRule$1.evaluate(NoShadowingOrOverridesOnMethodsRule.java:40)
	at com.carrotsearch.randomizedtesting.rules.NoShadowingOrOverridesOnMethodsRule$1.evaluate(NoShadowingOrOverridesOnMethodsRule.java:40)
	at com.carrotsearch.randomizedtesting.rules.StatementAdapter.evaluate(StatementAdapter.java:36)
	at com.carrotsearch.randomizedtesting.rules.StatementAdapter.evaluate(StatementAdapter.java:36)
	at com.carrotsearch.randomizedtesting.rules.StatementAdapter.evaluate(StatementAdapter.java:36)
	at org.apache.lucene.util.TestRuleAssertionsRequired$1.evaluate(TestRuleAssertionsRequired.java:53)
	at org.apache.lucene.util.TestRuleMarkFailure$1.evaluate(TestRuleMarkFailure.java:47)
	at org.apache.lucene.util.TestRuleIgnoreAfterMaxFailures$1.evaluate(TestRuleIgnoreAfterMaxFailures.java:64)
	at org.apache.lucene.util.TestRuleIgnoreTestSuites$1.evaluate(TestRuleIgnoreTestSuites.java:54)
	at com.carrotsearch.randomizedtesting.rules.StatementAdapter.evaluate(StatementAdapter.java:36)
	at com.carrotsearch.randomizedtesting.ThreadLeakControl$StatementRunner.run(ThreadLeakControl.java:368)
	at java.lang.Thread.run(Thread.java:748)
Caused by: java.net.SocketTimeoutException: Read timed out
	at java.net.SocketInputStream.socketRead0(Native Method)
	at java.net.SocketInputStream.socketRead(SocketInputStream.java:116)
	at java.net.SocketInputStream.read(SocketInputStream.java:171)
	at java.net.SocketInputStream.read(SocketInputStream.java:141)
	at org.apache.http.impl.io.SessionInputBufferImpl.streamRead(SessionInputBufferImpl.java:137)
	at org.apache.http.impl.io.SessionInputBufferImpl.fillBuffer(SessionInputBufferImpl.java:153)
	at org.apache.http.impl.io.SessionInputBufferImpl.readLine(SessionInputBufferImpl.java:282)
	at org.apache.http.impl.conn.DefaultHttpResponseParser.parseHead(DefaultHttpResponseParser.java:138)
	at org.apache.http.impl.conn.DefaultHttpResponseParser.parseHead(DefaultHttpResponseParser.java:56)
	at org.apache.http.impl.io.AbstractMessageParser.parse(AbstractMessageParser.java:259)
	at org.apache.http.impl.DefaultBHttpClientConnection.receiveResponseHeader(DefaultBHttpClientConnection.java:163)
	at org.apache.http.impl.conn.CPoolProxy.receiveResponseHeader(CPoolProxy.java:165)
	at org.apache.http.protocol.HttpRequestExecutor.doReceiveResponse(HttpRequestExecutor.java:273)
	at org.apache.http.protocol.HttpRequestExecutor.execute(HttpRequestExecutor.java:125)
	at org.apache.http.impl.execchain.MainClientExec.execute(MainClientExec.java:272)
	at org.apache.http.impl.execchain.ProtocolExec.execute(ProtocolExec.java:185)
	at org.apache.http.impl.execchain.RetryExec.execute(RetryExec.java:89)
	at org.apache.http.impl.execchain.RedirectExec.execute(RedirectExec.java:111)
	at org.apache.http.impl.client.InternalHttpClient.doExecute(InternalHttpClient.java:185)
	at org.apache.http.impl.client.CloseableHttpClient.execute(CloseableHttpClient.java:83)
	at org.apache.http.impl.client.CloseableHttpClient.execute(CloseableHttpClient.java:56)
	at org.apache.solr.client.solrj.impl.HttpSolrClient.executeMethod(HttpSolrClient.java:542)
	... 43 more


FAILED:  junit.framework.TestSuite.org.apache.solr.schema.IndexSchemaRuntimeFieldTest

Error Message:
Could not remove the following files (in the order of attempts):    C:\Users\jenkins\workspace\Lucene-Solr-7.x-Windows\solr\build\solr-core\test\J1\temp\solr.schema.IndexSchemaRuntimeFieldTest_EAC1A3309403F2A5-001\init-core-data-001: java.nio.file.AccessDeniedException: C:\Users\jenkins\workspace\Lucene-Solr-7.x-Windows\solr\build\solr-core\test\J1\temp\solr.schema.IndexSchemaRuntimeFieldTest_EAC1A3309403F2A5-001\init-core-data-001    C:\Users\jenkins\workspace\Lucene-Solr-7.x-Windows\solr\build\solr-core\test\J1\temp\solr.schema.IndexSchemaRuntimeFieldTest_EAC1A3309403F2A5-001: java.nio.file.DirectoryNotEmptyException: C:\Users\jenkins\workspace\Lucene-Solr-7.x-Windows\solr\build\solr-core\test\J1\temp\solr.schema.IndexSchemaRuntimeFieldTest_EAC1A3309403F2A5-001 

Stack Trace:
java.io.IOException: Could not remove the following files (in the order of attempts):
   C:\Users\jenkins\workspace\Lucene-Solr-7.x-Windows\solr\build\solr-core\test\J1\temp\solr.schema.IndexSchemaRuntimeFieldTest_EAC1A3309403F2A5-001\init-core-data-001: java.nio.file.AccessDeniedException: C:\Users\jenkins\workspace\Lucene-Solr-7.x-Windows\solr\build\solr-core\test\J1\temp\solr.schema.IndexSchemaRuntimeFieldTest_EAC1A3309403F2A5-001\init-core-data-001
   C:\Users\jenkins\workspace\Lucene-Solr-7.x-Windows\solr\build\solr-core\test\J1\temp\solr.schema.IndexSchemaRuntimeFieldTest_EAC1A3309403F2A5-001: java.nio.file.DirectoryNotEmptyException: C:\Users\jenkins\workspace\Lucene-Solr-7.x-Windows\solr\build\solr-core\test\J1\temp\solr.schema.IndexSchemaRuntimeFieldTest_EAC1A3309403F2A5-001

	at __randomizedtesting.SeedInfo.seed([EAC1A3309403F2A5]:0)
	at org.apache.lucene.util.IOUtils.rm(IOUtils.java:329)
	at org.apache.lucene.util.TestRuleTemporaryFilesCleanup.afterAlways(TestRuleTemporaryFilesCleanup.java:216)
	at com.carrotsearch.randomizedtesting.rules.TestRuleAdapter$1.afterAlways(TestRuleAdapter.java:31)
	at com.carrotsearch.randomizedtesting.rules.StatementAdapter.evaluate(StatementAdapter.java:43)
	at com.carrotsearch.randomizedtesting.rules.StatementAdapter.evaluate(StatementAdapter.java:36)
	at org.apache.lucene.util.TestRuleAssertionsRequired$1.evaluate(TestRuleAssertionsRequired.java:53)
	at org.apache.lucene.util.TestRuleMarkFailure$1.evaluate(TestRuleMarkFailure.java:47)
	at org.apache.lucene.util.TestRuleIgnoreAfterMaxFailures$1.evaluate(TestRuleIgnoreAfterMaxFailures.java:64)
	at org.apache.lucene.util.TestRuleIgnoreTestSuites$1.evaluate(TestRuleIgnoreTestSuites.java:54)
	at com.carrotsearch.randomizedtesting.rules.StatementAdapter.evaluate(StatementAdapter.java:36)
	at com.carrotsearch.randomizedtesting.ThreadLeakControl$StatementRunner.run(ThreadLeakControl.java:368)
	at java.lang.Thread.run(Thread.java:748)


FAILED:  junit.framework.TestSuite.org.apache.solr.search.mlt.CloudMLTQParserTest

Error Message:
Could not remove the following files (in the order of attempts):    C:\Users\jenkins\workspace\Lucene-Solr-7.x-Windows\solr\build\solr-core\test\J0\temp\solr.search.mlt.CloudMLTQParserTest_EAC1A3309403F2A5-001\tempDir-001\node1\mlt-collection_shard1_replica_n1\data\tlog: java.nio.file.DirectoryNotEmptyException: C:\Users\jenkins\workspace\Lucene-Solr-7.x-Windows\solr\build\solr-core\test\J0\temp\solr.search.mlt.CloudMLTQParserTest_EAC1A3309403F2A5-001\tempDir-001\node1\mlt-collection_shard1_replica_n1\data\tlog    C:\Users\jenkins\workspace\Lucene-Solr-7.x-Windows\solr\build\solr-core\test\J0\temp\solr.search.mlt.CloudMLTQParserTest_EAC1A3309403F2A5-001\tempDir-001\node1\mlt-collection_shard1_replica_n1\data: java.nio.file.DirectoryNotEmptyException: C:\Users\jenkins\workspace\Lucene-Solr-7.x-Windows\solr\build\solr-core\test\J0\temp\solr.search.mlt.CloudMLTQParserTest_EAC1A3309403F2A5-001\tempDir-001\node1\mlt-collection_shard1_replica_n1\data    C:\Users\jenkins\workspace\Lucene-Solr-7.x-Windows\solr\build\solr-core\test\J0\temp\solr.search.mlt.CloudMLTQParserTest_EAC1A3309403F2A5-001\tempDir-001\node1\mlt-collection_shard1_replica_n1: java.nio.file.DirectoryNotEmptyException: C:\Users\jenkins\workspace\Lucene-Solr-7.x-Windows\solr\build\solr-core\test\J0\temp\solr.search.mlt.CloudMLTQParserTest_EAC1A3309403F2A5-001\tempDir-001\node1\mlt-collection_shard1_replica_n1    C:\Users\jenkins\workspace\Lucene-Solr-7.x-Windows\solr\build\solr-core\test\J0\temp\solr.search.mlt.CloudMLTQParserTest_EAC1A3309403F2A5-001\tempDir-001\node1: java.nio.file.DirectoryNotEmptyException: C:\Users\jenkins\workspace\Lucene-Solr-7.x-Windows\solr\build\solr-core\test\J0\temp\solr.search.mlt.CloudMLTQParserTest_EAC1A3309403F2A5-001\tempDir-001\node1    C:\Users\jenkins\workspace\Lucene-Solr-7.x-Windows\solr\build\solr-core\test\J0\temp\solr.search.mlt.CloudMLTQParserTest_EAC1A3309403F2A5-001\tempDir-001: java.nio.file.DirectoryNotEmptyException: C:\Users\jenkins\workspace\Lucene-Solr-7.x-Windows\solr\build\solr-core\test\J0\temp\solr.search.mlt.CloudMLTQParserTest_EAC1A3309403F2A5-001\tempDir-001    C:\Users\jenkins\workspace\Lucene-Solr-7.x-Windows\solr\build\solr-core\test\J0\temp\solr.search.mlt.CloudMLTQParserTest_EAC1A3309403F2A5-001\tempDir-001\node1\mlt-collection_shard1_replica_n1\data\tlog\tlog.0000000000000000000: java.nio.file.AccessDeniedException: C:\Users\jenkins\workspace\Lucene-Solr-7.x-Windows\solr\build\solr-core\test\J0\temp\solr.search.mlt.CloudMLTQParserTest_EAC1A3309403F2A5-001\tempDir-001\node1\mlt-collection_shard1_replica_n1\data\tlog\tlog.0000000000000000000    C:\Users\jenkins\workspace\Lucene-Solr-7.x-Windows\solr\build\solr-core\test\J0\temp\solr.search.mlt.CloudMLTQParserTest_EAC1A3309403F2A5-001: java.nio.file.DirectoryNotEmptyException: C:\Users\jenkins\workspace\Lucene-Solr-7.x-Windows\solr\build\solr-core\test\J0\temp\solr.search.mlt.CloudMLTQParserTest_EAC1A3309403F2A5-001 

Stack Trace:
java.io.IOException: Could not remove the following files (in the order of attempts):
   C:\Users\jenkins\workspace\Lucene-Solr-7.x-Windows\solr\build\solr-core\test\J0\temp\solr.search.mlt.CloudMLTQParserTest_EAC1A3309403F2A5-001\tempDir-001\node1\mlt-collection_shard1_replica_n1\data\tlog: java.nio.file.DirectoryNotEmptyException: C:\Users\jenkins\workspace\Lucene-Solr-7.x-Windows\solr\build\solr-core\test\J0\temp\solr.search.mlt.CloudMLTQParserTest_EAC1A3309403F2A5-001\tempDir-001\node1\mlt-collection_shard1_replica_n1\data\tlog
   C:\Users\jenkins\workspace\Lucene-Solr-7.x-Windows\solr\build\solr-core\test\J0\temp\solr.search.mlt.CloudMLTQParserTest_EAC1A3309403F2A5-001\tempDir-001\node1\mlt-collection_shard1_replica_n1\data: java.nio.file.DirectoryNotEmptyException: C:\Users\jenkins\workspace\Lucene-Solr-7.x-Windows\solr\build\solr-core\test\J0\temp\solr.search.mlt.CloudMLTQParserTest_EAC1A3309403F2A5-001\tempDir-001\node1\mlt-collection_shard1_replica_n1\data
   C:\Users\jenkins\workspace\Lucene-Solr-7.x-Windows\solr\build\solr-core\test\J0\temp\solr.search.mlt.CloudMLTQParserTest_EAC1A3309403F2A5-001\tempDir-001\node1\mlt-collection_shard1_replica_n1: java.nio.file.DirectoryNotEmptyException: C:\Users\jenkins\workspace\Lucene-Solr-7.x-Windows\solr\build\solr-core\test\J0\temp\solr.search.mlt.CloudMLTQParserTest_EAC1A3309403F2A5-001\tempDir-001\node1\mlt-collection_shard1_replica_n1
   C:\Users\jenkins\workspace\Lucene-Solr-7.x-Windows\solr\build\solr-core\test\J0\temp\solr.search.mlt.CloudMLTQParserTest_EAC1A3309403F2A5-001\tempDir-001\node1: java.nio.file.DirectoryNotEmptyException: C:\Users\jenkins\workspace\Lucene-Solr-7.x-Windows\solr\build\solr-core\test\J0\temp\solr.search.mlt.CloudMLTQParserTest_EAC1A3309403F2A5-001\tempDir-001\node1
   C:\Users\jenkins\workspace\Lucene-Solr-7.x-Windows\solr\build\solr-core\test\J0\temp\solr.search.mlt.CloudMLTQParserTest_EAC1A3309403F2A5-001\tempDir-001: java.nio.file.DirectoryNotEmptyException: C:\Users\jenkins\workspace\Lucene-Solr-7.x-Windows\solr\build\solr-core\test\J0\temp\solr.search.mlt.CloudMLTQParserTest_EAC1A3309403F2A5-001\tempDir-001
   C:\Users\jenkins\workspace\Lucene-Solr-7.x-Windows\solr\build\solr-core\test\J0\temp\solr.search.mlt.CloudMLTQParserTest_EAC1A3309403F2A5-001\tempDir-001\node1\mlt-collection_shard1_replica_n1\data\tlog\tlog.0000000000000000000: java.nio.file.AccessDeniedException: C:\Users\jenkins\workspace\Lucene-Solr-7.x-Windows\solr\build\solr-core\test\J0\temp\solr.search.mlt.CloudMLTQParserTest_EAC1A3309403F2A5-001\tempDir-001\node1\mlt-collection_shard1_replica_n1\data\tlog\tlog.0000000000000000000
   C:\Users\jenkins\workspace\Lucene-Solr-7.x-Windows\solr\build\solr-core\test\J0\temp\solr.search.mlt.CloudMLTQParserTest_EAC1A3309403F2A5-001: java.nio.file.DirectoryNotEmptyException: C:\Users\jenkins\workspace\Lucene-Solr-7.x-Windows\solr\build\solr-core\test\J0\temp\solr.search.mlt.CloudMLTQParserTest_EAC1A3309403F2A5-001

	at __randomizedtesting.SeedInfo.seed([EAC1A3309403F2A5]:0)
	at org.apache.lucene.util.IOUtils.rm(IOUtils.java:329)
	at org.apache.lucene.util.TestRuleTemporaryFilesCleanup.afterAlways(TestRuleTemporaryFilesCleanup.java:216)
	at com.carrotsearch.randomizedtesting.rules.TestRuleAdapter$1.afterAlways(TestRuleAdapter.java:31)
	at com.carrotsearch.randomizedtesting.rules.StatementAdapter.evaluate(StatementAdapter.java:43)
	at com.carrotsearch.randomizedtesting.rules.StatementAdapter.evaluate(StatementAdapter.java:36)
	at org.apache.lucene.util.TestRuleAssertionsRequired$1.evaluate(TestRuleAssertionsRequired.java:53)
	at org.apache.lucene.util.TestRuleMarkFailure$1.evaluate(TestRuleMarkFailure.java:47)
	at org.apache.lucene.util.TestRuleIgnoreAfterMaxFailures$1.evaluate(TestRuleIgnoreAfterMaxFailures.java:64)
	at org.apache.lucene.util.TestRuleIgnoreTestSuites$1.evaluate(TestRuleIgnoreTestSuites.java:54)
	at com.carrotsearch.randomizedtesting.rules.StatementAdapter.evaluate(StatementAdapter.java:36)
	at com.carrotsearch.randomizedtesting.ThreadLeakControl$StatementRunner.run(ThreadLeakControl.java:368)
	at java.lang.Thread.run(Thread.java:748)


FAILED:  junit.framework.TestSuite.org.apache.solr.update.processor.TestOpenNLPExtractNamedEntitiesUpdateProcessorFactory

Error Message:
Could not remove the following files (in the order of attempts):    C:\Users\jenkins\workspace\Lucene-Solr-7.x-Windows\solr\build\contrib\solr-analysis-extras\test\J1\temp\solr.update.processor.TestOpenNLPExtractNamedEntitiesUpdateProcessorFactory_686308EBCC0223C-001\tempDir-001\collection1\conf: java.nio.file.DirectoryNotEmptyException: C:\Users\jenkins\workspace\Lucene-Solr-7.x-Windows\solr\build\contrib\solr-analysis-extras\test\J1\temp\solr.update.processor.TestOpenNLPExtractNamedEntitiesUpdateProcessorFactory_686308EBCC0223C-001\tempDir-001\collection1\conf    C:\Users\jenkins\workspace\Lucene-Solr-7.x-Windows\solr\build\contrib\solr-analysis-extras\test\J1\temp\solr.update.processor.TestOpenNLPExtractNamedEntitiesUpdateProcessorFactory_686308EBCC0223C-001\tempDir-001\collection1: java.nio.file.DirectoryNotEmptyException: C:\Users\jenkins\workspace\Lucene-Solr-7.x-Windows\solr\build\contrib\solr-analysis-extras\test\J1\temp\solr.update.processor.TestOpenNLPExtractNamedEntitiesUpdateProcessorFactory_686308EBCC0223C-001\tempDir-001\collection1    C:\Users\jenkins\workspace\Lucene-Solr-7.x-Windows\solr\build\contrib\solr-analysis-extras\test\J1\temp\solr.update.processor.TestOpenNLPExtractNamedEntitiesUpdateProcessorFactory_686308EBCC0223C-001\tempDir-001: java.nio.file.DirectoryNotEmptyException: C:\Users\jenkins\workspace\Lucene-Solr-7.x-Windows\solr\build\contrib\solr-analysis-extras\test\J1\temp\solr.update.processor.TestOpenNLPExtractNamedEntitiesUpdateProcessorFactory_686308EBCC0223C-001\tempDir-001    C:\Users\jenkins\workspace\Lucene-Solr-7.x-Windows\solr\build\contrib\solr-analysis-extras\test\J1\temp\solr.update.processor.TestOpenNLPExtractNamedEntitiesUpdateProcessorFactory_686308EBCC0223C-001\tempDir-001\collection1\conf\en-test-sent.bin: java.nio.file.AccessDeniedException: C:\Users\jenkins\workspace\Lucene-Solr-7.x-Windows\solr\build\contrib\solr-analysis-extras\test\J1\temp\solr.update.processor.TestOpenNLPExtractNamedEntitiesUpdateProcessorFactory_686308EBCC0223C-001\tempDir-001\collection1\conf\en-test-sent.bin    C:\Users\jenkins\workspace\Lucene-Solr-7.x-Windows\solr\build\contrib\solr-analysis-extras\test\J1\temp\solr.update.processor.TestOpenNLPExtractNamedEntitiesUpdateProcessorFactory_686308EBCC0223C-001\tempDir-001\collection1\conf\en-test-ner-person.bin: java.nio.file.AccessDeniedException: C:\Users\jenkins\workspace\Lucene-Solr-7.x-Windows\solr\build\contrib\solr-analysis-extras\test\J1\temp\solr.update.processor.TestOpenNLPExtractNamedEntitiesUpdateProcessorFactory_686308EBCC0223C-001\tempDir-001\collection1\conf\en-test-ner-person.bin    C:\Users\jenkins\workspace\Lucene-Solr-7.x-Windows\solr\build\contrib\solr-analysis-extras\test\J1\temp\solr.update.processor.TestOpenNLPExtractNamedEntitiesUpdateProcessorFactory_686308EBCC0223C-001\tempDir-001\collection1\conf\en-test-tokenizer.bin: java.nio.file.AccessDeniedException: C:\Users\jenkins\workspace\Lucene-Solr-7.x-Windows\solr\build\contrib\solr-analysis-extras\test\J1\temp\solr.update.processor.TestOpenNLPExtractNamedEntitiesUpdateProcessorFactory_686308EBCC0223C-001\tempDir-001\collection1\conf\en-test-tokenizer.bin    C:\Users\jenkins\workspace\Lucene-Solr-7.x-Windows\solr\build\contrib\solr-analysis-extras\test\J1\temp\solr.update.processor.TestOpenNLPExtractNamedEntitiesUpdateProcessorFactory_686308EBCC0223C-001: java.nio.file.DirectoryNotEmptyException: C:\Users\jenkins\workspace\Lucene-Solr-7.x-Windows\solr\build\contrib\solr-analysis-extras\test\J1\temp\solr.update.processor.TestOpenNLPExtractNamedEntitiesUpdateProcessorFactory_686308EBCC0223C-001 

Stack Trace:
java.io.IOException: Could not remove the following files (in the order of attempts):
   C:\Users\jenkins\workspace\Lucene-Solr-7.x-Windows\solr\build\contrib\solr-analysis-extras\test\J1\temp\solr.update.processor.TestOpenNLPExtractNamedEntitiesUpdateProcessorFactory_686308EBCC0223C-001\tempDir-001\collection1\conf: java.nio.file.DirectoryNotEmptyException: C:\Users\jenkins\workspace\Lucene-Solr-7.x-Windows\solr\build\contrib\solr-analysis-extras\test\J1\temp\solr.update.processor.TestOpenNLPExtractNamedEntitiesUpdateProcessorFactory_686308EBCC0223C-001\tempDir-001\collection1\conf
   C:\Users\jenkins\workspace\Lucene-Solr-7.x-Windows\solr\build\contrib\solr-analysis-extras\test\J1\temp\solr.update.processor.TestOpenNLPExtractNamedEntitiesUpdateProcessorFactory_686308EBCC0223C-001\tempDir-001\collection1: java.nio.file.DirectoryNotEmptyException: C:\Users\jenkins\workspace\Lucene-Solr-7.x-Windows\solr\build\contrib\solr-analysis-extras\test\J1\temp\solr.update.processor.TestOpenNLPExtractNamedEntitiesUpdateProcessorFactory_686308EBCC0223C-001\tempDir-001\collection1
   C:\Users\jenkins\workspace\Lucene-Solr-7.x-Windows\solr\build\contrib\solr-analysis-extras\test\J1\temp\solr.update.processor.TestOpenNLPExtractNamedEntitiesUpdateProcessorFactory_686308EBCC0223C-001\tempDir-001: java.nio.file.DirectoryNotEmptyException: C:\Users\jenkins\workspace\Lucene-Solr-7.x-Windows\solr\build\contrib\solr-analysis-extras\test\J1\temp\solr.update.processor.TestOpenNLPExtractNamedEntitiesUpdateProcessorFactory_686308EBCC0223C-001\tempDir-001
   C:\Users\jenkins\workspace\Lucene-Solr-7.x-Windows\solr\build\contrib\solr-analysis-extras\test\J1\temp\solr.update.processor.TestOpenNLPExtractNamedEntitiesUpdateProcessorFactory_686308EBCC0223C-001\tempDir-001\collection1\conf\en-test-sent.bin: java.nio.file.AccessDeniedException: C:\Users\jenkins\workspace\Lucene-Solr-7.x-Windows\solr\build\contrib\solr-analysis-extras\test\J1\temp\solr.update.processor.TestOpenNLPExtractNamedEntitiesUpdateProcessorFactory_686308EBCC0223C-001\tempDir-001\collection1\conf\en-test-sent.bin
   C:\Users\jenkins\workspace\Lucene-Solr-7.x-Windows\solr\build\contrib\solr-analysis-extras\test\J1\temp\solr.update.processor.TestOpenNLPExtractNamedEntitiesUpdateProcessorFactory_686308EBCC0223C-001\tempDir-001\collection1\conf\en-test-ner-person.bin: java.nio.file.AccessDeniedException: C:\Users\jenkins\workspace\Lucene-Solr-7.x-Windows\solr\build\contrib\solr-analysis-extras\test\J1\temp\solr.update.processor.TestOpenNLPExtractNamedEntitiesUpdateProcessorFactory_686308EBCC0223C-001\tempDir-001\collection1\conf\en-test-ner-person.bin
   C:\Users\jenkins\workspace\Lucene-Solr-7.x-Windows\solr\build\contrib\solr-analysis-extras\test\J1\temp\solr.update.processor.TestOpenNLPExtractNamedEntitiesUpdateProcessorFactory_686308EBCC0223C-001\tempDir-001\collection1\conf\en-test-tokenizer.bin: java.nio.file.AccessDeniedException: C:\Users\jenkins\workspace\Lucene-Solr-7.x-Windows\solr\build\contrib\solr-analysis-extras\test\J1\temp\solr.update.processor.TestOpenNLPExtractNamedEntitiesUpdateProcessorFactory_686308EBCC0223C-001\tempDir-001\collection1\conf\en-test-tokenizer.bin
   C:\Users\jenkins\workspace\Lucene-Solr-7.x-Windows\solr\build\contrib\solr-analysis-extras\test\J1\temp\solr.update.processor.TestOpenNLPExtractNamedEntitiesUpdateProcessorFactory_686308EBCC0223C-001: java.nio.file.DirectoryNotEmptyException: C:\Users\jenkins\workspace\Lucene-Solr-7.x-Windows\solr\build\contrib\solr-analysis-extras\test\J1\temp\solr.update.processor.TestOpenNLPExtractNamedEntitiesUpdateProcessorFactory_686308EBCC0223C-001

	at __randomizedtesting.SeedInfo.seed([686308EBCC0223C]:0)
	at org.apache.lucene.util.IOUtils.rm(IOUtils.java:329)
	at org.apache.lucene.util.TestRuleTemporaryFilesCleanup.afterAlways(TestRuleTemporaryFilesCleanup.java:216)
	at com.carrotsearch.randomizedtesting.rules.TestRuleAdapter$1.afterAlways(TestRuleAdapter.java:31)
	at com.carrotsearch.randomizedtesting.rules.StatementAdapter.evaluate(StatementAdapter.java:43)
	at com.carrotsearch.randomizedtesting.rules.StatementAdapter.evaluate(StatementAdapter.java:36)
	at org.apache.lucene.util.TestRuleAssertionsRequired$1.evaluate(TestRuleAssertionsRequired.java:53)
	at org.apache.lucene.util.TestRuleMarkFailure$1.evaluate(TestRuleMarkFailure.java:47)
	at org.apache.lucene.util.TestRuleIgnoreAfterMaxFailures$1.evaluate(TestRuleIgnoreAfterMaxFailures.java:64)
	at org.apache.lucene.util.TestRuleIgnoreTestSuites$1.evaluate(TestRuleIgnoreTestSuites.java:54)
	at com.carrotsearch.randomizedtesting.rules.StatementAdapter.evaluate(StatementAdapter.java:36)
	at com.carrotsearch.randomizedtesting.ThreadLeakControl$StatementRunner.run(ThreadLeakControl.java:368)
	at java.lang.Thread.run(Thread.java:748)




Build Log:
[...truncated 8885 lines...]
   [junit4] Suite: org.apache.lucene.replicator.IndexAndTaxonomyReplicationClientTest
   [junit4]   2> dic 18, 2017 2:57:56 PM com.carrotsearch.randomizedtesting.RandomizedRunner$QueueUncaughtExceptionsHandler uncaughtException
   [junit4]   2> ADVERTENCIA: Uncaught exception in thread: Thread[ReplicationThread-indexAndTaxo,5,TGRP-IndexAndTaxonomyReplicationClientTest]
   [junit4]   2> java.lang.AssertionError: handler failed too many times: -1
   [junit4]   2> 	at __randomizedtesting.SeedInfo.seed([ECBFD4653FFEAAA3]:0)
   [junit4]   2> 	at org.apache.lucene.replicator.IndexAndTaxonomyReplicationClientTest$4.handleUpdateException(IndexAndTaxonomyReplicationClientTest.java:422)
   [junit4]   2> 	at org.apache.lucene.replicator.ReplicationClient$ReplicationThread.run(ReplicationClient.java:77)
   [junit4]   2> 
   [junit4]   2> NOTE: reproduce with: ant test  -Dtestcase=IndexAndTaxonomyReplicationClientTest -Dtests.method=testConsistencyOnExceptions -Dtests.seed=ECBFD4653FFEAAA3 -Dtests.slow=true -Dtests.locale=es-MX -Dtests.timezone=Asia/Urumqi -Dtests.asserts=true -Dtests.file.encoding=Cp1252
   [junit4] ERROR   3.38s J1 | IndexAndTaxonomyReplicationClientTest.testConsistencyOnExceptions <<<
   [junit4]    > Throwable #1: com.carrotsearch.randomizedtesting.UncaughtExceptionError: Captured an uncaught exception in thread: Thread[id=18, name=ReplicationThread-indexAndTaxo, state=RUNNABLE, group=TGRP-IndexAndTaxonomyReplicationClientTest]
   [junit4]    > 	at __randomizedtesting.SeedInfo.seed([ECBFD4653FFEAAA3:633133C52D92595C]:0)
   [junit4]    > Caused by: java.lang.AssertionError: handler failed too many times: -1
   [junit4]    > 	at __randomizedtesting.SeedInfo.seed([ECBFD4653FFEAAA3]:0)
   [junit4]    > 	at org.apache.lucene.replicator.IndexAndTaxonomyReplicationClientTest$4.handleUpdateException(IndexAndTaxonomyReplicationClientTest.java:422)
   [junit4]    > 	at org.apache.lucene.replicator.ReplicationClient$ReplicationThread.run(ReplicationClient.java:77)
   [junit4]   2> NOTE: test params are: codec=Asserting(Lucene70): {$full_path$=PostingsFormat(name=LuceneVarGapFixedInterval), $facets=FST50, $payloads$=PostingsFormat(name=LuceneVarGapFixedInterval)}, docValues:{$facets=DocValuesFormat(name=Memory)}, maxPointsInLeafNode=723, maxMBSortInHeap=5.34173506536652, sim=RandomSimilarity(queryNorm=false): {}, locale=es-MX, timezone=Asia/Urumqi
   [junit4]   2> NOTE: Windows 10 10.0 amd64/Oracle Corporation 1.8.0_144 (64-bit)/cpus=3,threads=1,free=68573736,total=100663296
   [junit4]   2> NOTE: All tests run in this JVM: [IndexAndTaxonomyRevisionTest, SessionTokenTest, IndexAndTaxonomyReplicationClientTest]
   [junit4] Completed [4/9 (1!)] on J1 in 4.68s, 5 tests, 1 error <<< FAILURES!

[...truncated 3838 lines...]
   [junit4] Suite: org.apache.solr.search.mlt.CloudMLTQParserTest
   [junit4]   2> 1469174 INFO  (SUITE-CloudMLTQParserTest-seed#[EAC1A3309403F2A5]-worker) [    ] o.a.s.SolrTestCaseJ4 SecureRandom sanity checks: test.solr.allowed.securerandom=null & java.security.egd=file:/dev/./urandom
   [junit4]   2> Creating dataDir: C:\Users\jenkins\workspace\Lucene-Solr-7.x-Windows\solr\build\solr-core\test\J0\temp\solr.search.mlt.CloudMLTQParserTest_EAC1A3309403F2A5-001\init-core-data-001
   [junit4]   2> 1469204 WARN  (SUITE-CloudMLTQParserTest-seed#[EAC1A3309403F2A5]-worker) [    ] o.a.s.SolrTestCaseJ4 startTrackingSearchers: numOpens=28 numCloses=28
   [junit4]   2> 1469204 INFO  (SUITE-CloudMLTQParserTest-seed#[EAC1A3309403F2A5]-worker) [    ] o.a.s.SolrTestCaseJ4 Using PointFields (NUMERIC_POINTS_SYSPROP=true) w/NUMERIC_DOCVALUES_SYSPROP=false
   [junit4]   2> 1469224 INFO  (SUITE-CloudMLTQParserTest-seed#[EAC1A3309403F2A5]-worker) [    ] o.a.s.SolrTestCaseJ4 Randomized ssl (false) and clientAuth (false) via: @org.apache.solr.util.RandomizeSSL(reason=, value=NaN, ssl=NaN, clientAuth=NaN)
   [junit4]   2> 1469228 INFO  (SUITE-CloudMLTQParserTest-seed#[EAC1A3309403F2A5]-worker) [    ] o.a.s.c.MiniSolrCloudCluster Starting cluster of 2 servers in C:\Users\jenkins\workspace\Lucene-Solr-7.x-Windows\solr\build\solr-core\test\J0\temp\solr.search.mlt.CloudMLTQParserTest_EAC1A3309403F2A5-001\tempDir-001
   [junit4]   2> 1469228 INFO  (SUITE-CloudMLTQParserTest-seed#[EAC1A3309403F2A5]-worker) [    ] o.a.s.c.ZkTestServer STARTING ZK TEST SERVER
   [junit4]   2> 1469229 INFO  (Thread-2595) [    ] o.a.s.c.ZkTestServer client port:0.0.0.0/0.0.0.0:0
   [junit4]   2> 1469229 INFO  (Thread-2595) [    ] o.a.s.c.ZkTestServer Starting server
   [junit4]   2> 1469231 ERROR (Thread-2595) [    ] o.a.z.s.ZooKeeperServer ZKShutdownHandler is not registered, so ZooKeeper server won't take any action on ERROR or SHUTDOWN server state changes
   [junit4]   2> 1469328 INFO  (SUITE-CloudMLTQParserTest-seed#[EAC1A3309403F2A5]-worker) [    ] o.a.s.c.ZkTestServer start zk server on port:60355
   [junit4]   2> 1469332 INFO  (zkConnectionManagerCallback-2838-thread-1) [    ] o.a.s.c.c.ConnectionManager zkClient has connected
   [junit4]   2> 1469334 WARN  (NIOServerCxn.Factory:0.0.0.0/0.0.0.0:0) [    ] o.a.z.s.NIOServerCnxn caught end of stream exception
   [junit4]   2> EndOfStreamException: Unable to read additional data from client sessionid 0x16068f110e80000, likely client has closed socket
   [junit4]   2> 	at org.apache.zookeeper.server.NIOServerCnxn.doIO(NIOServerCnxn.java:239)
   [junit4]   2> 	at org.apache.zookeeper.server.NIOServerCnxnFactory.run(NIOServerCnxnFactory.java:203)
   [junit4]   2> 	at java.lang.Thread.run(Thread.java:748)
   [junit4]   2> 1469336 INFO  (jetty-launcher-2835-thread-2) [    ] o.e.j.s.Server jetty-9.3.20.v20170531
   [junit4]   2> 1469337 INFO  (jetty-launcher-2835-thread-2) [    ] o.e.j.s.h.ContextHandler Started o.e.j.s.ServletContextHandler@a23bc86{/solr,null,AVAILABLE}
   [junit4]   2> 1469336 INFO  (jetty-launcher-2835-thread-1) [    ] o.e.j.s.Server jetty-9.3.20.v20170531
   [junit4]   2> 1469337 INFO  (jetty-launcher-2835-thread-1) [    ] o.e.j.s.h.ContextHandler Started o.e.j.s.ServletContextHandler@40bcacb4{/solr,null,AVAILABLE}
   [junit4]   2> 1469338 INFO  (jetty-launcher-2835-thread-1) [    ] o.e.j.s.AbstractConnector Started ServerConnector@705532a5{HTTP/1.1,[http/1.1]}{127.0.0.1:60362}
   [junit4]   2> 1469338 INFO  (jetty-launcher-2835-thread-1) [    ] o.e.j.s.Server Started @1478598ms
   [junit4]   2> 1469338 INFO  (jetty-launcher-2835-thread-1) [    ] o.a.s.c.s.e.JettySolrRunner Jetty properties: {hostContext=/solr, hostPort=60362}
   [junit4]   2> 1469346 INFO  (jetty-launcher-2835-thread-2) [    ] o.e.j.s.AbstractConnector Started ServerConnector@195baef2{HTTP/1.1,[http/1.1]}{127.0.0.1:60359}
   [junit4]   2> 1469346 INFO  (jetty-launcher-2835-thread-2) [    ] o.e.j.s.Server Started @1478606ms
   [junit4]   2> 1469346 INFO  (jetty-launcher-2835-thread-2) [    ] o.a.s.c.s.e.JettySolrRunner Jetty properties: {hostContext=/solr, hostPort=60359}
   [junit4]   2> 1469346 ERROR (jetty-launcher-2835-thread-2) [    ] o.a.s.u.StartupLoggingUtils Missing Java Option solr.log.dir. Logging may be missing or incomplete.
   [junit4]   2> 1469346 ERROR (jetty-launcher-2835-thread-1) [    ] o.a.s.u.StartupLoggingUtils Missing Java Option solr.log.dir. Logging may be missing or incomplete.
   [junit4]   2> 1469346 INFO  (jetty-launcher-2835-thread-2) [    ] o.a.s.s.SolrDispatchFilter  ___      _       Welcome to Apache Solr™ version 7.3.0
   [junit4]   2> 1469346 INFO  (jetty-launcher-2835-thread-1) [    ] o.a.s.s.SolrDispatchFilter  ___      _       Welcome to Apache Solr™ version 7.3.0
   [junit4]   2> 1469346 INFO  (jetty-launcher-2835-thread-2) [    ] o.a.s.s.SolrDispatchFilter / __| ___| |_ _   Starting in cloud mode on port null
   [junit4]   2> 1469346 INFO  (jetty-launcher-2835-thread-1) [    ] o.a.s.s.SolrDispatchFilter / __| ___| |_ _   Starting in cloud mode on port null
   [junit4]   2> 1469346 INFO  (jetty-launcher-2835-thread-2) [    ] o.a.s.s.SolrDispatchFilter \__ \/ _ \ | '_|  Install dir: null
   [junit4]   2> 1469346 INFO  (jetty-launcher-2835-thread-1) [    ] o.a.s.s.SolrDispatchFilter \__ \/ _ \ | '_|  Install dir: null
   [junit4]   2> 1469346 INFO  (jetty-launcher-2835-thread-2) [    ] o.a.s.s.SolrDispatchFilter |___/\___/_|_|    Start time: 2017-12-18T09:25:17.275Z
   [junit4]   2> 1469346 INFO  (jetty-launcher-2835-thread-1) [    ] o.a.s.s.SolrDispatchFilter |___/\___/_|_|    Start time: 2017-12-18T09:25:17.275Z
   [junit4]   2> 1469352 INFO  (zkConnectionManagerCallback-2841-thread-1) [    ] o.a.s.c.c.ConnectionManager zkClient has connected
   [junit4]   2> 1469353 INFO  (jetty-launcher-2835-thread-1) [    ] o.a.s.s.SolrDispatchFilter solr.xml found in ZooKeeper. Loading...
   [junit4]   2> 1469382 INFO  (zkConnectionManagerCallback-2842-thread-1) [    ] o.a.s.c.c.ConnectionManager zkClient has connected
   [junit4]   2> 1469384 INFO  (jetty-launcher-2835-thread-2) [    ] o.a.s.s.SolrDispatchFilter solr.xml found in ZooKeeper. Loading...
   [junit4]   2> 1469389 INFO  (jetty-launcher-2835-thread-1) [    ] o.a.s.c.ZkContainer Zookeeper client=127.0.0.1:60355/solr
   [junit4]   2> 1469389 WARN  (NIOServerCxn.Factory:0.0.0.0/0.0.0.0:0) [    ] o.a.z.s.NIOServerCnxn caught end of stream exception
   [junit4]   2> EndOfStreamException: Unable to read additional data from client sessionid 0x16068f110e80002, likely client has closed socket
   [junit4]   2> 	at org.apache.zookeeper.server.NIOServerCnxn.doIO(NIOServerCnxn.java:239)
   [junit4]   2> 	at org.apache.zookeeper.server.NIOServerCnxnFactory.run(NIOServerCnxnFactory.java:203)
   [junit4]   2> 	at java.lang.Thread.run(Thread.java:748)
   [junit4]   2> 1469394 INFO  (jetty-launcher-2835-thread-2) [    ] o.a.s.c.ZkContainer Zookeeper client=127.0.0.1:60355/solr
   [junit4]   2> 1469396 INFO  (zkConnectionManagerCallback-2846-thread-1) [    ] o.a.s.c.c.ConnectionManager zkClient has connected
   [junit4]   2> 1469398 WARN  (NIOServerCxn.Factory:0.0.0.0/0.0.0.0:0) [    ] o.a.z.s.NIOServerCnxn caught end of stream exception
   [junit4]   2> EndOfStreamException: Unable to read additional data from client sessionid 0x16068f110e80003, likely client has closed socket
   [junit4]   2> 	at org.apache.zookeeper.server.NIOServerCnxn.doIO(NIOServerCnxn.java:239)
   [junit4]   2> 	at org.apache.zookeeper.server.NIOServerCnxnFactory.run(NIOServerCnxnFactory.java:203)
   [junit4]   2> 	at java.lang.Thread.run(Thread.java:748)
   [junit4]   2> 1469399 INFO  (zkConnectionManagerCallback-2850-thread-1) [    ] o.a.s.c.c.ConnectionManager zkClient has connected
   [junit4]   2> 1469400 WARN  (NIOServerCxn.Factory:0.0.0.0/0.0.0.0:0) [    ] o.a.z.s.NIOServerCnxn caught end of stream exception
   [junit4]   2> EndOfStreamException: Unable to read additional data from client sessionid 0x16068f110e80004, likely client has closed socket
   [junit4]   2> 	at org.apache.zookeeper.server.NIOServerCnxn.doIO(NIOServerCnxn.java:239)
   [junit4]   2> 	at org.apache.zookeeper.server.NIOServerCnxnFactory.run(NIOServerCnxnFactory.java:203)
   [junit4]   2> 	at java.lang.Thread.run(Thread.java:748)
   [junit4]   2> 1469402 INFO  (zkConnectionManagerCallback-2852-thread-1-processing-n:127.0.0.1:60362_solr) [n:127.0.0.1:60362_solr    ] o.a.s.c.c.ConnectionManager zkClient has connected
   [junit4]   2> 1469403 INFO  (zkConnectionManagerCallback-2854-thread-1-processing-n:127.0.0.1:60359_solr) [n:127.0.0.1:60359_solr    ] o.a.s.c.c.ConnectionManager zkClient has connected
   [junit4]   2> 1469612 INFO  (jetty-launcher-2835-thread-2) [n:127.0.0.1:60359_solr    ] o.a.s.c.Overseer Overseer (id=null) closing
   [junit4]   2> 1469612 INFO  (jetty-launcher-2835-thread-1) [n:127.0.0.1:60362_solr    ] o.a.s.c.Overseer Overseer (id=null) closing
   [junit4]   2> 1469612 INFO  (jetty-launcher-2835-thread-2) [n:127.0.0.1:60359_solr    ] o.a.s.c.OverseerElectionContext I am going to be the leader 127.0.0.1:60359_solr
   [junit4]   2> 1469613 INFO  (jetty-launcher-2835-thread-1) [n:127.0.0.1:60362_solr    ] o.a.s.c.ZkController Register node as live in ZooKeeper:/live_nodes/127.0.0.1:60362_solr
   [junit4]   2> 1469614 INFO  (jetty-launcher-2835-thread-2) [n:127.0.0.1:60359_solr    ] o.a.s.c.Overseer Overseer (id=99194576382197766-127.0.0.1:60359_solr-n_0000000000) starting
   [junit4]   2> 1469619 INFO  (jetty-launcher-2835-thread-2) [n:127.0.0.1:60359_solr    ] o.a.s.c.ZkController Register node as live in ZooKeeper:/live_nodes/127.0.0.1:60359_solr
   [junit4]   2> 1469634 INFO  (zkCallback-2851-thread-1-processing-n:127.0.0.1:60362_solr) [n:127.0.0.1:60362_solr    ] o.a.s.c.c.ZkStateReader Updated live nodes from ZooKeeper... (0) -> (2)
   [junit4]   2> 1469636 INFO  (zkCallback-2853-thread-1-processing-n:127.0.0.1:60359_solr) [n:127.0.0.1:60359_solr    ] o.a.s.c.c.ZkStateReader Updated live nodes from ZooKeeper... (0) -> (2)
   [junit4]   2> 1469725 INFO  (jetty-launcher-2835-thread-1) [n:127.0.0.1:60362_solr    ] o.a.s.m.r.SolrJmxReporter JMX monitoring for 'solr_60362.solr.node' (registry 'solr.node') enabled at server: com.sun.jmx.mbeanserver.JmxMBeanServer@319c5277
   [junit4]   2> 1469739 INFO  (jetty-launcher-2835-thread-1) [n:127.0.0.1:60362_solr    ] o.a.s.m.r.SolrJmxReporter JMX monitoring for 'solr_60362.solr.jvm' (registry 'solr.jvm') enabled at server: com.sun.jmx.mbeanserver.JmxMBeanServer@319c5277
   [junit4]   2> 1469739 INFO  (jetty-launcher-2835-thread-1) [n:127.0.0.1:60362_solr    ] o.a.s.m.r.SolrJmxReporter JMX monitoring for 'solr_60362.solr.jetty' (registry 'solr.jetty') enabled at server: com.sun.jmx.mbeanserver.JmxMBeanServer@319c5277
   [junit4]   2> 1469740 INFO  (jetty-launcher-2835-thread-2) [n:127.0.0.1:60359_solr    ] o.a.s.m.r.SolrJmxReporter JMX monitoring for 'solr_60359.solr.node' (registry 'solr.node') enabled at server: com.sun.jmx.mbeanserver.JmxMBeanServer@319c5277
   [junit4]   2> 1469742 INFO  (jetty-launcher-2835-thread-1) [n:127.0.0.1:60362_solr    ] o.a.s.c.CorePropertiesLocator Found 0 core definitions underneath C:\Users\jenkins\workspace\Lucene-Solr-7.x-Windows\solr\build\solr-core\test\J0\temp\solr.search.mlt.CloudMLTQParserTest_EAC1A3309403F2A5-001\tempDir-001\node1\.
   [junit4]   2> 1469747 INFO  (jetty-launcher-2835-thread-2) [n:127.0.0.1:60359_solr    ] o.a.s.m.r.SolrJmxReporter JMX monitoring for 'solr_60359.solr.jvm' (registry 'solr.jvm') enabled at server: com.sun.jmx.mbeanserver.JmxMBeanServer@319c5277
   [junit4]   2> 1469747 INFO  (jetty-launcher-2835-thread-2) [n:127.0.0.1:60359_solr    ] o.a.s.m.r.SolrJmxReporter JMX monitoring for 'solr_60359.solr.jetty' (registry 'solr.jetty') enabled at server: com.sun.jmx.mbeanserver.JmxMBeanServer@319c5277
   [junit4]   2> 1469749 INFO  (jetty-launcher-2835-thread-2) [n:127.0.0.1:60359_solr    ] o.a.s.c.CorePropertiesLocator Found 0 core definitions underneath C:\Users\jenkins\workspace\Lucene-Solr-7.x-Windows\solr\build\solr-core\test\J0\temp\solr.search.mlt.CloudMLTQParserTest_EAC1A3309403F2A5-001\tempDir-001\node2\.
   [junit4]   2> 1469800 INFO  (zkConnectionManagerCallback-2860-thread-1) [    ] o.a.s.c.c.ConnectionManager zkClient has connected
   [junit4]   2> 1469802 WARN  (NIOServerCxn.Factory:0.0.0.0/0.0.0.0:0) [    ] o.a.z.s.NIOServerCnxn caught end of stream exception
   [junit4]   2> EndOfStreamException: Unable to read additional data from client sessionid 0x16068f110e80007, likely client has closed socket
   [junit4]   2> 	at org.apache.zookeeper.server.NIOServerCnxn.doIO(NIOServerCnxn.java:239)
   [junit4]   2> 	at org.apache.zookeeper.server.NIOServerCnxnFactory.run(NIOServerCnxnFactory.java:203)
   [junit4]   2> 	at java.lang.Thread.run(Thread.java:748)
   [junit4]   2> 1469806 INFO  (zkConnectionManagerCallback-2864-thread-1) [    ] o.a.s.c.c.ConnectionManager zkClient has connected
   [junit4]   2> 1469807 INFO  (SUITE-CloudMLTQParserTest-seed#[EAC1A3309403F2A5]-worker) [    ] o.a.s.c.c.ZkStateReader Updated live nodes from ZooKeeper... (0) -> (2)
   [junit4]   2> 1469807 INFO  (SUITE-CloudMLTQParserTest-seed#[EAC1A3309403F2A5]-worker) [    ] o.a.s.c.s.i.ZkClientClusterStateProvider Cluster at 127.0.0.1:60355/solr ready
   [junit4]   2> 1469815 INFO  (qtp1560330866-12017) [n:127.0.0.1:60359_solr    ] o.a.s.h.a.CollectionsHandler Invoked Collection Action :create with params async=593c880c-b41b-456d-8395-d3e4f8262853&replicationFactor=1&collection.configName=conf&name=mlt-collection&nrtReplicas=1&action=CREATE&numShards=2&wt=javabin&version=2 and sendToOCPQueue=true
   [junit4]   2> 1469816 INFO  (qtp1560330866-12017) [n:127.0.0.1:60359_solr    ] o.a.s.s.HttpSolrCall [admin] webapp=null path=/admin/collections params={async=593c880c-b41b-456d-8395-d3e4f8262853&replicationFactor=1&collection.configName=conf&name=mlt-collection&nrtReplicas=1&action=CREATE&numShards=2&wt=javabin&version=2} status=0 QTime=1
   [junit4]   2> 1469817 INFO  (qtp1560330866-12016) [n:127.0.0.1:60359_solr    ] o.a.s.h.a.CollectionsHandler Invoked Collection Action :requeststatus with params requestid=593c880c-b41b-456d-8395-d3e4f8262853&action=REQUESTSTATUS&wt=javabin&version=2 and sendToOCPQueue=true
   [junit4]   2> 1469819 INFO  (qtp1560330866-12016) [n:127.0.0.1:60359_solr    ] o.a.s.s.HttpSolrCall [admin] webapp=null path=/admin/collections params={requestid=593c880c-b41b-456d-8395-d3e4f8262853&action=REQUESTSTATUS&wt=javabin&version=2} status=0 QTime=1
   [junit4]   2> 1469820 INFO  (OverseerThreadFactory-4814-thread-1-processing-n:127.0.0.1:60359_solr) [n:127.0.0.1:60359_solr    ] o.a.s.c.CreateCollectionCmd Create collection mlt-collection
   [junit4]   2> 1469949 INFO  (OverseerStateUpdate-99194576382197766-127.0.0.1:60359_solr-n_0000000000) [n:127.0.0.1:60359_solr    ] o.a.s.c.o.SliceMutator createReplica() {
   [junit4]   2>   "operation":"ADDREPLICA",
   [junit4]   2>   "collection":"mlt-collection",
   [junit4]   2>   "shard":"shard1",
   [junit4]   2>   "core":"mlt-collection_shard1_replica_n1",
   [junit4]   2>   "state":"down",
   [junit4]   2>   "base_url":"http://127.0.0.1:60362/solr",
   [junit4]   2>   "type":"NRT",
   [junit4]   2>   "waitForFinalState":"false"} 
   [junit4]   2> 1469950 INFO  (OverseerStateUpdate-99194576382197766-127.0.0.1:60359_solr-n_0000000000) [n:127.0.0.1:60359_solr    ] o.a.s.c.o.SliceMutator createReplica() {
   [junit4]   2>   "operation":"ADDREPLICA",
   [junit4]   2>   "collection":"mlt-collection",
   [junit4]   2>   "shard":"shard2",
   [junit4]   2>   "core":"mlt-collection_shard2_replica_n2",
   [junit4]   2>   "state":"down",
   [junit4]   2>   "base_url":"http://127.0.0.1:60359/solr",
   [junit4]   2>   "type":"NRT",
   [junit4]   2>   "waitForFinalState":"false"} 
   [junit4]   2> 1470154 INFO  (qtp158241983-12029) [n:127.0.0.1:60362_solr    ] o.a.s.s.HttpSolrCall [admin] webapp=null path=/admin/cores params={qt=/admin/cores&collection.configName=conf&newCollection=true&collection=mlt-collection&version=2&replicaType=NRT&async=593c880c-b41b-456d-8395-d3e4f82628531290253351412437&coreNodeName=core_node3&name=mlt-collection_shard1_replica_n1&action=CREATE&numShards=2&shard=shard1&wt=javabin} status=0 QTime=0
   [junit4]   2> 1470158 INFO  (parallelCoreAdminExecutor-4815-thread-1-processing-n:127.0.0.1:60362_solr 593c880c-b41b-456d-8395-d3e4f82628531290253351412437 CREATE) [n:127.0.0.1:60362_solr    ] o.a.s.h.a.CoreAdminOperation core create command qt=/admin/cores&collection.configName=conf&newCollection=true&collection=mlt-collection&version=2&replicaType=NRT&async=593c880c-b41b-456d-8395-d3e4f82628531290253351412437&coreNodeName=core_node3&name=mlt-collection_shard1_replica_n1&action=CREATE&numShards=2&shard=shard1&wt=javabin
   [junit4]   2> 1470159 INFO  (parallelCoreAdminExecutor-4815-thread-1-processing-n:127.0.0.1:60362_solr 593c880c-b41b-456d-8395-d3e4f82628531290253351412437 CREATE) [n:127.0.0.1:60362_solr    ] o.a.s.c.TransientSolrCoreCacheDefault Allocating transient cache for 2147483647 transient cores
   [junit4]   2> 1470160 INFO  (qtp1560330866-12015) [n:127.0.0.1:60359_solr    ] o.a.s.s.HttpSolrCall [admin] webapp=null path=/admin/cores params={qt=/admin/cores&collection.configName=conf&newCollection=true&collection=mlt-collection&version=2&replicaType=NRT&async=593c880c-b41b-456d-8395-d3e4f82628531290253354108687&coreNodeName=core_node4&name=mlt-collection_shard2_replica_n2&action=CREATE&numShards=2&shard=shard2&wt=javabin} status=0 QTime=0
   [junit4]   2> 1470162 INFO  (qtp158241983-12029) [n:127.0.0.1:60362_solr    ] o.a.s.h.a.CoreAdminOperation Checking request status for : 593c880c-b41b-456d-8395-d3e4f82628531290253351412437
   [junit4]   2> 1470162 INFO  (qtp158241983-12029) [n:127.0.0.1:60362_solr    ] o.a.s.s.HttpSolrCall [admin] webapp=null path=/admin/cores params={qt=/admin/cores&requestid=593c880c-b41b-456d-8395-d3e4f82628531290253351412437&action=REQUESTSTATUS&wt=javabin&version=2} status=0 QTime=0
   [junit4]   2> 1470167 INFO  (parallelCoreAdminExecutor-4816-thread-1-processing-n:127.0.0.1:60359_solr 593c880c-b41b-456d-8395-d3e4f82628531290253354108687 CREATE) [n:127.0.0.1:60359_solr    ] o.a.s.h.a.CoreAdminOperation core create command qt=/admin/cores&collection.configName=conf&newCollection=true&collection=mlt-collection&version=2&replicaType=NRT&async=593c880c-b41b-456d-8395-d3e4f82628531290253354108687&coreNodeName=core_node4&name=mlt-collection_shard2_replica_n2&action=CREATE&numShards=2&shard=shard2&wt=javabin
   [junit4]   2> 1470168 INFO  (parallelCoreAdminExecutor-4816-thread-1-processing-n:127.0.0.1:60359_solr 593c880c-b41b-456d-8395-d3e4f82628531290253354108687 CREATE) [n:127.0.0.1:60359_solr    ] o.a.s.c.TransientSolrCoreCacheDefault Allocating transient cache for 2147483647 transient cores
   [junit4]   2> 1470284 INFO  (zkCallback-2851-thread-1-processing-n:127.0.0.1:60362_solr) [n:127.0.0.1:60362_solr    ] o.a.s.c.c.ZkStateReader A cluster state change: [WatchedEvent state:SyncConnected type:NodeDataChanged path:/collections/mlt-collection/state.json] for collection [mlt-collection] has occurred - updating... (live nodes size: [2])
   [junit4]   2> 1470284 INFO  (zkCallback-2853-thread-1-processing-n:127.0.0.1:60359_solr) [n:127.0.0.1:60359_solr    ] o.a.s.c.c.ZkStateReader A cluster state change: [WatchedEvent state:SyncConnected type:NodeDataChanged path:/collections/mlt-collection/state.json] for collection [mlt-collection] has occurred - updating... (live nodes size: [2])
   [junit4]   2> 1470294 INFO  (zkCallback-2851-thread-2-processing-n:127.0.0.1:60362_solr) [n:127.0.0.1:60362_solr    ] o.a.s.c.c.ZkStateReader A cluster state change: [WatchedEvent state:SyncConnected type:NodeDataChanged path:/collections/mlt-collection/state.json] for collection [mlt-collection] has occurred - updating... (live nodes size: [2])
   [junit4]   2> 1470294 INFO  (zkCallback-2853-thread-2-processing-n:127.0.0.1:60359_solr) [n:127.0.0.1:60359_solr    ] o.a.s.c.c.ZkStateReader A cluster state change: [WatchedEvent state:SyncConnected type:NodeDataChanged path:/collections/mlt-collection/state.json] for collection [mlt-collection] has occurred - updating... (live nodes size: [2])
   [junit4]   2> 1470820 INFO  (qtp1560330866-12015) [n:127.0.0.1:60359_solr    ] o.a.s.h.a.CollectionsHandler Invoked Collection Action :requeststatus with params requestid=593c880c-b41b-456d-8395-d3e4f8262853&action=REQUESTSTATUS&wt=javabin&version=2 and sendToOCPQueue=true
   [junit4]   2> 1470822 INFO  (qtp1560330866-12015) [n:127.0.0.1:60359_solr    ] o.a.s.s.HttpSolrCall [admin] webapp=null path=/admin/collections params={requestid=593c880c-b41b-456d-8395-d3e4f8262853&action=REQUESTSTATUS&wt=javabin&version=2} status=0 QTime=2
   [junit4]   2> 1471164 INFO  (qtp158241983-12029) [n:127.0.0.1:60362_solr    ] o.a.s.h.a.CoreAdminOperation Checking request status for : 593c880c-b41b-456d-8395-d3e4f82628531290253351412437
   [junit4]   2> 1471164 INFO  (qtp158241983-12029) [n:127.0.0.1:60362_solr    ] o.a.s.s.HttpSolrCall [admin] webapp=null path=/admin/cores params={qt=/admin/cores&requestid=593c880c-b41b-456d-8395-d3e4f82628531290253351412437&action=REQUESTSTATUS&wt=javabin&version=2} status=0 QTime=0
   [junit4]   2> 1471185 INFO  (parallelCoreAdminExecutor-4815-thread-1-processing-n:127.0.0.1:60362_solr 593c880c-b41b-456d-8395-d3e4f82628531290253351412437 CREATE) [n:127.0.0.1:60362_solr c:mlt-collection s:shard1 r:core_node3 x:mlt-collection_shard1_replica_n1] o.a.s.c.SolrConfig Using Lucene MatchVersion: 7.3.0
   [junit4]   2> 1471199 INFO  (parallelCoreAdminExecutor-4815-thread-1-processing-n:127.0.0.1:60362_solr 593c880c-b41b-456d-8395-d3e4f82628531290253351412437 CREATE) [n:127.0.0.1:60362_solr c:mlt-collection s:shard1 r:core_node3 x:mlt-collection_shard1_replica_n1] o.a.s.s.IndexSchema [mlt-collection_shard1_replica_n1] Schema name=cloud-dynamic
   [junit4]   2> 1471253 INFO  (parallelCoreAdminExecutor-4816-thread-1-processing-n:127.0.0.1:60359_solr 593c880c-b41b-456d-8395-d3e4f82628531290253354108687 CREATE) [n:127.0.0.1:60359_solr c:mlt-collection s:shard2 r:core_node4 x:mlt-collection_shard2_replica_n2] o.a.s.c.SolrConfig Using Lucene MatchVersion: 7.3.0
   [junit4]   2> 1471255 INFO  (parallelCoreAdminExecutor-4815-thread-1-processing-n:127.0.0.1:60362_solr 593c880c-b41b-456d-8395-d3e4f82628531290253351412437 CREATE) [n:127.0.0.1:60362_solr c:mlt-collection s:shard1 r:core_node3 x:mlt-collection_shard1_replica_n1] o.a.s.s.IndexSchema Loaded schema cloud-dynamic/1.6 with uniqueid field id
   [junit4]   2> 1471255 INFO  (parallelCoreAdminExecutor-4815-thread-1-processing-n:127.0.0.1:60362_solr 593c880c-b41b-456d-8395-d3e4f82628531290253351412437 CREATE) [n:127.0.0.1:60362_solr c:mlt-collection s:shard1 r:core_node3 x:mlt-collection_shard1_replica_n1] o.a.s.c.CoreContainer Creating SolrCore 'mlt-collection_shard1_replica_n1' using configuration from collection mlt-collection, trusted=true
   [junit4]   2> 1471255 INFO  (parallelCoreAdminExecutor-4815-thread-1-processing-n:127.0.0.1:60362_solr 593c880c-b41b-456d-8395-d3e4f82628531290253351412437 CREATE) [n:127.0.0.1:60362_solr c:mlt-collection s:shard1 r:core_node3 x:mlt-collection_shard1_replica_n1] o.a.s.m.r.SolrJmxReporter JMX monitoring for 'solr_60362.solr.core.mlt-collection.shard1.replica_n1' (registry 'solr.core.mlt-collection.shard1.replica_n1') enabled at server: com.sun.jmx.mbeanserver.JmxMBeanServer@319c5277
   [junit4]   2> 1471255 INFO  (parallelCoreAdminExecutor-4815-thread-1-processing-n:127.0.0.1:60362_solr 593c880c-b41b-456d-8395-d3e4f82628531290253351412437 CREATE) [n:127.0.0.1:60362_solr c:mlt-collection s:shard1 r:core_node3 x:mlt-collection_shard1_replica_n1] o.a.s.c.SolrCore solr.RecoveryStrategy.Builder
   [junit4]   2> 1471255 INFO  (parallelCoreAdminExecutor-4815-thread-1-processing-n:127.0.0.1:60362_solr 593c880c-b41b-456d-8395-d3e4f82628531290253351412437 CREATE) [n:127.0.0.1:60362_solr c:mlt-collection s:shard1 r:core_node3 x:mlt-collection_shard1_replica_n1] o.a.s.c.SolrCore [[mlt-collection_shard1_replica_n1] ] Opening new SolrCore at [C:\Users\jenkins\workspace\Lucene-Solr-7.x-Windows\solr\build\solr-core\test\J0\temp\solr.search.mlt.CloudMLTQParserTest_EAC1A3309403F2A5-001\tempDir-001\node1\mlt-collection_shard1_replica_n1], dataDir=[C:\Users\jenkins\workspace\Lucene-Solr-7.x-Windows\solr\build\solr-core\test\J0\temp\solr.search.mlt.CloudMLTQParserTest_EAC1A3309403F2A5-001\tempDir-001\node1\.\mlt-collection_shard1_replica_n1\data\]
   [junit4]   2> 1471261 INFO  (parallelCoreAdminExecutor-4816-thread-1-processing-n:127.0.0.1:60359_solr 593c880c-b41b-456d-8395-d3e4f82628531290253354108687 CREATE) [n:127.0.0.1:60359_solr c:mlt-collection s:shard2 r:core_node4 x:mlt-collection_shard2_replica_n2] o.a.s.s.IndexSchema [mlt-collection_shard2_replica_n2] Schema name=cloud-dynamic
   [junit4]   2> 1471279 INFO  (parallelCoreAdminExecutor-4816-thread-1-processing-n:127.0.0.1:60359_solr 593c880c-b41b-456d-8395-d3e4f82628531290253354108687 CREATE) [n:127.0.0.1:60359_solr c:mlt-collection s:shard2 r:core_node4 x:mlt-collection_shard2_replica_n2] o.a.s.s.IndexSchema Loaded schema cloud-dynamic/1.6 with uniqueid field id
   [junit4]   2> 1471279 INFO  (parallelCoreAdminExecutor-4816-thread-1-processing-n:127.0.0.1:60359_solr 593c880c-b41b-456d-8395-d3e4f82628531290253354108687 CREATE) [n:127.0.0.1:60359_solr c:mlt-collection s:shard2 r:core_node4 x:mlt-collection_shard2_replica_n2] o.a.s.c.CoreContainer Creating SolrCore 'mlt-collection_shard2_replica_n2' using configuration from collection mlt-collection, trusted=true
   [junit4]   2> 1471281 INFO  (parallelCoreAdminExecutor-4816-thread-1-processing-n:127.0.0.1:60359_solr 593c880c-b41b-456d-8395-d3e4f82628531290253354108687 CREATE) [n:127.0.0.1:60359_solr c:mlt-collection s:shard2 r:core_node4 x:mlt-collection_shard2_replica_n2] o.a.s.m.r.SolrJmxReporter JMX monitoring for 'solr_60359.solr.core.mlt-collection.shard2.replica_n2' (registry 'solr.core.mlt-collection.shard2.replica_n2') enabled at server: com.sun.jmx.mbeanserver.JmxMBeanServer@319c5277
   [junit4]   2> 1471281 INFO  (parallelCoreAdminExecutor-4816-thread-1-processing-n:127.0.0.1:60359_solr 593c880c-b41b-456d-8395-d3e4f82628531290253354108687 CREATE) [n:127.0.0.1:60359_solr c:mlt-collection s:shard2 r:core_node4 x:mlt-collection_shard2_replica_n2] o.a.s.c.SolrCore solr.RecoveryStrategy.Builder
   [junit4]   2> 1471281 INFO  (parallelCoreAdminExecutor-4816-thread-1-processing-n:127.0.0.1:60359_solr 593c880c-b41b-456d-8395-d3e4f82628531290253354108687 CREATE) [n:127.0.0.1:60359_solr c:mlt-collection s:shard2 r:core_node4 x:mlt-collection_shard2_replica_n2] o.a.s.c.SolrCore [[mlt-collection_shard2_replica_n2] ] Opening new SolrCore at [C:\Users\jenkins\workspace\Lucene-Solr-7.x-Windows\solr\build\solr-core\test\J0\temp\solr.search.mlt.CloudMLTQParserTest_EAC1A3309403F2A5-001\tempDir-001\node2\mlt-collection_shard2_replica_n2], dataDir=[C:\Users\jenkins\workspace\Lucene-Solr-7.x-Windows\solr\build\solr-core\test\J0\temp\solr.search.mlt.CloudMLTQParserTest_EAC1A3309403F2A5-001\tempDir-001\node2\.\mlt-collection_shard2_replica_n2\data\]
   [junit4]   2> 1471352 INFO  (parallelCoreAdminExecutor-4815-thread-1-processing-n:127.0.0.1:60362_solr 593c880c-b41b-456d-8395-d3e4f82628531290253351412437 CREATE) [n:127.0.0.1:60362_solr c:mlt-collection s:shard1 r:core_node3 x:mlt-collection_shard1_replica_n1] o.a.s.u.UpdateHandler Using UpdateLog implementation: org.apache.solr.update.UpdateLog
   [junit4]   2> 1471352 INFO  (parallelCoreAdminExecutor-4815-thread-1-processing-n:127.0.0.1:60362_solr 593c880c-b41b-456d-8395-d3e4f82628531290253351412437 CREATE) [n:127.0.0.1:60362_solr c:mlt-collection s:shard1 r:core_node3 x:mlt-collection_shard1_replica_n1] o.a.s.u.UpdateLog Initializing UpdateLog: dataDir=null defaultSyncLevel=FLUSH numRecordsToKeep=100 maxNumLogsToKeep=10 numVersionBuckets=65536
   [junit4]   2> 1471353 INFO  (parallelCoreAdminExecutor-4815-thread-1-processing-n:127.0.0.1:60362_solr 593c880c-b41b-456d-8395-d3e4f82628531290253351412437 CREATE) [n:127.0.0.1:60362_solr c:mlt-collection s:shard1 r:core_node3 x:mlt-collection_shard1_replica_n1] o.a.s.u.CommitTracker Hard AutoCommit: disabled
   [junit4]   2> 1471353 INFO  (parallelCoreAdminExecutor-4815-thread-1-processing-n:127.0.0.1:60362_solr 593c880c-b41b-456d-8395-d3e4f82628531290253351412437 CREATE) [n:127.0.0.1:60362_solr c:mlt-collection s:shard1 r:core_node3 x:mlt-collection_shard1_replica_n1] o.a.s.u.CommitTracker Soft AutoCommit: disabled
   [junit4]   2> 1471355 INFO  (parallelCoreAdminExecutor-4816-thread-1-processing-n:127.0.0.1:60359_solr 593c880c-b41b-456d-8395-d3e4f82628531290253354108687 CREATE) [n:127.0.0.1:60359_solr c:mlt-collection s:shard2 r:core_node4 x:mlt-collection_shard2_replica_n2] o.a.s.u.UpdateHandler Using UpdateLog implementation: org.apache.solr.update.UpdateLog
   [junit4]   2> 1471355 INFO  (parallelCoreAdminExecutor-4816-thread-1-processing-n:127.0.0.1:60359_solr 593c880c-b41b-456d-8395-d3e4f82628531290253354108687 CREATE) [n:127.0.0.1:60359_solr c:mlt-collection s:shard2 r:core_node4 x:mlt-collection_shard2_replica_n2] o.a.s.u.UpdateLog Initializing UpdateLog: dataDir=null defaultSyncLevel=FLUSH numRecordsToKeep=100 maxNumLogsToKeep=10 numVersionBuckets=65536
   [junit4]   2> 1471355 INFO  (parallelCoreAdminExecutor-4815-thread-1-processing-n:127.0.0.1:60362_solr 593c880c-b41b-456d-8395-d3e4f82628531290253351412437 CREATE) [n:127.0.0.1:60362_solr c:mlt-collection s:shard1 r:core_node3 x:mlt-collection_shard1_replica_n1] o.a.s.s.SolrIndexSearcher Opening [Searcher@5ebd9f8b[mlt-collection_shard1_replica_n1] main]
   [junit4]   2> 1471356 INFO  (parallelCoreAdminExecutor-4815-thread-1-processing-n:127.0.0.1:60362_solr 593c880c-b41b-456d-8395-d3e4f82628531290253351412437 CREATE) [n:127.0.0.1:60362_solr c:mlt-collection s:shard1 r:core_node3 x:mlt-collection_shard1_replica_n1] o.a.s.r.ManagedResourceStorage Configured ZooKeeperStorageIO with znodeBase: /configs/conf
   [junit4]   2> 1471358 INFO  (parallelCoreAdminExecutor-4815-thread-1-processing-n:127.0.0.1:60362_solr 593c880c-b41b-456d-8395-d3e4f82628531290253351412437 CREATE) [n:127.0.0.1:60362_solr c:mlt-collection s:shard1 r:core_node3 x:mlt-collection_shard1_replica_n1] o.a.s.r.ManagedResourceStorage Loaded null at path _rest_managed.json using ZooKeeperStorageIO:path=/configs/conf
   [junit4]   2> 1471358 INFO  (parallelCoreAdminExecutor-4816-thread-1-processing-n:127.0.0.1:60359_solr 593c880c-b41b-456d-8395-d3e4f82628531290253354108687 CREATE) [n:127.0.0.1:60359_solr c:mlt-collection s:shard2 r:core_node4 x:mlt-collection_shard2_replica_n2] o.a.s.u.CommitTracker Hard AutoCommit: disabled
   [junit4]   2> 1471358 INFO  (parallelCoreAdminExecutor-4815-thread-1-processing-n:127.0.0.1:60362_solr 593c880c-b41b-456d-8395-d3e4f82628531290253351412437 CREATE) [n:127.0.0.1:60362_solr c:mlt-collection s:shard1 r:core_node3 x:mlt-collection_shard1_replica_n1] o.a.s.h.ReplicationHandler Commits will be reserved for 10000ms.
   [junit4]   2> 1471358 INFO  (parallelCoreAdminExecutor-4816-thread-1-processing-n:127.0.0.1:60359_solr 593c880c-b41b-456d-8395-d3e4f82628531290253354108687 CREATE) [n:127.0.0.1:60359_solr c:mlt-collection s:shard2 r:core_node4 x:mlt-collection_shard2_replica_n2] o.a.s.u.CommitTracker Soft AutoCommit: disabled
   [junit4]   2> 1471359 INFO  (searcherExecutor-4819-thread-1-processing-x:mlt-collection_shard1_replica_n1 r:core_node3 593c880c-b41b-456d-8395-d3e4f82628531290253351412437 CREATE n:127.0.0.1:60362_solr s:shard1 c:mlt-collection) [n:127.0.0.1:60362_solr c:mlt-collection s:shard1 r:core_node3 x:mlt-collection_shard1_replica_n1] o.a.s.c.SolrCore [mlt-collection_shard1_replica_n1] Registered new searcher Searcher@5ebd9f8b[mlt-collection_shard1_replica_n1] main{ExitableDirectoryReader(UninvertingDirectoryReader())}
   [junit4]   2> 1471359 INFO  (parallelCoreAdminExecutor-4815-thread-1-processing-n:127.0.0.1:60362_solr 593c880c-b41b-456d-8395-d3e4f82628531290253351412437 CREATE) [n:127.0.0.1:60362_solr c:mlt-collection s:shard1 r:core_node3 x:mlt-collection_shard1_replica_n1] o.a.s.u.UpdateLog Could not find max version in index or recent updates, using new clock 1587113224346533888
   [junit4]   2> 1471359 INFO  (parallelCoreAdminExecutor-4816-thread-1-processing-n:127.0.0.1:60359_solr 593c880c-b41b-456d-8395-d3e4f82628531290253354108687 CREATE) [n:127.0.0.1:60359_solr c:mlt-collection s:shard2 r:core_node4 x:mlt-collection_shard2_replica_n2] o.a.s.s.SolrIndexSearcher Opening [Searcher@1b29ae13[mlt-collection_shard2_replica_n2] main]
   [junit4]   2> 1471362 INFO  (parallelCoreAdminExecutor-4816-thread-1-processing-n:127.0.0.1:60359_solr 593c880c-b41b-456d-8395-d3e4f82628531290253354108687 CREATE) [n:127.0.0.1:60359_solr c:mlt-collection s:shard2 r:core_node4 x:mlt-collection_shard2_replica_n2] o.a.s.r.ManagedResourceStorage Configured ZooKeeperStorageIO with znodeBase: /configs/conf
   [junit4]   2> 1471362 INFO  (parallelCoreAdminExecutor-4816-thread-1-processing-n:127.0.0.1:60359_solr 593c880c-b41b-456d-8395-d3e4f82628531290253354108687 CREATE) [n:127.0.0.1:60359_solr c:mlt-collection s:shard2 r:core_node4 x:mlt-collection_shard2_replica_n2] o.a.s.r.ManagedResourceStorage Loaded null at path _rest_managed.json using ZooKeeperStorageIO:path=/configs/conf
   [junit4]   2> 1471363 INFO  (parallelCoreAdminExecutor-4816-thread-1-processing-n:127.0.0.1:60359_solr 593c880c-b41b-456d-8395-d3e4f82628531290253354108687 CREATE) [n:127.0.0.1:60359_solr c:mlt-collection s:shard2 r:core_node4 x:mlt-collection_shard2_replica_n2] o.a.s.h.ReplicationHandler Commits will be reserved for 10000ms.
   [junit4]   2> 1471363 INFO  (parallelCoreAdminExecutor-4816-thread-1-processing-n:127.0.0.1:60359_solr 593c880c-b41b-456d-8395-d3e4f82628531290253354108687 CREATE) [n:127.0.0.1:60359_solr c:mlt-collection s:shard2 r:core_node4 x:mlt-collection_shard2_replica_n2] o.a.s.u.UpdateLog Could not find max version in index or recent updates, using new clock 1587113224350728192
   [junit4]   2> 1471365 INFO  (searcherExecutor-4820-thread-1-processing-x:mlt-collection_shard2_replica_n2 r:core_node4 593c880c-b41b-456d-8395-d3e4f82628531290253354108687 CREATE n:127.0.0.1:60359_solr s:shard2 c:mlt-collection) [n:127.0.0.1:60359_solr c:mlt-collection s:shard2 r:core_node4 x:mlt-collection_shard2_replica_n2] o.a.s.c.SolrCore [mlt-collection_shard2_replica_n2] Registered new searcher Searcher@1b29ae13[mlt-collection_shard2_replica_n2] main{ExitableDirectoryReader(UninvertingDirectoryReader())}
   [junit4]   2> 1471368 INFO  (parallelCoreAdminExecutor-4815-thread-1-processing-n:127.0.0.1:60362_solr 593c880c-b41b-456d-8395-d3e4f82628531290253351412437 CREATE) [n:127.0.0.1:60362_solr c:mlt-collection s:shard1 r:core_node3 x:mlt-collection_shard1_replica_n1] o.a.s.c.ShardLeaderElectionContext Enough replicas found to continue.
   [junit4]   2> 1471368 INFO  (parallelCoreAdminExecutor-4815-thread-1-processing-n:127.0.0.1:60362_solr 593c880c-b41b-456d-8395-d3e4f82628531290253351412437 CREATE) [n:127.0.0.1:60362_solr c:mlt-collection s:shard1 r:core_node3 x:mlt-collection_shard1_replica_n1] o.a.s.c.ShardLeaderElectionContext I may be the new leader - try and sync
   [junit4]   2> 1471368 INFO  (parallelCoreAdminExecutor-4816-thread-1-processing-n:127.0.0.1:60359_solr 593c880c-b41b-456d-8395-d3e4f82628531290253354108687 CREATE) [n:127.0.0.1:60359_solr c:mlt-collection s:shard2 r:core_node4 x:mlt-collection_shard2_replica_n2] o.a.s.c.ShardLeaderElectionContext Enough replicas found to continue.
   [junit4]   2> 1471368 INFO  (parallelCoreAdminExecutor-4816-thread-1-processing-n:127.0.0.1:60359_solr 593c880c-b41b-456d-8395-d3e4f82628531290253354108687 CREATE) [n:127.0.0.1:60359_solr c:mlt-collection s:shard2 r:core_node4 x:mlt-collection_shard2_replica_n2] o.a.s.c.ShardLeaderElectionContext I may be the new leader - try and sync
   [junit4]   2> 1471368 INFO  (parallelCoreAdminExecutor-4815-thread-1-processing-n:127.0.0.1:60362_solr 593c880c-b41b-456d-8395-d3e4f82628531290253351412437 CREATE) [n:127.0.0.1:60362_solr c:mlt-collection s:shard1 r:core_node3 x:mlt-collection_shard1_replica_n1] o.a.s.c.SyncStrategy Sync replicas to http://127.0.0.1:60362/solr/mlt-collection_shard1_replica_n1/
   [junit4]   2> 1471368 INFO  (parallelCoreAdminExecutor-4816-thread-1-processing-n:127.0.0.1:60359_solr 593c880c-b41b-456d-8395-d3e4f82628531290253354108687 CREATE) [n:127.0.0.1:60359_solr c:mlt-collection s:shard2 r:core_node4 x:mlt-collection_shard2_replica_n2] o.a.s.c.SyncStrategy Sync replicas to http://127.0.0.1:60359/solr/mlt-collection_shard2_replica_n2/
   [junit4]   2> 1471369 INFO  (parallelCoreAdminExecutor-4815-thread-1-processing-n:127.0.0.1:60362_solr 593c880c-b41b-456d-8395-d3e4f82628531290253351412437 CREATE) [n:127.0.0.1:60362_solr c:mlt-collection s:shard1 r:core_node3 x:mlt-collection_shard1_replica_n1] o.a.s.c.SyncStrategy Sync Success - now sync replicas to me
   [junit4]   2> 1471369 INFO  (parallelCoreAdminExecutor-4816-thread-1-processing-n:127.0.0.1:60359_solr 593c880c-b41b-456d-8395-d3e4f82628531290253354108687 CREATE) [n:127.0.0.1:60359_solr c:mlt-collection s:shard2 r:core_node4 x:mlt-collection_shard2_replica_n2] o.a.s.c.SyncStrategy Sync Success - now sync replicas to me
   [junit4]   2> 1471369 INFO  (parallelCoreAdminExecutor-4815-thread-1-processing-n:127.0.0.1:60362_solr 593c880c-b41b-456d-8395-d3e4f82628531290253351412437 CREATE) [n:127.0.0.1:60362_solr c:mlt-collection s:shard1 r:core_node3 x:mlt-collection_shard1_replica_n1] o.a.s.c.SyncStrategy http://127.0.0.1:60362/solr/mlt-collection_shard1_replica_n1/ has no replicas
   [junit4]   2> 1471369 INFO  (parallelCoreAdminExecutor-4815-thread-1-processing-n:127.0.0.1:60362_solr 593c880c-b41b-456d-8395-d3e4f82628531290253351412437 CREATE) [n:127.0.0.1:60362_solr c:mlt-collection s:shard1 r:core_node3 x:mlt-collection_shard1_replica_n1] o.a.s.c.ShardLeaderElectionContext Found all replicas participating in election, clear LIR
   [junit4]   2> 1471369 INFO  (parallelCoreAdminExecutor-4816-thread-1-processing-n:127.0.0.1:60359_solr 593c880c-b41b-456d-8395-d3e4f82628531290253354108687 CREATE) [n:127.0.0.1:60359_solr c:mlt-collection s:shard2 r:core_node4 x:mlt-collection_shard2_replica_n2] o.a.s.c.SyncStrategy http://127.0.0.1:60359/solr/mlt-collection_shard2_replica_n2/ has no replicas
   [junit4]   2> 1471369 INFO  (parallelCoreAdminExecutor-4816-thread-1-processing-n:127.0.0.1:60359_solr 593c880c-b41b-456d-8395-d3e4f82628531290253354108687 CREATE) [n:127.0.0.1:60359_solr c:mlt-collection s:shard2 r:core_node4 x:mlt-collection_shard2_replica_n2] o.a.s.c.ShardLeaderElectionContext Found all replicas participating in election, clear LIR
   [junit4]   2> 1471373 INFO  (parallelCoreAdminExecutor-4816-thread-1-processing-n:127.0.0.1:60359_solr 593c880c-b41b-456d-8395-d3e4f82628531290253354108687 CREATE) [n:127.0.0.1:60359_solr c:mlt-collection s:shard2 r:core_node4 x:mlt-collection_shard2_replica_n2] o.a.s.c.ShardLeaderElectionContext I am the new leader: http://127.0.0.1:60359/solr/mlt-collection_shard2_replica_n2/ shard2
   [junit4]   2> 1471373 INFO  (parallelCoreAdminExecutor-4815-thread-1-processing-n:127.0.0.1:60362_solr 593c880c-b41b-456d-8395-d3e4f82628531290253351412437 CREATE) [n:127.0.0.1:60362_solr c:mlt-collection s:shard1 r:core_node3 x:mlt-collection_shard1_replica_n1] o.a.s.c.ShardLeaderElectionContext I am the new leader: http://127.0.0.1:60362/solr/mlt-collection_shard1_replica_n1/ shard1
   [junit4]   2> 1471475 INFO  (zkCallback-2851-thread-2-processing-n:127.0.0.1:60362_solr) [n:127.0.0.1:60362_solr    ] o.a.s.c.c.ZkStateReader A cluster state change: [WatchedEvent state:SyncConnected type:NodeDataChanged path:/collections/mlt-collection/state.json] for collection [mlt-collection] has occurred - updating... (live nodes size: [2])
   [junit4]   2> 1471475 INFO  (zkCallback-2851-thread-1-processing-n:127.0.0.1:60362_solr) [n:127.0.0.1:60362_solr    ] o.a.s.c.c.ZkStateReader A cluster state change: [WatchedEvent state:SyncConnected type:NodeDataChanged path:/collections/mlt-collection/state.json] for collection [mlt-collection] has occurred - updating... (live nodes size: [2])
   [junit4]   2> 1471475 INFO  (zkCallback-2853-thread-3-processing-n:127.0.0.1:60359_solr) [n:127.0.0.1:60359_solr    ] o.a.s.c.c.ZkStateReader A cluster state change: [WatchedEvent state:SyncConnected type:NodeDataChanged path:/collections/mlt-collection/state.json] for collection [mlt-collection] has occurred - updating... (live nodes size: [2])
   [junit4]   2> 1471475 INFO  (zkCallback-2853-thread-2-processing-n:127.0.0.1:60359_solr) [n:127.0.0.1:60359_solr    ] o.a.s.c.c.ZkStateReader A cluster state change: [WatchedEvent state:SyncConnected type:NodeDataChanged path:/collections/mlt-collection/state.json] for collection [mlt-collection] has occurred - updating... (live nodes size: [2])
   [junit4]   2> 1471477 INFO  (parallelCoreAdminExecutor-4815-thread-1-processing-n:127.0.0.1:60362_solr 593c880c-b41b-456d-8395-d3e4f82628531290253351412437 CREATE) [n:127.0.0.1:60362_solr c:mlt-collection s:shard1 r:core_node3 x:mlt-collection_shard1_replica_n1] o.a.s.c.ZkController I am the leader, no recovery necessary
   [junit4]   2> 1471482 INFO  (parallelCoreAdminExecutor-4816-thread-1-processing-n:127.0.0.1:60359_solr 593c880c-b41b-456d-8395-d3e4f82628531290253354108687 CREATE) [n:127.0.0.1:60359_solr c:mlt-collection s:shard2 r:core_node4 x:mlt-collection_shard2_replica_n2] o.a.s.c.ZkController I am the leader, no recovery necessary
   [junit4]   2> 1471588 INFO  (zkCallback-2851-thread-1-processing-n:127.0.0.1:60362_solr) [n:127.0.0.1:60362_solr    ] o.a.s.c.c.ZkStateReader A cluster state change: [WatchedEvent state:SyncConnected type:NodeDataChanged path:/collections/mlt-collection/state.json] for collection [mlt-collection] has occurred - updating... (live nodes size: [2])
   [junit4]   2> 1471588 INFO  (zkCallback-2851-thread-2-processing-n:127.0.0.1:60362_solr) [n:127.0.0.1:60362_solr    ] o.a.s.c.c.ZkStateReader A cluster state change: [WatchedEvent state:SyncConnected type:NodeDataChanged path:/collections/mlt-collection/state.json] for collection [mlt-collection] has occurred - updating... (live nodes size: [2])
   [junit4]   2> 1471588 INFO  (zkCallback-2853-thread-2-processing-n:127.0.0.1:60359_solr) [n:127.0.0.1:60359_solr    ] o.a.s.c.c.ZkStateReader A cluster state change: [WatchedEvent state:SyncConnected type:NodeDataChanged path:/collections/mlt-collection/state.json] for collection [mlt-collection] has occurred - updating... (live nodes size: [2])
   [junit4]   2> 1471589 INFO  (zkCallback-2853-thread-3-processing-n:127.0.0.1:60359_solr) [n:127.0.0.1:60359_solr    ] o.a.s.c.c.ZkStateReader A cluster state change: [WatchedEvent state:SyncConnected type:NodeDataChanged path:/collections/mlt-collection/state.json] for collection [mlt-collection] has occurred - updating... (live nodes size: [2])
   [junit4]   2> 1471822 INFO  (qtp1560330866-12013) [n:127.0.0.1:60359_solr    ] o.a.s.h.a.CollectionsHandler Invoked Collection Action :requeststatus with params requestid=593c880c-b41b-456d-8395-d3e4f8262853&action=REQUESTSTATUS&wt=javabin&version=2 and sendToOCPQueue=true
   [junit4]   2> 1471823 INFO  (qtp1560330866-12013) [n:127.0.0.1:60359_solr    ] o.a.s.s.HttpSolrCall [admin] webapp=null path=/admin/collections params={requestid=593c880c-b41b-456d-8395-d3e4f8262853&action=REQUESTSTATUS&wt=javabin&version=2} status=0 QTime=1
   [junit4]   2> 1472165 INFO  (qtp158241983-12023) [n:127.0.0.1:60362_solr    ] o.a.s.h.a.CoreAdminOperation Checking request status for : 593c880c-b41b-456d-8395-d3e4f82628531290253351412437
   [junit4]   2> 1472165 INFO  (qtp158241983-12023) [n:127.0.0.1:60362_solr    ] o.a.s.s.HttpSolrCall [admin] webapp=null path=/admin/cores params={qt=/admin/cores&requestid=593c880c-b41b-456d-8395-d3e4f82628531290253351412437&action=REQUESTSTATUS&wt=javabin&version=2} status=0 QTime=0
   [junit4]   2> 1472171 INFO  (qtp1560330866-12036) [n:127.0.0.1:60359_solr    ] o.a.s.h.a.CoreAdminOperation Checking request status for : 593c880c-b41b-456d-8395-d3e4f82628531290253354108687
   [junit4]   2> 1472171 INFO  (qtp1560330866-12036) [n:127.0.0.1:60359_solr    ] o.a.s.s.HttpSolrCall [admin] webapp=null path=/admin/cores params={qt=/admin/cores&requestid=593c880c-b41b-456d-8395-d3e4f82628531290253354108687&action=REQUESTSTATUS&wt=javabin&version=2} status=0 QTime=0
   [junit4]   2> 1472176 INFO  (OverseerThreadFactory-4814-thread-1-processing-n:127.0.0.1:60359_solr) [n:127.0.0.1:60359_solr    ] o.a.s.c.OverseerTaskQueue Response ZK path: /overseer/collection-queue-work/qnr-0000000000 doesn't exist.  Requestor may have disconnected from ZooKeeper
   [junit4]   2> 1472823 INFO  (qtp1560330866-12036) [n:127.0.0.1:60359_solr    ] o.a.s.h.a.CollectionsHandler Invoked Collection Action :requeststatus with params requestid=593c880c-b41b-456d-8395-d3e4f8262853&action=REQUESTSTATUS&wt=javabin&version=2 and sendToOCPQueue=true
   [junit4]   2> 1472825 INFO  (qtp1560330866-12036) [n:127.0.0.1:60359_solr    ] o.a.s.s.HttpSolrCall [admin] webapp=null path=/admin/collections params={requestid=593c880c-b41b-456d-8395-d3e4f8262853&action=REQUESTSTATUS&wt=javabin&version=2} status=0 QTime=1
   [junit4]   2> 1472825 INFO  (qtp1560330866-12034) [n:127.0.0.1:60359_solr    ] o.a.s.h.a.CollectionsHandler Invoked Collection Action :deletestatus with params requestid=593c880c-b41b-456d-8395-d3e4f8262853&action=DELETESTATUS&wt=javabin&version=2 and sendToOCPQueue=true
   [junit4]   2> 1472827 INFO  (qtp1560330866-12034) [n:127.0.0.1:60359_solr    ] o.a.s.s.HttpSolrCall [admin] webapp=null path=/admin/collections params={requestid=593c880c-b41b-456d-8395-d3e4f8262853&action=DELETESTATUS&wt=javabin&version=2} status=0 QTime=1
   [junit4]   2> 1472845 INFO  (qtp1560330866-12020) [n:127.0.0.1:60359_solr c:mlt-collection s:shard2 r:core_node4 x:mlt-collection_shard2_replica_n2] o.a.s.u.p.LogUpdateProcessorFactory [mlt-collection_shard2_replica_n2]  webapp=/solr path=/update params={_stateVer_=mlt-collection:4&wt=javabin&version=2}{add=[2 (1587113225894232064), 3 (1587113225902620672), 5 (1587113225903669248), 6 (1587113225903669249), 7 (1587113225903669250), 9 (1587113225903669251), 17 (1587113225903669252), 18 (1587113225903669253), 19 (1587113225903669254), 21 (1587113225903669255), ... (16 adds)]} 0 9
   [junit4]   2> 1472846 INFO  (qtp158241983-12023) [n:127.0.0.1:60362_solr c:mlt-collection s:shard1 r:core_node3 x:mlt-collection_shard1_replica_n1] o.a.s.u.p.LogUpdateProcessorFactory [mlt-collection_shard1_replica_n1]  webapp=/solr path=/update params={_stateVer_=mlt-collection:4&wt=javabin&version=2}{add=[1 (1587113225896329216), 4 (1587113225902620672), 8 (1587113225902620673), 10 (1587113225903669248), 12 (1587113225903669249), 13 (1587113225903669250), 14 (1587113225903669251), 15 (1587113225903669252), 16 (1587113225903669253), 20 (1587113225904717824), ... (15 adds)]} 0 8
   [junit4]   2> 1472863 INFO  (qtp158241983-12031) [n:127.0.0.1:60362_solr c:mlt-collection s:shard1 r:core_node3 x:mlt-collection_shard1_replica_n1] o.a.s.u.DirectUpdateHandler2 start commit{_version_=1587113225923592192,optimize=false,openSearcher=true,waitSearcher=true,expungeDeletes=false,softCommit=false,prepareCommit=false}
   [junit4]   2> 1472863 INFO  (qtp158241983-12031) [n:127.0.0.1:60362_solr c:mlt-collection s:shard1 r:core_node3 x:mlt-collection_shard1_replica_n1] o.a.s.u.SolrIndexWriter Calling setCommitData with IW:org.apache.solr.update.SolrIndexWriter@7e8fcc2b commitCommandVersion:1587113225923592192
   [junit4]   2> 1472866 INFO  (qtp1560330866-12017) [n:127.0.0.1:60359_solr c:mlt-collection s:shard2 r:core_node4 x:mlt-collection_shard2_replica_n2] o.a.s.u.DirectUpdateHandler2 start commit{_version_=1587113225926737920,optimize=false,openSearcher=true,waitSearcher=true,expungeDeletes=false,softCommit=false,prepareCommit=false}
   [junit4]   2> 1472866 INFO  (qtp1560330866-12017) [n:127.0.0.1:60359_solr c:mlt-collection s:shard2 r:core_node4 x:mlt-collection_shard2_replica_n2] o.a.s.u.SolrIndexWriter Calling setCommitData with IW:org.apache.solr.update.SolrIndexWriter@26c16590 commitCommandVersion:1587113225926737920
   [junit4]   2> 1472877 INFO  (qtp1560330866-12017) [n:127.0.0.1:60359_solr c:mlt-collection s:shard2 r:core_node4 x:mlt-collection_shard2_replica_n2] o.a.s.s.SolrIndexSearcher Opening [Searcher@4d7a2988[mlt-collection_shard2_replica_n2] main]
   [junit4]   2> 1472877 INFO  (qtp158241983-12031) [n:127.0.0.1:60362_solr c:mlt-collection s:shard1 r:core_node3 x:mlt-collection_shard1_replica_n1] o.a.s.s.SolrIndexSearcher Opening [Searcher@2f1dcf8c[mlt-collection_shard1_replica_n1] main]
   [junit4]   2> 1472878 INFO  (searcherExecutor-4820-thread-1-processing-n:127.0.0.1:60359_solr x:mlt-collection_shard2_replica_n2 s:shard2 c:mlt-collection r:core_node4) [n:127.0.0.1:60359_solr c:mlt-collection s:shard2 r:core_node4 x:mlt-collection_shard2_replica_n2] o.a.s.c.SolrCore [mlt-collection_shard2_replica_n2] Registered new searcher Searcher@4d7a2988[mlt-collection_shard2_replica_n2] main{ExitableDirectoryReader(UninvertingDirectoryReader(Uninverting(_0(7.3.0):C16)))}
   [junit4]   2> 1472878 INFO  (searcherExecutor-4819-thread-1-processing-n:127.0.0.1:60362_solr x:mlt-collection_shard1_replica_n1 s:shard1 c:mlt-collection r:core_node3) [n:127.0.0.1:60362_solr c:mlt-collection s:shard1 r:core_node3 x:mlt-collection_shard1_replica_n1] o.a.s.c.SolrCore [mlt-collection_shard1_replica_n1] Registered new searcher Searcher@2f1dcf8c[mlt-collection_shard1_replica_n1] main{ExitableDirectoryReader(UninvertingDirectoryReader(Uninverting(_0(7.3.0):C15)))}
   [junit4]   2> 1472879 INFO  (qtp1560330866-12017) [n:127.0.0.1:60359_solr c:mlt-collection s:shard2 r:core_node4 x:mlt-collection_shard2_replica_n2] o.a.s.u.DirectUpdateHandler2 end_commit_flush
   [junit4]   2> 1472879 INFO  (qtp158241983-12031) [n:127.0.0.1:60362_solr c:mlt-collection s:shard1 r:core_node3 x:mlt-collection_shard1_replica_n1] o.a.s.u.DirectUpdateHandler2 end_commit_flush
   [junit4]   2> 1472879 INFO  (qtp1560330866-12017) [n:127.0.0.1:60359_solr c:mlt-collection s:shard2 r:core_node4 x:mlt-collection_shard2_replica_n2] o.a.s.u.p.LogUpdateProcessorFactory [mlt-collection_shard2_replica_n2]  webapp=/solr path=/update params={update.distrib=FROMLEADER&waitSearcher=true&openSearcher=true&commit=true&softCommit=false&distrib.from=http://127.0.0.1:60362/solr/mlt-collection_shard1_replica_n1/&commit_end_point=true&wt=javabin&version=2&expungeDeletes=false}{commit=} 0 13
   [junit4]   2> 1472879 INFO  (qtp158241983-12031) [n:127.0.0.1:60362_solr c:mlt-collection s:shard1 r:core_node3 x:mlt-collection_shard1_replica_n1] o.a.s.u.p.LogUpdateProcessorFactory [mlt-collection_shard1_replica_n1]  webapp=/solr path=/update params={update.distrib=FROMLEADER&waitSearcher=true&openSearcher=true&commit=true&softCommit=false&distrib.from=http://127.0.0.1:60362/solr/mlt-collection_shard1_replica_n1/&commit_end_point=true&wt=javabin&version=2&expungeDeletes=false}{commit=} 0 15
   [junit4]   2> 1472879 INFO  (qtp158241983-12023) [n:127.0.0.1:60362_solr c:mlt-collection s:shard1 r:core_node3 x:mlt-collection_shard1_replica_n1] o.a.s.u.p.LogUpdateProcessorFactory [mlt-collection_shard1_replica_n1]  webapp=/solr path=/update params={_stateVer_=mlt-collection:4&commit=true&wt=javabin&version=2}{commit=} 0 33
   [junit4]   2> 1472906 INFO  (TEST-CloudMLTQParserTest.testInvalidSourceDocument-seed#[EAC1A3309403F2A5]) [    ] o.a.s.SolrTestCaseJ4 ###Starting testInvalidSourceDocument
   [junit4]   2> 1472911 INFO  (qtp1560330866-12016) [n:127.0.0.1:60359_solr c:mlt-collection s:shard2 r:core_node4 x:mlt-collection_shard2_replica_n2] o.a.s.h.c.RealTimeGetComponent LOOKUP_SLICE:shard2=http://127.0.0.1:60359/solr/mlt-collection_shard2_replica_n2/
   [junit4]   2> 1472912 INFO  (qtp1560330866-12014) [n:127.0.0.1:60359_solr c:mlt-collection s:shard2 r:core_node4 x:mlt-collection_shard2_replica_n2] o.a.s.c.S.Request [mlt-collection_shard2_replica_n2]  webapp=/solr path=/get params={distrib=false&qt=/get&omitHeader=true&shards.purpose=1&NOW=1513589120836&ids=999999&isShard=true&shard.url=http://127.0.0.1:60359/solr/mlt-collection_shard2_replica_n2/&wt=javabin&version=2&shards.qt=/get} status=0 QTime=0
   [junit4]   2> 1472913 ERROR (qtp1560330866-12016) [n:127.0.0.1:60359_solr c:mlt-collection s:shard2 r:core_node4 x:mlt-collection_shard2_replica_n2] o.a.s.h.RequestHandlerBase org.apache.solr.common.SolrException: Error completing MLT request. Could not fetch document with id [999999]
   [junit4]   2> 	at org.apache.solr.search.mlt.CloudMLTQParser.parse(CloudMLTQParser.java:68)
   [junit4]   2> 	at org.apache.solr.search.QParser.getQuery(QParser.java:169)
   [junit4]   2> 	at org.apache.solr.handler.component.QueryComponent.prepare(QueryComponent.java:160)
   [junit4]   2> 	at org.apache.solr.handler.component.SearchHandler.handleRequestBody(SearchHandler.java:269)
   [junit4]   2> 	at org.apache.solr.handler.RequestHandlerBase.handleRequest(RequestHandlerBase.java:177)
   [junit4]   2> 	at org.apache.solr.core.SolrCore.execute(SolrCore.java:2503)
   [junit4]   2> 	at org.apache.solr.servlet.HttpSolrCall.execute(HttpSolrCall.java:711)
   [junit4]   2> 	at org.apache.solr.servlet.HttpSolrCall.call(HttpSolrCall.java:517)
   [junit4]   2> 	at org.apache.solr.servlet.SolrDispatchFilter.doFilter(SolrDispatchFilter.java:382)
   [junit4]   2> 	at org.apache.solr.servlet.SolrDispatchFilter.doFilter(SolrDispatchFilter.java:326)
   [junit4]   2> 	at org.eclipse.jetty.servlet.ServletHandler$CachedChain.doFilter(ServletHandler.java:1759)
   [junit4]   2> 	at org.apache.solr.client.solrj.embedded.JettySolrRunner$DebugFilter.doFilter(JettySolrRunner.java:139)
   [junit4]   2> 	at org.eclipse.jetty.servlet.ServletHandler$CachedChain.doFilter(ServletHandler.java:1759)
   [junit4]   2> 	at org.eclipse.jetty.servlet.ServletHandler.doHandle(ServletHandler.java:582)
   [junit4]   2> 	at org.eclipse.jetty.server.session.SessionHandler.doHandle(SessionHandler.java:224)
   [junit4]   2> 	at org.eclipse.jetty.server.handler.ContextHandler.doHandle(ContextHandler.java:1180)
   [junit4]   2> 	at org.eclipse.jetty.servlet.ServletHandler.doScope(ServletHandler.java:512)
   [junit4]   2> 	at org.eclipse.jetty.server.session.SessionHandler.doScope(SessionHandler.java:185)
   [junit4]   2> 	at org.eclipse.jetty.server.handler.ContextHandler.doScope(ContextHandler.java:1112)
   [junit4]   2> 	at org.eclipse.jetty.server.handler.ScopedHandler.handle(ScopedHandler.java:141)
   [junit4]   2> 	at org.eclipse.jetty.server.handler.gzip.GzipHandler.handle(GzipHandler.java:493)
   [junit4]   2> 	at org.eclipse.jetty.server.handler.HandlerWrapper.handle(HandlerWrapper.java:134)
   [junit4]   2> 	at org.eclipse.jetty.server.Server.handle(Server.java:534)
   [junit4]   2> 	at org.eclipse.jetty.server.HttpChannel.handle(HttpChannel.java:320)
   [junit4]   2> 	at org.eclipse.jetty.server.HttpConnection.onFillable(HttpConnection.java:251)
   [junit4]   2> 	at org.eclipse.jetty.io.AbstractConnection$ReadCallback.succeeded(AbstractConnection.java:283)
   [junit4]   2> 	at org.eclipse.jetty.io.FillInterest.fillable(FillInterest.java:108)
   [junit4]   2> 	at org.eclipse.jetty.io.SelectChannelEndPoint$2.run(SelectChannelEndPoint.java:93)
   [junit4]   2> 	at org.eclipse.jetty.util.thread.strategy.ExecuteProduceConsume.executeProduceConsume(ExecuteProduceConsume.java:303)
   [junit4]   2> 	at org.eclipse.jetty.util.thread.strategy.ExecuteProduceConsume.produceConsume(ExecuteProduceConsume.java:148)
   [junit4]   2> 	at org.eclipse.jetty.util.thread.strategy.ExecuteProduceConsume.run(ExecuteProduceConsume.java:136)
   [junit4]   2> 	at org.eclipse.jetty.util.thread.QueuedThreadPool.runJob(QueuedThreadPool.java:671)
   [junit4]   2> 	at org.eclipse.jetty.util.thread.QueuedThreadPool$2.run(QueuedThreadPool.java:589)
   [junit4]   2> 	at java.lang.Thread.run(Thread.java:748)
   [junit4]   2> 
   [junit4]   2> 1472914 INFO  (qtp1560330866-12016) [n:127.0.0.1:60359_solr c:mlt-collection s:shard2 r:core_node4 x:mlt-collection_shard2_replica_n2] o.a.s.c.S.Request [mlt-collection_shard2_replica_n2]  webapp=/solr path=/select params={q={!mlt+qf%3Dlowerfilt_u}999999&_stateVer_=mlt-collection:4&wt=javabin&version=2} status=400 QTime=6
   [junit4]   2> 1472915 ERROR (TEST-CloudMLTQParserTest.testInvalidSourceDocument-seed#[EAC1A3309403F2A5]) [    ] o.a.s.c.s.i.CloudSolrClient Request to collection [mlt-collection] failed due to (400) org.apache.solr.client.solrj.impl.HttpSolrClient$RemoteSolrException: Error from server at http://127.0.0.1:60359/solr/mlt-collection: Error completing MLT request. Could not fetch document with id [999999], retry? 0
   [junit4]   2> 1472915 INFO  (TEST-CloudMLTQParserTest.testInvalidSourceDocument-seed#[EAC1A3309403F2A5]) [    ] o.a.s.SolrTestCaseJ4 ###Ending testInvalidSourceDocument
   [junit4]   2> 1472934 INFO  (TEST-CloudMLTQParserTest.testMinDF-seed#[EAC1A3309403F2A5]) [    ] o.a.s.SolrTestCaseJ4 ###Starting testMinDF
   [junit4]   2> 1472935 INFO  (qtp1560330866-12015) [n:127.0.0.1:60359_solr c:mlt-collection s:shard2 r:core_node4 x:mlt-collection_shard2_replica_n2] o.a.s.h.c.RealTimeGetComponent LOOKUP_SLICE:shard2=http://127.0.0.1:60359/solr/mlt-collection_shard2_replica_n2/
   [junit4]   2> 1472936 INFO  (qtp1560330866-12013) [n:127.0.0.1:60359_solr c:mlt-collection s:shard2 r:core_node4 x:mlt-collection_shard2_replica_n2] o.a.s.c.S.Request [mlt-collection_shard2_replica_n2]  webapp=/solr path=/get params={distrib=false&qt=/get&omitHeader=true&shards.purpose=1&NOW=1513589120864&ids=3&isShard=true&shard.url=http://127.0.0.1:60359/solr/mlt-collection_shard2_replica_n2/&wt=javabin&version=2&shards.qt=/get} status=0 QTime=0
   [junit4]   2> 1472939 INFO  (qtp1560330866-12013) [n:127.0.0.1:60359_solr c:mlt-collection s:shard2 r:core_node4 x:mlt-collection_shard2_replica_n2] o.a.s.h.c.RealTimeGetComponent LOOKUP_SLICE:shard2=http://127.0.0.1:60359/solr/mlt-collection_shard2_replica_n2/
   [junit4]   2> 1472944 INFO  (qtp158241983-12033) [n:127.0.0.1:60362_solr c:mlt-collection s:shard1 r:core_node3 x:mlt-collection_shard1_replica_n1] o.a.s.h.c.RealTimeGetComponent LOOKUP_SLICE:shard2=http://127.0.0.1:60359/solr/mlt-collection_shard2_replica_n2/
   [junit4]   2> 1472947 INFO  (qtp1560330866-12036) [n:127.0.0.1:60359_solr c:mlt-collection s:shard2 r:core_node4 x:mlt-collection_shard2_replica_n2] o.a.s.c.S.Request [mlt-collection_shard2_replica_n2]  webapp=/solr path=/get params={distrib=false&qt=/get&omitHeader=true&shards.purpose=1&NOW=1513589120864&ids=3&isShard=true&shard.url=http://127.0.0.1:60359/solr/mlt-collection_shard2_replica_n2/&wt=javabin&version=2&shards.qt=/get} status=0 QTime=0
   [junit4]   2> 1472948 INFO  (qtp1560330866-12013) [n:127.0.0.1:60359_solr c:mlt-collection s:shard2 r:core_node4 x:mlt-collection_shard2_replica_n2] o.a.s.c.S.Request [mlt-collection_shard2_replica_n2]  webapp=/solr path=/select params={df=text&distrib=false&_stateVer_=mlt-collection:4&debug=false&debug=timing&debug=track&fl=id&fl=score&shards.purpose=4&start=0&fsv=true&shard.url=http://127.0.0.1:60359/solr/mlt-collection_shard2_replica_n2/&rid=127.0.0.1-mlt-collection_shard2_replica_n2-1513589120867-10&rows=10&version=2&q={!mlt+qf%3Dlowerfilt_u+mindf%3D0+mintf%3D1}3&requestPurpose=GET_TOP_IDS&NOW=1513589120864&isShard=true&wt=javabin&debugQuery=false} hits=2 status=0 QTime=10
   [junit4]   2> 1472954 INFO  (qtp1560330866-12034) [n:127.0.0.1:60359_solr c:mlt-collection s:shard2 r:core_node4 x:mlt-collection_shard2_replica_n2] o.a.s.c.S.Request [mlt-collection_shard2_replica_n2]  webapp=/solr path=/get params={distrib=false&qt=/get&omitHeader=true&shards.purpose=1&NOW=1513589120864&ids=3&isShard=true&shard.url=http://127.0.0.1:60359/solr/mlt-collection_shard2_replica_n2/&wt=javabin&version=2&shards.qt=/get} status=0 QTime=0
   [junit4]   2> 1472955 INFO  (qtp158241983-12033) [n:127.0.0.1:60362_solr c:mlt-collection s:shard1 r:core_node3 x:mlt-collection_shard1_replica_n1] o.a.s.c.S.Request [mlt-collection_shard1_replica_n1]  webapp=/solr path=/select params={df=text&distrib=false&_stateVer_=mlt-collection:4&debug=false&debug=timing&debug=track&fl=id&fl=score&shards.purpose=4&start=0&fsv=true&shard.url=http://127.0.0.1:60362/solr/mlt-collection_shard1_replica_n1/&rid=1

[...truncated too long message...]

omputePlanAction, HdfsBasicDistributedZkTest, BaseCdcrDistributedZkTest, MinimalSchemaTest, TestSolrConfigHandlerConcurrent, CoreSorterTest, TestNRTOpen, TestGraphTermsQParserPlugin, HdfsRecoveryZkTest, StatsComponentTest, TestMaxScoreQueryParser, TestXIncludeConfig, SolrJmxReporterTest, TestCopyFieldCollectionResource, TestReplicationHandlerBackup, TestClusterStateMutator, TestQuerySenderListener, BadIndexSchemaTest, ZkControllerTest, HdfsSyncSliceTest, TestSurroundQueryParser, SolrMetricsIntegrationTest, PropertiesRequestHandlerTest, PathHierarchyTokenizerFactoryTest, ExitableDirectoryReaderTest, ReturnFieldsTest, TestMiniSolrCloudClusterSSL, AddReplicaTest, AssignBackwardCompatibilityTest, TestSolrCoreProperties, TestCodecSupport, TestInfoStreamLogging, TestPseudoReturnFields, TestFieldCacheSort, TestPHPSerializedResponseWriter, TestDistributedSearch, NodeLostTriggerTest, SignatureUpdateProcessorFactoryTest, DefaultValueUpdateProcessorTest, HdfsLockFactoryTest, TestTlogReplica, InfixSuggestersTest, RequestHandlersTest, TestRawResponseWriter, SpellCheckCollatorTest, ConvertedLegacyTest, VMParamsZkACLAndCredentialsProvidersTest, TestClassicSimilarityFactory, DeleteInactiveReplicaTest, TestMultiWordSynonyms, RegexBoostProcessorTest, AtomicUpdateProcessorFactoryTest, BlockJoinFacetRandomTest, DocExpirationUpdateProcessorFactoryTest, CollectionTooManyReplicasTest, TestHttpShardHandlerFactory, HdfsNNFailoverTest, TestStressUserVersions, ShardRoutingTest, TestZkAclsWithHadoopAuth, TestUtils, TestCoreBackup, TestSolrCloudSnapshots, TestManagedResource, TestSchemaVersionResource, TestHighlightDedupGrouping, CoreAdminRequestStatusTest, BinaryUpdateRequestHandlerTest, TestCollationFieldDocValues, EnumFieldTest, TestPullReplicaErrorHandling, SyncSliceTest, CloudMLTQParserTest, TestManagedSynonymFilterFactory, DistributedFacetExistsSmallTest, PeerSyncReplicationTest, DistributedFacetSimpleRefinementLongTailTest, TestDownShardTolerantSearch, TestDeleteCollectionOnDownNodes, ParsingFieldUpdateProcessorsTest, TestConfigSetsAPI, TestOmitPositions, TestLegacyNumericUtils, DirectUpdateHandlerOptimizeTest, TestCorePropertiesReload, NotRequiredUniqueKeyTest, TestMacros, HttpTriggerListenerTest, DisMaxRequestHandlerTest, DistribCursorPagingTest, UUIDFieldTest, GraphQueryTest, AutoScalingHandlerTest, QueryResultKeyTest, DirectUpdateHandlerTest, URLClassifyProcessorTest, SuggestComponentContextFilterQueryTest, TestRandomDVFaceting, TestRestoreCore, PKIAuthenticationIntegrationTest, UniqFieldsUpdateProcessorFactoryTest, ZkCLITest, PrimitiveFieldTypeTest, SaslZkACLProviderTest, TestFiltering, TestChildDocTransformer, TestCloudDeleteByQuery, CdcrUpdateLogTest, AnalyticsMergeStrategyTest, TestSolrDeletionPolicy2, TestStressRecovery, RAMDirectoryFactoryTest, TestPrepRecovery, BasicAuthIntegrationTest, TestIBSimilarityFactory, TestDynamicLoading, TestRandomRequestDistribution, HdfsWriteToMultipleCollectionsTest, TestDynamicFieldResource, RegexBytesRefFilterTest, BasicDistributedZkTest, LeaderElectionContextKeyTest, TestCustomDocTransformer, DistributedFacetPivotSmallTest, TestAtomicUpdateErrorCases, TestComplexPhraseQParserPlugin, ForceLeaderTest, TestFieldSortValues, DeleteLastCustomShardedReplicaTest, DeleteReplicaTest, DistribJoinFromCollectionTest, LeaderInitiatedRecoveryOnShardRestartTest, MigrateRouteKeyTest, OverriddenZkACLAndCredentialsProvidersTest, OverseerCollectionConfigSetProcessorTest, OverseerModifyCollectionTest, OverseerStatusTest, OverseerTaskQueueTest, SSLMigrationTest, ShardSplitTest, TestSolrCloudWithSecureImpersonation, TestStressCloudBlindAtomicUpdates, TestStressInPlaceUpdates, AutoAddReplicasIntegrationTest, SystemLogListenerTest, TestPolicyCloud, TestClusterStateProvider, TestDistribStateManager, TestExecutePlanAction, TestLargeCluster, TestNodeAddedTrigger, TestNodeLostTrigger, TestSimDistributedQueue, TestTriggerIntegration, CdcrBidirectionalTest, CdcrRequestHandlerTest, HdfsChaosMonkeyNothingIsSafeTest, HdfsChaosMonkeySafeLeaderTest, ZkStateWriterTest, RuleEngineTest, RulesTest, BlobRepositoryCloudTest, DirectoryFactoryTest, TestBackupRepositoryFactory, TestConfigSetImmutable, TestConfigSetProperties, TestReloadAndDeleteDocs, TestShardHandlerFactory, TestSimpleTextCodec, TestSolrCoreSnapshots, RequestLoggingTest, TestBlobHandler]
   [junit4] Completed [741/763 (3!)] on J0 in 632.17s, 1 test, 1 error <<< FAILURES!

[...truncated 2431 lines...]
   [junit4] Suite: org.apache.solr.update.processor.TestOpenNLPExtractNamedEntitiesUpdateProcessorFactory
   [junit4]   2> log4j:WARN No appenders could be found for logger (org.apache.solr.SolrTestCaseJ4).
   [junit4]   2> log4j:WARN Please initialize the log4j system properly.
   [junit4]   2> log4j:WARN See http://logging.apache.org/log4j/1.2/faq.html#noconfig for more info.
   [junit4]   2> Creating dataDir: C:\Users\jenkins\workspace\Lucene-Solr-7.x-Windows\solr\build\contrib\solr-analysis-extras\test\J1\temp\solr.update.processor.TestOpenNLPExtractNamedEntitiesUpdateProcessorFactory_686308EBCC0223C-001\init-core-data-001
   [junit4]   2> NOTE: test params are: codec=Asserting(Lucene70): {}, docValues:{}, maxPointsInLeafNode=1427, maxMBSortInHeap=6.809459928464567, sim=RandomSimilarity(queryNorm=false): {}, locale=et, timezone=America/Halifax
   [junit4]   2> NOTE: Windows 10 10.0 amd64/Oracle Corporation 1.8.0_144 (64-bit)/cpus=3,threads=1,free=73832712,total=100663296
   [junit4]   2> NOTE: All tests run in this JVM: [TestOpenNLPExtractNamedEntitiesUpdateProcessorFactory]
   [junit4]   2> NOTE: reproduce with: ant test  -Dtestcase=TestOpenNLPExtractNamedEntitiesUpdateProcessorFactory -Dtests.seed=686308EBCC0223C -Dtests.slow=true -Dtests.locale=et -Dtests.timezone=America/Halifax -Dtests.asserts=true -Dtests.file.encoding=ISO-8859-1
   [junit4] ERROR   0.00s J1 | TestOpenNLPExtractNamedEntitiesUpdateProcessorFactory (suite) <<<
   [junit4]    > Throwable #1: java.io.IOException: Could not remove the following files (in the order of attempts):
   [junit4]    >    C:\Users\jenkins\workspace\Lucene-Solr-7.x-Windows\solr\build\contrib\solr-analysis-extras\test\J1\temp\solr.update.processor.TestOpenNLPExtractNamedEntitiesUpdateProcessorFactory_686308EBCC0223C-001\tempDir-001\collection1\conf: java.nio.file.DirectoryNotEmptyException: C:\Users\jenkins\workspace\Lucene-Solr-7.x-Windows\solr\build\contrib\solr-analysis-extras\test\J1\temp\solr.update.processor.TestOpenNLPExtractNamedEntitiesUpdateProcessorFactory_686308EBCC0223C-001\tempDir-001\collection1\conf
   [junit4]    >    C:\Users\jenkins\workspace\Lucene-Solr-7.x-Windows\solr\build\contrib\solr-analysis-extras\test\J1\temp\solr.update.processor.TestOpenNLPExtractNamedEntitiesUpdateProcessorFactory_686308EBCC0223C-001\tempDir-001\collection1: java.nio.file.DirectoryNotEmptyException: C:\Users\jenkins\workspace\Lucene-Solr-7.x-Windows\solr\build\contrib\solr-analysis-extras\test\J1\temp\solr.update.processor.TestOpenNLPExtractNamedEntitiesUpdateProcessorFactory_686308EBCC0223C-001\tempDir-001\collection1
   [junit4]    >    C:\Users\jenkins\workspace\Lucene-Solr-7.x-Windows\solr\build\contrib\solr-analysis-extras\test\J1\temp\solr.update.processor.TestOpenNLPExtractNamedEntitiesUpdateProcessorFactory_686308EBCC0223C-001\tempDir-001: java.nio.file.DirectoryNotEmptyException: C:\Users\jenkins\workspace\Lucene-Solr-7.x-Windows\solr\build\contrib\solr-analysis-extras\test\J1\temp\solr.update.processor.TestOpenNLPExtractNamedEntitiesUpdateProcessorFactory_686308EBCC0223C-001\tempDir-001
   [junit4]    >    C:\Users\jenkins\workspace\Lucene-Solr-7.x-Windows\solr\build\contrib\solr-analysis-extras\test\J1\temp\solr.update.processor.TestOpenNLPExtractNamedEntitiesUpdateProcessorFactory_686308EBCC0223C-001\tempDir-001\collection1\conf\en-test-sent.bin: java.nio.file.AccessDeniedException: C:\Users\jenkins\workspace\Lucene-Solr-7.x-Windows\solr\build\contrib\solr-analysis-extras\test\J1\temp\solr.update.processor.TestOpenNLPExtractNamedEntitiesUpdateProcessorFactory_686308EBCC0223C-001\tempDir-001\collection1\conf\en-test-sent.bin
   [junit4]    >    C:\Users\jenkins\workspace\Lucene-Solr-7.x-Windows\solr\build\contrib\solr-analysis-extras\test\J1\temp\solr.update.processor.TestOpenNLPExtractNamedEntitiesUpdateProcessorFactory_686308EBCC0223C-001\tempDir-001\collection1\conf\en-test-ner-person.bin: java.nio.file.AccessDeniedException: C:\Users\jenkins\workspace\Lucene-Solr-7.x-Windows\solr\build\contrib\solr-analysis-extras\test\J1\temp\solr.update.processor.TestOpenNLPExtractNamedEntitiesUpdateProcessorFactory_686308EBCC0223C-001\tempDir-001\collection1\conf\en-test-ner-person.bin
   [junit4]    >    C:\Users\jenkins\workspace\Lucene-Solr-7.x-Windows\solr\build\contrib\solr-analysis-extras\test\J1\temp\solr.update.processor.TestOpenNLPExtractNamedEntitiesUpdateProcessorFactory_686308EBCC0223C-001\tempDir-001\collection1\conf\en-test-tokenizer.bin: java.nio.file.AccessDeniedException: C:\Users\jenkins\workspace\Lucene-Solr-7.x-Windows\solr\build\contrib\solr-analysis-extras\test\J1\temp\solr.update.processor.TestOpenNLPExtractNamedEntitiesUpdateProcessorFactory_686308EBCC0223C-001\tempDir-001\collection1\conf\en-test-tokenizer.bin
   [junit4]    >    C:\Users\jenkins\workspace\Lucene-Solr-7.x-Windows\solr\build\contrib\solr-analysis-extras\test\J1\temp\solr.update.processor.TestOpenNLPExtractNamedEntitiesUpdateProcessorFactory_686308EBCC0223C-001: java.nio.file.DirectoryNotEmptyException: C:\Users\jenkins\workspace\Lucene-Solr-7.x-Windows\solr\build\contrib\solr-analysis-extras\test\J1\temp\solr.update.processor.TestOpenNLPExtractNamedEntitiesUpdateProcessorFactory_686308EBCC0223C-001
   [junit4]    > 	at __randomizedtesting.SeedInfo.seed([686308EBCC0223C]:0)
   [junit4]    > 	at org.apache.lucene.util.IOUtils.rm(IOUtils.java:329)
   [junit4]    > 	at java.lang.Thread.run(Thread.java:748)
   [junit4] Completed [1/5 (1!)] on J1 in 17.97s, 8 tests, 1 error <<< FAILURES!

[...truncated 45745 lines...]

Mime
View raw message