lucene-dev mailing list archives

Site index · List index
Message view « Date » · « Thread »
Top « Date » · « Thread »
From Policeman Jenkins Server <jenk...@thetaphi.de>
Subject [JENKINS] Lucene-Solr-7.x-Windows (64bit/jdk1.8.0_144) - Build # 349 - Still Unstable!
Date Tue, 19 Dec 2017 00:52:48 GMT
Build: https://jenkins.thetaphi.de/job/Lucene-Solr-7.x-Windows/349/
Java: 64bit/jdk1.8.0_144 -XX:+UseCompressedOops -XX:+UseSerialGC

6 tests failed.
FAILED:  junit.framework.TestSuite.org.apache.lucene.store.TestMultiMMap

Error Message:
Could not remove the following files (in the order of attempts):    C:\Users\jenkins\workspace\Lucene-Solr-7.x-Windows\lucene\build\core\test\J0\temp\lucene.store.TestMultiMMap_A2470EF42927C3FE-001\testSeekSliceZero-018: java.nio.file.DirectoryNotEmptyException: C:\Users\jenkins\workspace\Lucene-Solr-7.x-Windows\lucene\build\core\test\J0\temp\lucene.store.TestMultiMMap_A2470EF42927C3FE-001\testSeekSliceZero-018 

Stack Trace:
java.io.IOException: Could not remove the following files (in the order of attempts):
   C:\Users\jenkins\workspace\Lucene-Solr-7.x-Windows\lucene\build\core\test\J0\temp\lucene.store.TestMultiMMap_A2470EF42927C3FE-001\testSeekSliceZero-018: java.nio.file.DirectoryNotEmptyException: C:\Users\jenkins\workspace\Lucene-Solr-7.x-Windows\lucene\build\core\test\J0\temp\lucene.store.TestMultiMMap_A2470EF42927C3FE-001\testSeekSliceZero-018

	at __randomizedtesting.SeedInfo.seed([A2470EF42927C3FE]:0)
	at org.apache.lucene.util.IOUtils.rm(IOUtils.java:329)
	at org.apache.lucene.util.TestRuleTemporaryFilesCleanup.afterAlways(TestRuleTemporaryFilesCleanup.java:216)
	at com.carrotsearch.randomizedtesting.rules.TestRuleAdapter$1.afterAlways(TestRuleAdapter.java:31)
	at com.carrotsearch.randomizedtesting.rules.StatementAdapter.evaluate(StatementAdapter.java:43)
	at com.carrotsearch.randomizedtesting.rules.StatementAdapter.evaluate(StatementAdapter.java:36)
	at org.apache.lucene.util.TestRuleAssertionsRequired$1.evaluate(TestRuleAssertionsRequired.java:53)
	at org.apache.lucene.util.TestRuleMarkFailure$1.evaluate(TestRuleMarkFailure.java:47)
	at org.apache.lucene.util.TestRuleIgnoreAfterMaxFailures$1.evaluate(TestRuleIgnoreAfterMaxFailures.java:64)
	at org.apache.lucene.util.TestRuleIgnoreTestSuites$1.evaluate(TestRuleIgnoreTestSuites.java:54)
	at com.carrotsearch.randomizedtesting.rules.StatementAdapter.evaluate(StatementAdapter.java:36)
	at com.carrotsearch.randomizedtesting.ThreadLeakControl$StatementRunner.run(ThreadLeakControl.java:368)
	at java.lang.Thread.run(Thread.java:748)


FAILED:  org.apache.solr.cloud.autoscaling.TriggerIntegrationTest.testEventQueue

Error Message:
action wasn't interrupted

Stack Trace:
java.lang.AssertionError: action wasn't interrupted
	at __randomizedtesting.SeedInfo.seed([9504AD70F8EB96A5:5CB1EFDEF18C5050]:0)
	at org.junit.Assert.fail(Assert.java:93)
	at org.junit.Assert.assertTrue(Assert.java:43)
	at org.apache.solr.cloud.autoscaling.TriggerIntegrationTest.testEventQueue(TriggerIntegrationTest.java:707)
	at sun.reflect.NativeMethodAccessorImpl.invoke0(Native Method)
	at sun.reflect.NativeMethodAccessorImpl.invoke(NativeMethodAccessorImpl.java:62)
	at sun.reflect.DelegatingMethodAccessorImpl.invoke(DelegatingMethodAccessorImpl.java:43)
	at java.lang.reflect.Method.invoke(Method.java:498)
	at com.carrotsearch.randomizedtesting.RandomizedRunner.invoke(RandomizedRunner.java:1737)
	at com.carrotsearch.randomizedtesting.RandomizedRunner$8.evaluate(RandomizedRunner.java:934)
	at com.carrotsearch.randomizedtesting.RandomizedRunner$9.evaluate(RandomizedRunner.java:970)
	at com.carrotsearch.randomizedtesting.RandomizedRunner$10.evaluate(RandomizedRunner.java:984)
	at com.carrotsearch.randomizedtesting.rules.SystemPropertiesRestoreRule$1.evaluate(SystemPropertiesRestoreRule.java:57)
	at org.apache.lucene.util.TestRuleSetupTeardownChained$1.evaluate(TestRuleSetupTeardownChained.java:49)
	at org.apache.lucene.util.AbstractBeforeAfterRule$1.evaluate(AbstractBeforeAfterRule.java:45)
	at org.apache.lucene.util.TestRuleThreadAndTestName$1.evaluate(TestRuleThreadAndTestName.java:48)
	at org.apache.lucene.util.TestRuleIgnoreAfterMaxFailures$1.evaluate(TestRuleIgnoreAfterMaxFailures.java:64)
	at org.apache.lucene.util.TestRuleMarkFailure$1.evaluate(TestRuleMarkFailure.java:47)
	at com.carrotsearch.randomizedtesting.rules.StatementAdapter.evaluate(StatementAdapter.java:36)
	at com.carrotsearch.randomizedtesting.ThreadLeakControl$StatementRunner.run(ThreadLeakControl.java:368)
	at com.carrotsearch.randomizedtesting.ThreadLeakControl.forkTimeoutingTask(ThreadLeakControl.java:817)
	at com.carrotsearch.randomizedtesting.ThreadLeakControl$3.evaluate(ThreadLeakControl.java:468)
	at com.carrotsearch.randomizedtesting.RandomizedRunner.runSingleTest(RandomizedRunner.java:943)
	at com.carrotsearch.randomizedtesting.RandomizedRunner$5.evaluate(RandomizedRunner.java:829)
	at com.carrotsearch.randomizedtesting.RandomizedRunner$6.evaluate(RandomizedRunner.java:879)
	at com.carrotsearch.randomizedtesting.RandomizedRunner$7.evaluate(RandomizedRunner.java:890)
	at com.carrotsearch.randomizedtesting.rules.StatementAdapter.evaluate(StatementAdapter.java:36)
	at com.carrotsearch.randomizedtesting.rules.SystemPropertiesRestoreRule$1.evaluate(SystemPropertiesRestoreRule.java:57)
	at org.apache.lucene.util.AbstractBeforeAfterRule$1.evaluate(AbstractBeforeAfterRule.java:45)
	at com.carrotsearch.randomizedtesting.rules.StatementAdapter.evaluate(StatementAdapter.java:36)
	at org.apache.lucene.util.TestRuleStoreClassName$1.evaluate(TestRuleStoreClassName.java:41)
	at com.carrotsearch.randomizedtesting.rules.NoShadowingOrOverridesOnMethodsRule$1.evaluate(NoShadowingOrOverridesOnMethodsRule.java:40)
	at com.carrotsearch.randomizedtesting.rules.NoShadowingOrOverridesOnMethodsRule$1.evaluate(NoShadowingOrOverridesOnMethodsRule.java:40)
	at com.carrotsearch.randomizedtesting.rules.StatementAdapter.evaluate(StatementAdapter.java:36)
	at com.carrotsearch.randomizedtesting.rules.StatementAdapter.evaluate(StatementAdapter.java:36)
	at com.carrotsearch.randomizedtesting.rules.StatementAdapter.evaluate(StatementAdapter.java:36)
	at org.apache.lucene.util.TestRuleAssertionsRequired$1.evaluate(TestRuleAssertionsRequired.java:53)
	at org.apache.lucene.util.TestRuleMarkFailure$1.evaluate(TestRuleMarkFailure.java:47)
	at org.apache.lucene.util.TestRuleIgnoreAfterMaxFailures$1.evaluate(TestRuleIgnoreAfterMaxFailures.java:64)
	at org.apache.lucene.util.TestRuleIgnoreTestSuites$1.evaluate(TestRuleIgnoreTestSuites.java:54)
	at com.carrotsearch.randomizedtesting.rules.StatementAdapter.evaluate(StatementAdapter.java:36)
	at com.carrotsearch.randomizedtesting.ThreadLeakControl$StatementRunner.run(ThreadLeakControl.java:368)
	at java.lang.Thread.run(Thread.java:748)


FAILED:  org.apache.solr.cloud.autoscaling.sim.TestGenericDistributedQueue.testDistributedQueue

Error Message:
Test abandoned because suite timeout was reached.

Stack Trace:
java.lang.Exception: Test abandoned because suite timeout was reached.
	at __randomizedtesting.SeedInfo.seed([9504AD70F8EB96A5]:0)


FAILED:  junit.framework.TestSuite.org.apache.solr.cloud.autoscaling.sim.TestGenericDistributedQueue

Error Message:
Suite timeout exceeded (>= 7200000 msec).

Stack Trace:
java.lang.Exception: Suite timeout exceeded (>= 7200000 msec).
	at __randomizedtesting.SeedInfo.seed([9504AD70F8EB96A5]:0)


FAILED:  junit.framework.TestSuite.org.apache.solr.handler.component.TestExpandComponent

Error Message:
Could not remove the following files (in the order of attempts):    C:\Users\jenkins\workspace\Lucene-Solr-7.x-Windows\solr\build\solr-core\test\J1\temp\solr.handler.component.TestExpandComponent_9504AD70F8EB96A5-001\init-core-data-001\tlog: java.nio.file.DirectoryNotEmptyException: C:\Users\jenkins\workspace\Lucene-Solr-7.x-Windows\solr\build\solr-core\test\J1\temp\solr.handler.component.TestExpandComponent_9504AD70F8EB96A5-001\init-core-data-001\tlog    C:\Users\jenkins\workspace\Lucene-Solr-7.x-Windows\solr\build\solr-core\test\J1\temp\solr.handler.component.TestExpandComponent_9504AD70F8EB96A5-001\init-core-data-001: java.nio.file.DirectoryNotEmptyException: C:\Users\jenkins\workspace\Lucene-Solr-7.x-Windows\solr\build\solr-core\test\J1\temp\solr.handler.component.TestExpandComponent_9504AD70F8EB96A5-001\init-core-data-001    C:\Users\jenkins\workspace\Lucene-Solr-7.x-Windows\solr\build\solr-core\test\J1\temp\solr.handler.component.TestExpandComponent_9504AD70F8EB96A5-001\init-core-data-001\tlog\tlog.0000000000000000005: java.nio.file.AccessDeniedException: C:\Users\jenkins\workspace\Lucene-Solr-7.x-Windows\solr\build\solr-core\test\J1\temp\solr.handler.component.TestExpandComponent_9504AD70F8EB96A5-001\init-core-data-001\tlog\tlog.0000000000000000005    C:\Users\jenkins\workspace\Lucene-Solr-7.x-Windows\solr\build\solr-core\test\J1\temp\solr.handler.component.TestExpandComponent_9504AD70F8EB96A5-001: java.nio.file.DirectoryNotEmptyException: C:\Users\jenkins\workspace\Lucene-Solr-7.x-Windows\solr\build\solr-core\test\J1\temp\solr.handler.component.TestExpandComponent_9504AD70F8EB96A5-001 

Stack Trace:
java.io.IOException: Could not remove the following files (in the order of attempts):
   C:\Users\jenkins\workspace\Lucene-Solr-7.x-Windows\solr\build\solr-core\test\J1\temp\solr.handler.component.TestExpandComponent_9504AD70F8EB96A5-001\init-core-data-001\tlog: java.nio.file.DirectoryNotEmptyException: C:\Users\jenkins\workspace\Lucene-Solr-7.x-Windows\solr\build\solr-core\test\J1\temp\solr.handler.component.TestExpandComponent_9504AD70F8EB96A5-001\init-core-data-001\tlog
   C:\Users\jenkins\workspace\Lucene-Solr-7.x-Windows\solr\build\solr-core\test\J1\temp\solr.handler.component.TestExpandComponent_9504AD70F8EB96A5-001\init-core-data-001: java.nio.file.DirectoryNotEmptyException: C:\Users\jenkins\workspace\Lucene-Solr-7.x-Windows\solr\build\solr-core\test\J1\temp\solr.handler.component.TestExpandComponent_9504AD70F8EB96A5-001\init-core-data-001
   C:\Users\jenkins\workspace\Lucene-Solr-7.x-Windows\solr\build\solr-core\test\J1\temp\solr.handler.component.TestExpandComponent_9504AD70F8EB96A5-001\init-core-data-001\tlog\tlog.0000000000000000005: java.nio.file.AccessDeniedException: C:\Users\jenkins\workspace\Lucene-Solr-7.x-Windows\solr\build\solr-core\test\J1\temp\solr.handler.component.TestExpandComponent_9504AD70F8EB96A5-001\init-core-data-001\tlog\tlog.0000000000000000005
   C:\Users\jenkins\workspace\Lucene-Solr-7.x-Windows\solr\build\solr-core\test\J1\temp\solr.handler.component.TestExpandComponent_9504AD70F8EB96A5-001: java.nio.file.DirectoryNotEmptyException: C:\Users\jenkins\workspace\Lucene-Solr-7.x-Windows\solr\build\solr-core\test\J1\temp\solr.handler.component.TestExpandComponent_9504AD70F8EB96A5-001

	at __randomizedtesting.SeedInfo.seed([9504AD70F8EB96A5]:0)
	at org.apache.lucene.util.IOUtils.rm(IOUtils.java:329)
	at org.apache.lucene.util.TestRuleTemporaryFilesCleanup.afterAlways(TestRuleTemporaryFilesCleanup.java:216)
	at com.carrotsearch.randomizedtesting.rules.TestRuleAdapter$1.afterAlways(TestRuleAdapter.java:31)
	at com.carrotsearch.randomizedtesting.rules.StatementAdapter.evaluate(StatementAdapter.java:43)
	at com.carrotsearch.randomizedtesting.rules.StatementAdapter.evaluate(StatementAdapter.java:36)
	at org.apache.lucene.util.TestRuleAssertionsRequired$1.evaluate(TestRuleAssertionsRequired.java:53)
	at org.apache.lucene.util.TestRuleMarkFailure$1.evaluate(TestRuleMarkFailure.java:47)
	at org.apache.lucene.util.TestRuleIgnoreAfterMaxFailures$1.evaluate(TestRuleIgnoreAfterMaxFailures.java:64)
	at org.apache.lucene.util.TestRuleIgnoreTestSuites$1.evaluate(TestRuleIgnoreTestSuites.java:54)
	at com.carrotsearch.randomizedtesting.rules.StatementAdapter.evaluate(StatementAdapter.java:36)
	at com.carrotsearch.randomizedtesting.ThreadLeakControl$StatementRunner.run(ThreadLeakControl.java:368)
	at java.lang.Thread.run(Thread.java:748)


FAILED:  junit.framework.TestSuite.org.apache.solr.update.processor.TestOpenNLPExtractNamedEntitiesUpdateProcessorFactory

Error Message:
Could not remove the following files (in the order of attempts):    C:\Users\jenkins\workspace\Lucene-Solr-7.x-Windows\solr\build\contrib\solr-analysis-extras\test\J1\temp\solr.update.processor.TestOpenNLPExtractNamedEntitiesUpdateProcessorFactory_8F8BFE8221EB2B3D-001\tempDir-001\collection1\conf: java.nio.file.DirectoryNotEmptyException: C:\Users\jenkins\workspace\Lucene-Solr-7.x-Windows\solr\build\contrib\solr-analysis-extras\test\J1\temp\solr.update.processor.TestOpenNLPExtractNamedEntitiesUpdateProcessorFactory_8F8BFE8221EB2B3D-001\tempDir-001\collection1\conf    C:\Users\jenkins\workspace\Lucene-Solr-7.x-Windows\solr\build\contrib\solr-analysis-extras\test\J1\temp\solr.update.processor.TestOpenNLPExtractNamedEntitiesUpdateProcessorFactory_8F8BFE8221EB2B3D-001\tempDir-001\collection1: java.nio.file.DirectoryNotEmptyException: C:\Users\jenkins\workspace\Lucene-Solr-7.x-Windows\solr\build\contrib\solr-analysis-extras\test\J1\temp\solr.update.processor.TestOpenNLPExtractNamedEntitiesUpdateProcessorFactory_8F8BFE8221EB2B3D-001\tempDir-001\collection1    C:\Users\jenkins\workspace\Lucene-Solr-7.x-Windows\solr\build\contrib\solr-analysis-extras\test\J1\temp\solr.update.processor.TestOpenNLPExtractNamedEntitiesUpdateProcessorFactory_8F8BFE8221EB2B3D-001\tempDir-001: java.nio.file.DirectoryNotEmptyException: C:\Users\jenkins\workspace\Lucene-Solr-7.x-Windows\solr\build\contrib\solr-analysis-extras\test\J1\temp\solr.update.processor.TestOpenNLPExtractNamedEntitiesUpdateProcessorFactory_8F8BFE8221EB2B3D-001\tempDir-001    C:\Users\jenkins\workspace\Lucene-Solr-7.x-Windows\solr\build\contrib\solr-analysis-extras\test\J1\temp\solr.update.processor.TestOpenNLPExtractNamedEntitiesUpdateProcessorFactory_8F8BFE8221EB2B3D-001\tempDir-001\collection1\conf\en-test-tokenizer.bin: java.nio.file.AccessDeniedException: C:\Users\jenkins\workspace\Lucene-Solr-7.x-Windows\solr\build\contrib\solr-analysis-extras\test\J1\temp\solr.update.processor.TestOpenNLPExtractNamedEntitiesUpdateProcessorFactory_8F8BFE8221EB2B3D-001\tempDir-001\collection1\conf\en-test-tokenizer.bin    C:\Users\jenkins\workspace\Lucene-Solr-7.x-Windows\solr\build\contrib\solr-analysis-extras\test\J1\temp\solr.update.processor.TestOpenNLPExtractNamedEntitiesUpdateProcessorFactory_8F8BFE8221EB2B3D-001\tempDir-001\collection1\conf\en-test-sent.bin: java.nio.file.AccessDeniedException: C:\Users\jenkins\workspace\Lucene-Solr-7.x-Windows\solr\build\contrib\solr-analysis-extras\test\J1\temp\solr.update.processor.TestOpenNLPExtractNamedEntitiesUpdateProcessorFactory_8F8BFE8221EB2B3D-001\tempDir-001\collection1\conf\en-test-sent.bin    C:\Users\jenkins\workspace\Lucene-Solr-7.x-Windows\solr\build\contrib\solr-analysis-extras\test\J1\temp\solr.update.processor.TestOpenNLPExtractNamedEntitiesUpdateProcessorFactory_8F8BFE8221EB2B3D-001\tempDir-001\collection1\conf\en-test-ner-person.bin: java.nio.file.AccessDeniedException: C:\Users\jenkins\workspace\Lucene-Solr-7.x-Windows\solr\build\contrib\solr-analysis-extras\test\J1\temp\solr.update.processor.TestOpenNLPExtractNamedEntitiesUpdateProcessorFactory_8F8BFE8221EB2B3D-001\tempDir-001\collection1\conf\en-test-ner-person.bin    C:\Users\jenkins\workspace\Lucene-Solr-7.x-Windows\solr\build\contrib\solr-analysis-extras\test\J1\temp\solr.update.processor.TestOpenNLPExtractNamedEntitiesUpdateProcessorFactory_8F8BFE8221EB2B3D-001: java.nio.file.DirectoryNotEmptyException: C:\Users\jenkins\workspace\Lucene-Solr-7.x-Windows\solr\build\contrib\solr-analysis-extras\test\J1\temp\solr.update.processor.TestOpenNLPExtractNamedEntitiesUpdateProcessorFactory_8F8BFE8221EB2B3D-001 

Stack Trace:
java.io.IOException: Could not remove the following files (in the order of attempts):
   C:\Users\jenkins\workspace\Lucene-Solr-7.x-Windows\solr\build\contrib\solr-analysis-extras\test\J1\temp\solr.update.processor.TestOpenNLPExtractNamedEntitiesUpdateProcessorFactory_8F8BFE8221EB2B3D-001\tempDir-001\collection1\conf: java.nio.file.DirectoryNotEmptyException: C:\Users\jenkins\workspace\Lucene-Solr-7.x-Windows\solr\build\contrib\solr-analysis-extras\test\J1\temp\solr.update.processor.TestOpenNLPExtractNamedEntitiesUpdateProcessorFactory_8F8BFE8221EB2B3D-001\tempDir-001\collection1\conf
   C:\Users\jenkins\workspace\Lucene-Solr-7.x-Windows\solr\build\contrib\solr-analysis-extras\test\J1\temp\solr.update.processor.TestOpenNLPExtractNamedEntitiesUpdateProcessorFactory_8F8BFE8221EB2B3D-001\tempDir-001\collection1: java.nio.file.DirectoryNotEmptyException: C:\Users\jenkins\workspace\Lucene-Solr-7.x-Windows\solr\build\contrib\solr-analysis-extras\test\J1\temp\solr.update.processor.TestOpenNLPExtractNamedEntitiesUpdateProcessorFactory_8F8BFE8221EB2B3D-001\tempDir-001\collection1
   C:\Users\jenkins\workspace\Lucene-Solr-7.x-Windows\solr\build\contrib\solr-analysis-extras\test\J1\temp\solr.update.processor.TestOpenNLPExtractNamedEntitiesUpdateProcessorFactory_8F8BFE8221EB2B3D-001\tempDir-001: java.nio.file.DirectoryNotEmptyException: C:\Users\jenkins\workspace\Lucene-Solr-7.x-Windows\solr\build\contrib\solr-analysis-extras\test\J1\temp\solr.update.processor.TestOpenNLPExtractNamedEntitiesUpdateProcessorFactory_8F8BFE8221EB2B3D-001\tempDir-001
   C:\Users\jenkins\workspace\Lucene-Solr-7.x-Windows\solr\build\contrib\solr-analysis-extras\test\J1\temp\solr.update.processor.TestOpenNLPExtractNamedEntitiesUpdateProcessorFactory_8F8BFE8221EB2B3D-001\tempDir-001\collection1\conf\en-test-tokenizer.bin: java.nio.file.AccessDeniedException: C:\Users\jenkins\workspace\Lucene-Solr-7.x-Windows\solr\build\contrib\solr-analysis-extras\test\J1\temp\solr.update.processor.TestOpenNLPExtractNamedEntitiesUpdateProcessorFactory_8F8BFE8221EB2B3D-001\tempDir-001\collection1\conf\en-test-tokenizer.bin
   C:\Users\jenkins\workspace\Lucene-Solr-7.x-Windows\solr\build\contrib\solr-analysis-extras\test\J1\temp\solr.update.processor.TestOpenNLPExtractNamedEntitiesUpdateProcessorFactory_8F8BFE8221EB2B3D-001\tempDir-001\collection1\conf\en-test-sent.bin: java.nio.file.AccessDeniedException: C:\Users\jenkins\workspace\Lucene-Solr-7.x-Windows\solr\build\contrib\solr-analysis-extras\test\J1\temp\solr.update.processor.TestOpenNLPExtractNamedEntitiesUpdateProcessorFactory_8F8BFE8221EB2B3D-001\tempDir-001\collection1\conf\en-test-sent.bin
   C:\Users\jenkins\workspace\Lucene-Solr-7.x-Windows\solr\build\contrib\solr-analysis-extras\test\J1\temp\solr.update.processor.TestOpenNLPExtractNamedEntitiesUpdateProcessorFactory_8F8BFE8221EB2B3D-001\tempDir-001\collection1\conf\en-test-ner-person.bin: java.nio.file.AccessDeniedException: C:\Users\jenkins\workspace\Lucene-Solr-7.x-Windows\solr\build\contrib\solr-analysis-extras\test\J1\temp\solr.update.processor.TestOpenNLPExtractNamedEntitiesUpdateProcessorFactory_8F8BFE8221EB2B3D-001\tempDir-001\collection1\conf\en-test-ner-person.bin
   C:\Users\jenkins\workspace\Lucene-Solr-7.x-Windows\solr\build\contrib\solr-analysis-extras\test\J1\temp\solr.update.processor.TestOpenNLPExtractNamedEntitiesUpdateProcessorFactory_8F8BFE8221EB2B3D-001: java.nio.file.DirectoryNotEmptyException: C:\Users\jenkins\workspace\Lucene-Solr-7.x-Windows\solr\build\contrib\solr-analysis-extras\test\J1\temp\solr.update.processor.TestOpenNLPExtractNamedEntitiesUpdateProcessorFactory_8F8BFE8221EB2B3D-001

	at __randomizedtesting.SeedInfo.seed([8F8BFE8221EB2B3D]:0)
	at org.apache.lucene.util.IOUtils.rm(IOUtils.java:329)
	at org.apache.lucene.util.TestRuleTemporaryFilesCleanup.afterAlways(TestRuleTemporaryFilesCleanup.java:216)
	at com.carrotsearch.randomizedtesting.rules.TestRuleAdapter$1.afterAlways(TestRuleAdapter.java:31)
	at com.carrotsearch.randomizedtesting.rules.StatementAdapter.evaluate(StatementAdapter.java:43)
	at com.carrotsearch.randomizedtesting.rules.StatementAdapter.evaluate(StatementAdapter.java:36)
	at org.apache.lucene.util.TestRuleAssertionsRequired$1.evaluate(TestRuleAssertionsRequired.java:53)
	at org.apache.lucene.util.TestRuleMarkFailure$1.evaluate(TestRuleMarkFailure.java:47)
	at org.apache.lucene.util.TestRuleIgnoreAfterMaxFailures$1.evaluate(TestRuleIgnoreAfterMaxFailures.java:64)
	at org.apache.lucene.util.TestRuleIgnoreTestSuites$1.evaluate(TestRuleIgnoreTestSuites.java:54)
	at com.carrotsearch.randomizedtesting.rules.StatementAdapter.evaluate(StatementAdapter.java:36)
	at com.carrotsearch.randomizedtesting.ThreadLeakControl$StatementRunner.run(ThreadLeakControl.java:368)
	at java.lang.Thread.run(Thread.java:748)




Build Log:
[...truncated 1007 lines...]
   [junit4] Suite: org.apache.lucene.store.TestMultiMMap
   [junit4]   2> NOTE: test params are: codec=CheapBastard, sim=RandomSimilarity(queryNorm=false): {}, locale=no-NO, timezone=Asia/Gaza
   [junit4]   2> NOTE: Windows 10 10.0 amd64/Oracle Corporation 1.8.0_144 (64-bit)/cpus=3,threads=1,free=67415544,total=97386496
   [junit4]   2> NOTE: All tests run in this JVM: [TestBinaryTerms, TestTerms, TestSloppyPhraseQuery, TestPayloadsOnVectors, TestIndexWriterWithThreads, TestConjunctions, TestWordlistLoader, TestFilterWeight, TestDocsAndPositions, TestSpansEnum, TestRecyclingIntBlockAllocator, TestStandardAnalyzer, TestSortRescorer, TestDirectPacked, TestDateSort, TestIndexWriterMerging, TestMatchNoDocsQuery, TestNoMergePolicy, TestLucene70DocValuesFormat, TestParallelCompositeReader, TestBoolean2ScorerSupplier, TestTopDocsMerge, TestHugeRamFile, TestForUtil, TestFrequencyTrackingRingBuffer, TestIndexWriterMergePolicy, TestSpans, TestCodecs, TestMutablePointsReaderUtils, TestIndexWriterOnVMError, TestCloseableThreadLocal, TestTimeLimitingCollector, TestBoostQuery, TestNativeFSLockFactory, TestTwoPhaseCommitTool, TestSimpleFSDirectory, TestHighCompressionMode, TestIndexOrDocValuesQuery, TestByteArrayDataInput, TestArrayUtil, TestQueryRescorer, TestBooleanSimilarity, TestBKD, TestPrefixQuery, TestCharacterUtils, TestIntBlockPool, TestSpanOrQuery, TestTermScorer, TestLongRangeFieldQueries, TestAssertions, TestRegexpQuery, TestIndexSorting, TestDoc, TestLucene70SegmentInfoFormat, TestIndexWriterUnicode, TestIndexWriterThreadsToSegments, TestLockFactory, TestAttributeSource, TestDuelingCodecs, TestIOUtils, TestCollectionUtil, TestWildcardRandom, TestBooleanOr, TestOneMergeWrappingMergePolicy, FiniteStringsIteratorTest, TestFilterDirectory, TestMultiThreadTermVectors, TestCodecHoldsOpenFiles, TestBagOfPostings, TestMixedDocValuesUpdates, TestCharFilter, TestCharArrayMap, TestPrefixRandom, TestBooleanQueryVisitSubscorers, TestPositionIncrement, TestReusableStringReader, TestNeverDelete, TestSameScoresWithThreads, TestAddIndexes, TestSumDocFreq, TestDirectoryReader, TestAllFilesHaveCodecHeader, TestBlockPostingsFormat2, TestBooleanMinShouldMatch, TestLucene50StoredFieldsFormat, TestSparseFixedBitDocIdSet, TestRegexpRandom, TestSpanCollection, TestFlushByRamOrCountsPolicy, TestBooleanQuery, TestRegexpRandom2, TestUnicodeUtil, TestDoubleValuesSource, TestMergePolicyWrapper, MultiCollectorTest, TestSort, TestNormsFieldExistsQuery, TestExternalCodecs, TestPolygon, TestPointValues, TestBytesRef, TestThreadedForceMerge, TestMutableValues, TestTrackingDirectoryWrapper, TestMultiMMap]
   [junit4]   2> NOTE: reproduce with: ant test  -Dtestcase=TestMultiMMap -Dtests.seed=A2470EF42927C3FE -Dtests.slow=true -Dtests.locale=no-NO -Dtests.timezone=Asia/Gaza -Dtests.asserts=true -Dtests.file.encoding=Cp1252
   [junit4] ERROR   0.00s J0 | TestMultiMMap (suite) <<<
   [junit4]    > Throwable #1: java.io.IOException: Could not remove the following files (in the order of attempts):
   [junit4]    >    C:\Users\jenkins\workspace\Lucene-Solr-7.x-Windows\lucene\build\core\test\J0\temp\lucene.store.TestMultiMMap_A2470EF42927C3FE-001\testSeekSliceZero-018: java.nio.file.DirectoryNotEmptyException: C:\Users\jenkins\workspace\Lucene-Solr-7.x-Windows\lucene\build\core\test\J0\temp\lucene.store.TestMultiMMap_A2470EF42927C3FE-001\testSeekSliceZero-018
   [junit4]    > 	at __randomizedtesting.SeedInfo.seed([A2470EF42927C3FE]:0)
   [junit4]    > 	at org.apache.lucene.util.IOUtils.rm(IOUtils.java:329)
   [junit4]    > 	at java.lang.Thread.run(Thread.java:748)
   [junit4] Completed [236/458 (1!)] on J0 in 3.00s, 54 tests, 1 error <<< FAILURES!

[...truncated 10829 lines...]
   [junit4] Suite: org.apache.solr.cloud.autoscaling.TriggerIntegrationTest
   [junit4]   2> Creating dataDir: C:\Users\jenkins\workspace\Lucene-Solr-7.x-Windows\solr\build\solr-core\test\J0\temp\solr.cloud.autoscaling.TriggerIntegrationTest_9504AD70F8EB96A5-001\init-core-data-001
   [junit4]   2> 131707 INFO  (SUITE-TriggerIntegrationTest-seed#[9504AD70F8EB96A5]-worker) [    ] o.a.s.SolrTestCaseJ4 Using PointFields (NUMERIC_POINTS_SYSPROP=true) w/NUMERIC_DOCVALUES_SYSPROP=false
   [junit4]   2> 131714 INFO  (SUITE-TriggerIntegrationTest-seed#[9504AD70F8EB96A5]-worker) [    ] o.a.s.SolrTestCaseJ4 Randomized ssl (false) and clientAuth (false) via: @org.apache.solr.util.RandomizeSSL(reason=, value=NaN, ssl=NaN, clientAuth=NaN)
   [junit4]   2> 131714 INFO  (SUITE-TriggerIntegrationTest-seed#[9504AD70F8EB96A5]-worker) [    ] o.a.s.SolrTestCaseJ4 SecureRandom sanity checks: test.solr.allowed.securerandom=null & java.security.egd=file:/dev/./urandom
   [junit4]   2> 131716 INFO  (SUITE-TriggerIntegrationTest-seed#[9504AD70F8EB96A5]-worker) [    ] o.a.s.c.MiniSolrCloudCluster Starting cluster of 2 servers in C:\Users\jenkins\workspace\Lucene-Solr-7.x-Windows\solr\build\solr-core\test\J0\temp\solr.cloud.autoscaling.TriggerIntegrationTest_9504AD70F8EB96A5-001\tempDir-001
   [junit4]   2> 131717 INFO  (SUITE-TriggerIntegrationTest-seed#[9504AD70F8EB96A5]-worker) [    ] o.a.s.c.ZkTestServer STARTING ZK TEST SERVER
   [junit4]   2> 131717 INFO  (Thread-225) [    ] o.a.s.c.ZkTestServer client port:0.0.0.0/0.0.0.0:0
   [junit4]   2> 131717 INFO  (Thread-225) [    ] o.a.s.c.ZkTestServer Starting server
   [junit4]   2> 131722 ERROR (Thread-225) [    ] o.a.z.s.ZooKeeperServer ZKShutdownHandler is not registered, so ZooKeeper server won't take any action on ERROR or SHUTDOWN server state changes
   [junit4]   2> 131817 INFO  (SUITE-TriggerIntegrationTest-seed#[9504AD70F8EB96A5]-worker) [    ] o.a.s.c.ZkTestServer start zk server on port:58688
   [junit4]   2> 131823 INFO  (zkConnectionManagerCallback-212-thread-1) [    ] o.a.s.c.c.ConnectionManager zkClient has connected
   [junit4]   2> 131825 WARN  (NIOServerCxn.Factory:0.0.0.0/0.0.0.0:0) [    ] o.a.z.s.NIOServerCnxn caught end of stream exception
   [junit4]   2> EndOfStreamException: Unable to read additional data from client sessionid 0x1606b9c27510000, likely client has closed socket
   [junit4]   2> 	at org.apache.zookeeper.server.NIOServerCnxn.doIO(NIOServerCnxn.java:239)
   [junit4]   2> 	at org.apache.zookeeper.server.NIOServerCnxnFactory.run(NIOServerCnxnFactory.java:203)
   [junit4]   2> 	at java.lang.Thread.run(Thread.java:748)
   [junit4]   2> 131829 INFO  (jetty-launcher-209-thread-2) [    ] o.e.j.s.Server jetty-9.3.20.v20170531
   [junit4]   2> 131830 INFO  (jetty-launcher-209-thread-2) [    ] o.e.j.s.h.ContextHandler Started o.e.j.s.ServletContextHandler@d1d469{/solr,null,AVAILABLE}
   [junit4]   2> 131832 INFO  (jetty-launcher-209-thread-2) [    ] o.e.j.s.AbstractConnector Started ServerConnector@5fc47b6e{HTTP/1.1,[http/1.1]}{127.0.0.1:58692}
   [junit4]   2> 131832 INFO  (jetty-launcher-209-thread-2) [    ] o.e.j.s.Server Started @141875ms
   [junit4]   2> 131832 INFO  (jetty-launcher-209-thread-2) [    ] o.a.s.c.s.e.JettySolrRunner Jetty properties: {hostContext=/solr, hostPort=58692}
   [junit4]   2> 131832 ERROR (jetty-launcher-209-thread-2) [    ] o.a.s.u.StartupLoggingUtils Missing Java Option solr.log.dir. Logging may be missing or incomplete.
   [junit4]   2> 131832 INFO  (jetty-launcher-209-thread-2) [    ] o.a.s.s.SolrDispatchFilter  ___      _       Welcome to Apache Solr™ version 7.3.0
   [junit4]   2> 131832 INFO  (jetty-launcher-209-thread-2) [    ] o.a.s.s.SolrDispatchFilter / __| ___| |_ _   Starting in cloud mode on port null
   [junit4]   2> 131832 INFO  (jetty-launcher-209-thread-2) [    ] o.a.s.s.SolrDispatchFilter \__ \/ _ \ | '_|  Install dir: null
   [junit4]   2> 131832 INFO  (jetty-launcher-209-thread-2) [    ] o.a.s.s.SolrDispatchFilter |___/\___/_|_|    Start time: 2017-12-18T21:51:24.095Z
   [junit4]   2> 131833 INFO  (jetty-launcher-209-thread-1) [    ] o.e.j.s.Server jetty-9.3.20.v20170531
   [junit4]   2> 131834 INFO  (jetty-launcher-209-thread-1) [    ] o.e.j.s.h.ContextHandler Started o.e.j.s.ServletContextHandler@54a8c7d{/solr,null,AVAILABLE}
   [junit4]   2> 131837 INFO  (jetty-launcher-209-thread-1) [    ] o.e.j.s.AbstractConnector Started ServerConnector@480d0f0e{HTTP/1.1,[http/1.1]}{127.0.0.1:58697}
   [junit4]   2> 131837 INFO  (jetty-launcher-209-thread-1) [    ] o.e.j.s.Server Started @141880ms
   [junit4]   2> 131837 INFO  (jetty-launcher-209-thread-1) [    ] o.a.s.c.s.e.JettySolrRunner Jetty properties: {hostContext=/solr, hostPort=58697}
   [junit4]   2> 131838 ERROR (jetty-launcher-209-thread-1) [    ] o.a.s.u.StartupLoggingUtils Missing Java Option solr.log.dir. Logging may be missing or incomplete.
   [junit4]   2> 131838 INFO  (jetty-launcher-209-thread-1) [    ] o.a.s.s.SolrDispatchFilter  ___      _       Welcome to Apache Solr™ version 7.3.0
   [junit4]   2> 131838 INFO  (jetty-launcher-209-thread-1) [    ] o.a.s.s.SolrDispatchFilter / __| ___| |_ _   Starting in cloud mode on port null
   [junit4]   2> 131838 INFO  (jetty-launcher-209-thread-1) [    ] o.a.s.s.SolrDispatchFilter \__ \/ _ \ | '_|  Install dir: null
   [junit4]   2> 131838 INFO  (jetty-launcher-209-thread-1) [    ] o.a.s.s.SolrDispatchFilter |___/\___/_|_|    Start time: 2017-12-18T21:51:24.101Z
   [junit4]   2> 131838 INFO  (zkConnectionManagerCallback-214-thread-1) [    ] o.a.s.c.c.ConnectionManager zkClient has connected
   [junit4]   2> 131839 INFO  (jetty-launcher-209-thread-2) [    ] o.a.s.s.SolrDispatchFilter solr.xml found in ZooKeeper. Loading...
   [junit4]   2> 131841 INFO  (zkConnectionManagerCallback-216-thread-1) [    ] o.a.s.c.c.ConnectionManager zkClient has connected
   [junit4]   2> 131843 INFO  (jetty-launcher-209-thread-1) [    ] o.a.s.s.SolrDispatchFilter solr.xml found in ZooKeeper. Loading...
   [junit4]   2> 131864 INFO  (jetty-launcher-209-thread-2) [    ] o.a.s.c.ZkContainer Zookeeper client=127.0.0.1:58688/solr
   [junit4]   2> 131865 INFO  (jetty-launcher-209-thread-1) [    ] o.a.s.c.ZkContainer Zookeeper client=127.0.0.1:58688/solr
   [junit4]   2> 131867 INFO  (zkConnectionManagerCallback-221-thread-1) [    ] o.a.s.c.c.ConnectionManager zkClient has connected
   [junit4]   2> 131871 WARN  (NIOServerCxn.Factory:0.0.0.0/0.0.0.0:0) [    ] o.a.z.s.NIOServerCnxn caught end of stream exception
   [junit4]   2> EndOfStreamException: Unable to read additional data from client sessionid 0x1606b9c27510003, likely client has closed socket
   [junit4]   2> 	at org.apache.zookeeper.server.NIOServerCnxn.doIO(NIOServerCnxn.java:239)
   [junit4]   2> 	at org.apache.zookeeper.server.NIOServerCnxnFactory.run(NIOServerCnxnFactory.java:203)
   [junit4]   2> 	at java.lang.Thread.run(Thread.java:748)
   [junit4]   2> 131873 INFO  (zkConnectionManagerCallback-224-thread-1) [    ] o.a.s.c.c.ConnectionManager zkClient has connected
   [junit4]   2> 131873 INFO  (zkConnectionManagerCallback-226-thread-1-processing-n:127.0.0.1:58692_solr) [n:127.0.0.1:58692_solr    ] o.a.s.c.c.ConnectionManager zkClient has connected
   [junit4]   2> 131878 INFO  (zkConnectionManagerCallback-228-thread-1-processing-n:127.0.0.1:58697_solr) [n:127.0.0.1:58697_solr    ] o.a.s.c.c.ConnectionManager zkClient has connected
   [junit4]   2> 131978 INFO  (jetty-launcher-209-thread-2) [n:127.0.0.1:58692_solr    ] o.a.s.c.Overseer Overseer (id=null) closing
   [junit4]   2> 131979 INFO  (jetty-launcher-209-thread-2) [n:127.0.0.1:58692_solr    ] o.a.s.c.OverseerElectionContext I am going to be the leader 127.0.0.1:58692_solr
   [junit4]   2> 131980 INFO  (jetty-launcher-209-thread-2) [n:127.0.0.1:58692_solr    ] o.a.s.c.Overseer Overseer (id=99197510220840965-127.0.0.1:58692_solr-n_0000000000) starting
   [junit4]   2> 131981 INFO  (jetty-launcher-209-thread-1) [n:127.0.0.1:58697_solr    ] o.a.s.c.Overseer Overseer (id=null) closing
   [junit4]   2> 131982 INFO  (jetty-launcher-209-thread-1) [n:127.0.0.1:58697_solr    ] o.a.s.c.ZkController Register node as live in ZooKeeper:/live_nodes/127.0.0.1:58697_solr
   [junit4]   2> 131987 INFO  (zkCallback-227-thread-1-processing-n:127.0.0.1:58697_solr) [n:127.0.0.1:58697_solr    ] o.a.s.c.c.ZkStateReader Updated live nodes from ZooKeeper... (0) -> (1)
   [junit4]   2> 131988 INFO  (zkCallback-225-thread-1-processing-n:127.0.0.1:58692_solr) [n:127.0.0.1:58692_solr    ] o.a.s.c.c.ZkStateReader Updated live nodes from ZooKeeper... (0) -> (1)
   [junit4]   2> 131993 INFO  (jetty-launcher-209-thread-2) [n:127.0.0.1:58692_solr    ] o.a.s.c.ZkController Register node as live in ZooKeeper:/live_nodes/127.0.0.1:58692_solr
   [junit4]   2> 131995 DEBUG (OverseerAutoScalingTriggerThread-99197510220840965-127.0.0.1:58692_solr-n_0000000000) [n:127.0.0.1:58692_solr    ] o.a.s.c.a.OverseerTriggerThread Adding .autoAddReplicas trigger
   [junit4]   2> 132047 INFO  (zkCallback-227-thread-1-processing-n:127.0.0.1:58697_solr) [n:127.0.0.1:58697_solr    ] o.a.s.c.c.ZkStateReader Updated live nodes from ZooKeeper... (1) -> (2)
   [junit4]   2> 132047 INFO  (OverseerStateUpdate-99197510220840965-127.0.0.1:58692_solr-n_0000000000) [n:127.0.0.1:58692_solr    ] o.a.s.c.c.ZkStateReader Updated live nodes from ZooKeeper... (1) -> (2)
   [junit4]   2> 132048 DEBUG (OverseerAutoScalingTriggerThread-99197510220840965-127.0.0.1:58692_solr-n_0000000000) [n:127.0.0.1:58692_solr    ] o.a.s.c.a.OverseerTriggerThread Refreshing /autoscaling.json with znode version 1
   [junit4]   2> 132049 DEBUG (OverseerAutoScalingTriggerThread-99197510220840965-127.0.0.1:58692_solr-n_0000000000) [n:127.0.0.1:58692_solr    ] o.a.s.c.a.NodeLostTrigger Initial livenodes: [127.0.0.1:58692_solr, 127.0.0.1:58697_solr]
   [junit4]   2> 132049 DEBUG (OverseerAutoScalingTriggerThread-99197510220840965-127.0.0.1:58692_solr-n_0000000000) [n:127.0.0.1:58692_solr    ] o.a.s.c.a.OverseerTriggerThread Current znodeVersion 1, lastZnodeVersion -1
   [junit4]   2> 132049 DEBUG (OverseerAutoScalingTriggerThread-99197510220840965-127.0.0.1:58692_solr-n_0000000000) [n:127.0.0.1:58692_solr    ] o.a.s.c.a.OverseerTriggerThread Processed trigger updates upto znodeVersion 1
   [junit4]   2> 132052 DEBUG (OverseerAutoScalingTriggerThread-99197510220840965-127.0.0.1:58692_solr-n_0000000000) [n:127.0.0.1:58692_solr    ] o.a.s.c.a.OverseerTriggerThread -- clean old nodeAdded markers
   [junit4]   2> 132052 DEBUG (OverseerAutoScalingTriggerThread-99197510220840965-127.0.0.1:58692_solr-n_0000000000) [n:127.0.0.1:58692_solr    ] o.a.s.c.a.OverseerTriggerThread Current znodeVersion 1, lastZnodeVersion 1
   [junit4]   2> 132061 DEBUG (ScheduledTrigger-395-thread-1) [n:127.0.0.1:58692_solr    ] o.a.s.c.a.NodeLostTrigger Running NodeLostTrigger: .auto_add_replicas with currently live nodes: 2
   [junit4]   2> 132171 INFO  (jetty-launcher-209-thread-2) [n:127.0.0.1:58692_solr    ] o.a.s.m.r.SolrJmxReporter JMX monitoring for 'solr_58692.solr.node' (registry 'solr.node') enabled at server: com.sun.jmx.mbeanserver.JmxMBeanServer@492ec68f
   [junit4]   2> 132175 INFO  (jetty-launcher-209-thread-1) [n:127.0.0.1:58697_solr    ] o.a.s.m.r.SolrJmxReporter JMX monitoring for 'solr_58697.solr.node' (registry 'solr.node') enabled at server: com.sun.jmx.mbeanserver.JmxMBeanServer@492ec68f
   [junit4]   2> 132190 INFO  (jetty-launcher-209-thread-2) [n:127.0.0.1:58692_solr    ] o.a.s.m.r.SolrJmxReporter JMX monitoring for 'solr_58692.solr.jvm' (registry 'solr.jvm') enabled at server: com.sun.jmx.mbeanserver.JmxMBeanServer@492ec68f
   [junit4]   2> 132190 INFO  (jetty-launcher-209-thread-2) [n:127.0.0.1:58692_solr    ] o.a.s.m.r.SolrJmxReporter JMX monitoring for 'solr_58692.solr.jetty' (registry 'solr.jetty') enabled at server: com.sun.jmx.mbeanserver.JmxMBeanServer@492ec68f
   [junit4]   2> 132193 INFO  (jetty-launcher-209-thread-1) [n:127.0.0.1:58697_solr    ] o.a.s.m.r.SolrJmxReporter JMX monitoring for 'solr_58697.solr.jvm' (registry 'solr.jvm') enabled at server: com.sun.jmx.mbeanserver.JmxMBeanServer@492ec68f
   [junit4]   2> 132193 INFO  (jetty-launcher-209-thread-1) [n:127.0.0.1:58697_solr    ] o.a.s.m.r.SolrJmxReporter JMX monitoring for 'solr_58697.solr.jetty' (registry 'solr.jetty') enabled at server: com.sun.jmx.mbeanserver.JmxMBeanServer@492ec68f
   [junit4]   2> 132194 INFO  (jetty-launcher-209-thread-1) [n:127.0.0.1:58697_solr    ] o.a.s.c.CorePropertiesLocator Found 0 core definitions underneath C:\Users\jenkins\workspace\Lucene-Solr-7.x-Windows\solr\build\solr-core\test\J0\temp\solr.cloud.autoscaling.TriggerIntegrationTest_9504AD70F8EB96A5-001\tempDir-001\node1\.
   [junit4]   2> 132195 INFO  (jetty-launcher-209-thread-2) [n:127.0.0.1:58692_solr    ] o.a.s.c.CorePropertiesLocator Found 0 core definitions underneath C:\Users\jenkins\workspace\Lucene-Solr-7.x-Windows\solr\build\solr-core\test\J0\temp\solr.cloud.autoscaling.TriggerIntegrationTest_9504AD70F8EB96A5-001\tempDir-001\node2\.
   [junit4]   2> 132247 INFO  (zkConnectionManagerCallback-234-thread-1) [    ] o.a.s.c.c.ConnectionManager zkClient has connected
   [junit4]   2> 132253 INFO  (zkConnectionManagerCallback-238-thread-1) [    ] o.a.s.c.c.ConnectionManager zkClient has connected
   [junit4]   2> 132254 INFO  (SUITE-TriggerIntegrationTest-seed#[9504AD70F8EB96A5]-worker) [    ] o.a.s.c.c.ZkStateReader Updated live nodes from ZooKeeper... (0) -> (2)
   [junit4]   2> 132255 INFO  (SUITE-TriggerIntegrationTest-seed#[9504AD70F8EB96A5]-worker) [    ] o.a.s.c.s.i.ZkClientClusterStateProvider Cluster at 127.0.0.1:58688/solr ready
   [junit4]   2> 132276 INFO  (TEST-TriggerIntegrationTest.testEventQueue-seed#[9504AD70F8EB96A5]) [    ] o.a.s.SolrTestCaseJ4 ###Starting testEventQueue
   [junit4]   2> 132276 INFO  (TEST-TriggerIntegrationTest.testEventQueue-seed#[9504AD70F8EB96A5]) [    ] o.a.s.c.a.TriggerIntegrationTest /autoscaling.json reset, new znode version 2
   [junit4]   2> 132276 DEBUG (zkCallback-225-thread-1-processing-n:127.0.0.1:58692_solr) [n:127.0.0.1:58692_solr    ] o.a.s.c.a.OverseerTriggerThread Refreshing /autoscaling.json with znode version 2
   [junit4]   2> 132276 DEBUG (OverseerAutoScalingTriggerThread-99197510220840965-127.0.0.1:58692_solr-n_0000000000) [n:127.0.0.1:58692_solr    ] o.a.s.c.a.OverseerTriggerThread Processed trigger updates upto znodeVersion 2
   [junit4]   2> 132278 DEBUG (OverseerAutoScalingTriggerThread-99197510220840965-127.0.0.1:58692_solr-n_0000000000) [n:127.0.0.1:58692_solr    ] o.a.s.c.a.OverseerTriggerThread -- clean old nodeLost markers
   [junit4]   2> 132279 DEBUG (OverseerAutoScalingTriggerThread-99197510220840965-127.0.0.1:58692_solr-n_0000000000) [n:127.0.0.1:58692_solr    ] o.a.s.c.a.OverseerTriggerThread -- clean old nodeAdded markers
   [junit4]   2> 132281 DEBUG (OverseerAutoScalingTriggerThread-99197510220840965-127.0.0.1:58692_solr-n_0000000000) [n:127.0.0.1:58692_solr    ] o.a.s.c.a.OverseerTriggerThread Current znodeVersion 2, lastZnodeVersion 2
   [junit4]   2> 132285 INFO  (qtp1110293848-1021) [n:127.0.0.1:58697_solr    ] o.a.s.h.a.CollectionsHandler Invoked Collection Action :overseerstatus with params action=OVERSEERSTATUS&wt=javabin&version=2 and sendToOCPQueue=true
   [junit4]   2> 132296 INFO  (qtp1110293848-1021) [n:127.0.0.1:58697_solr    ] o.a.s.s.HttpSolrCall [admin] webapp=null path=/admin/collections params={action=OVERSEERSTATUS&wt=javabin&version=2} status=0 QTime=11
   [junit4]   2> 132354 INFO  (qtp182033748-1008) [n:127.0.0.1:58692_solr    ] o.a.s.s.HttpSolrCall [admin] webapp=null path=/admin/metrics params={prefix=CORE.coreName&wt=javabin&version=2&group=solr.core} status=0 QTime=10
   [junit4]   2> 132357 INFO  (qtp1110293848-1017) [n:127.0.0.1:58697_solr    ] o.a.s.s.HttpSolrCall [admin] webapp=null path=/admin/metrics params={prefix=CORE.coreName&wt=javabin&version=2&group=solr.core} status=0 QTime=0
   [junit4]   2> 132358 DEBUG (qtp1110293848-1018) [n:127.0.0.1:58697_solr    ] o.a.s.c.a.AutoScalingHandler Verified autoscaling configuration
   [junit4]   2> 132358 INFO  (qtp1110293848-1018) [n:127.0.0.1:58697_solr    ] o.a.s.s.HttpSolrCall [admin] webapp=null path=/cluster/autoscaling params={wt=javabin&version=2} status=0 QTime=43
   [junit4]   2> 132359 DEBUG (zkCallback-225-thread-1-processing-n:127.0.0.1:58692_solr) [n:127.0.0.1:58692_solr    ] o.a.s.c.a.OverseerTriggerThread Refreshing /autoscaling.json with znode version 3
   [junit4]   2> 132363 INFO  (zkCallback-225-thread-1-processing-n:127.0.0.1:58692_solr) [n:127.0.0.1:58692_solr    ] o.a.s.c.a.TriggerIntegrationTest TestEventQueueAction instantiated
   [junit4]   2> 132365 DEBUG (zkCallback-225-thread-1-processing-n:127.0.0.1:58692_solr) [n:127.0.0.1:58692_solr    ] o.a.s.c.a.NodeAddedTrigger Initial livenodes: [127.0.0.1:58692_solr, 127.0.0.1:58697_solr]
   [junit4]   2> 132365 DEBUG (zkCallback-225-thread-1-processing-n:127.0.0.1:58692_solr) [n:127.0.0.1:58692_solr    ] o.a.s.c.a.NodeAddedTrigger NodeAddedTrigger node_added_trigger1 instantiated with properties: {event=nodeAdded, waitFor=1, actions=[{name=test, class=org.apache.solr.cloud.autoscaling.TriggerIntegrationTest$TestEventQueueAction}], enabled=true}
   [junit4]   2> 132365 DEBUG (OverseerAutoScalingTriggerThread-99197510220840965-127.0.0.1:58692_solr-n_0000000000) [n:127.0.0.1:58692_solr    ] o.a.s.c.a.OverseerTriggerThread Processed trigger updates upto znodeVersion 3
   [junit4]   2> 132367 DEBUG (OverseerAutoScalingTriggerThread-99197510220840965-127.0.0.1:58692_solr-n_0000000000) [n:127.0.0.1:58692_solr    ] o.a.s.c.a.TriggerIntegrationTest TestTriggerAction init
   [junit4]   2> 132368 DEBUG (OverseerAutoScalingTriggerThread-99197510220840965-127.0.0.1:58692_solr-n_0000000000) [n:127.0.0.1:58692_solr    ] o.a.s.c.a.OverseerTriggerThread -- clean old nodeLost markers
   [junit4]   2> 132369 INFO  (TEST-TriggerIntegrationTest.testEventQueue-seed#[9504AD70F8EB96A5]) [    ] o.e.j.s.Server jetty-9.3.20.v20170531
   [junit4]   2> 132370 INFO  (TEST-TriggerIntegrationTest.testEventQueue-seed#[9504AD70F8EB96A5]) [    ] o.e.j.s.h.ContextHandler Started o.e.j.s.ServletContextHandler@57b43de6{/solr,null,AVAILABLE}
   [junit4]   2> 132370 DEBUG (OverseerAutoScalingTriggerThread-99197510220840965-127.0.0.1:58692_solr-n_0000000000) [n:127.0.0.1:58692_solr    ] o.a.s.c.a.OverseerTriggerThread Current znodeVersion 3, lastZnodeVersion 3
   [junit4]   2> 132370 DEBUG (ScheduledTrigger-395-thread-1) [n:127.0.0.1:58692_solr    ] o.a.s.c.a.NodeAddedTrigger Running NodeAddedTrigger node_added_trigger1
   [junit4]   2> 132371 DEBUG (ScheduledTrigger-395-thread-1) [n:127.0.0.1:58692_solr    ] o.a.s.c.a.NodeAddedTrigger Found livenodes: 2
   [junit4]   2> 132371 INFO  (TEST-TriggerIntegrationTest.testEventQueue-seed#[9504AD70F8EB96A5]) [    ] o.e.j.s.AbstractConnector Started ServerConnector@1e10dfb8{HTTP/1.1,[http/1.1]}{127.0.0.1:58727}
   [junit4]   2> 132372 INFO  (TEST-TriggerIntegrationTest.testEventQueue-seed#[9504AD70F8EB96A5]) [    ] o.e.j.s.Server Started @142415ms
   [junit4]   2> 132372 INFO  (TEST-TriggerIntegrationTest.testEventQueue-seed#[9504AD70F8EB96A5]) [    ] o.a.s.c.s.e.JettySolrRunner Jetty properties: {hostContext=/solr, hostPort=58727}
   [junit4]   2> 132372 ERROR (TEST-TriggerIntegrationTest.testEventQueue-seed#[9504AD70F8EB96A5]) [    ] o.a.s.u.StartupLoggingUtils Missing Java Option solr.log.dir. Logging may be missing or incomplete.
   [junit4]   2> 132373 INFO  (TEST-TriggerIntegrationTest.testEventQueue-seed#[9504AD70F8EB96A5]) [    ] o.a.s.s.SolrDispatchFilter  ___      _       Welcome to Apache Solr™ version 7.3.0
   [junit4]   2> 132373 INFO  (TEST-TriggerIntegrationTest.testEventQueue-seed#[9504AD70F8EB96A5]) [    ] o.a.s.s.SolrDispatchFilter / __| ___| |_ _   Starting in cloud mode on port null
   [junit4]   2> 132373 INFO  (TEST-TriggerIntegrationTest.testEventQueue-seed#[9504AD70F8EB96A5]) [    ] o.a.s.s.SolrDispatchFilter \__ \/ _ \ | '_|  Install dir: null
   [junit4]   2> 132373 INFO  (TEST-TriggerIntegrationTest.testEventQueue-seed#[9504AD70F8EB96A5]) [    ] o.a.s.s.SolrDispatchFilter |___/\___/_|_|    Start time: 2017-12-18T21:51:24.636Z
   [junit4]   2> 132377 INFO  (zkConnectionManagerCallback-240-thread-1) [    ] o.a.s.c.c.ConnectionManager zkClient has connected
   [junit4]   2> 132378 INFO  (TEST-TriggerIntegrationTest.testEventQueue-seed#[9504AD70F8EB96A5]) [    ] o.a.s.s.SolrDispatchFilter solr.xml found in ZooKeeper. Loading...
   [junit4]   2> 132391 INFO  (TEST-TriggerIntegrationTest.testEventQueue-seed#[9504AD70F8EB96A5]) [    ] o.a.s.c.ZkContainer Zookeeper client=127.0.0.1:58688/solr
   [junit4]   2> 132395 INFO  (zkConnectionManagerCallback-244-thread-1) [    ] o.a.s.c.c.ConnectionManager zkClient has connected
   [junit4]   2> 132397 WARN  (NIOServerCxn.Factory:0.0.0.0/0.0.0.0:0) [    ] o.a.z.s.NIOServerCnxn caught end of stream exception
   [junit4]   2> EndOfStreamException: Unable to read additional data from client sessionid 0x1606b9c2751000a, likely client has closed socket
   [junit4]   2> 	at org.apache.zookeeper.server.NIOServerCnxn.doIO(NIOServerCnxn.java:239)
   [junit4]   2> 	at org.apache.zookeeper.server.NIOServerCnxnFactory.run(NIOServerCnxnFactory.java:203)
   [junit4]   2> 	at java.lang.Thread.run(Thread.java:748)
   [junit4]   2> 132401 INFO  (zkConnectionManagerCallback-246-thread-1-processing-n:127.0.0.1:58727_solr) [n:127.0.0.1:58727_solr    ] o.a.s.c.c.ConnectionManager zkClient has connected
   [junit4]   2> 132409 INFO  (TEST-TriggerIntegrationTest.testEventQueue-seed#[9504AD70F8EB96A5]) [n:127.0.0.1:58727_solr    ] o.a.s.c.c.ZkStateReader Updated live nodes from ZooKeeper... (0) -> (2)
   [junit4]   2> 132412 INFO  (TEST-TriggerIntegrationTest.testEventQueue-seed#[9504AD70F8EB96A5]) [n:127.0.0.1:58727_solr    ] o.a.s.c.Overseer Overseer (id=null) closing
   [junit4]   2> 132414 INFO  (TEST-TriggerIntegrationTest.testEventQueue-seed#[9504AD70F8EB96A5]) [n:127.0.0.1:58727_solr    ] o.a.s.c.ZkController Register node as live in ZooKeeper:/live_nodes/127.0.0.1:58727_solr
   [junit4]   2> 132417 INFO  (zkCallback-225-thread-1-processing-n:127.0.0.1:58692_solr) [n:127.0.0.1:58692_solr    ] o.a.s.c.c.ZkStateReader Updated live nodes from ZooKeeper... (2) -> (3)
   [junit4]   2> 132417 INFO  (zkCallback-227-thread-1-processing-n:127.0.0.1:58697_solr) [n:127.0.0.1:58697_solr    ] o.a.s.c.c.ZkStateReader Updated live nodes from ZooKeeper... (2) -> (3)
   [junit4]   2> 132418 INFO  (zkCallback-245-thread-1-processing-n:127.0.0.1:58727_solr) [n:127.0.0.1:58727_solr    ] o.a.s.c.c.ZkStateReader Updated live nodes from ZooKeeper... (2) -> (3)
   [junit4]   2> 132419 INFO  (zkCallback-237-thread-1) [    ] o.a.s.c.c.ZkStateReader Updated live nodes from ZooKeeper... (2) -> (3)
   [junit4]   2> 132524 INFO  (TEST-TriggerIntegrationTest.testEventQueue-seed#[9504AD70F8EB96A5]) [n:127.0.0.1:58727_solr    ] o.a.s.m.r.SolrJmxReporter JMX monitoring for 'solr_58727.solr.node' (registry 'solr.node') enabled at server: com.sun.jmx.mbeanserver.JmxMBeanServer@492ec68f
   [junit4]   2> 132529 INFO  (TEST-TriggerIntegrationTest.testEventQueue-seed#[9504AD70F8EB96A5]) [n:127.0.0.1:58727_solr    ] o.a.s.m.r.SolrJmxReporter JMX monitoring for 'solr_58727.solr.jvm' (registry 'solr.jvm') enabled at server: com.sun.jmx.mbeanserver.JmxMBeanServer@492ec68f
   [junit4]   2> 132529 INFO  (TEST-TriggerIntegrationTest.testEventQueue-seed#[9504AD70F8EB96A5]) [n:127.0.0.1:58727_solr    ] o.a.s.m.r.SolrJmxReporter JMX monitoring for 'solr_58727.solr.jetty' (registry 'solr.jetty') enabled at server: com.sun.jmx.mbeanserver.JmxMBeanServer@492ec68f
   [junit4]   2> 132530 INFO  (TEST-TriggerIntegrationTest.testEventQueue-seed#[9504AD70F8EB96A5]) [n:127.0.0.1:58727_solr    ] o.a.s.c.CorePropertiesLocator Found 0 core definitions underneath C:\Users\jenkins\workspace\Lucene-Solr-7.x-Windows\solr\build\solr-core\test\J0\temp\solr.cloud.autoscaling.TriggerIntegrationTest_9504AD70F8EB96A5-001\tempDir-001\node3\.
   [junit4]   2> 133376 DEBUG (ScheduledTrigger-395-thread-1) [n:127.0.0.1:58692_solr    ] o.a.s.c.a.NodeAddedTrigger Running NodeAddedTrigger node_added_trigger1
   [junit4]   2> 133376 DEBUG (ScheduledTrigger-395-thread-1) [n:127.0.0.1:58692_solr    ] o.a.s.c.a.NodeAddedTrigger Found livenodes: 3
   [junit4]   2> 133376 DEBUG (ScheduledTrigger-395-thread-1) [n:127.0.0.1:58692_solr    ] o.a.s.c.a.NodeAddedTrigger Tracking new node: 127.0.0.1:58727_solr at time 1335021534614338
   [junit4]   2> 134291 INFO  (OverseerCollectionConfigSetProcessor-99197510220840965-127.0.0.1:58692_solr-n_0000000000) [n:127.0.0.1:58692_solr    ] o.a.s.c.OverseerTaskQueue Response ZK path: /overseer/collection-queue-work/qnr-0000000000 doesn't exist.  Requestor may have disconnected from ZooKeeper
   [junit4]   2> 134379 DEBUG (ScheduledTrigger-395-thread-3) [n:127.0.0.1:58692_solr    ] o.a.s.c.a.NodeAddedTrigger Running NodeAddedTrigger node_added_trigger1
   [junit4]   2> 134379 DEBUG (ScheduledTrigger-395-thread-3) [n:127.0.0.1:58692_solr    ] o.a.s.c.a.NodeAddedTrigger Found livenodes: 3
   [junit4]   2> 134379 DEBUG (ScheduledTrigger-395-thread-3) [n:127.0.0.1:58692_solr    ] o.a.s.c.a.NodeAddedTrigger NodeAddedTrigger node_added_trigger1 firing registered processor for nodes: [127.0.0.1:58727_solr] added at times [1335021534614338], now=1335022538332882
   [junit4]   2> 134383 DEBUG (ScheduledTrigger-395-thread-3) [n:127.0.0.1:58692_solr    ] o.a.s.c.a.ScheduledTriggers ++++++++ Cooldown inactive - processing event: {
   [junit4]   2>   "id":"4be31ec569342Tdvtl8fq5v41e7lib1by7x91ct",
   [junit4]   2>   "source":"node_added_trigger1",
   [junit4]   2>   "eventTime":1335021534614338,
   [junit4]   2>   "eventType":"NODEADDED",
   [junit4]   2>   "properties":{
   [junit4]   2>     "eventTimes":[1335021534614338],
   [junit4]   2>     "nodeNames":["127.0.0.1:58727_solr"]}}
   [junit4]   2> 134385 INFO  (ScheduledTrigger-395-thread-3) [n:127.0.0.1:58692_solr    ] o.a.s.c.a.SystemLogListener Collection .system does not exist, disabling logging.
   [junit4]   2> 134390 DEBUG (AutoscalingActionExecutor-396-thread-1-processing-n:127.0.0.1:58692_solr) [n:127.0.0.1:58692_solr    ] o.a.s.c.a.ScheduledTriggers -- processing actions for {
   [junit4]   2>   "id":"4be31ec569342Tdvtl8fq5v41e7lib1by7x91ct",
   [junit4]   2>   "source":"node_added_trigger1",
   [junit4]   2>   "eventTime":1335021534614338,
   [junit4]   2>   "eventType":"NODEADDED",
   [junit4]   2>   "properties":{
   [junit4]   2>     "eventTimes":[1335021534614338],
   [junit4]   2>     "_enqueue_time_":1335022542118838,
   [junit4]   2>     "nodeNames":["127.0.0.1:58727_solr"]}}
   [junit4]   2> 134394 INFO  (AutoscalingActionExecutor-396-thread-1-processing-n:127.0.0.1:58692_solr) [n:127.0.0.1:58692_solr    ] o.a.s.c.a.TriggerIntegrationTest -- event: {
   [junit4]   2>   "id":"4be31ec569342Tdvtl8fq5v41e7lib1by7x91ct",
   [junit4]   2>   "source":"node_added_trigger1",
   [junit4]   2>   "eventTime":1335021534614338,
   [junit4]   2>   "eventType":"NODEADDED",
   [junit4]   2>   "properties":{
   [junit4]   2>     "eventTimes":[1335021534614338],
   [junit4]   2>     "_enqueue_time_":1335022542118838,
   [junit4]   2>     "nodeNames":["127.0.0.1:58727_solr"]}}
   [junit4]   2> 134395 INFO  (TEST-TriggerIntegrationTest.testEventQueue-seed#[9504AD70F8EB96A5]) [    ] o.e.j.s.AbstractConnector Stopped ServerConnector@5fc47b6e{HTTP/1.1,[http/1.1]}{127.0.0.1:0}
   [junit4]   2> 134397 INFO  (TEST-TriggerIntegrationTest.testEventQueue-seed#[9504AD70F8EB96A5]) [    ] o.a.s.c.CoreContainer Shutting down CoreContainer instance=1150542027
   [junit4]   2> 134397 INFO  (TEST-TriggerIntegrationTest.testEventQueue-seed#[9504AD70F8EB96A5]) [    ] o.a.s.m.SolrMetricManager Closing metric reporters for registry=solr.node, tag=null
   [junit4]   2> 134398 INFO  (TEST-TriggerIntegrationTest.testEventQueue-seed#[9504AD70F8EB96A5]) [    ] o.a.s.m.r.SolrJmxReporter Closing reporter [org.apache.solr.metrics.reporters.SolrJmxReporter@5911123e: rootName = solr_58692, domain = solr.node, service url = null, agent id = null] for registry solr.node / com.codahale.metrics.MetricRegistry@76b16d13
   [junit4]   2> 134404 INFO  (TEST-TriggerIntegrationTest.testEventQueue-seed#[9504AD70F8EB96A5]) [    ] o.a.s.m.SolrMetricManager Closing metric reporters for registry=solr.jvm, tag=null
   [junit4]   2> 134404 INFO  (TEST-TriggerIntegrationTest.testEventQueue-seed#[9504AD70F8EB96A5]) [    ] o.a.s.m.r.SolrJmxReporter Closing reporter [org.apache.solr.metrics.reporters.SolrJmxReporter@19331471: rootName = solr_58692, domain = solr.jvm, service url = null, agent id = null] for registry solr.jvm / com.codahale.metrics.MetricRegistry@416106a4
   [junit4]   2> 134408 INFO  (TEST-TriggerIntegrationTest.testEventQueue-seed#[9504AD70F8EB96A5]) [    ] o.a.s.m.SolrMetricManager Closing metric reporters for registry=solr.jetty, tag=null
   [junit4]   2> 134408 INFO  (TEST-TriggerIntegrationTest.testEventQueue-seed#[9504AD70F8EB96A5]) [    ] o.a.s.m.r.SolrJmxReporter Closing reporter [org.apache.solr.metrics.reporters.SolrJmxReporter@3875a196: rootName = solr_58692, domain = solr.jetty, service url = null, agent id = null] for registry solr.jetty / com.codahale.metrics.MetricRegistry@455e8a50
   [junit4]   2> 134410 DEBUG (AutoscalingActionExecutor-396-thread-1-processing-n:127.0.0.1:58692_solr) [n:127.0.0.1:58692_solr    ] o.a.s.c.a.ScheduledTriggers -- processing took 20 ms for event id=4be31ec569342Tdvtl8fq5v41e7lib1by7x91ct
   [junit4]   2> 134410 INFO  (TEST-TriggerIntegrationTest.testEventQueue-seed#[9504AD70F8EB96A5]) [    ] o.a.s.c.ZkController Remove node as live in ZooKeeper:/live_nodes/127.0.0.1:58692_solr
   [junit4]   2> 134412 INFO  (TEST-TriggerIntegrationTest.testEventQueue-seed#[9504AD70F8EB96A5]) [    ] o.a.s.m.SolrMetricManager Closing metric reporters for registry=solr.cluster, tag=null
   [junit4]   2> 134414 INFO  (TEST-TriggerIntegrationTest.testEventQueue-seed#[9504AD70F8EB96A5]) [    ] o.a.s.c.TransientSolrCoreCacheDefault Allocating transient cache for 2147483647 transient cores
   [junit4]   2> 134414 INFO  (TEST-TriggerIntegrationTest.testEventQueue-seed#[9504AD70F8EB96A5]) [    ] o.a.s.c.Overseer Overseer (id=99197510220840965-127.0.0.1:58692_solr-n_0000000000) closing
   [junit4]   2> 134414 INFO  (zkCallback-225-thread-1-processing-n:127.0.0.1:58692_solr) [n:127.0.0.1:58692_solr    ] o.a.s.c.c.ZkStateReader Updated live nodes from ZooKeeper... (3) -> (2)
   [junit4]   2> 134414 INFO  (zkCallback-245-thread-1-processing-n:127.0.0.1:58727_solr) [n:127.0.0.1:58727_solr    ] o.a.s.c.c.ZkStateReader Updated live nodes from ZooKeeper... (3) -> (2)
   [junit4]   2> 134414 INFO  (zkCallback-227-thread-1-processing-n:127.0.0.1:58697_solr) [n:127.0.0.1:58697_solr    ] o.a.s.c.c.ZkStateReader Updated live nodes from ZooKeeper... (3) -> (2)
   [junit4]   2> 134415 INFO  (zkCallback-237-thread-1) [    ] o.a.s.c.c.ZkStateReader Updated live nodes from ZooKeeper... (3) -> (2)
   [junit4]   2> 134415 INFO  (OverseerStateUpdate-99197510220840965-127.0.0.1:58692_solr-n_0000000000) [n:127.0.0.1:58692_solr    ] o.a.s.c.Overseer Overseer Loop exiting : 127.0.0.1:58692_solr
   [junit4]   2> 134417 WARN  (OverseerAutoScalingTriggerThread-99197510220840965-127.0.0.1:58692_solr-n_0000000000) [n:127.0.0.1:58692_solr    ] o.a.s.c.a.OverseerTriggerThread OverseerTriggerThread woken up but we are closed, exiting.
   [junit4]   2> 134418 DEBUG (TEST-TriggerIntegrationTest.testEventQueue-seed#[9504AD70F8EB96A5]) [    ] o.a.s.c.a.OverseerTriggerThread OverseerTriggerThread has been closed explicitly
   [junit4]   2> 134418 INFO  (zkCallback-227-thread-1-processing-n:127.0.0.1:58697_solr) [n:127.0.0.1:58697_solr    ] o.a.s.c.OverseerElectionContext I am going to be the leader 127.0.0.1:58697_solr
   [junit4]   2> 134418 INFO  (TEST-TriggerIntegrationTest.testEventQueue-seed#[9504AD70F8EB96A5]) [    ] o.e.j.s.h.ContextHandler Stopped o.e.j.s.ServletContextHandler@d1d469{/solr,null,UNAVAILABLE}
   [junit4]   2> 134423 INFO  (zkCallback-227-thread-1-processing-n:127.0.0.1:58697_solr) [n:127.0.0.1:58697_solr    ] o.a.s.c.Overseer Overseer (id=99197510220840966-127.0.0.1:58697_solr-n_0000000001) starting
   [junit4]   2> 134430 DEBUG (OverseerAutoScalingTriggerThread-99197510220840966-127.0.0.1:58697_solr-n_0000000001) [n:127.0.0.1:58697_solr    ] o.a.s.c.a.OverseerTriggerThread Adding .autoAddReplicas trigger
   [junit4]   2> 134432 DEBUG (OverseerAutoScalingTriggerThread-99197510220840966-127.0.0.1:58697_solr-n_0000000001) [n:127.0.0.1:58697_solr    ] o.a.s.c.a.OverseerTriggerThread Refreshing /autoscaling.json with znode version 4
   [junit4]   2> 134432 INFO  (OverseerAutoScalingTriggerThread-99197510220840966-127.0.0.1:58697_solr-n_0000000001) [n:127.0.0.1:58697_solr    ] o.a.s.c.a.TriggerIntegrationTest TestEventQueueAction instantiated
   [junit4]   2> 134432 DEBUG (OverseerAutoScalingTriggerThread-99197510220840966-127.0.0.1:58697_solr-n_0000000001) [n:127.0.0.1:58697_solr    ] o.a.s.c.a.NodeAddedTrigger Initial livenodes: [127.0.0.1:58727_solr, 127.0.0.1:58697_solr]
   [junit4]   2> 134432 DEBUG (OverseerAutoScalingTriggerThread-99197510220840966-127.0.0.1:58697_solr-n_0000000001) [n:127.0.0.1:58697_solr    ] o.a.s.c.a.NodeAddedTrigger NodeAddedTrigger node_added_trigger1 instantiated with properties: {event=nodeAdded, waitFor=1, actions=[{name=test, class=org.apache.solr.cloud.autoscaling.TriggerIntegrationTest$TestEventQueueAction}], enabled=true}
   [junit4]   2> 134432 DEBUG (OverseerAutoScalingTriggerThread-99197510220840966-127.0.0.1:58697_solr-n_0000000001) [n:127.0.0.1:58697_solr    ] o.a.s.c.a.NodeLostTrigger Initial livenodes: [127.0.0.1:58727_solr, 127.0.0.1:58697_solr]
   [junit4]   2> 134432 DEBUG (OverseerAutoScalingTriggerThread-99197510220840966-127.0.0.1:58697_solr-n_0000000001) [n:127.0.0.1:58697_solr    ] o.a.s.c.a.OverseerTriggerThread Current znodeVersion 4, lastZnodeVersion -1
   [junit4]   2> 134432 DEBUG (OverseerAutoScalingTriggerThread-99197510220840966-127.0.0.1:58697_solr-n_0000000001) [n:127.0.0.1:58697_solr    ] o.a.s.c.a.OverseerTriggerThread Processed trigger updates upto znodeVersion 4
   [junit4]   2> 134434 DEBUG (OverseerAutoScalingTriggerThread-99197510220840966-127.0.0.1:58697_solr-n_0000000001) [n:127.0.0.1:58697_solr    ] o.a.s.c.a.TriggerIntegrationTest TestTriggerAction init
   [junit4]   2> 134435 DEBUG (OverseerAutoScalingTriggerThread-99197510220840966-127.0.0.1:58697_solr-n_0000000001) [n:127.0.0.1:58697_solr    ] o.a.s.c.a.OverseerTriggerThread Current znodeVersion 4, lastZnodeVersion 4
   [junit4]   2> 134435 DEBUG (ScheduledTrigger-410-thread-1) [n:127.0.0.1:58697_solr    ] o.a.s.c.a.NodeLostTrigger Running NodeLostTrigger: .auto_add_replicas with currently live nodes: 2
   [junit4]   2> 134436 DEBUG (ScheduledTrigger-410-thread-2) [n:127.0.0.1:58697_solr    ] o.a.s.c.a.NodeAddedTrigger Running NodeAddedTrigger node_added_trigger1
   [junit4]   2> 134436 DEBUG (ScheduledTrigger-410-thread-2) [n:127.0.0.1:58697_solr    ] o.a.s.c.a.NodeAddedTrigger Found livenodes: 2
   [junit4]   2> 135438 DEBUG (ScheduledTrigger-410-thread-1) [n:127.0.0.1:58697_solr    ] o.a.s.c.a.NodeLostTrigger Running NodeLostTrigger: .auto_add_replicas with currently live nodes: 2
   [junit4]   2> 135439 DEBUG (ScheduledTrigger-410-thread-3) [n:127.0.0.1:58697_solr    ] o.a.s.c.a.NodeAddedTrigger Running NodeAddedTrigger node_added_trigger1
   [junit4]   2> 135439 DEBUG (ScheduledTrigger-410-thread-3) [n:127.0.0.1:58697_solr    ] o.a.s.c.a.NodeAddedTrigger Found livenodes: 2
   [junit4]   2> 136440 DEBUG (ScheduledTrigger-410-thread-4) [n:127.0.0.1:58697_solr    ] o.a.s.c.a.NodeAddedTrigger Running NodeAddedTrigger node_added_trigger1
   [junit4]   2> 136440 DEBUG (ScheduledTrigger-410-thread-4) [n:127.0.0.1:58697_solr    ] o.a.s.c.a.NodeAddedTrigger Found livenodes: 2
   [junit4]   2> 136441 DEBUG (ScheduledTrigger-410-thread-2) [n:127.0.0.1:58697_solr    ] o.a.s.c.a.NodeLostTrigger Running NodeLostTrigger: .auto_add_replicas with currently live nodes: 2
   [junit4]   2> 137441 DEBUG (ScheduledTrigger-410-thread-3) [n:127.0.0.1:58697_solr    ] o.a.s.c.a.NodeLostTrigger Running NodeLostTrigger: .auto_add_replicas with currently live nodes: 2
   [junit4]   2> 137441 DEBUG (ScheduledTrigger-410-thread-4) [n:127.0.0.1:58697_solr    ] o.a.s.c.a.NodeAddedTrigger Running NodeAddedTrigger node_added_trigger1
   [junit4]   2> 137441 DEBUG (ScheduledTrigger-410-thread-4) [n:127.0.0.1:58697_solr    ] o.a.s.c.a.NodeAddedTrigger Found livenodes: 2
   [junit4]   2> 138441 DEBUG (ScheduledTrigger-410-thread-2) [n:127.0.0.1:58697_solr    ] o.a.s.c.a.NodeAddedTrigger Running NodeAddedTrigger node_added_trigger1
   [junit4]   2> 138441 DEBUG (ScheduledTrigger-410-thread-2) [n:127.0.0.1:58697_solr    ] o.a.s.c.a.NodeAddedTrigger Found livenodes: 2
   [junit4]   2> 138441 DEBUG (ScheduledTrigger-410-thread-3) [n:127.0.0.1:58697_solr    ] o.a.s.c.a.NodeLostTrigger Running NodeLostTrigger: .auto_add_replicas with currently live nodes: 2
   [junit4]   2> 139443 DEBUG (ScheduledTrigger-410-thread-4) [n:127.0.0.1:58697_solr    ] o.a.s.c.a.NodeLostTrigger Running NodeLostTrigger: .auto_add_replicas with currently live nodes: 2
   [junit4]   2> 139443 DEBUG (ScheduledTrigger-410-thread-2) [n:127.0.0.1:58697_solr    ] o.a.s.c.a.NodeAddedTrigger Running NodeAddedTrigger node_added_trigger1
   [junit4]   2> 139443 DEBUG (ScheduledTrigger-410-thread-2) [n:127.0.0.1:58697_solr    ] o.a.s.c.a.NodeAddedTrigger Found livenodes: 2
   [junit4]   2> 140446 DEBUG (ScheduledTrigger-410-thread-3) [n:127.0.0.1:58697_solr    ] o.a.s.c.a.NodeAddedTrigger Running NodeAddedTrigger node_added_trigger1
   [junit4]   2> 140446 DEBUG (ScheduledTrigger-410-thread-3) [n:127.0.0.1:58697_solr    ] o.a.s.c.a.NodeAddedTrigger Found livenodes: 2
   [junit4]   2> 140446 DEBUG (ScheduledTrigger-410-thread-4) [n:127.0.0.1:58697_solr    ] o.a.s.c.a.NodeLostTrigger Running NodeLostTrigger: .auto_add_replicas with currently live nodes: 2
   [junit4]   2> 141452 DEBUG (ScheduledTrigger-410-thread-2) [n:127.0.0.1:58697_solr    ] o.a.s.c.a.NodeLostTrigger Running NodeLostTrigger: .auto_add_replicas with currently live nodes: 2
   [junit4]   2> 141453 DEBUG (ScheduledTrigger-410-thread-3) [n:127.0.0.1:58697_solr    ] o.a.s.c.a.NodeAddedTrigger Running NodeAddedTrigger node_added_trigger1
   [junit4]   2> 141453 DEBUG (ScheduledTrigger-410-thread-3) [n:127.0.0.1:58697_solr    ] o.a.s.c.a.NodeAddedTrigger Found livenodes: 2
   [junit4]   2> 142424 INFO  (TEST-TriggerIntegrationTest.testEventQueue-seed#[9504AD70F8EB96A5]) [    ] o.a.s.SolrTestCaseJ4 ###Ending testEventQueue
   [junit4]   2> NOTE: reproduce with: ant test  -Dtestcase=TriggerIntegrationTest -Dtests.method=testEventQueue -Dtests.seed=9504AD70F8EB96A5 -Dtests.slow=true -Dtests.locale=sk -Dtests.timezone=Etc/GMT-10 -Dtests.asserts=true -Dtests.file.encoding=UTF-8
   [junit4] FAILURE 10.2s J0 | TriggerIntegrationTest.testEventQueue <<<
   [junit4]    > Throwable #1: java.lang.AssertionError: action wasn't interrupted
   [junit4]    > 	at __randomizedtesting.SeedInfo.seed([9504AD70F8EB96A5:5CB1EFDEF18C5050]:0)
   [junit4]    > 	at org.apache.solr.cloud.autoscaling.TriggerIntegrationTest.testEventQueue(TriggerIntegrationTest.java:707)
   [junit4]    > 	at java.lang.Thread.run(Thread.java:748)
   [junit4] IGNOR/A 0.01s J0 | TriggerIntegrationTest.testSearchRate
   [junit4]    > Assumption #1: 'awaitsfix' test group is disabled (@AwaitsFix(bugUrl=https://issues.apache.org/jira/browse/SOLR-11714))
   [junit4]   2> 142452 DEBUG (ScheduledTrigger-410-thread-2) [n:127.0.0.1:58697_solr    ] o.a.s.c.a.NodeLostTrigger Running NodeLostTrigger: .auto_add_replicas with currently live nodes: 2
   [junit4]   2> 142452 DEBUG (ScheduledTrigger-410-thread-4) [n:127.0.0.1:58697_solr    ] o.a.s.c.a.NodeAddedTrigger Running NodeAddedTrigger node_added_trigger1
   [junit4]   2> 142453 DEBUG (ScheduledTrigger-410-thread-4) [n:127.0.0.1:58697_solr    ] o.a.s.c.a.NodeAddedTrigger Found livenodes: 2
   [junit4]   2> 142465 INFO  (TEST-TriggerIntegrationTest.testNodeLostTrigger-seed#[9504AD70F8EB96A5]) [    ] o.a.s.SolrTestCaseJ4 ###Starting testNodeLostTrigger
   [junit4]   2> 142466 INFO  (TEST-TriggerIntegrationTest.testNodeLostTrigger-seed#[9504AD70F8EB96A5]) [    ] o.a.s.c.a.TriggerIntegrationTest /autoscaling.json reset, new znode version 5
   [junit4]   2> 142466 DEBUG (zkCallback-227-thread-1-processing-n:127.0.0.1:58697_solr) [n:127.0.0.1:58697_solr    ] o.a.s.c.a.OverseerTriggerThread Refreshing /autoscaling.json with znode version 5
   [junit4]   2> 142467 DEBUG (OverseerAutoScalingTriggerThread-99197510220840966-127.0.0.1:58697_solr-n_0000000001) [n:127.0.0.1:58697_solr    ] o.a.s.c.a.OverseerTriggerThread Processed trigger updates upto znodeVersion 5
   [junit4]   2> 142472 DEBUG (OverseerAutoScalingTriggerThread-99197510220840966-127.0.0.1:58697_solr-n_0000000001) [n:127.0.0.1:58697_solr    ] o.a.s.c.a.OverseerTriggerThread -- clean old nodeLost markers
   [junit4]   2> 142472 DEBUG (OverseerAutoScalingTriggerThread-99197510220840966-127.0.0.1:58697_solr-n_0000000001) [n:127.0.0.1:58697_solr    ] o.a.s.c.a.OverseerTriggerThread -- clean old nodeAdded markers
   [junit4]   2> 142473 DEBUG (OverseerAutoScalingTriggerThread-99197510220840966-127.0.0.1:58697_solr-n_0000000001) [n:127.0.0.1:58697_solr    ] o.a.s.c.a.OverseerTriggerThread Current znodeVersion 5, lastZnodeVersion 5
   [junit4]   2> 142475 INFO  (qtp1110293848-1016) [n:127.0.0.1:58697_solr    ] o.a.s.h.a.CollectionsHandler Invoked Collection Action :overseerstatus with params action=OVERSEERSTATUS&wt=javabin&version=2 and sendToOCPQueue=true
   [junit4]   2> 142513 INFO  (qtp1110293848-1016) [n:127.0.0.1:58697_solr    ] o.a.s.s.HttpSolrCall [admin] webapp=null path=/admin/collections params={action=OVERSEERSTATUS&wt=javabin&version=2} status=0 QTime=36
   [junit4]   2> 142549 INFO  (qtp1110293848-1014) [n:127.0.0.1:58697_solr    ] o.a.s.s.HttpSolrCall [admin] webapp=null path=/admin/metrics params={prefix=CORE.coreName&wt=javabin&version=2&group=solr.core} status=0 QTime=0
   [junit4]   2> 142553 INFO  (qtp74803195-1077) [n:127.0.0.1:58727_solr    ] o.a.s.s.HttpSolrCall [admin] webapp=null path=/admin/metrics params={prefix=CORE.coreName&wt=javabin&version=2&group=solr.core} status=0 QTime=0
   [junit4]   2> 142553 DEBUG (qtp74803195-1079) [n:127.0.0.1:58727_solr    ] o.a.s.c.a.AutoScalingHandler Verified autoscaling configuration
   [junit4]   2> 142557 INFO  (qtp74803195-1079) [n:127.0.0.1:58727_solr    ] o.a.s.s.HttpSolrCall [admin] webapp=null path=/cluster/autoscaling params={wt=javabin&version=2} status=0 QTime=16
   [junit4]   2> 142560 DEBUG (zkCallback-227-thread-1-processing-n:127.0.0.1:58697_solr) [n:127.0.0.1:58697_solr    ] o.a.s.c.a.OverseerTriggerThread Refreshing /autoscaling.json with znode version 6
   [junit4]   2> 142564 DEBUG (zkCallback-227-thread-1-processing-n:127.0.0.1:58697_solr) [n:127.0.0.1:58697_solr    ] o.a.s.c.a.NodeLostTrigger Initial livenodes: [127.0.0.1:58727_solr, 127.0.0.1:58697_solr]
   [junit4]   2> 142564 DEBUG (OverseerAutoScalingTriggerThread-99197510220840966-127.0.0.1:58697_solr-n_0000000001) [n:127.0.0.1:58697_solr    ] o.a.s.c.a.OverseerTriggerThread Processed trigger updates upto znodeVersion 6
   [junit4]   2> 142570 INFO  (OverseerAutoScalingTriggerThread-99197510220840966-127.0.0.1:58697_solr-n_0000000001) [n:127.0.0.1:58697_solr    ] o.a.s.c.a.TriggerIntegrationTest TestTriggerAction init
   [junit4]   2> 142576 INFO  (TEST-TriggerIntegrationTest.testNodeLostTrigger-seed#[9504AD70F8EB96A5]) [    ] o.e.j.s.AbstractConnector Stopped ServerConnector@1e10dfb8{HTTP/1.1,[http/1.1]}{127.0.0.1:0}
   [junit4]   2> 142576 INFO  (TEST-TriggerIntegrationTest.testNodeLostTrigger-seed#[9504AD70F8EB96A5]) [    ] o.a.s.c.CoreContainer Shutting down CoreContainer instance=1558035063
   [junit4]   2> 142577 INFO  (TEST-TriggerIntegrationTest.testNodeLostTrigger-seed#[9504AD70F8EB96A5]) [    ] o.a.s.m.SolrMetricManager Closing metric reporters for registry=solr.node, tag=null
   [junit4]   2> 142578 INFO  (TEST-TriggerIntegrationTest.testNodeLostTrigger-seed#[9504AD70F8EB96A5]) [    ] o.a.s.m.r.SolrJmxReporter Closing reporter [org.apache.solr.metrics.reporters.SolrJmxReporter@61d7d835: rootName = solr_58727, domain = solr.node, service url = null, agent id = null] for registry solr.node / com.codahale.metrics.MetricRegistry@792a2d99
   [junit4]   2> 142581 DEBUG (OverseerAutoScalingTriggerThread-99197510220840966-127.0.0.1:58697_solr-n_0000000001) [n:127.0.0.1:58697_solr    ] o.a.s.c.a.OverseerTriggerThread -- clean old nodeAdded markers
   [junit4]   2> 142583 DEBUG (OverseerAutoScalingTriggerThread-99197510220840966-127.0.0.1:58697_solr-n_0000000001) [n:127.0.0.1:58697_solr    ] o.a.s.c.a.OverseerTriggerThread Current znodeVersion 6, lastZnodeVersion 6
   [junit4]   2> 142585 DEBUG (ScheduledTrigger-410-thread-3) [n:127.0.0.1:58697_solr    ] o.a.s.c.a.NodeLostTrigger Running NodeLostTrigger: node_lost_trigger with currently live nodes: 2
   [junit4]   2> 142585 INFO  (TEST-TriggerIntegrationTest.testNodeLostTrigger-seed#[9504AD70F8EB96A5]) [    ] o.a.s.m.SolrMetricManager Closing metric reporters for registry=solr.jvm, tag=null
   [junit4]   2> 142585 INFO  (TEST-TriggerIntegrationTest.testNodeLostTrigger-seed#[9504AD70F8EB96A5]) [    ] o.a.s.m.r.SolrJmxReporter Closing reporter [org.apache.solr.metrics.reporters.SolrJmxReporter@41134746: rootName = solr_58727, domain = solr.jvm, service url = null, agent id = null] for registry solr.jvm / com.codahale.metrics.MetricRegistry@416106a4
   [junit4]   2> 142592 INFO  (TEST-TriggerIntegrationTest.testNodeLostTrigger-seed#[9504AD70F8EB96A5]) [    ] o.a.s.m.SolrMetricManager Closing metric reporters for registry=solr.jetty, tag=null
   [junit4]   2> 142592 INFO  (TEST-TriggerIntegrationTest.testNodeLostTrigger-seed#[9504AD70F8EB96A5]) [    ] o.a.s.m.r.SolrJmxReporter Closing reporter [org.apache.solr.metrics.reporters.SolrJmxReporter@78eb59b4: rootName = solr_58727, domain = solr.jetty, service url = null, agent id = null] for registry solr.jetty / com.codahale.metrics.MetricRegistry@455e8a50
   [junit4]   2> 142602 INFO  (TEST-TriggerIntegrationTest.testNodeLostTrigger-seed#[9504AD70F8EB96A5]) [    ] o.a.s.c.ZkController Remove node as live in ZooKeeper:/live_nodes/127.0.0.1:58727_solr
   [junit4]   2> 142603 INFO  (TEST-TriggerIntegrationTest.testNodeLostTrigger-seed#[9504AD70F8EB96A5]) [    ] o.a.s.m.SolrMetricManager Closing metric reporters for registry=solr.cluster, tag=null
   [junit4]   2> 142604 INFO  (TEST-TriggerIntegrationTest.testNodeLostTrigger-seed#[9504AD70F8EB96A5]) [    ] o.a.s.c.TransientSolrCoreCacheDefault Allocating transient cache for 2147483647 transient cores
   [junit4]   2> 142609 WARN  (NIOServerCxn.Factory:0.0.0.0/0.0.0.0:0) [    ] o.a.z.s.NIOServerCnxn caught end of stream exception
   [junit4]   2> EndOfStreamException: Unable to read additional data from client sessionid 0x1606b9c2751000b, likely client has closed socket
   [junit4]   2> 	at org.apache.zookeeper.server.NIOServerCnxn.doIO(NIOServerCnxn.java:239)
   [junit4]   2> 	at org.apache.zookeeper.server.NIOServerCnxnFactory.run(NIOServerCnxnFactory.java:203)
   [junit4]   2> 	at java.lang.Thread.run(Thread.java:748)
   [junit4]   2> 142611 INFO  (zkCallback-227-thread-1-processing-n:127.0.0.1:58697_solr) [n:127.0.0.1:58697_solr    ] o.a.s.c.c.ZkStateReader Updated live nodes from ZooKeeper... (2) -> (1)
   [junit4]   2> 142611 INFO  (zkCallback-237-thread-1) [    ] o.a.s.c.c.ZkStateReader Updated live nodes from ZooKeeper... (2) -> (1)
   [junit4]   2> 143589 DEBUG (ScheduledTrigger-410-thread-3) [n:127.0.0.1:58697_solr    ] o.a.s.c.a.NodeLostTrigger Running NodeLostTrigger: node_lost_trigger with currently live nodes: 1
   [junit4]   2> 143589 DEBUG (ScheduledTrigger-410-thread-3) [n:127.0.0.1:58697_solr    ] o.a.s.c.a.NodeLostTrigger Tracking lost node: 127.0.0.1:58727_solr
   [junit4]   2> 144106 WARN  (zkCallback-245-thread-1-processing-n:127.0.0.1:58727_solr) [n:127.0.0.1:58727_solr    ] o.a.s.c.c.ZkStateReader ZooKeeper watch triggered, but Solr cannot talk to ZK: [KeeperErrorCode = Session expired for /live_nodes]
   [junit4]   2> 144107 INFO  (TEST-TriggerIntegrationTest.testNodeLostTrigger-seed#[9504AD70F8EB96A5]) [    ] o.e.j.s.h.ContextHandler Stopped o.e.j.s.ServletContextHandler@57b43de6{/solr,null,UNAVAILABLE}
   [junit4]   2> 144501 INFO  (OverseerCollectionConfigSetProcessor-99197510220840966-127.0.0.1:58697_solr-n_0000000001) [n:127.0.0.1:58697_solr    ] o.a.s.c.OverseerTaskQueue Response ZK path: /overseer/collection-queue-work/qnr-0000000002 doesn't exist.  Requestor may have disconnected from ZooKeeper
   [junit4]   2> 144591 DEBUG (ScheduledTrigger-410-thread-4) [n:127.0.0.1:58697_solr    ] o.a.s.c.a.NodeLostTrigger Running NodeLostTrigger: node_lost_trigger with currently live nodes: 1
   [junit4]   2> 145592 DEBUG (ScheduledTrigger-410-thread-1) [n:127.0.0.1:58697_solr    ] o.a.s.c.a.NodeLostTrigger Running NodeLostTrigger: node_lost_trigger with currently live nodes: 1
   [junit4]   2> 145592 DEBUG (ScheduledTrigger-410-thread-1) [n:127.0.0.1:58697_solr    ] o.a.s.c.a.NodeLostTrigger NodeLostTrigger firing registered processor for lost nodes: [127.0.0.1:58727_solr]
   [junit4]   2> 145593 DEBUG (ScheduledTrigger-410-thread-1) [n:127.0.0.1:58697_solr    ] o.a.s.c.a.ScheduledTriggers ++++++++ Cooldown inactive - processing event: {
   [junit4]   2>   "id":"4be344d1c3fb8Tdvtl8fq5v41e7lib1by7x91cv",
   [junit4]   2>   "source":"node_lost_trigger",
   [junit4]   2>   "eventTime":1335031748116408,
   [junit4]   2>   "eventType":"NODELOST",
   [junit4]   2>   "properties":{
   [junit4]   2>     "eventTimes":[1335031748116408],
   [junit4]   2>     "nodeNames":["127.0.0.1:58727_solr"]}}
   [junit4]   2> 145594 INFO  (ScheduledTrigger-410-thread-1) [n:127.0.0.1:58697_solr    ] o.a.s.c.a.SystemLogListener Collection .system does not exist, disabling logging.
   [junit4]   2> 145620 DEBUG (AutoscalingActionExecutor-411-thread-1-processing-n:127.0.0.1:58697_solr) [n:127.0.0.1:58697_solr    ] o.a.s.c.a.ScheduledTriggers -- processing actions for {
   [junit4]   2>   "id":"4be344d1c3fb8Tdvtl8fq5v41e7lib1by7x91cv",
   [junit4]   2>   "source":"node_lost_trigger",
   [junit4]   2>   "eventTime":1335031748116408,
   [junit4]   2>   "eventType":"NODELOST",
   [junit4]   2>   "properties":{
   [junit4]   2>     "eventTimes":[1335031748116408],
   [junit4]   2>     "_enqueue_time_":1335033751467449,
   [junit4]   2>     "nodeNames":["127.0.0.1:58727_solr"]}}
   [junit4]   2> 145625 INFO  (qtp1110293848-1015) [n:127.0.0.1:58697_solr    ] o.a.s.s.HttpSolrCall [admin] webapp=null path=/admin/metrics params={prefix=CORE.coreName&wt=javabin&version=2&group=solr.core} status=0 QTime=0
   [junit4]   2> 145625 DEBUG (qtp1110293848-1014) [n:127.0.0.1:58697_solr    ] o.a.s.c.a.AutoScalingHandler Verified autoscaling configuration
   [junit4]   2> 145626 DEBUG (AutoscalingActionExecutor-411-thread-1-processing-n:127.0.0.1:58697_solr) [n:127.0.0.1:58697_solr    ] o.a.s.c.a.ScheduledTriggers -- processing took 5 ms for event id=4be344d1c3fb8Tdvtl8fq5v41e7lib1by7x91cv
   [junit4]   2> 145626 INFO  (qtp1110293848-1014) [n:127.0.0.1:58697_solr    ] o.a.s.s.HttpSolrCall [admin] webapp=null path=/admin/autoscaling params={wt=javabin&version=2} status=0 QTime=3
   [junit4]   2> 145627 DEBUG (zkCallback-227-thread-1-processing-n:127.0.0.1:58697_solr) [n:127.0.0.1:58697_solr    ] o.a.s.c.a.OverseerTriggerThread Refreshing /autoscaling.json with znode version 7
   [junit4]   2> 145627 DEBUG (zkCallback-227-thread-1-processing-n:127.0.0.1:58697_solr) [n:127.0.0.1:58697_solr    ] o.a.s.c.a.NodeLostTrigger Initial livenodes: [127.0.0.1:58697_solr]
   [junit4]   2> 145627 DEBUG (OverseerAutoScalingTriggerThread-99197510220840966-127.0.0.1:58697_solr-n_0000000001) [n:127.0.0.1:58697_solr    ] o.a.s.c.a.OverseerTriggerThread Processed trigger updates upto znodeVersion 7
   [junit4]   2> 145628 DEBUG (OverseerAutoScalingTriggerThread-99197510220840966-127.0.0.1:58697_solr-n_0000000001) [n:127.0.0.1:58697_solr    ] o.a.s.c.a.OverseerTriggerThread -- clean old nodeAdded markers
   [junit4]   2> 145628 DEBUG (OverseerAutoScalingTriggerThread-99197510220840966-127.0.0.1:58697_solr-n_0000000001) [n:127.0.0.1:58697_solr    ] o.a.s.c.a.OverseerTriggerThread Current znodeVersion 7, lastZnodeVersion 7
   [junit4]   2> 146620 DEBUG (ScheduledTrigger-410-thread-1) [n:127.0.0.1:58697_solr    ] o.a.s.c.a.NodeLostTrigger Running NodeLostTrigger: node_lost_trigger with currently live nodes: 1
   [junit4]   2> 147623 DEBUG (ScheduledTrigger-410-thread-1) [n:127.0.0.1:58697_solr    ] o.a.s.c.a.NodeLostTrigger Running NodeLostTrigger: node_lost_trigger with currently live nodes: 1
   [junit4]   2> 147627 INFO  (TEST-TriggerIntegrationTest.testNodeLostTrigger-seed#[9504AD70F8EB96A5]) [    ] o.a.s.SolrTestCaseJ4 ###Ending testNodeLostTrigger
   [junit4]   2> 147641 INFO  (TEST-TriggerIntegrationTest.testSetProperties-seed#[9504AD70F8EB96A5]) [    ] o.a.s.SolrTestCaseJ4 ###Starting testSetProperties
   [junit4]   2> 147643 INFO  (TEST-TriggerIntegrationTest.testSetProperties-seed#[9504AD70F8EB96A5]) [    ] o.a.s.c.a.TriggerIntegrationTest /autoscaling.json reset, new znode version 8
   [junit4]   2> 147643 DEBUG (zkCallback-227-thread-1-processing-n:127.0.0.1:58697_solr) [n:127.0.0.1:58697_solr    ] o.a.s.c.a.OverseerTriggerThread Refreshing /autoscaling.json with znode version 8
   [junit4]   2> 147643 DEBUG (OverseerAutoScalingTriggerThread-99197510220840966-127.0.0.1:58697_solr-n_0000000001) [n:127.0.0.1:58697_solr    ] o.a.s.c.a.OverseerTriggerThread Processed trigger updates upto znodeVersion 8
   [junit4]   2> 147646 DEBUG (OverseerAutoScalingTriggerThread-99197510220840966-127.0.0.1:58697_solr-n_0000000001) [n:127.0.0.1:58697_solr    ] o.a.s.c.a.OverseerTriggerThread -- clean old nodeLost markers
   [junit4]   2> 147646 DEBUG (OverseerAutoScalingTriggerThread-99197510220840966-127.0.0.1:58697_solr-n_0000000001) [n:127.0.0.1:58697_solr    ] o.a.s.c.a.OverseerTriggerThread -- clean old nodeAdded markers
   [junit4]   2> 147648 DEBUG (OverseerAutoScalingTriggerThread-99197510220840966-127.0.0.1:58697_solr-n_0000000001) [n:127.0.0.1:58697_solr    ] o.a.s.c.a.OverseerTriggerThread Current znodeVersion 8, lastZnodeVersion 8
   [junit4]   2> 147648 INFO  (TEST-TriggerIntegrationTest.testSetProperties-seed#[9504AD70F8EB96A5]) [    ] o.e.j.s.Server jetty-9.3.20.v20170531
   [junit4]   2> 147649 INFO  (TEST-TriggerIntegrationTest.testSetProperties-seed#[9504AD70F8EB96A5]) [    ] o.e.j.s.h.ContextHandler Started o.e.j.s.ServletContextHandler@58a47da4{/solr,null,AVAILABLE}
   [junit4]   2> 147650 INFO  (TEST-TriggerIntegrationTest.testSetProperties-seed#[9504AD70F8EB96A5]) [    ] o.e.j.s.AbstractConnector Started ServerConnector@6659df04{HTTP/1.1,[http/1.1]}{127.0.0.1:58840}
   [junit4]   2> 147650 INFO  (TEST-TriggerIntegrationTest.testSetProperties-seed#[9504AD70F8EB96A5]) [    ] o.e.j.s.Server Started @157693ms
   [junit4]   2> 147650 INFO  (TEST-TriggerIntegrationTest.testSetProperties-seed#[9504AD70F8EB96A5]) [    ] o.a.s.c.s.e.JettySolrRunner Jetty properties: {hostContext=/solr, hostPort=58840}
   [junit4]   2> 147650 ERROR (TEST-TriggerIntegrationTest.testSetProperties-seed#[9504AD70F8EB96A5]) [    ] o.a.s.u.StartupLoggingUtils Missing Java Option solr.log.dir. Logging may be missing or incomplete.
   [junit4]   2> 147650 INFO  (TEST-TriggerIntegrationTest.testSetProperties-seed#[9504AD70F8EB96A5]) [    ] o.a.s.s.SolrDispatchFilter  ___      _       Welcome to Apache Solr™ version 7.3.0
   [junit4]   2> 147650 INFO  (TEST-TriggerIntegrationTest.testSetProperties-seed#[9504AD70F8EB96A5]) [    ] o.a.s.s.SolrDispatchFilter / __| ___| |_ _   Starting in cloud mode on port null
   [junit4]   2> 147650 INFO  (TEST-TriggerIntegrationTest.testSetProperties-seed#[9504AD70F8EB96A5]) [    ] o.a.s.s.SolrDispatchFilter \__ \/ _ \ | '_|  Install dir: null
   [junit4]   2> 147650 INFO  (TEST-TriggerIntegrationTest.testSetProperties-seed#[9504AD70F8EB96A5]) [    ] o.a.s.s.SolrDispatchFilter |___/\___/_|_|    Start time: 2017-12-18T21:51:39.913Z
   [junit4]   2> 147671 INFO  (zkConnectionManagerCallback-250-thread-1) [    ] o.a.s.c.c.ConnectionManager zkClient has connected
   [junit4]   2> 147671 INFO  (TEST-TriggerIntegrationTest.testSetProperties-seed#[9504AD70F8EB96A5]) [    ] o.a.s.s.SolrDispatchFilter solr.xml found in ZooKeeper. Loading...
   [junit4]   2> 147681 WARN  (NIOServerCxn.Factory:0.0.0.0/0.0.0.0:0) [    ] o.a.z.s.NIOServerCnxn caught end of stream exception
   [junit4]   2> EndOfStreamException: Unable to read additional data from client sessionid 0x1606b9c2751000c, likely client has closed socket
   [junit4]   2> 	at org.apache.zookeeper.server.NIOServerCnxn.doIO(NIOServerCnxn.java:239)
   [junit4]   2> 	at org.apache.zookeeper.server.NIOServerCnxnFactory.run(NIOServerCnxnFactory.java:203)
   [junit4]   2> 	at java.lang.Thread.run(Thread.java:748)
   [junit4]   2> 147683 INFO  (TEST-TriggerIntegrationTest.testSetProperties-seed#[9504AD70F8EB96A5]) [    ] o.a.s.c.ZkContainer Zookeeper client=127.0.0.1:58688/solr
   [junit4]   2> 147688 INFO  (zkConnectionManagerCallback-254-thread-1) [    ] o.a.s.c.c.ConnectionManager zkClient has connected
   [junit4]   2> 147694 INFO  (zkConnectionManagerCallback-256-thread-1-processing-n:127.0.0.1:58840_solr) [n:127.0.0.1:58840_solr    ] o.a.s.c.c.ConnectionManager zkClient has connected
   [junit4]   2> 147701 INFO  (TEST-TriggerIntegrationTest.testSetProperties-seed#[9504AD70F8EB96A5]) [n:127.0.0.1:58840_solr    ] o.a.s.c.c.ZkStateReader Updated live nodes from ZooKeeper... (0) -> (1)
   [junit4]   2> 147703 INFO  (TEST-TriggerIntegrationTest.testSetProperties-seed#[9504AD70F8EB96A5]) [n:127.0.0.1:58840_solr    ] o.a.s.c.Overseer Overseer (id=null) closing
   [junit4]   2> 147707 INFO  (TEST-TriggerIntegrationTest.testSetProperties-seed#[9504AD70F8EB96A5]) [n:127.0.0.1:58840_solr    ] o.a.s.c.ZkController Register node as live in ZooKeeper:/live_nodes/127.0.0.1:58840_solr
   [junit4]   2> 147709 INFO  (zkCallback-227-thread-1-processing-n:127.0.0.1:58697_solr) [n:127.0.0.1:58697_solr    ] o.a.s.c.c.ZkStateReader Updated live nodes from ZooKeeper... (1) -> (2)
   [junit4]   2> 147709 INFO  (zkCallback-237-thread-1) [    ] o.a.s.c.c.ZkStateReader Updated live nodes from ZooKeeper... (1) -> (2)
   [junit4]   2> 147710 INFO  (zkCallback-255-thread-1-processing-n:127.0.0.1:58840_solr) [n:127.0.0.1:58840_solr    ] o.a.s.c.c.ZkStateReader Updated live nodes from ZooKeeper... (1) -> (2)
   [junit4]   2> 147787 INFO  (TEST-TriggerIntegrationTest.testSetProperties-seed#[9504AD70F8EB96A5]) [n:127.0.0.1:58840_solr    ] o.a.s.m.r.SolrJmxReporter JMX monitoring for 'solr_58840.solr.node' (registry 'solr.node') enabled at server: com.sun.jmx.mbeanserver.JmxMBeanServer@492ec68f
   [junit4]   2> 147802 INFO  (TEST-TriggerIntegrationTest.testSetProperties-seed#[9504AD70F8EB96A5]) [n:127.0.0.1:58840_solr    ] o.a.s.m.r.SolrJmxReporter JMX monitoring for 'solr_58840.solr.jvm' (registry 'solr.jvm') enabled at server: com.sun.jmx.mbeanserver.JmxMBeanServer@492ec68f
   [junit4]   2> 147802 INFO  (TEST-TriggerIntegrationTest.testSetProperties-seed#[9504AD70F8EB96A5]) [n:127.0.0.1:58840_solr    ] o.a.s.m.r.SolrJmxReporter JMX monitoring for 'solr_58840.solr.jetty' (registry 'solr.jetty') enabled at server: com.sun.jmx.mbeanserver.JmxMBeanServer@492ec68f
   [junit4]   2> 147803 INFO  (TEST-TriggerIntegrationTest.testSetProperties-seed#[9504AD70F8EB96A5]) [n:127.0.0.1:58840_solr    ] o.a.s.c.CorePropertiesLocator Found 0 core definitions underneath C:\Users\jenkins\workspace\Lucene-Solr-7.x-Windows\solr\build\solr-core\test\J0\temp\solr.cloud.autoscaling.TriggerIntegrationTest_9504AD70F8EB96A5-001\tempDir-001\node4\.
   [junit4]   2> 148838 DEBUG (TEST-TriggerIntegrationTest.testSetProperties-seed#[9504AD70F8EB96A5]) [    ] o.a.s.c.a.ScheduledTriggers Changing value of autoscaling property: triggerScheduleDelaySeconds from: 1 to: 4
   [junit4]   2> 156848 DEBUG (TEST-TriggerIntegrationTest.testSetProperties-seed#[9504AD70F8EB96A5]) [    ] o.a.s.c.a.ScheduledTriggers Changing value of autoscaling property: triggerScheduleDelaySeconds from: 4 to: 1
   [junit4]   2> 166870 DEBUG (TEST-TriggerIntegrationTest.testSetProperties-seed#[9504AD70F8EB96A5]) [    ] o.a.s.c.a.ScheduledTriggers Changing value of autoscaling property: triggerCorePoolSize from: 4 to: 6
   [junit4]   2> 176878 DEBUG (TEST-TriggerIntegrationTest.testSetProperties-seed#[9504AD70F8EB96A5]) [    ] o.a.s.c.a.ScheduledTriggers Changing value of autoscaling property: actionThrottlePeriodSeconds from: 5 to: 6
   [junit4]   2> 176880 DEBUG (TEST-TriggerIntegrationTest.testSetProperties-seed#[9504AD70F8EB96A5]) [    ] o.a.s.c.a.NodeAddedTrigger Initial livenodes: [127.0.0.1:58697_solr, 127.0.0.1:58840_solr]
   [junit4]   2> 176880 DEBUG (TEST-TriggerIntegrationTest.testSetProperties-seed#[9504AD70F8EB96A5]) [    ] o.a.s.c.a.NodeAddedTrigger NodeAddedTrigger y1 instantiated with properties: {waitFor=0, actions=[{name=throttler, class=org.apache.solr.cloud.autoscaling.TriggerIntegrationTest$ThrottlingTesterAction}]}
   [junit4]   2> 176881 INFO  (TEST-TriggerIntegrationTest.testSetProperties-seed#[9504AD70F8EB96A5]) [    ] o.a.s.c.a.TriggerIntegrationTest TestTriggerAction init
   [junit4]   2> 176881 DEBUG (TEST-TriggerIntegrationTest.testSetProperties-seed#[9504AD70F8EB96A5]) [    ] o.a.s.c.a.NodeAddedTrigger Initial livenodes: [127.0.0.1:58697_solr, 127.0.0.1:58840_solr]
   [junit4]   2> 176881 DEBUG (TEST-TriggerIntegrationTest.testSetProperties-seed#[9504AD70F8EB96A5]) [    ] o.a.s.c.a.NodeAddedTrigger NodeAddedTrigger y2 instantiated with properties: {waitFor=0, actions=[{name=throttler, class=org.apache.solr.cloud.autoscaling.TriggerIntegrationTest$ThrottlingTesterAction}]}
   [junit4]   2> 176883 DEBUG (ScheduledTrigger-420-thread-2) [    ] o.a.s.c.a.NodeAddedTrigger Running NodeAddedTrigger y1
   [junit4]   2> 176883 DEBUG (ScheduledTrigger-420-thread-2) [    ] o.a.s.c.a.NodeAddedTrigger Found livenodes: 2
   [junit4]   2> 176884 INFO  (TEST-TriggerIntegrationTest.testSetProperties-seed#[9504AD70F8EB96A5]) [    ] o.a.s.c.a.TriggerIntegrationTest TestTriggerAction init
   [junit4]   2> 176886 INFO  (TEST-TriggerIntegrationTest.testSetProperties-seed#[9504AD70F8EB96A5]) [    ] o.e.j.s.Server jetty-9.3.20.v20170531
   [junit4]   2> 176886 DEBUG (ScheduledTrigger-420-thread-5) [    ] o.a.s.c.a.NodeAddedTrigger Running NodeAddedTrigger y2
   [junit4]   2> 176886 DEBUG (ScheduledTrigger-420-thread-5) [    ] o.a.s.c.a.NodeAddedTrigger Found livenodes: 2
   [junit4]   2> 176887 INFO  (TEST-TriggerIntegrationTest.testSetProperties-seed#[9504AD70F8EB96A5]) [    ] o.e.j.s.h.ContextHandler Started o.e.j.s.ServletContextHandler@402272a1{/solr,null,AVAILABLE}
   [junit4]   2> 176888 INFO  (TEST-TriggerIntegrationTest.testSetProperties-seed#[9504AD70F8EB96A5]) [    ] o.e.j.s.AbstractConnector Started ServerConnector@7e972d63{HTTP/1.1,[http/1.1]}{127.0.0.1:59090}
   [junit4]   2> 176888 INFO  (TEST-TriggerIntegrationTest.testSetProperties-seed#[9504AD70F8EB96A5]) [    ] o.e.j.s.Server Started @186931ms
   [junit4]   2> 176888 INFO  (TEST-TriggerIntegrationTest.testSetProperties-seed#[9504AD70F8EB96A5]) [    ] o.a.s.c.s.e.JettySolrRunner Jetty properties: {hostContext=/solr, hostPort=59090}
   [junit4]   2> 176888 ERROR (TEST-TriggerIntegrationTest.testSetProperties-seed#[9504AD70F8EB96A5]) [    ] o.a.s.u.StartupLoggingUtils Missing Java Option solr.log.dir. Logging may be missing or incomplete.
   [junit4]   2> 176888 INFO  (TEST-TriggerIntegrationTest.testSetProperties-seed#[9504AD70F8EB96A5]) [    ] o.a.s.s.SolrDispatchFilter  ___      _       Welcome to Apache Solr™ version 7.3.0
   [junit4]   2> 176888 INFO  (TEST-TriggerIntegrationTest.testSetProperties-seed#[9504AD70F8EB96A5]) [    ] o.a.s.s.SolrDispatchFilter / __| ___| |_ _   Starting in cloud mode on port null
   [junit4]   2> 176888 INFO  (TEST-TriggerIntegrationTest.testSetProperties-seed#[9504AD70F8EB96A5]) [    ] o.a.s.s.SolrDispatchFilter \__ \/ _ \ | '_|  Install dir: null
   [junit4]   2> 176888 INFO  (TEST-TriggerIntegrationTest.testSetProperties-seed#[9504AD70F8EB96A5]) [    ] o.a.s.s.SolrDispatchFilter |___/\___/_|_|    Start time: 2017-12-18T21:52:09.151Z
   [junit4]   2> 176895 INFO  (zkConnectionManagerCallback-260-thread-1) [    ] o.a.s.c.c.ConnectionManager zkClient has connected
   [junit4]   2> 176896 INFO  (TEST-TriggerIntegrationTest.testSetProperties-seed#[9504AD70F8EB96A5]) [    ] o.a.s.s.SolrDispatchFilter solr.xml found in ZooKeeper. Loading...
   [junit4]   2> 176913 WARN  (NIOServerCxn.Factory:0.0.0.0/0.0.0.0:0) [    ] o.a.z.s.NIOServerCnxn caught end of stream exception
   [junit4]   2> EndOfStreamException: Unable to read additional data from client sessionid 0x1606b9c2751000f, likely client has closed socket
   [junit4]   2> 	at org.apache.zookeeper.server.NIOServerCnxn.doIO(NIOServerCnxn.java:239)
   [junit4]   2> 	at org.apache.zookeeper.server.NIOServerCnxnFactory.run(NIOServerCnxnFactory.java:203)
   [junit4]   2> 	at java.lang.Thread.run(Thread.java:748)
   [junit4]   2> 176918 INFO  (TEST-TriggerIntegrationTest.testSetProperties-seed#[9504AD70F8EB96A5]) [    ] o.a.s.c.ZkContainer Zookeeper client=127.0.0.1:58688/solr
   [junit4]   2> 176921 INFO  (zkConnectio

[...truncated too long message...]

yFieldReuse, LargeFieldTest, TestPolicyCloud, TestCollectionsAPIViaSolrCloudCluster, TestRebalanceLeaders, TestCustomSort, AnalysisErrorHandlingTest, SolrSlf4jReporterTest, ZkSolrClientTest, ShardSplitTest, CdcrReplicationDistributedZkTest, TestSchemaNameResource, TestWordDelimiterFilterFactory, TestJettySolrRunner, ChaosMonkeySafeLeaderTest, TestExceedMaxTermLength, DistributedQueryComponentOptimizationTest, TestXmlQParserPlugin, SolrPluginUtilsTest, TestConfig, TestRandomFlRTGCloud, SolrShardReporterTest, TestFieldCacheSortRandom, IgnoreCommitOptimizeUpdateProcessorFactoryTest, ImplicitSnitchTest, TestHalfAndHalfDocValues, CoreMergeIndexesAdminHandlerTest, TestSubQueryTransformer, TestExpandComponent, TestSuggestSpellingConverter, TestPayloadCheckQParserPlugin, HdfsDirectoryTest, TestCryptoKeys, DOMUtilTest, HLLUtilTest, CdcrBidirectionalTest, TestFieldCollectionResource, DocValuesMissingTest, ExternalFileFieldSortTest, TestLockTree, TestCustomStream, EchoParamsTest, TestFieldCacheWithThreads, AddSchemaFieldsUpdateProcessorFactoryTest, StatelessScriptUpdateProcessorFactoryTest, TestCloudInspectUtil, V2StandaloneTest, MultiThreadedOCPTest, TestHashQParserPlugin, TestIndexSearcher, TestSmileRequest, TestPerFieldSimilarity, TestZkChroot, TestManagedSynonymGraphFilterFactory, DistribDocExpirationUpdateProcessorTest, TestTolerantUpdateProcessorCloud, UpdateParamsTest, TestFaceting, ZkFailoverTest, MissingSegmentRecoveryTest, DocumentBuilderTest, TestBinaryResponseWriter, BlockJoinFacetSimpleTest, TestAnalyzeInfixSuggestions, QueryElevationComponentTest, CdcrRequestHandlerTest, HdfsCollectionsAPIDistributedZkTest, SynonymTokenizerTest, LeaderFailoverAfterPartitionTest, RestartWhileUpdatingTest, TestCoreAdminApis, TestFoldingMultitermQuery, DeleteReplicaTest, TestBulkSchemaConcurrent, TestDelegationWithHadoopAuth, CoreAdminHandlerTest, TestMacroExpander, NumberUtilsTest, SpatialHeatmapFacetsTest, TestLuceneIndexBackCompat, SSLMigrationTest, ConjunctionSolrSpellCheckerTest, AnalyticsQueryTest, TestCollectionAPIs, AnalysisAfterCoreReloadTest, HdfsUnloadDistributedZkTest, RecoveryAfterSoftCommitTest, SolrJmxReporterCloudTest, TestPostingsSolrHighlighter, DistributedIntervalFacetingTest, TestPartialUpdateDeduplication, TestSolrConfigHandlerCloud, TestFieldTypeCollectionResource, TestFilteredDocIdSet, HdfsRestartWhileUpdatingTest, BitVectorTest, DeleteLastCustomShardedReplicaTest, NodeAddedTriggerTest, TestInPlaceUpdatesDistrib, HdfsAutoAddReplicasIntegrationTest, LeaderInitiatedRecoveryOnCommitTest, TestSchemaSimilarityResource, TestSort, TestSolrJ, TestTrie, BadComponentTest, TestLegacyTerms, TestNumericTerms32, TestExclusionRuleCollectionAccess, LoggingHandlerTest, TestSolrXml, TestFileDictionaryLookup, TestClusterProperties, SampleTest, TestSimpleTextCodec, TestFunctionQuery, AssignTest, HdfsDirectoryFactoryTest, TemplateUpdateProcessorTest, TestExtendedDismaxParser, TestRandomFaceting, LeaderElectionIntegrationTest, CacheHeaderTest, ShardRoutingCustomTest, TestStressReorder, AtomicUpdatesTest, TestCloudNestedDocsSort, DocValuesNotIndexedTest, TestLegacyNumericRangeQueryBuilder, CollectionStateFormat2Test, TestLeaderInitiatedRecoveryThread, TestDistributedGrouping, ZkStateReaderTest, BasicDistributedZk2Test, TestIntervalFaceting, TestCloudRecovery, OpenExchangeRatesOrgProviderTest, TestValueSourceCache, SolrIndexSplitterTest, JSONWriterTest, TestUninvertingReader, TestImplicitCoreProperties, TestConfigSets, DataDrivenBlockJoinTest, TestGraphMLResponseWriter, TestStandardQParsers, OutOfBoxZkACLAndCredentialsProvidersTest, QueryEqualityTest, TestNumericRangeQuery32, TestSerializedLuceneMatchVersion, HttpSolrCallGetCoreTest, TestClusterStateProvider, TestOnReconnectListenerSupport, TestBackupRepositoryFactory, TestAuthorizationFramework, TestRemoteStreaming, DocValuesTest, TestJsonFacetRefinement, TestPullReplica, ClassificationUpdateProcessorIntegrationTest, TestCollationField, TestMinMaxOnMultiValuedField, PreAnalyzedFieldTest, OverseerTaskQueueTest, TestGenericDistributedQueue]
   [junit4]   2> NOTE: reproduce with: ant test  -Dtestcase=TestGenericDistributedQueue -Dtests.seed=9504AD70F8EB96A5 -Dtests.slow=true -Dtests.locale=en-NZ -Dtests.timezone=Africa/Sao_Tome -Dtests.asserts=true -Dtests.file.encoding=UTF-8
   [junit4] ERROR   0.00s J1 | TestGenericDistributedQueue (suite) <<<
   [junit4]    > Throwable #1: java.lang.Exception: Suite timeout exceeded (>= 7200000 msec).
   [junit4]    > 	at __randomizedtesting.SeedInfo.seed([9504AD70F8EB96A5]:0)
   [junit4] Completed [763/763 (3!)] on J1 in 7220.27s, 1 test, 2 errors <<< FAILURES!

[...truncated 2376 lines...]
   [junit4] Suite: org.apache.solr.update.processor.TestOpenNLPExtractNamedEntitiesUpdateProcessorFactory
   [junit4]   2> Creating dataDir: C:\Users\jenkins\workspace\Lucene-Solr-7.x-Windows\solr\build\contrib\solr-analysis-extras\test\J1\temp\solr.update.processor.TestOpenNLPExtractNamedEntitiesUpdateProcessorFactory_8F8BFE8221EB2B3D-001\init-core-data-001
   [junit4]   2> NOTE: test params are: codec=Asserting(Lucene70): {}, docValues:{}, maxPointsInLeafNode=634, maxMBSortInHeap=6.6678069558535356, sim=RandomSimilarity(queryNorm=false): {}, locale=zh-TW, timezone=PRC
   [junit4]   2> NOTE: Windows 10 10.0 amd64/Oracle Corporation 1.8.0_144 (64-bit)/cpus=3,threads=1,free=47459608,total=97386496
   [junit4]   2> NOTE: All tests run in this JVM: [TestFoldingMultitermExtrasQuery, TestICUCollationFieldOptions, TestOpenNLPExtractNamedEntitiesUpdateProcessorFactory]
   [junit4]   2> NOTE: reproduce with: ant test  -Dtestcase=TestOpenNLPExtractNamedEntitiesUpdateProcessorFactory -Dtests.seed=8F8BFE8221EB2B3D -Dtests.slow=true -Dtests.locale=zh-TW -Dtests.timezone=PRC -Dtests.asserts=true -Dtests.file.encoding=Cp1252
   [junit4] ERROR   0.00s J1 | TestOpenNLPExtractNamedEntitiesUpdateProcessorFactory (suite) <<<
   [junit4]    > Throwable #1: java.io.IOException: Could not remove the following files (in the order of attempts):
   [junit4]    >    C:\Users\jenkins\workspace\Lucene-Solr-7.x-Windows\solr\build\contrib\solr-analysis-extras\test\J1\temp\solr.update.processor.TestOpenNLPExtractNamedEntitiesUpdateProcessorFactory_8F8BFE8221EB2B3D-001\tempDir-001\collection1\conf: java.nio.file.DirectoryNotEmptyException: C:\Users\jenkins\workspace\Lucene-Solr-7.x-Windows\solr\build\contrib\solr-analysis-extras\test\J1\temp\solr.update.processor.TestOpenNLPExtractNamedEntitiesUpdateProcessorFactory_8F8BFE8221EB2B3D-001\tempDir-001\collection1\conf
   [junit4]    >    C:\Users\jenkins\workspace\Lucene-Solr-7.x-Windows\solr\build\contrib\solr-analysis-extras\test\J1\temp\solr.update.processor.TestOpenNLPExtractNamedEntitiesUpdateProcessorFactory_8F8BFE8221EB2B3D-001\tempDir-001\collection1: java.nio.file.DirectoryNotEmptyException: C:\Users\jenkins\workspace\Lucene-Solr-7.x-Windows\solr\build\contrib\solr-analysis-extras\test\J1\temp\solr.update.processor.TestOpenNLPExtractNamedEntitiesUpdateProcessorFactory_8F8BFE8221EB2B3D-001\tempDir-001\collection1
   [junit4]    >    C:\Users\jenkins\workspace\Lucene-Solr-7.x-Windows\solr\build\contrib\solr-analysis-extras\test\J1\temp\solr.update.processor.TestOpenNLPExtractNamedEntitiesUpdateProcessorFactory_8F8BFE8221EB2B3D-001\tempDir-001: java.nio.file.DirectoryNotEmptyException: C:\Users\jenkins\workspace\Lucene-Solr-7.x-Windows\solr\build\contrib\solr-analysis-extras\test\J1\temp\solr.update.processor.TestOpenNLPExtractNamedEntitiesUpdateProcessorFactory_8F8BFE8221EB2B3D-001\tempDir-001
   [junit4]    >    C:\Users\jenkins\workspace\Lucene-Solr-7.x-Windows\solr\build\contrib\solr-analysis-extras\test\J1\temp\solr.update.processor.TestOpenNLPExtractNamedEntitiesUpdateProcessorFactory_8F8BFE8221EB2B3D-001\tempDir-001\collection1\conf\en-test-tokenizer.bin: java.nio.file.AccessDeniedException: C:\Users\jenkins\workspace\Lucene-Solr-7.x-Windows\solr\build\contrib\solr-analysis-extras\test\J1\temp\solr.update.processor.TestOpenNLPExtractNamedEntitiesUpdateProcessorFactory_8F8BFE8221EB2B3D-001\tempDir-001\collection1\conf\en-test-tokenizer.bin
   [junit4]    >    C:\Users\jenkins\workspace\Lucene-Solr-7.x-Windows\solr\build\contrib\solr-analysis-extras\test\J1\temp\solr.update.processor.TestOpenNLPExtractNamedEntitiesUpdateProcessorFactory_8F8BFE8221EB2B3D-001\tempDir-001\collection1\conf\en-test-sent.bin: java.nio.file.AccessDeniedException: C:\Users\jenkins\workspace\Lucene-Solr-7.x-Windows\solr\build\contrib\solr-analysis-extras\test\J1\temp\solr.update.processor.TestOpenNLPExtractNamedEntitiesUpdateProcessorFactory_8F8BFE8221EB2B3D-001\tempDir-001\collection1\conf\en-test-sent.bin
   [junit4]    >    C:\Users\jenkins\workspace\Lucene-Solr-7.x-Windows\solr\build\contrib\solr-analysis-extras\test\J1\temp\solr.update.processor.TestOpenNLPExtractNamedEntitiesUpdateProcessorFactory_8F8BFE8221EB2B3D-001\tempDir-001\collection1\conf\en-test-ner-person.bin: java.nio.file.AccessDeniedException: C:\Users\jenkins\workspace\Lucene-Solr-7.x-Windows\solr\build\contrib\solr-analysis-extras\test\J1\temp\solr.update.processor.TestOpenNLPExtractNamedEntitiesUpdateProcessorFactory_8F8BFE8221EB2B3D-001\tempDir-001\collection1\conf\en-test-ner-person.bin
   [junit4]    >    C:\Users\jenkins\workspace\Lucene-Solr-7.x-Windows\solr\build\contrib\solr-analysis-extras\test\J1\temp\solr.update.processor.TestOpenNLPExtractNamedEntitiesUpdateProcessorFactory_8F8BFE8221EB2B3D-001: java.nio.file.DirectoryNotEmptyException: C:\Users\jenkins\workspace\Lucene-Solr-7.x-Windows\solr\build\contrib\solr-analysis-extras\test\J1\temp\solr.update.processor.TestOpenNLPExtractNamedEntitiesUpdateProcessorFactory_8F8BFE8221EB2B3D-001
   [junit4]    > 	at __randomizedtesting.SeedInfo.seed([8F8BFE8221EB2B3D]:0)
   [junit4]    > 	at org.apache.lucene.util.IOUtils.rm(IOUtils.java:329)
   [junit4]    > 	at java.lang.Thread.run(Thread.java:748)
   [junit4] Completed [5/5 (1!)] on J1 in 1.27s, 8 tests, 1 error <<< FAILURES!

[...truncated 45753 lines...]

Mime
View raw message