lucene-dev mailing list archives

Site index · List index
Message view « Date » · « Thread »
Top « Date » · « Thread »
From Policeman Jenkins Server <jenk...@thetaphi.de>
Subject [JENKINS] Lucene-Solr-master-Windows (64bit/jdk1.8.0_144) - Build # 7063 - Still Unstable!
Date Tue, 19 Dec 2017 20:58:14 GMT
Build: https://jenkins.thetaphi.de/job/Lucene-Solr-master-Windows/7063/
Java: 64bit/jdk1.8.0_144 -XX:+UseCompressedOops -XX:+UseSerialGC

9 tests failed.
FAILED:  junit.framework.TestSuite.org.apache.lucene.index.TestBackwardsCompatibility

Error Message:
Could not remove the following files (in the order of attempts):    C:\Users\jenkins\workspace\Lucene-Solr-master-Windows\lucene\build\backward-codecs\test\J0\temp\lucene.index.TestBackwardsCompatibility_B599383E1C973DC9-001\3.0.2-nocfs-001: java.nio.file.DirectoryNotEmptyException: C:\Users\jenkins\workspace\Lucene-Solr-master-Windows\lucene\build\backward-codecs\test\J0\temp\lucene.index.TestBackwardsCompatibility_B599383E1C973DC9-001\3.0.2-nocfs-001 

Stack Trace:
java.io.IOException: Could not remove the following files (in the order of attempts):
   C:\Users\jenkins\workspace\Lucene-Solr-master-Windows\lucene\build\backward-codecs\test\J0\temp\lucene.index.TestBackwardsCompatibility_B599383E1C973DC9-001\3.0.2-nocfs-001: java.nio.file.DirectoryNotEmptyException: C:\Users\jenkins\workspace\Lucene-Solr-master-Windows\lucene\build\backward-codecs\test\J0\temp\lucene.index.TestBackwardsCompatibility_B599383E1C973DC9-001\3.0.2-nocfs-001

	at __randomizedtesting.SeedInfo.seed([B599383E1C973DC9]:0)
	at org.apache.lucene.util.IOUtils.rm(IOUtils.java:329)
	at org.apache.lucene.util.TestRuleTemporaryFilesCleanup.afterAlways(TestRuleTemporaryFilesCleanup.java:216)
	at com.carrotsearch.randomizedtesting.rules.TestRuleAdapter$1.afterAlways(TestRuleAdapter.java:31)
	at com.carrotsearch.randomizedtesting.rules.StatementAdapter.evaluate(StatementAdapter.java:43)
	at com.carrotsearch.randomizedtesting.rules.StatementAdapter.evaluate(StatementAdapter.java:36)
	at org.apache.lucene.util.TestRuleAssertionsRequired$1.evaluate(TestRuleAssertionsRequired.java:53)
	at org.apache.lucene.util.TestRuleMarkFailure$1.evaluate(TestRuleMarkFailure.java:47)
	at org.apache.lucene.util.TestRuleIgnoreAfterMaxFailures$1.evaluate(TestRuleIgnoreAfterMaxFailures.java:64)
	at org.apache.lucene.util.TestRuleIgnoreTestSuites$1.evaluate(TestRuleIgnoreTestSuites.java:54)
	at com.carrotsearch.randomizedtesting.rules.StatementAdapter.evaluate(StatementAdapter.java:36)
	at com.carrotsearch.randomizedtesting.ThreadLeakControl$StatementRunner.run(ThreadLeakControl.java:368)
	at java.lang.Thread.run(Thread.java:748)


FAILED:  junit.framework.TestSuite.org.apache.lucene.codecs.blockterms.TestVarGapDocFreqIntervalPostingsFormat

Error Message:
Could not remove the following files (in the order of attempts):    C:\Users\jenkins\workspace\Lucene-Solr-master-Windows\lucene\build\codecs\test\J0\temp\lucene.codecs.blockterms.TestVarGapDocFreqIntervalPostingsFormat_A1EF7255751A33E3-001\testPostingsFormat.testExact-006: java.nio.file.AccessDeniedException: C:\Users\jenkins\workspace\Lucene-Solr-master-Windows\lucene\build\codecs\test\J0\temp\lucene.codecs.blockterms.TestVarGapDocFreqIntervalPostingsFormat_A1EF7255751A33E3-001\testPostingsFormat.testExact-006    C:\Users\jenkins\workspace\Lucene-Solr-master-Windows\lucene\build\codecs\test\J0\temp\lucene.codecs.blockterms.TestVarGapDocFreqIntervalPostingsFormat_A1EF7255751A33E3-001: java.nio.file.DirectoryNotEmptyException: C:\Users\jenkins\workspace\Lucene-Solr-master-Windows\lucene\build\codecs\test\J0\temp\lucene.codecs.blockterms.TestVarGapDocFreqIntervalPostingsFormat_A1EF7255751A33E3-001 

Stack Trace:
java.io.IOException: Could not remove the following files (in the order of attempts):
   C:\Users\jenkins\workspace\Lucene-Solr-master-Windows\lucene\build\codecs\test\J0\temp\lucene.codecs.blockterms.TestVarGapDocFreqIntervalPostingsFormat_A1EF7255751A33E3-001\testPostingsFormat.testExact-006: java.nio.file.AccessDeniedException: C:\Users\jenkins\workspace\Lucene-Solr-master-Windows\lucene\build\codecs\test\J0\temp\lucene.codecs.blockterms.TestVarGapDocFreqIntervalPostingsFormat_A1EF7255751A33E3-001\testPostingsFormat.testExact-006
   C:\Users\jenkins\workspace\Lucene-Solr-master-Windows\lucene\build\codecs\test\J0\temp\lucene.codecs.blockterms.TestVarGapDocFreqIntervalPostingsFormat_A1EF7255751A33E3-001: java.nio.file.DirectoryNotEmptyException: C:\Users\jenkins\workspace\Lucene-Solr-master-Windows\lucene\build\codecs\test\J0\temp\lucene.codecs.blockterms.TestVarGapDocFreqIntervalPostingsFormat_A1EF7255751A33E3-001

	at __randomizedtesting.SeedInfo.seed([A1EF7255751A33E3]:0)
	at org.apache.lucene.util.IOUtils.rm(IOUtils.java:329)
	at org.apache.lucene.util.TestRuleTemporaryFilesCleanup.afterAlways(TestRuleTemporaryFilesCleanup.java:216)
	at com.carrotsearch.randomizedtesting.rules.TestRuleAdapter$1.afterAlways(TestRuleAdapter.java:31)
	at com.carrotsearch.randomizedtesting.rules.StatementAdapter.evaluate(StatementAdapter.java:43)
	at com.carrotsearch.randomizedtesting.rules.StatementAdapter.evaluate(StatementAdapter.java:36)
	at org.apache.lucene.util.TestRuleAssertionsRequired$1.evaluate(TestRuleAssertionsRequired.java:53)
	at org.apache.lucene.util.TestRuleMarkFailure$1.evaluate(TestRuleMarkFailure.java:47)
	at org.apache.lucene.util.TestRuleIgnoreAfterMaxFailures$1.evaluate(TestRuleIgnoreAfterMaxFailures.java:64)
	at org.apache.lucene.util.TestRuleIgnoreTestSuites$1.evaluate(TestRuleIgnoreTestSuites.java:54)
	at com.carrotsearch.randomizedtesting.rules.StatementAdapter.evaluate(StatementAdapter.java:36)
	at com.carrotsearch.randomizedtesting.ThreadLeakControl$StatementRunner.run(ThreadLeakControl.java:368)
	at java.lang.Thread.run(Thread.java:748)


FAILED:  junit.framework.TestSuite.org.apache.lucene.store.TestFileSwitchDirectory

Error Message:
Could not remove the following files (in the order of attempts):    C:\Users\jenkins\workspace\Lucene-Solr-master-Windows\lucene\build\core\test\J1\temp\lucene.store.TestFileSwitchDirectory_A5291C4283B01F20-001\bar-026: java.nio.file.AccessDeniedException: C:\Users\jenkins\workspace\Lucene-Solr-master-Windows\lucene\build\core\test\J1\temp\lucene.store.TestFileSwitchDirectory_A5291C4283B01F20-001\bar-026    C:\Users\jenkins\workspace\Lucene-Solr-master-Windows\lucene\build\core\test\J1\temp\lucene.store.TestFileSwitchDirectory_A5291C4283B01F20-001: java.nio.file.DirectoryNotEmptyException: C:\Users\jenkins\workspace\Lucene-Solr-master-Windows\lucene\build\core\test\J1\temp\lucene.store.TestFileSwitchDirectory_A5291C4283B01F20-001 

Stack Trace:
java.io.IOException: Could not remove the following files (in the order of attempts):
   C:\Users\jenkins\workspace\Lucene-Solr-master-Windows\lucene\build\core\test\J1\temp\lucene.store.TestFileSwitchDirectory_A5291C4283B01F20-001\bar-026: java.nio.file.AccessDeniedException: C:\Users\jenkins\workspace\Lucene-Solr-master-Windows\lucene\build\core\test\J1\temp\lucene.store.TestFileSwitchDirectory_A5291C4283B01F20-001\bar-026
   C:\Users\jenkins\workspace\Lucene-Solr-master-Windows\lucene\build\core\test\J1\temp\lucene.store.TestFileSwitchDirectory_A5291C4283B01F20-001: java.nio.file.DirectoryNotEmptyException: C:\Users\jenkins\workspace\Lucene-Solr-master-Windows\lucene\build\core\test\J1\temp\lucene.store.TestFileSwitchDirectory_A5291C4283B01F20-001

	at __randomizedtesting.SeedInfo.seed([A5291C4283B01F20]:0)
	at org.apache.lucene.util.IOUtils.rm(IOUtils.java:329)
	at org.apache.lucene.util.TestRuleTemporaryFilesCleanup.afterAlways(TestRuleTemporaryFilesCleanup.java:216)
	at com.carrotsearch.randomizedtesting.rules.TestRuleAdapter$1.afterAlways(TestRuleAdapter.java:31)
	at com.carrotsearch.randomizedtesting.rules.StatementAdapter.evaluate(StatementAdapter.java:43)
	at com.carrotsearch.randomizedtesting.rules.StatementAdapter.evaluate(StatementAdapter.java:36)
	at org.apache.lucene.util.TestRuleAssertionsRequired$1.evaluate(TestRuleAssertionsRequired.java:53)
	at org.apache.lucene.util.TestRuleMarkFailure$1.evaluate(TestRuleMarkFailure.java:47)
	at org.apache.lucene.util.TestRuleIgnoreAfterMaxFailures$1.evaluate(TestRuleIgnoreAfterMaxFailures.java:64)
	at org.apache.lucene.util.TestRuleIgnoreTestSuites$1.evaluate(TestRuleIgnoreTestSuites.java:54)
	at com.carrotsearch.randomizedtesting.rules.StatementAdapter.evaluate(StatementAdapter.java:36)
	at com.carrotsearch.randomizedtesting.ThreadLeakControl$StatementRunner.run(ThreadLeakControl.java:368)
	at java.lang.Thread.run(Thread.java:748)


FAILED:  org.apache.lucene.replicator.IndexReplicationClientTest.testRestart

Error Message:
Could not remove the following files (in the order of attempts):    C:\Users\jenkins\workspace\Lucene-Solr-master-Windows\lucene\build\replicator\test\J1\temp\lucene.replicator.IndexReplicationClientTest_6677A68B716F7020-001\replicationClientTest-002\1: java.nio.file.DirectoryNotEmptyException: C:\Users\jenkins\workspace\Lucene-Solr-master-Windows\lucene\build\replicator\test\J1\temp\lucene.replicator.IndexReplicationClientTest_6677A68B716F7020-001\replicationClientTest-002\1 

Stack Trace:
java.io.IOException: Could not remove the following files (in the order of attempts):
   C:\Users\jenkins\workspace\Lucene-Solr-master-Windows\lucene\build\replicator\test\J1\temp\lucene.replicator.IndexReplicationClientTest_6677A68B716F7020-001\replicationClientTest-002\1: java.nio.file.DirectoryNotEmptyException: C:\Users\jenkins\workspace\Lucene-Solr-master-Windows\lucene\build\replicator\test\J1\temp\lucene.replicator.IndexReplicationClientTest_6677A68B716F7020-001\replicationClientTest-002\1

	at __randomizedtesting.SeedInfo.seed([6677A68B716F7020:F3FA4AEAF487C435]:0)
	at org.apache.lucene.util.IOUtils.rm(IOUtils.java:329)
	at org.apache.lucene.replicator.PerSessionDirectoryFactory.cleanupSession(PerSessionDirectoryFactory.java:58)
	at org.apache.lucene.replicator.ReplicationClient.doUpdate(ReplicationClient.java:259)
	at org.apache.lucene.replicator.ReplicationClient.updateNow(ReplicationClient.java:401)
	at org.apache.lucene.replicator.IndexReplicationClientTest.testRestart(IndexReplicationClientTest.java:193)
	at sun.reflect.NativeMethodAccessorImpl.invoke0(Native Method)
	at sun.reflect.NativeMethodAccessorImpl.invoke(NativeMethodAccessorImpl.java:62)
	at sun.reflect.DelegatingMethodAccessorImpl.invoke(DelegatingMethodAccessorImpl.java:43)
	at java.lang.reflect.Method.invoke(Method.java:498)
	at com.carrotsearch.randomizedtesting.RandomizedRunner.invoke(RandomizedRunner.java:1737)
	at com.carrotsearch.randomizedtesting.RandomizedRunner$8.evaluate(RandomizedRunner.java:934)
	at com.carrotsearch.randomizedtesting.RandomizedRunner$9.evaluate(RandomizedRunner.java:970)
	at com.carrotsearch.randomizedtesting.RandomizedRunner$10.evaluate(RandomizedRunner.java:984)
	at org.apache.lucene.util.TestRuleSetupTeardownChained$1.evaluate(TestRuleSetupTeardownChained.java:49)
	at org.apache.lucene.util.AbstractBeforeAfterRule$1.evaluate(AbstractBeforeAfterRule.java:45)
	at org.apache.lucene.util.TestRuleThreadAndTestName$1.evaluate(TestRuleThreadAndTestName.java:48)
	at org.apache.lucene.util.TestRuleIgnoreAfterMaxFailures$1.evaluate(TestRuleIgnoreAfterMaxFailures.java:64)
	at org.apache.lucene.util.TestRuleMarkFailure$1.evaluate(TestRuleMarkFailure.java:47)
	at com.carrotsearch.randomizedtesting.rules.StatementAdapter.evaluate(StatementAdapter.java:36)
	at com.carrotsearch.randomizedtesting.ThreadLeakControl$StatementRunner.run(ThreadLeakControl.java:368)
	at com.carrotsearch.randomizedtesting.ThreadLeakControl.forkTimeoutingTask(ThreadLeakControl.java:817)
	at com.carrotsearch.randomizedtesting.ThreadLeakControl$3.evaluate(ThreadLeakControl.java:468)
	at com.carrotsearch.randomizedtesting.RandomizedRunner.runSingleTest(RandomizedRunner.java:943)
	at com.carrotsearch.randomizedtesting.RandomizedRunner$5.evaluate(RandomizedRunner.java:829)
	at com.carrotsearch.randomizedtesting.RandomizedRunner$6.evaluate(RandomizedRunner.java:879)
	at com.carrotsearch.randomizedtesting.RandomizedRunner$7.evaluate(RandomizedRunner.java:890)
	at org.apache.lucene.util.AbstractBeforeAfterRule$1.evaluate(AbstractBeforeAfterRule.java:45)
	at com.carrotsearch.randomizedtesting.rules.StatementAdapter.evaluate(StatementAdapter.java:36)
	at org.apache.lucene.util.TestRuleStoreClassName$1.evaluate(TestRuleStoreClassName.java:41)
	at com.carrotsearch.randomizedtesting.rules.NoShadowingOrOverridesOnMethodsRule$1.evaluate(NoShadowingOrOverridesOnMethodsRule.java:40)
	at com.carrotsearch.randomizedtesting.rules.NoShadowingOrOverridesOnMethodsRule$1.evaluate(NoShadowingOrOverridesOnMethodsRule.java:40)
	at com.carrotsearch.randomizedtesting.rules.StatementAdapter.evaluate(StatementAdapter.java:36)
	at com.carrotsearch.randomizedtesting.rules.StatementAdapter.evaluate(StatementAdapter.java:36)
	at com.carrotsearch.randomizedtesting.rules.StatementAdapter.evaluate(StatementAdapter.java:36)
	at org.apache.lucene.util.TestRuleAssertionsRequired$1.evaluate(TestRuleAssertionsRequired.java:53)
	at org.apache.lucene.util.TestRuleMarkFailure$1.evaluate(TestRuleMarkFailure.java:47)
	at org.apache.lucene.util.TestRuleIgnoreAfterMaxFailures$1.evaluate(TestRuleIgnoreAfterMaxFailures.java:64)
	at org.apache.lucene.util.TestRuleIgnoreTestSuites$1.evaluate(TestRuleIgnoreTestSuites.java:54)
	at com.carrotsearch.randomizedtesting.rules.StatementAdapter.evaluate(StatementAdapter.java:36)
	at com.carrotsearch.randomizedtesting.ThreadLeakControl$StatementRunner.run(ThreadLeakControl.java:368)
	at java.lang.Thread.run(Thread.java:748)


FAILED:  junit.framework.TestSuite.org.apache.solr.analytics.value.CastingAnalyticsValueTest

Error Message:
Could not remove the following files (in the order of attempts):    C:\Users\jenkins\workspace\Lucene-Solr-master-Windows\solr\build\contrib\solr-analytics\test\J0\temp\solr.analytics.value.CastingAnalyticsValueTest_4EE4299D6B5BD5F4-001\init-core-data-001: java.nio.file.AccessDeniedException: C:\Users\jenkins\workspace\Lucene-Solr-master-Windows\solr\build\contrib\solr-analytics\test\J0\temp\solr.analytics.value.CastingAnalyticsValueTest_4EE4299D6B5BD5F4-001\init-core-data-001    C:\Users\jenkins\workspace\Lucene-Solr-master-Windows\solr\build\contrib\solr-analytics\test\J0\temp\solr.analytics.value.CastingAnalyticsValueTest_4EE4299D6B5BD5F4-001: java.nio.file.DirectoryNotEmptyException: C:\Users\jenkins\workspace\Lucene-Solr-master-Windows\solr\build\contrib\solr-analytics\test\J0\temp\solr.analytics.value.CastingAnalyticsValueTest_4EE4299D6B5BD5F4-001 

Stack Trace:
java.io.IOException: Could not remove the following files (in the order of attempts):
   C:\Users\jenkins\workspace\Lucene-Solr-master-Windows\solr\build\contrib\solr-analytics\test\J0\temp\solr.analytics.value.CastingAnalyticsValueTest_4EE4299D6B5BD5F4-001\init-core-data-001: java.nio.file.AccessDeniedException: C:\Users\jenkins\workspace\Lucene-Solr-master-Windows\solr\build\contrib\solr-analytics\test\J0\temp\solr.analytics.value.CastingAnalyticsValueTest_4EE4299D6B5BD5F4-001\init-core-data-001
   C:\Users\jenkins\workspace\Lucene-Solr-master-Windows\solr\build\contrib\solr-analytics\test\J0\temp\solr.analytics.value.CastingAnalyticsValueTest_4EE4299D6B5BD5F4-001: java.nio.file.DirectoryNotEmptyException: C:\Users\jenkins\workspace\Lucene-Solr-master-Windows\solr\build\contrib\solr-analytics\test\J0\temp\solr.analytics.value.CastingAnalyticsValueTest_4EE4299D6B5BD5F4-001

	at __randomizedtesting.SeedInfo.seed([4EE4299D6B5BD5F4]:0)
	at org.apache.lucene.util.IOUtils.rm(IOUtils.java:329)
	at org.apache.lucene.util.TestRuleTemporaryFilesCleanup.afterAlways(TestRuleTemporaryFilesCleanup.java:216)
	at com.carrotsearch.randomizedtesting.rules.TestRuleAdapter$1.afterAlways(TestRuleAdapter.java:31)
	at com.carrotsearch.randomizedtesting.rules.StatementAdapter.evaluate(StatementAdapter.java:43)
	at com.carrotsearch.randomizedtesting.rules.StatementAdapter.evaluate(StatementAdapter.java:36)
	at org.apache.lucene.util.TestRuleAssertionsRequired$1.evaluate(TestRuleAssertionsRequired.java:53)
	at org.apache.lucene.util.TestRuleMarkFailure$1.evaluate(TestRuleMarkFailure.java:47)
	at org.apache.lucene.util.TestRuleIgnoreAfterMaxFailures$1.evaluate(TestRuleIgnoreAfterMaxFailures.java:64)
	at org.apache.lucene.util.TestRuleIgnoreTestSuites$1.evaluate(TestRuleIgnoreTestSuites.java:54)
	at com.carrotsearch.randomizedtesting.rules.StatementAdapter.evaluate(StatementAdapter.java:36)
	at com.carrotsearch.randomizedtesting.ThreadLeakControl$StatementRunner.run(ThreadLeakControl.java:368)
	at java.lang.Thread.run(Thread.java:748)


FAILED:  org.apache.solr.cloud.HttpPartitionTest.test

Error Message:
Doc with id=4 not found in http://127.0.0.1:54497/c8n_1x3 due to: Path not found: /id; rsp={doc=null}

Stack Trace:
java.lang.AssertionError: Doc with id=4 not found in http://127.0.0.1:54497/c8n_1x3 due to: Path not found: /id; rsp={doc=null}
	at __randomizedtesting.SeedInfo.seed([AA296055E731493C:227D5F8F49CD24C4]:0)
	at org.junit.Assert.fail(Assert.java:93)
	at org.junit.Assert.assertTrue(Assert.java:43)
	at org.apache.solr.cloud.HttpPartitionTest.assertDocExists(HttpPartitionTest.java:604)
	at org.apache.solr.cloud.HttpPartitionTest.assertDocsExistInAllReplicas(HttpPartitionTest.java:559)
	at org.apache.solr.cloud.HttpPartitionTest.testRf3(HttpPartitionTest.java:430)
	at org.apache.solr.cloud.HttpPartitionTest.test(HttpPartitionTest.java:137)
	at sun.reflect.NativeMethodAccessorImpl.invoke0(Native Method)
	at sun.reflect.NativeMethodAccessorImpl.invoke(NativeMethodAccessorImpl.java:62)
	at sun.reflect.DelegatingMethodAccessorImpl.invoke(DelegatingMethodAccessorImpl.java:43)
	at java.lang.reflect.Method.invoke(Method.java:498)
	at com.carrotsearch.randomizedtesting.RandomizedRunner.invoke(RandomizedRunner.java:1737)
	at com.carrotsearch.randomizedtesting.RandomizedRunner$8.evaluate(RandomizedRunner.java:934)
	at com.carrotsearch.randomizedtesting.RandomizedRunner$9.evaluate(RandomizedRunner.java:970)
	at com.carrotsearch.randomizedtesting.RandomizedRunner$10.evaluate(RandomizedRunner.java:984)
	at org.apache.solr.BaseDistributedSearchTestCase$ShardsRepeatRule$ShardsFixedStatement.callStatement(BaseDistributedSearchTestCase.java:993)
	at org.apache.solr.BaseDistributedSearchTestCase$ShardsRepeatRule$ShardsStatement.evaluate(BaseDistributedSearchTestCase.java:968)
	at com.carrotsearch.randomizedtesting.rules.SystemPropertiesRestoreRule$1.evaluate(SystemPropertiesRestoreRule.java:57)
	at org.apache.lucene.util.TestRuleSetupTeardownChained$1.evaluate(TestRuleSetupTeardownChained.java:49)
	at org.apache.lucene.util.AbstractBeforeAfterRule$1.evaluate(AbstractBeforeAfterRule.java:45)
	at org.apache.lucene.util.TestRuleThreadAndTestName$1.evaluate(TestRuleThreadAndTestName.java:48)
	at org.apache.lucene.util.TestRuleIgnoreAfterMaxFailures$1.evaluate(TestRuleIgnoreAfterMaxFailures.java:64)
	at org.apache.lucene.util.TestRuleMarkFailure$1.evaluate(TestRuleMarkFailure.java:47)
	at com.carrotsearch.randomizedtesting.rules.StatementAdapter.evaluate(StatementAdapter.java:36)
	at com.carrotsearch.randomizedtesting.ThreadLeakControl$StatementRunner.run(ThreadLeakControl.java:368)
	at com.carrotsearch.randomizedtesting.ThreadLeakControl.forkTimeoutingTask(ThreadLeakControl.java:817)
	at com.carrotsearch.randomizedtesting.ThreadLeakControl$3.evaluate(ThreadLeakControl.java:468)
	at com.carrotsearch.randomizedtesting.RandomizedRunner.runSingleTest(RandomizedRunner.java:943)
	at com.carrotsearch.randomizedtesting.RandomizedRunner$5.evaluate(RandomizedRunner.java:829)
	at com.carrotsearch.randomizedtesting.RandomizedRunner$6.evaluate(RandomizedRunner.java:879)
	at com.carrotsearch.randomizedtesting.RandomizedRunner$7.evaluate(RandomizedRunner.java:890)
	at com.carrotsearch.randomizedtesting.rules.StatementAdapter.evaluate(StatementAdapter.java:36)
	at com.carrotsearch.randomizedtesting.rules.SystemPropertiesRestoreRule$1.evaluate(SystemPropertiesRestoreRule.java:57)
	at org.apache.lucene.util.AbstractBeforeAfterRule$1.evaluate(AbstractBeforeAfterRule.java:45)
	at com.carrotsearch.randomizedtesting.rules.StatementAdapter.evaluate(StatementAdapter.java:36)
	at org.apache.lucene.util.TestRuleStoreClassName$1.evaluate(TestRuleStoreClassName.java:41)
	at com.carrotsearch.randomizedtesting.rules.NoShadowingOrOverridesOnMethodsRule$1.evaluate(NoShadowingOrOverridesOnMethodsRule.java:40)
	at com.carrotsearch.randomizedtesting.rules.NoShadowingOrOverridesOnMethodsRule$1.evaluate(NoShadowingOrOverridesOnMethodsRule.java:40)
	at com.carrotsearch.randomizedtesting.rules.StatementAdapter.evaluate(StatementAdapter.java:36)
	at com.carrotsearch.randomizedtesting.rules.StatementAdapter.evaluate(StatementAdapter.java:36)
	at com.carrotsearch.randomizedtesting.rules.StatementAdapter.evaluate(StatementAdapter.java:36)
	at org.apache.lucene.util.TestRuleAssertionsRequired$1.evaluate(TestRuleAssertionsRequired.java:53)
	at org.apache.lucene.util.TestRuleMarkFailure$1.evaluate(TestRuleMarkFailure.java:47)
	at org.apache.lucene.util.TestRuleIgnoreAfterMaxFailures$1.evaluate(TestRuleIgnoreAfterMaxFailures.java:64)
	at org.apache.lucene.util.TestRuleIgnoreTestSuites$1.evaluate(TestRuleIgnoreTestSuites.java:54)
	at com.carrotsearch.randomizedtesting.rules.StatementAdapter.evaluate(StatementAdapter.java:36)
	at com.carrotsearch.randomizedtesting.ThreadLeakControl$StatementRunner.run(ThreadLeakControl.java:368)
	at java.lang.Thread.run(Thread.java:748)


FAILED:  junit.framework.TestSuite.org.apache.solr.core.TestSolrIndexConfig

Error Message:
Could not remove the following files (in the order of attempts):    C:\Users\jenkins\workspace\Lucene-Solr-master-Windows\solr\build\solr-core\test\J0\temp\solr.core.TestSolrIndexConfig_AA296055E731493C-001\init-core-data-001: java.nio.file.AccessDeniedException: C:\Users\jenkins\workspace\Lucene-Solr-master-Windows\solr\build\solr-core\test\J0\temp\solr.core.TestSolrIndexConfig_AA296055E731493C-001\init-core-data-001    C:\Users\jenkins\workspace\Lucene-Solr-master-Windows\solr\build\solr-core\test\J0\temp\solr.core.TestSolrIndexConfig_AA296055E731493C-001: java.nio.file.DirectoryNotEmptyException: C:\Users\jenkins\workspace\Lucene-Solr-master-Windows\solr\build\solr-core\test\J0\temp\solr.core.TestSolrIndexConfig_AA296055E731493C-001 

Stack Trace:
java.io.IOException: Could not remove the following files (in the order of attempts):
   C:\Users\jenkins\workspace\Lucene-Solr-master-Windows\solr\build\solr-core\test\J0\temp\solr.core.TestSolrIndexConfig_AA296055E731493C-001\init-core-data-001: java.nio.file.AccessDeniedException: C:\Users\jenkins\workspace\Lucene-Solr-master-Windows\solr\build\solr-core\test\J0\temp\solr.core.TestSolrIndexConfig_AA296055E731493C-001\init-core-data-001
   C:\Users\jenkins\workspace\Lucene-Solr-master-Windows\solr\build\solr-core\test\J0\temp\solr.core.TestSolrIndexConfig_AA296055E731493C-001: java.nio.file.DirectoryNotEmptyException: C:\Users\jenkins\workspace\Lucene-Solr-master-Windows\solr\build\solr-core\test\J0\temp\solr.core.TestSolrIndexConfig_AA296055E731493C-001

	at __randomizedtesting.SeedInfo.seed([AA296055E731493C]:0)
	at org.apache.lucene.util.IOUtils.rm(IOUtils.java:329)
	at org.apache.lucene.util.TestRuleTemporaryFilesCleanup.afterAlways(TestRuleTemporaryFilesCleanup.java:216)
	at com.carrotsearch.randomizedtesting.rules.TestRuleAdapter$1.afterAlways(TestRuleAdapter.java:31)
	at com.carrotsearch.randomizedtesting.rules.StatementAdapter.evaluate(StatementAdapter.java:43)
	at com.carrotsearch.randomizedtesting.rules.StatementAdapter.evaluate(StatementAdapter.java:36)
	at org.apache.lucene.util.TestRuleAssertionsRequired$1.evaluate(TestRuleAssertionsRequired.java:53)
	at org.apache.lucene.util.TestRuleMarkFailure$1.evaluate(TestRuleMarkFailure.java:47)
	at org.apache.lucene.util.TestRuleIgnoreAfterMaxFailures$1.evaluate(TestRuleIgnoreAfterMaxFailures.java:64)
	at org.apache.lucene.util.TestRuleIgnoreTestSuites$1.evaluate(TestRuleIgnoreTestSuites.java:54)
	at com.carrotsearch.randomizedtesting.rules.StatementAdapter.evaluate(StatementAdapter.java:36)
	at com.carrotsearch.randomizedtesting.ThreadLeakControl$StatementRunner.run(ThreadLeakControl.java:368)
	at java.lang.Thread.run(Thread.java:748)


FAILED:  junit.framework.TestSuite.org.apache.solr.handler.component.DistributedFacetPivotLargeTest

Error Message:
Could not remove the following files (in the order of attempts):    C:\Users\jenkins\workspace\Lucene-Solr-master-Windows\solr\build\solr-core\test\J0\temp\solr.handler.component.DistributedFacetPivotLargeTest_AA296055E731493C-001\tempDir-001\shard2\cores\collection1\data\spellchecker2: java.nio.file.DirectoryNotEmptyException: C:\Users\jenkins\workspace\Lucene-Solr-master-Windows\solr\build\solr-core\test\J0\temp\solr.handler.component.DistributedFacetPivotLargeTest_AA296055E731493C-001\tempDir-001\shard2\cores\collection1\data\spellchecker2    C:\Users\jenkins\workspace\Lucene-Solr-master-Windows\solr\build\solr-core\test\J0\temp\solr.handler.component.DistributedFacetPivotLargeTest_AA296055E731493C-001\tempDir-001\shard2\cores\collection1\data: java.nio.file.DirectoryNotEmptyException: C:\Users\jenkins\workspace\Lucene-Solr-master-Windows\solr\build\solr-core\test\J0\temp\solr.handler.component.DistributedFacetPivotLargeTest_AA296055E731493C-001\tempDir-001\shard2\cores\collection1\data    C:\Users\jenkins\workspace\Lucene-Solr-master-Windows\solr\build\solr-core\test\J0\temp\solr.handler.component.DistributedFacetPivotLargeTest_AA296055E731493C-001\tempDir-001\shard2\cores\collection1: java.nio.file.DirectoryNotEmptyException: C:\Users\jenkins\workspace\Lucene-Solr-master-Windows\solr\build\solr-core\test\J0\temp\solr.handler.component.DistributedFacetPivotLargeTest_AA296055E731493C-001\tempDir-001\shard2\cores\collection1    C:\Users\jenkins\workspace\Lucene-Solr-master-Windows\solr\build\solr-core\test\J0\temp\solr.handler.component.DistributedFacetPivotLargeTest_AA296055E731493C-001\tempDir-001\shard2\cores: java.nio.file.DirectoryNotEmptyException: C:\Users\jenkins\workspace\Lucene-Solr-master-Windows\solr\build\solr-core\test\J0\temp\solr.handler.component.DistributedFacetPivotLargeTest_AA296055E731493C-001\tempDir-001\shard2\cores    C:\Users\jenkins\workspace\Lucene-Solr-master-Windows\solr\build\solr-core\test\J0\temp\solr.handler.component.DistributedFacetPivotLargeTest_AA296055E731493C-001\tempDir-001\shard2: java.nio.file.DirectoryNotEmptyException: C:\Users\jenkins\workspace\Lucene-Solr-master-Windows\solr\build\solr-core\test\J0\temp\solr.handler.component.DistributedFacetPivotLargeTest_AA296055E731493C-001\tempDir-001\shard2    C:\Users\jenkins\workspace\Lucene-Solr-master-Windows\solr\build\solr-core\test\J0\temp\solr.handler.component.DistributedFacetPivotLargeTest_AA296055E731493C-001\tempDir-001: java.nio.file.DirectoryNotEmptyException: C:\Users\jenkins\workspace\Lucene-Solr-master-Windows\solr\build\solr-core\test\J0\temp\solr.handler.component.DistributedFacetPivotLargeTest_AA296055E731493C-001\tempDir-001 

Stack Trace:
java.io.IOException: Could not remove the following files (in the order of attempts):
   C:\Users\jenkins\workspace\Lucene-Solr-master-Windows\solr\build\solr-core\test\J0\temp\solr.handler.component.DistributedFacetPivotLargeTest_AA296055E731493C-001\tempDir-001\shard2\cores\collection1\data\spellchecker2: java.nio.file.DirectoryNotEmptyException: C:\Users\jenkins\workspace\Lucene-Solr-master-Windows\solr\build\solr-core\test\J0\temp\solr.handler.component.DistributedFacetPivotLargeTest_AA296055E731493C-001\tempDir-001\shard2\cores\collection1\data\spellchecker2
   C:\Users\jenkins\workspace\Lucene-Solr-master-Windows\solr\build\solr-core\test\J0\temp\solr.handler.component.DistributedFacetPivotLargeTest_AA296055E731493C-001\tempDir-001\shard2\cores\collection1\data: java.nio.file.DirectoryNotEmptyException: C:\Users\jenkins\workspace\Lucene-Solr-master-Windows\solr\build\solr-core\test\J0\temp\solr.handler.component.DistributedFacetPivotLargeTest_AA296055E731493C-001\tempDir-001\shard2\cores\collection1\data
   C:\Users\jenkins\workspace\Lucene-Solr-master-Windows\solr\build\solr-core\test\J0\temp\solr.handler.component.DistributedFacetPivotLargeTest_AA296055E731493C-001\tempDir-001\shard2\cores\collection1: java.nio.file.DirectoryNotEmptyException: C:\Users\jenkins\workspace\Lucene-Solr-master-Windows\solr\build\solr-core\test\J0\temp\solr.handler.component.DistributedFacetPivotLargeTest_AA296055E731493C-001\tempDir-001\shard2\cores\collection1
   C:\Users\jenkins\workspace\Lucene-Solr-master-Windows\solr\build\solr-core\test\J0\temp\solr.handler.component.DistributedFacetPivotLargeTest_AA296055E731493C-001\tempDir-001\shard2\cores: java.nio.file.DirectoryNotEmptyException: C:\Users\jenkins\workspace\Lucene-Solr-master-Windows\solr\build\solr-core\test\J0\temp\solr.handler.component.DistributedFacetPivotLargeTest_AA296055E731493C-001\tempDir-001\shard2\cores
   C:\Users\jenkins\workspace\Lucene-Solr-master-Windows\solr\build\solr-core\test\J0\temp\solr.handler.component.DistributedFacetPivotLargeTest_AA296055E731493C-001\tempDir-001\shard2: java.nio.file.DirectoryNotEmptyException: C:\Users\jenkins\workspace\Lucene-Solr-master-Windows\solr\build\solr-core\test\J0\temp\solr.handler.component.DistributedFacetPivotLargeTest_AA296055E731493C-001\tempDir-001\shard2
   C:\Users\jenkins\workspace\Lucene-Solr-master-Windows\solr\build\solr-core\test\J0\temp\solr.handler.component.DistributedFacetPivotLargeTest_AA296055E731493C-001\tempDir-001: java.nio.file.DirectoryNotEmptyException: C:\Users\jenkins\workspace\Lucene-Solr-master-Windows\solr\build\solr-core\test\J0\temp\solr.handler.component.DistributedFacetPivotLargeTest_AA296055E731493C-001\tempDir-001

	at __randomizedtesting.SeedInfo.seed([AA296055E731493C]:0)
	at org.apache.lucene.util.IOUtils.rm(IOUtils.java:329)
	at org.apache.lucene.util.TestRuleTemporaryFilesCleanup.afterAlways(TestRuleTemporaryFilesCleanup.java:216)
	at com.carrotsearch.randomizedtesting.rules.TestRuleAdapter$1.afterAlways(TestRuleAdapter.java:31)
	at com.carrotsearch.randomizedtesting.rules.StatementAdapter.evaluate(StatementAdapter.java:43)
	at com.carrotsearch.randomizedtesting.rules.StatementAdapter.evaluate(StatementAdapter.java:36)
	at org.apache.lucene.util.TestRuleAssertionsRequired$1.evaluate(TestRuleAssertionsRequired.java:53)
	at org.apache.lucene.util.TestRuleMarkFailure$1.evaluate(TestRuleMarkFailure.java:47)
	at org.apache.lucene.util.TestRuleIgnoreAfterMaxFailures$1.evaluate(TestRuleIgnoreAfterMaxFailures.java:64)
	at org.apache.lucene.util.TestRuleIgnoreTestSuites$1.evaluate(TestRuleIgnoreTestSuites.java:54)
	at com.carrotsearch.randomizedtesting.rules.StatementAdapter.evaluate(StatementAdapter.java:36)
	at com.carrotsearch.randomizedtesting.ThreadLeakControl$StatementRunner.run(ThreadLeakControl.java:368)
	at java.lang.Thread.run(Thread.java:748)


FAILED:  junit.framework.TestSuite.org.apache.solr.update.processor.TestOpenNLPExtractNamedEntitiesUpdateProcessorFactory

Error Message:
Could not remove the following files (in the order of attempts):    C:\Users\jenkins\workspace\Lucene-Solr-master-Windows\solr\build\contrib\solr-analysis-extras\test\J1\temp\solr.update.processor.TestOpenNLPExtractNamedEntitiesUpdateProcessorFactory_695D5F4558349EAF-001\tempDir-001\collection1\conf: java.nio.file.DirectoryNotEmptyException: C:\Users\jenkins\workspace\Lucene-Solr-master-Windows\solr\build\contrib\solr-analysis-extras\test\J1\temp\solr.update.processor.TestOpenNLPExtractNamedEntitiesUpdateProcessorFactory_695D5F4558349EAF-001\tempDir-001\collection1\conf    C:\Users\jenkins\workspace\Lucene-Solr-master-Windows\solr\build\contrib\solr-analysis-extras\test\J1\temp\solr.update.processor.TestOpenNLPExtractNamedEntitiesUpdateProcessorFactory_695D5F4558349EAF-001\tempDir-001\collection1: java.nio.file.DirectoryNotEmptyException: C:\Users\jenkins\workspace\Lucene-Solr-master-Windows\solr\build\contrib\solr-analysis-extras\test\J1\temp\solr.update.processor.TestOpenNLPExtractNamedEntitiesUpdateProcessorFactory_695D5F4558349EAF-001\tempDir-001\collection1    C:\Users\jenkins\workspace\Lucene-Solr-master-Windows\solr\build\contrib\solr-analysis-extras\test\J1\temp\solr.update.processor.TestOpenNLPExtractNamedEntitiesUpdateProcessorFactory_695D5F4558349EAF-001\tempDir-001: java.nio.file.DirectoryNotEmptyException: C:\Users\jenkins\workspace\Lucene-Solr-master-Windows\solr\build\contrib\solr-analysis-extras\test\J1\temp\solr.update.processor.TestOpenNLPExtractNamedEntitiesUpdateProcessorFactory_695D5F4558349EAF-001\tempDir-001    C:\Users\jenkins\workspace\Lucene-Solr-master-Windows\solr\build\contrib\solr-analysis-extras\test\J1\temp\solr.update.processor.TestOpenNLPExtractNamedEntitiesUpdateProcessorFactory_695D5F4558349EAF-001\tempDir-001\collection1\conf\en-test-sent.bin: java.nio.file.AccessDeniedException: C:\Users\jenkins\workspace\Lucene-Solr-master-Windows\solr\build\contrib\solr-analysis-extras\test\J1\temp\solr.update.processor.TestOpenNLPExtractNamedEntitiesUpdateProcessorFactory_695D5F4558349EAF-001\tempDir-001\collection1\conf\en-test-sent.bin    C:\Users\jenkins\workspace\Lucene-Solr-master-Windows\solr\build\contrib\solr-analysis-extras\test\J1\temp\solr.update.processor.TestOpenNLPExtractNamedEntitiesUpdateProcessorFactory_695D5F4558349EAF-001\tempDir-001\collection1\conf\en-test-ner-person.bin: java.nio.file.AccessDeniedException: C:\Users\jenkins\workspace\Lucene-Solr-master-Windows\solr\build\contrib\solr-analysis-extras\test\J1\temp\solr.update.processor.TestOpenNLPExtractNamedEntitiesUpdateProcessorFactory_695D5F4558349EAF-001\tempDir-001\collection1\conf\en-test-ner-person.bin    C:\Users\jenkins\workspace\Lucene-Solr-master-Windows\solr\build\contrib\solr-analysis-extras\test\J1\temp\solr.update.processor.TestOpenNLPExtractNamedEntitiesUpdateProcessorFactory_695D5F4558349EAF-001\tempDir-001\collection1\conf\en-test-tokenizer.bin: java.nio.file.AccessDeniedException: C:\Users\jenkins\workspace\Lucene-Solr-master-Windows\solr\build\contrib\solr-analysis-extras\test\J1\temp\solr.update.processor.TestOpenNLPExtractNamedEntitiesUpdateProcessorFactory_695D5F4558349EAF-001\tempDir-001\collection1\conf\en-test-tokenizer.bin    C:\Users\jenkins\workspace\Lucene-Solr-master-Windows\solr\build\contrib\solr-analysis-extras\test\J1\temp\solr.update.processor.TestOpenNLPExtractNamedEntitiesUpdateProcessorFactory_695D5F4558349EAF-001: java.nio.file.DirectoryNotEmptyException: C:\Users\jenkins\workspace\Lucene-Solr-master-Windows\solr\build\contrib\solr-analysis-extras\test\J1\temp\solr.update.processor.TestOpenNLPExtractNamedEntitiesUpdateProcessorFactory_695D5F4558349EAF-001 

Stack Trace:
java.io.IOException: Could not remove the following files (in the order of attempts):
   C:\Users\jenkins\workspace\Lucene-Solr-master-Windows\solr\build\contrib\solr-analysis-extras\test\J1\temp\solr.update.processor.TestOpenNLPExtractNamedEntitiesUpdateProcessorFactory_695D5F4558349EAF-001\tempDir-001\collection1\conf: java.nio.file.DirectoryNotEmptyException: C:\Users\jenkins\workspace\Lucene-Solr-master-Windows\solr\build\contrib\solr-analysis-extras\test\J1\temp\solr.update.processor.TestOpenNLPExtractNamedEntitiesUpdateProcessorFactory_695D5F4558349EAF-001\tempDir-001\collection1\conf
   C:\Users\jenkins\workspace\Lucene-Solr-master-Windows\solr\build\contrib\solr-analysis-extras\test\J1\temp\solr.update.processor.TestOpenNLPExtractNamedEntitiesUpdateProcessorFactory_695D5F4558349EAF-001\tempDir-001\collection1: java.nio.file.DirectoryNotEmptyException: C:\Users\jenkins\workspace\Lucene-Solr-master-Windows\solr\build\contrib\solr-analysis-extras\test\J1\temp\solr.update.processor.TestOpenNLPExtractNamedEntitiesUpdateProcessorFactory_695D5F4558349EAF-001\tempDir-001\collection1
   C:\Users\jenkins\workspace\Lucene-Solr-master-Windows\solr\build\contrib\solr-analysis-extras\test\J1\temp\solr.update.processor.TestOpenNLPExtractNamedEntitiesUpdateProcessorFactory_695D5F4558349EAF-001\tempDir-001: java.nio.file.DirectoryNotEmptyException: C:\Users\jenkins\workspace\Lucene-Solr-master-Windows\solr\build\contrib\solr-analysis-extras\test\J1\temp\solr.update.processor.TestOpenNLPExtractNamedEntitiesUpdateProcessorFactory_695D5F4558349EAF-001\tempDir-001
   C:\Users\jenkins\workspace\Lucene-Solr-master-Windows\solr\build\contrib\solr-analysis-extras\test\J1\temp\solr.update.processor.TestOpenNLPExtractNamedEntitiesUpdateProcessorFactory_695D5F4558349EAF-001\tempDir-001\collection1\conf\en-test-sent.bin: java.nio.file.AccessDeniedException: C:\Users\jenkins\workspace\Lucene-Solr-master-Windows\solr\build\contrib\solr-analysis-extras\test\J1\temp\solr.update.processor.TestOpenNLPExtractNamedEntitiesUpdateProcessorFactory_695D5F4558349EAF-001\tempDir-001\collection1\conf\en-test-sent.bin
   C:\Users\jenkins\workspace\Lucene-Solr-master-Windows\solr\build\contrib\solr-analysis-extras\test\J1\temp\solr.update.processor.TestOpenNLPExtractNamedEntitiesUpdateProcessorFactory_695D5F4558349EAF-001\tempDir-001\collection1\conf\en-test-ner-person.bin: java.nio.file.AccessDeniedException: C:\Users\jenkins\workspace\Lucene-Solr-master-Windows\solr\build\contrib\solr-analysis-extras\test\J1\temp\solr.update.processor.TestOpenNLPExtractNamedEntitiesUpdateProcessorFactory_695D5F4558349EAF-001\tempDir-001\collection1\conf\en-test-ner-person.bin
   C:\Users\jenkins\workspace\Lucene-Solr-master-Windows\solr\build\contrib\solr-analysis-extras\test\J1\temp\solr.update.processor.TestOpenNLPExtractNamedEntitiesUpdateProcessorFactory_695D5F4558349EAF-001\tempDir-001\collection1\conf\en-test-tokenizer.bin: java.nio.file.AccessDeniedException: C:\Users\jenkins\workspace\Lucene-Solr-master-Windows\solr\build\contrib\solr-analysis-extras\test\J1\temp\solr.update.processor.TestOpenNLPExtractNamedEntitiesUpdateProcessorFactory_695D5F4558349EAF-001\tempDir-001\collection1\conf\en-test-tokenizer.bin
   C:\Users\jenkins\workspace\Lucene-Solr-master-Windows\solr\build\contrib\solr-analysis-extras\test\J1\temp\solr.update.processor.TestOpenNLPExtractNamedEntitiesUpdateProcessorFactory_695D5F4558349EAF-001: java.nio.file.DirectoryNotEmptyException: C:\Users\jenkins\workspace\Lucene-Solr-master-Windows\solr\build\contrib\solr-analysis-extras\test\J1\temp\solr.update.processor.TestOpenNLPExtractNamedEntitiesUpdateProcessorFactory_695D5F4558349EAF-001

	at __randomizedtesting.SeedInfo.seed([695D5F4558349EAF]:0)
	at org.apache.lucene.util.IOUtils.rm(IOUtils.java:329)
	at org.apache.lucene.util.TestRuleTemporaryFilesCleanup.afterAlways(TestRuleTemporaryFilesCleanup.java:216)
	at com.carrotsearch.randomizedtesting.rules.TestRuleAdapter$1.afterAlways(TestRuleAdapter.java:31)
	at com.carrotsearch.randomizedtesting.rules.StatementAdapter.evaluate(StatementAdapter.java:43)
	at com.carrotsearch.randomizedtesting.rules.StatementAdapter.evaluate(StatementAdapter.java:36)
	at org.apache.lucene.util.TestRuleAssertionsRequired$1.evaluate(TestRuleAssertionsRequired.java:53)
	at org.apache.lucene.util.TestRuleMarkFailure$1.evaluate(TestRuleMarkFailure.java:47)
	at org.apache.lucene.util.TestRuleIgnoreAfterMaxFailures$1.evaluate(TestRuleIgnoreAfterMaxFailures.java:64)
	at org.apache.lucene.util.TestRuleIgnoreTestSuites$1.evaluate(TestRuleIgnoreTestSuites.java:54)
	at com.carrotsearch.randomizedtesting.rules.StatementAdapter.evaluate(StatementAdapter.java:36)
	at com.carrotsearch.randomizedtesting.ThreadLeakControl$StatementRunner.run(ThreadLeakControl.java:368)
	at java.lang.Thread.run(Thread.java:748)




Build Log:
[...truncated 458 lines...]
   [junit4] Suite: org.apache.lucene.store.TestFileSwitchDirectory
   [junit4] IGNOR/A 0.01s J1 | TestFileSwitchDirectory.testPendingDeletions
   [junit4]    > Assumption #1: we can only install VirusCheckingFS on an FSDirectory
   [junit4] IGNOR/A 0.01s J1 | TestFileSwitchDirectory.testFsyncDoesntCreateNewFiles
   [junit4]    > Assumption #1: test only works for FSDirectory subclasses
   [junit4]   2> NOTE: test params are: codec=Asserting(Lucene70): {}, docValues:{}, maxPointsInLeafNode=338, maxMBSortInHeap=7.831402527996726, sim=Asserting(org.apache.lucene.search.similarities.AssertingSimilarity@31be6a1d), locale=sr-CS, timezone=Pacific/Kiritimati
   [junit4]   2> NOTE: Windows 10 10.0 amd64/Oracle Corporation 1.8.0_144 (64-bit)/cpus=3,threads=1,free=156277648,total=261984256
   [junit4]   2> NOTE: All tests run in this JVM: [TestBlockPostingsFormat3, TestAxiomaticF3LOG, TestMatchNoDocsQuery, TestSubScorerFreqs, TestRollback, TestLongPostings, TestUniqueTermCount, TestIndexWriterOnDiskFull, TestAxiomaticF1LOG, TestCachingTokenFilter, TestIndexReaderClose, TestRadixSelector, Test2BSortedDocValuesFixedSorted, TestFuzzyQuery, TestSizeBoundedForceMerge, TestTermsEnum2, TestClassicSimilarity, TestParallelTermEnum, TestNumericDocValuesUpdates, TestLMDirichletSimilarity, TestBlockPostingsFormat, TestSpanMultiTermQueryWrapper, TestPayloads, TestLucene50StoredFieldsFormatHighCompression, TestForTooMuchCloning, TestMultiset, TestField, TestIndexWriterDelete, TestNormsFieldExistsQuery, TestIndexWriterOnJRECrash, TestIndexWriterLockRelease, TestTopFieldCollector, TestMultiPhraseQuery, Test2BPostingsBytes, TestBlendedTermQuery, TestTrackingDirectoryWrapper, TestMaxTermFrequency, TestIsCurrent, TestLongBitSet, TestSparseFixedBitDocIdSet, TestFilterDirectory, TestIndexedDISI, TestMergeRateLimiter, TestGraphTokenizers, TestMaxPosition, TestDocValuesScoring, TestSimilarity, TestBasics, TestSentinelIntSet, TestBasicModelIne, TestIndexWriterMaxDocs, TestSearcherManager, TestReadOnlyIndex, TestFileSwitchDirectory]
   [junit4]   2> NOTE: reproduce with: ant test  -Dtestcase=TestFileSwitchDirectory -Dtests.seed=A5291C4283B01F20 -Dtests.slow=true -Dtests.locale=sr-CS -Dtests.timezone=Pacific/Kiritimati -Dtests.asserts=true -Dtests.file.encoding=US-ASCII
   [junit4] ERROR   0.00s J1 | TestFileSwitchDirectory (suite) <<<
   [junit4]    > Throwable #1: java.io.IOException: Could not remove the following files (in the order of attempts):
   [junit4]    >    C:\Users\jenkins\workspace\Lucene-Solr-master-Windows\lucene\build\core\test\J1\temp\lucene.store.TestFileSwitchDirectory_A5291C4283B01F20-001\bar-026: java.nio.file.AccessDeniedException: C:\Users\jenkins\workspace\Lucene-Solr-master-Windows\lucene\build\core\test\J1\temp\lucene.store.TestFileSwitchDirectory_A5291C4283B01F20-001\bar-026
   [junit4]    >    C:\Users\jenkins\workspace\Lucene-Solr-master-Windows\lucene\build\core\test\J1\temp\lucene.store.TestFileSwitchDirectory_A5291C4283B01F20-001: java.nio.file.DirectoryNotEmptyException: C:\Users\jenkins\workspace\Lucene-Solr-master-Windows\lucene\build\core\test\J1\temp\lucene.store.TestFileSwitchDirectory_A5291C4283B01F20-001
   [junit4]    > 	at __randomizedtesting.SeedInfo.seed([A5291C4283B01F20]:0)
   [junit4]    > 	at org.apache.lucene.util.IOUtils.rm(IOUtils.java:329)
   [junit4]    > 	at java.lang.Thread.run(Thread.java:748)
   [junit4] Completed [71/475 (1!)] on J1 in 3.57s, 43 tests, 1 error, 2 skipped <<< FAILURES!

[...truncated 4322 lines...]
   [junit4] Suite: org.apache.lucene.index.TestBackwardsCompatibility
   [junit4] IGNOR/A 0.02s J0 | TestBackwardsCompatibility.testCreateNoCFS
   [junit4]    > Assumption #1: backcompat creation tests must be run with -Dtests.bwcdir=/path/to/write/indexes
   [junit4] IGNOR/A 0.00s J0 | TestBackwardsCompatibility.testCreateCFS
   [junit4]    > Assumption #1: backcompat creation tests must be run with -Dtests.bwcdir=/path/to/write/indexes
   [junit4] IGNOR/A 0.00s J0 | TestBackwardsCompatibility.testCreateMoreTermsIndex
   [junit4]    > Assumption #1: backcompat creation tests must be run with -Dtests.bwcdir=/path/to/write/indexes
   [junit4] IGNOR/A 0.00s J0 | TestBackwardsCompatibility.testCreateIndexWithDocValuesUpdates
   [junit4]    > Assumption #1: backcompat creation tests must be run with -Dtests.bwcdir=/path/to/write/indexes
   [junit4] IGNOR/A 0.00s J0 | TestBackwardsCompatibility.testCreateEmptyIndex
   [junit4]    > Assumption #1: backcompat creation tests must be run with -Dtests.bwcdir=/path/to/write/indexes
   [junit4] IGNOR/A 0.00s J0 | TestBackwardsCompatibility.testCreateSortedIndex
   [junit4]    > Assumption #1: backcompat creation tests must be run with -Dtests.bwcdir=/path/to/write/indexes
   [junit4] IGNOR/A 0.00s J0 | TestBackwardsCompatibility.testCreateSingleSegmentCFS
   [junit4]    > Assumption #1: backcompat creation tests must be run with -Dtests.bwcdir=/path/to/write/indexes
   [junit4] IGNOR/A 0.00s J0 | TestBackwardsCompatibility.testCreateSingleSegmentNoCFS
   [junit4]    > Assumption #1: backcompat creation tests must be run with -Dtests.bwcdir=/path/to/write/indexes
   [junit4]   2> NOTE: test params are: codec=Asserting(Lucene70): {content6=BlockTreeOrds(blocksize=128), content5=Lucene50(blocksize=128), content4=PostingsFormat(name=LuceneFixedGap), content3=TestBloomFilteredLucenePostings(BloomFilteringPostingsFormat(Lucene50(blocksize=128))), content2=BlockTreeOrds(blocksize=128), fie?ld=BlockTreeOrds(blocksize=128), utf8=PostingsFormat(name=LuceneFixedGap), id=BlockTreeOrds(blocksize=128), content=PostingsFormat(name=LuceneFixedGap), autf8=TestBloomFilteredLucenePostings(BloomFilteringPostingsFormat(Lucene50(blocksize=128)))}, docValues:{ndv2=DocValuesFormat(name=Asserting), ndv1=DocValuesFormat(name=Direct), dvShort=DocValuesFormat(name=Asserting), utf8=DocValuesFormat(name=Direct), fie?ld=DocValuesFormat(name=Lucene70), dvInt=DocValuesFormat(name=Direct), longPoint2d=DocValuesFormat(name=Asserting), dvBytesSortedVar=DocValuesFormat(name=Lucene70), dvSortedSet=DocValuesFormat(name=Lucene70), content=DocValuesFormat(name=Direct), floatPoint1d=DocValuesFormat(name=Lucene70), bdv2=DocValuesFormat(name=Asserting), bdv2_c=DocValuesFormat(name=Asserting), bdv1=DocValuesFormat(name=Direct), bdv1_c=DocValuesFormat(name=Lucene70), intPoint1d=DocValuesFormat(name=Memory), doublePoint2d=DocValuesFormat(name=Lucene70), dvBytesDerefVar=DocValuesFormat(name=Asserting), id=DocValuesFormat(name=Lucene70), binaryPoint2d=DocValuesFormat(name=Direct), dvSortedNumeric=DocValuesFormat(name=Asserting), dvBytesDerefFixed=DocValuesFormat(name=Direct), autf8=DocValuesFormat(name=Asserting), dvBytesSortedFixed=DocValuesFormat(name=Asserting), dvBytesStraightVar=DocValuesFormat(name=Memory), dvBytesStraightFixed=DocValuesFormat(name=Lucene70), dvLong=DocValuesFormat(name=Asserting), longPoint1d=DocValuesFormat(name=Direct), floatPoint2d=DocValuesFormat(name=Asserting), dvDouble=DocValuesFormat(name=Lucene70), dvFloat=DocValuesFormat(name=Asserting), content6=DocValuesFormat(name=Lucene70), content5=DocValuesFormat(name=Memory), dvPacked=DocValuesFormat(name=Asserting), intPoint2d=DocValuesFormat(name=Lucene70), content4=DocValuesFormat(name=Direct), content3=DocValuesFormat(name=Asserting), content2=DocValuesFormat(name=Lucene70), doublePoint1d=DocValuesFormat(name=Asserting), ndv1_c=DocValuesFormat(name=Lucene70), dvByte=DocValuesFormat(name=Asserting), ndv2_c=DocValuesFormat(name=Asserting), binaryPoint1d=DocValuesFormat(name=Asserting)}, maxPointsInLeafNode=1722, maxMBSortInHeap=6.213638189609659, sim=Asserting(org.apache.lucene.search.similarities.AssertingSimilarity@d7ee4c0), locale=fi-FI, timezone=America/Rio_Branco
   [junit4]   2> NOTE: Windows 10 10.0 amd64/Oracle Corporation 1.8.0_144 (64-bit)/cpus=3,threads=1,free=73443384,total=97320960
   [junit4]   2> NOTE: All tests run in this JVM: [TestBackwardsCompatibility]
   [junit4]   2> NOTE: reproduce with: ant test  -Dtestcase=TestBackwardsCompatibility -Dtests.seed=B599383E1C973DC9 -Dtests.slow=true -Dtests.locale=fi-FI -Dtests.timezone=America/Rio_Branco -Dtests.asserts=true -Dtests.file.encoding=Cp1252
   [junit4] ERROR   0.00s J0 | TestBackwardsCompatibility (suite) <<<
   [junit4]    > Throwable #1: java.io.IOException: Could not remove the following files (in the order of attempts):
   [junit4]    >    C:\Users\jenkins\workspace\Lucene-Solr-master-Windows\lucene\build\backward-codecs\test\J0\temp\lucene.index.TestBackwardsCompatibility_B599383E1C973DC9-001\3.0.2-nocfs-001: java.nio.file.DirectoryNotEmptyException: C:\Users\jenkins\workspace\Lucene-Solr-master-Windows\lucene\build\backward-codecs\test\J0\temp\lucene.index.TestBackwardsCompatibility_B599383E1C973DC9-001\3.0.2-nocfs-001
   [junit4]    > 	at __randomizedtesting.SeedInfo.seed([B599383E1C973DC9]:0)
   [junit4]    > 	at org.apache.lucene.util.IOUtils.rm(IOUtils.java:329)
   [junit4]    > 	at java.lang.Thread.run(Thread.java:748)
   [junit4] Completed [3/3 (1!)] on J0 in 22.67s, 30 tests, 1 error, 8 skipped <<< FAILURES!

[...truncated 1743 lines...]
   [junit4] Suite: org.apache.lucene.codecs.blockterms.TestVarGapDocFreqIntervalPostingsFormat
   [junit4]   2> NOTE: test params are: codec=Asserting(Lucene70): {}, docValues:{}, maxPointsInLeafNode=1422, maxMBSortInHeap=5.906135869746689, sim=Asserting(org.apache.lucene.search.similarities.AssertingSimilarity@22050058), locale=und, timezone=America/Cancun
   [junit4]   2> NOTE: Windows 10 10.0 amd64/Oracle Corporation 1.8.0_144 (64-bit)/cpus=3,threads=1,free=73960880,total=97320960
   [junit4]   2> NOTE: All tests run in this JVM: [TestVarGapDocFreqIntervalPostingsFormat]
   [junit4]   2> NOTE: reproduce with: ant test  -Dtestcase=TestVarGapDocFreqIntervalPostingsFormat -Dtests.seed=A1EF7255751A33E3 -Dtests.slow=true -Dtests.locale=und -Dtests.timezone=America/Cancun -Dtests.asserts=true -Dtests.file.encoding=Cp1252
   [junit4] ERROR   0.00s J0 | TestVarGapDocFreqIntervalPostingsFormat (suite) <<<
   [junit4]    > Throwable #1: java.io.IOException: Could not remove the following files (in the order of attempts):
   [junit4]    >    C:\Users\jenkins\workspace\Lucene-Solr-master-Windows\lucene\build\codecs\test\J0\temp\lucene.codecs.blockterms.TestVarGapDocFreqIntervalPostingsFormat_A1EF7255751A33E3-001\testPostingsFormat.testExact-006: java.nio.file.AccessDeniedException: C:\Users\jenkins\workspace\Lucene-Solr-master-Windows\lucene\build\codecs\test\J0\temp\lucene.codecs.blockterms.TestVarGapDocFreqIntervalPostingsFormat_A1EF7255751A33E3-001\testPostingsFormat.testExact-006
   [junit4]    >    C:\Users\jenkins\workspace\Lucene-Solr-master-Windows\lucene\build\codecs\test\J0\temp\lucene.codecs.blockterms.TestVarGapDocFreqIntervalPostingsFormat_A1EF7255751A33E3-001: java.nio.file.DirectoryNotEmptyException: C:\Users\jenkins\workspace\Lucene-Solr-master-Windows\lucene\build\codecs\test\J0\temp\lucene.codecs.blockterms.TestVarGapDocFreqIntervalPostingsFormat_A1EF7255751A33E3-001
   [junit4]    > 	at __randomizedtesting.SeedInfo.seed([A1EF7255751A33E3]:0)
   [junit4]    > 	at org.apache.lucene.util.IOUtils.rm(IOUtils.java:329)
   [junit4]    > 	at java.lang.Thread.run(Thread.java:748)
   [junit4] Completed [3/20 (1!)] on J0 in 14.48s, 25 tests, 1 error <<< FAILURES!

[...truncated 2320 lines...]
   [junit4] Suite: org.apache.lucene.replicator.IndexReplicationClientTest
   [junit4]   2> NOTE: reproduce with: ant test  -Dtestcase=IndexReplicationClientTest -Dtests.method=testRestart -Dtests.seed=6677A68B716F7020 -Dtests.slow=true -Dtests.locale=ar-BH -Dtests.timezone=Africa/Dar_es_Salaam -Dtests.asserts=true -Dtests.file.encoding=UTF-8
   [junit4] ERROR   0.06s J1 | IndexReplicationClientTest.testRestart <<<
   [junit4]    > Throwable #1: java.io.IOException: Could not remove the following files (in the order of attempts):
   [junit4]    >    C:\Users\jenkins\workspace\Lucene-Solr-master-Windows\lucene\build\replicator\test\J1\temp\lucene.replicator.IndexReplicationClientTest_6677A68B716F7020-001\replicationClientTest-002\1: java.nio.file.DirectoryNotEmptyException: C:\Users\jenkins\workspace\Lucene-Solr-master-Windows\lucene\build\replicator\test\J1\temp\lucene.replicator.IndexReplicationClientTest_6677A68B716F7020-001\replicationClientTest-002\1
   [junit4]    > 	at __randomizedtesting.SeedInfo.seed([6677A68B716F7020:F3FA4AEAF487C435]:0)
   [junit4]    > 	at org.apache.lucene.util.IOUtils.rm(IOUtils.java:329)
   [junit4]    > 	at org.apache.lucene.replicator.PerSessionDirectoryFactory.cleanupSession(PerSessionDirectoryFactory.java:58)
   [junit4]    > 	at org.apache.lucene.replicator.ReplicationClient.doUpdate(ReplicationClient.java:259)
   [junit4]    > 	at org.apache.lucene.replicator.ReplicationClient.updateNow(ReplicationClient.java:401)
   [junit4]    > 	at org.apache.lucene.replicator.IndexReplicationClientTest.testRestart(IndexReplicationClientTest.java:193)
   [junit4]    > 	at java.lang.Thread.run(Thread.java:748)
   [junit4]   2> NOTE: leaving temporary files on disk at: C:\Users\jenkins\workspace\Lucene-Solr-master-Windows\lucene\build\replicator\test\J1\temp\lucene.replicator.IndexReplicationClientTest_6677A68B716F7020-001
   [junit4]   2> NOTE: test params are: codec=FastCompressingStoredFields(storedFieldsFormat=CompressingStoredFieldsFormat(compressionMode=FAST, chunkSize=4, maxDocsPerChunk=384, blockSize=4), termVectorsFormat=CompressingTermVectorsFormat(compressionMode=FAST, chunkSize=4, blockSize=4)), sim=Asserting(org.apache.lucene.search.similarities.AssertingSimilarity@2d2e8ac5), locale=ar-BH, timezone=Africa/Dar_es_Salaam
   [junit4]   2> NOTE: Windows 10 10.0 amd64/Oracle Corporation 1.8.0_144 (64-bit)/cpus=3,threads=1,free=63807984,total=97320960
   [junit4]   2> NOTE: All tests run in this JVM: [IndexRevisionTest, SessionTokenTest, IndexAndTaxonomyRevisionTest, IndexReplicationClientTest]
   [junit4] Completed [4/9 (1!)] on J1 in 3.79s, 4 tests, 1 error <<< FAILURES!

[...truncated 4128 lines...]
   [junit4] Suite: org.apache.solr.handler.component.DistributedFacetPivotLargeTest
   [junit4]   2> 1857372 INFO  (SUITE-DistributedFacetPivotLargeTest-seed#[AA296055E731493C]-worker) [    ] o.a.s.SolrTestCaseJ4 SecureRandom sanity checks: test.solr.allowed.securerandom=null & java.security.egd=file:/dev/./urandom
   [junit4]   2> Creating dataDir: C:\Users\jenkins\workspace\Lucene-Solr-master-Windows\solr\build\solr-core\test\J0\temp\solr.handler.component.DistributedFacetPivotLargeTest_AA296055E731493C-001\init-core-data-001
   [junit4]   2> 1857373 WARN  (SUITE-DistributedFacetPivotLargeTest-seed#[AA296055E731493C]-worker) [    ] o.a.s.SolrTestCaseJ4 startTrackingSearchers: numOpens=2 numCloses=2
   [junit4]   2> 1857374 INFO  (SUITE-DistributedFacetPivotLargeTest-seed#[AA296055E731493C]-worker) [    ] o.a.s.SolrTestCaseJ4 Using PointFields (NUMERIC_POINTS_SYSPROP=true) w/NUMERIC_DOCVALUES_SYSPROP=true
   [junit4]   2> 1857374 INFO  (SUITE-DistributedFacetPivotLargeTest-seed#[AA296055E731493C]-worker) [    ] o.a.s.SolrTestCaseJ4 Randomized ssl (false) and clientAuth (true) via: @org.apache.solr.util.RandomizeSSL(reason=, value=NaN, ssl=NaN, clientAuth=NaN)
   [junit4]   2> 1857374 INFO  (SUITE-DistributedFacetPivotLargeTest-seed#[AA296055E731493C]-worker) [    ] o.a.s.BaseDistributedSearchTestCase Setting hostContext system property: /
   [junit4]   2> 1858211 INFO  (TEST-DistributedFacetPivotLargeTest.test-seed#[AA296055E731493C]) [    ] o.a.s.SolrTestCaseJ4 Writing core.properties file to C:\Users\jenkins\workspace\Lucene-Solr-master-Windows\solr\build\solr-core\test\J0\temp\solr.handler.component.DistributedFacetPivotLargeTest_AA296055E731493C-001\tempDir-001\control\cores\collection1
   [junit4]   2> 1858214 INFO  (TEST-DistributedFacetPivotLargeTest.test-seed#[AA296055E731493C]) [    ] o.e.j.s.Server jetty-9.3.20.v20170531
   [junit4]   2> 1858225 INFO  (TEST-DistributedFacetPivotLargeTest.test-seed#[AA296055E731493C]) [    ] o.e.j.s.h.ContextHandler Started o.e.j.s.ServletContextHandler@39383aec{/,null,AVAILABLE}
   [junit4]   2> 1858226 INFO  (TEST-DistributedFacetPivotLargeTest.test-seed#[AA296055E731493C]) [    ] o.e.j.s.AbstractConnector Started ServerConnector@5ef25478{HTTP/1.1,[http/1.1]}{127.0.0.1:65094}
   [junit4]   2> 1858227 INFO  (TEST-DistributedFacetPivotLargeTest.test-seed#[AA296055E731493C]) [    ] o.e.j.s.Server Started @1867477ms
   [junit4]   2> 1858227 INFO  (TEST-DistributedFacetPivotLargeTest.test-seed#[AA296055E731493C]) [    ] o.a.s.c.s.e.JettySolrRunner Jetty properties: {hostContext=/, hostPort=65094, coreRootDirectory=C:\Users\jenkins\workspace\Lucene-Solr-master-Windows\solr\build\solr-core\test\J0\temp\solr.handler.component.DistributedFacetPivotLargeTest_AA296055E731493C-001\tempDir-001\control\cores}
   [junit4]   2> 1858227 ERROR (TEST-DistributedFacetPivotLargeTest.test-seed#[AA296055E731493C]) [    ] o.a.s.u.StartupLoggingUtils Missing Java Option solr.log.dir. Logging may be missing or incomplete.
   [junit4]   2> 1858227 INFO  (TEST-DistributedFacetPivotLargeTest.test-seed#[AA296055E731493C]) [    ] o.a.s.s.SolrDispatchFilter  ___      _       Welcome to Apache Solr? version 8.0.0
   [junit4]   2> 1858228 INFO  (TEST-DistributedFacetPivotLargeTest.test-seed#[AA296055E731493C]) [    ] o.a.s.s.SolrDispatchFilter / __| ___| |_ _   Starting in standalone mode on port null
   [junit4]   2> 1858228 INFO  (TEST-DistributedFacetPivotLargeTest.test-seed#[AA296055E731493C]) [    ] o.a.s.s.SolrDispatchFilter \__ \/ _ \ | '_|  Install dir: null
   [junit4]   2> 1858228 INFO  (TEST-DistributedFacetPivotLargeTest.test-seed#[AA296055E731493C]) [    ] o.a.s.s.SolrDispatchFilter |___/\___/_|_|    Start time: 2017-12-19T20:04:09.797Z
   [junit4]   2> 1858228 INFO  (TEST-DistributedFacetPivotLargeTest.test-seed#[AA296055E731493C]) [    ] o.a.s.c.SolrXmlConfig Loading container configuration from C:\Users\jenkins\workspace\Lucene-Solr-master-Windows\solr\build\solr-core\test\J0\temp\solr.handler.component.DistributedFacetPivotLargeTest_AA296055E731493C-001\tempDir-001\control\solr.xml
   [junit4]   2> 1858239 INFO  (TEST-DistributedFacetPivotLargeTest.test-seed#[AA296055E731493C]) [    ] o.a.s.c.SolrXmlConfig Configuration parameter autoReplicaFailoverWorkLoopDelay is ignored
   [junit4]   2> 1858239 INFO  (TEST-DistributedFacetPivotLargeTest.test-seed#[AA296055E731493C]) [    ] o.a.s.c.SolrXmlConfig Configuration parameter autoReplicaFailoverBadNodeExpiration is ignored
   [junit4]   2> 1858240 INFO  (TEST-DistributedFacetPivotLargeTest.test-seed#[AA296055E731493C]) [    ] o.a.s.c.SolrXmlConfig MBean server found: com.sun.jmx.mbeanserver.JmxMBeanServer@695e9ca4, but no JMX reporters were configured - adding default JMX reporter.
   [junit4]   2> 1858360 INFO  (TEST-DistributedFacetPivotLargeTest.test-seed#[AA296055E731493C]) [    ] o.a.s.m.r.SolrJmxReporter JMX monitoring for 'solr.node' (registry 'solr.node') enabled at server: com.sun.jmx.mbeanserver.JmxMBeanServer@695e9ca4
   [junit4]   2> 1858368 INFO  (TEST-DistributedFacetPivotLargeTest.test-seed#[AA296055E731493C]) [    ] o.a.s.m.r.SolrJmxReporter JMX monitoring for 'solr.jvm' (registry 'solr.jvm') enabled at server: com.sun.jmx.mbeanserver.JmxMBeanServer@695e9ca4
   [junit4]   2> 1858368 INFO  (TEST-DistributedFacetPivotLargeTest.test-seed#[AA296055E731493C]) [    ] o.a.s.m.r.SolrJmxReporter JMX monitoring for 'solr.jetty' (registry 'solr.jetty') enabled at server: com.sun.jmx.mbeanserver.JmxMBeanServer@695e9ca4
   [junit4]   2> 1858374 INFO  (TEST-DistributedFacetPivotLargeTest.test-seed#[AA296055E731493C]) [    ] o.a.s.c.CorePropertiesLocator Found 1 core definitions underneath C:\Users\jenkins\workspace\Lucene-Solr-master-Windows\solr\build\solr-core\test\J0\temp\solr.handler.component.DistributedFacetPivotLargeTest_AA296055E731493C-001\tempDir-001\control\cores
   [junit4]   2> 1858374 INFO  (TEST-DistributedFacetPivotLargeTest.test-seed#[AA296055E731493C]) [    ] o.a.s.c.CorePropertiesLocator Cores are: [collection1]
   [junit4]   2> 1858375 INFO  (coreLoadExecutor-7972-thread-1) [    ] o.a.s.c.TransientSolrCoreCacheDefault Allocating transient cache for 4 transient cores
   [junit4]   2> 1858376 INFO  (coreLoadExecutor-7972-thread-1) [    x:collection1] o.a.s.c.SolrResourceLoader [null] Added 2 libs to classloader, from paths: [/C:/Users/jenkins/workspace/Lucene-Solr-master-Windows/solr/core/src/test-files/solr/collection1/lib, /C:/Users/jenkins/workspace/Lucene-Solr-master-Windows/solr/core/src/test-files/solr/collection1/lib/classes]
   [junit4]   2> 1858467 INFO  (coreLoadExecutor-7972-thread-1) [    x:collection1] o.a.s.c.SolrConfig Using Lucene MatchVersion: 8.0.0
   [junit4]   2> 1858496 INFO  (coreLoadExecutor-7972-thread-1) [    x:collection1] o.a.s.s.IndexSchema [collection1] Schema name=test
   [junit4]   2> 1858610 INFO  (coreLoadExecutor-7972-thread-1) [    x:collection1] o.a.s.s.IndexSchema Loaded schema test/1.0 with uniqueid field id
   [junit4]   2> 1858626 INFO  (coreLoadExecutor-7972-thread-1) [    x:collection1] o.a.s.c.CoreContainer Creating SolrCore 'collection1' using configuration from configset C:\Users\jenkins\workspace\Lucene-Solr-master-Windows\solr\core\src\test-files\solr\collection1, trusted=true
   [junit4]   2> 1858627 INFO  (coreLoadExecutor-7972-thread-1) [    x:collection1] o.a.s.m.r.SolrJmxReporter JMX monitoring for 'solr.core.collection1' (registry 'solr.core.collection1') enabled at server: com.sun.jmx.mbeanserver.JmxMBeanServer@695e9ca4
   [junit4]   2> 1858627 INFO  (coreLoadExecutor-7972-thread-1) [    x:collection1] o.a.s.c.SolrCore solr.RecoveryStrategy.Builder
   [junit4]   2> 1858627 INFO  (coreLoadExecutor-7972-thread-1) [    x:collection1] o.a.s.c.SolrCore [[collection1] ] Opening new SolrCore at [C:\Users\jenkins\workspace\Lucene-Solr-master-Windows\solr\core\src\test-files\solr\collection1], dataDir=[C:\Users\jenkins\workspace\Lucene-Solr-master-Windows\solr\build\solr-core\test\J0\temp\solr.handler.component.DistributedFacetPivotLargeTest_AA296055E731493C-001\tempDir-001\control\cores\collection1\data\]
   [junit4]   2> 1858630 INFO  (coreLoadExecutor-7972-thread-1) [    x:collection1] o.a.s.u.RandomMergePolicy RandomMergePolicy wrapping class org.apache.lucene.index.TieredMergePolicy: [TieredMergePolicy: maxMergeAtOnce=42, maxMergeAtOnceExplicit=39, maxMergedSegmentMB=19.1318359375, floorSegmentMB=1.0517578125, forceMergeDeletesPctAllowed=16.92658141744472, segmentsPerTier=19.0, maxCFSSegmentSizeMB=8.796093022207999E12, noCFSRatio=0.38970875313473197
   [junit4]   2> 1858742 INFO  (coreLoadExecutor-7972-thread-1) [    x:collection1] o.a.s.u.UpdateHandler Using UpdateLog implementation: org.apache.solr.update.UpdateLog
   [junit4]   2> 1858742 INFO  (coreLoadExecutor-7972-thread-1) [    x:collection1] o.a.s.u.UpdateLog Initializing UpdateLog: dataDir= defaultSyncLevel=FLUSH numRecordsToKeep=100 maxNumLogsToKeep=10 numVersionBuckets=65536
   [junit4]   2> 1858743 INFO  (coreLoadExecutor-7972-thread-1) [    x:collection1] o.a.s.u.CommitTracker Hard AutoCommit: disabled
   [junit4]   2> 1858744 INFO  (coreLoadExecutor-7972-thread-1) [    x:collection1] o.a.s.u.CommitTracker Soft AutoCommit: disabled
   [junit4]   2> 1858745 INFO  (coreLoadExecutor-7972-thread-1) [    x:collection1] o.a.s.u.RandomMergePolicy RandomMergePolicy wrapping class org.apache.lucene.index.LogByteSizeMergePolicy: [LogByteSizeMergePolicy: minMergeSize=1677721, mergeFactor=16, maxMergeSize=2147483648, maxMergeSizeForForcedMerge=9223372036854775807, calibrateSizeByDeletes=false, maxMergeDocs=2147483647, maxCFSSegmentSizeMB=8.796093022207999E12, noCFSRatio=0.0]
   [junit4]   2> 1858746 INFO  (coreLoadExecutor-7972-thread-1) [    x:collection1] o.a.s.s.SolrIndexSearcher Opening [Searcher@6eb397e1[collection1] main]
   [junit4]   2> 1858746 INFO  (coreLoadExecutor-7972-thread-1) [    x:collection1] o.a.s.h.c.SpellCheckComponent Initializing spell checkers
   [junit4]   2> 1858754 INFO  (coreLoadExecutor-7972-thread-1) [    x:collection1] o.a.s.s.DirectSolrSpellChecker init: {name=direct,classname=DirectSolrSpellChecker,field=lowerfilt,minQueryLength=3}
   [junit4]   2> 1858801 INFO  (coreLoadExecutor-7972-thread-1) [    x:collection1] o.a.s.h.ReplicationHandler Commits will be reserved for 10000ms.
   [junit4]   2> 1858801 INFO  (searcherExecutor-7973-thread-1-processing-x:collection1) [    x:collection1] o.a.s.h.c.SpellCheckComponent Loading spell index for spellchecker: default
   [junit4]   2> 1858801 INFO  (coreLoadExecutor-7972-thread-1) [    x:collection1] o.a.s.u.UpdateLog Could not find max version in index or recent updates, using new clock 1587244014365573120
   [junit4]   2> 1858801 INFO  (searcherExecutor-7973-thread-1-processing-x:collection1) [    x:collection1] o.a.s.h.c.SpellCheckComponent Loading spell index for spellchecker: direct
   [junit4]   2> 1858801 INFO  (searcherExecutor-7973-thread-1-processing-x:collection1) [    x:collection1] o.a.s.h.c.SpellCheckComponent Loading spell index for spellchecker: wordbreak
   [junit4]   2> 1858801 INFO  (searcherExecutor-7973-thread-1-processing-x:collection1) [    x:collection1] o.a.s.h.c.SpellCheckComponent Loading spell index for spellchecker: multipleFields
   [junit4]   2> 1858801 INFO  (searcherExecutor-7973-thread-1-processing-x:collection1) [    x:collection1] o.a.s.h.c.SpellCheckComponent Loading spell index for spellchecker: jarowinkler
   [junit4]   2> 1858801 INFO  (searcherExecutor-7973-thread-1-processing-x:collection1) [    x:collection1] o.a.s.h.c.SpellCheckComponent Loading spell index for spellchecker: external
   [junit4]   2> 1858801 INFO  (searcherExecutor-7973-thread-1-processing-x:collection1) [    x:collection1] o.a.s.h.c.SpellCheckComponent Loading spell index for spellchecker: freq
   [junit4]   2> 1858806 INFO  (searcherExecutor-7973-thread-1-processing-x:collection1) [    x:collection1] o.a.s.h.c.SpellCheckComponent Loading spell index for spellchecker: fqcn
   [junit4]   2> 1858807 INFO  (searcherExecutor-7973-thread-1-processing-x:collection1) [    x:collection1] o.a.s.h.c.SpellCheckComponent Loading spell index for spellchecker: perDict
   [junit4]   2> 1858809 INFO  (searcherExecutor-7973-thread-1-processing-x:collection1) [    x:collection1] o.a.s.c.SolrCore [collection1] Registered new searcher Searcher@6eb397e1[collection1] main{ExitableDirectoryReader(UninvertingDirectoryReader())}
   [junit4]   2> 1859468 INFO  (TEST-DistributedFacetPivotLargeTest.test-seed#[AA296055E731493C]) [    ] o.a.s.SolrTestCaseJ4 Writing core.properties file to C:\Users\jenkins\workspace\Lucene-Solr-master-Windows\solr\build\solr-core\test\J0\temp\solr.handler.component.DistributedFacetPivotLargeTest_AA296055E731493C-001\tempDir-001\shard0\cores\collection1
   [junit4]   2> 1859469 INFO  (TEST-DistributedFacetPivotLargeTest.test-seed#[AA296055E731493C]) [    ] o.e.j.s.Server jetty-9.3.20.v20170531
   [junit4]   2> 1859470 INFO  (TEST-DistributedFacetPivotLargeTest.test-seed#[AA296055E731493C]) [    ] o.e.j.s.h.ContextHandler Started o.e.j.s.ServletContextHandler@739d6f6a{/,null,AVAILABLE}
   [junit4]   2> 1859470 INFO  (TEST-DistributedFacetPivotLargeTest.test-seed#[AA296055E731493C]) [    ] o.e.j.s.AbstractConnector Started ServerConnector@784dde20{HTTP/1.1,[http/1.1]}{127.0.0.1:65100}
   [junit4]   2> 1859471 INFO  (TEST-DistributedFacetPivotLargeTest.test-seed#[AA296055E731493C]) [    ] o.e.j.s.Server Started @1868722ms
   [junit4]   2> 1859471 INFO  (TEST-DistributedFacetPivotLargeTest.test-seed#[AA296055E731493C]) [    ] o.a.s.c.s.e.JettySolrRunner Jetty properties: {hostContext=/, hostPort=65100, coreRootDirectory=C:\Users\jenkins\workspace\Lucene-Solr-master-Windows\solr\build\solr-core\test\J0\temp\solr.handler.component.DistributedFacetPivotLargeTest_AA296055E731493C-001\tempDir-001\shard0\cores}
   [junit4]   2> 1859471 ERROR (TEST-DistributedFacetPivotLargeTest.test-seed#[AA296055E731493C]) [    ] o.a.s.u.StartupLoggingUtils Missing Java Option solr.log.dir. Logging may be missing or incomplete.
   [junit4]   2> 1859471 INFO  (TEST-DistributedFacetPivotLargeTest.test-seed#[AA296055E731493C]) [    ] o.a.s.s.SolrDispatchFilter  ___      _       Welcome to Apache Solr? version 8.0.0
   [junit4]   2> 1859471 INFO  (TEST-DistributedFacetPivotLargeTest.test-seed#[AA296055E731493C]) [    ] o.a.s.s.SolrDispatchFilter / __| ___| |_ _   Starting in standalone mode on port null
   [junit4]   2> 1859471 INFO  (TEST-DistributedFacetPivotLargeTest.test-seed#[AA296055E731493C]) [    ] o.a.s.s.SolrDispatchFilter \__ \/ _ \ | '_|  Install dir: null
   [junit4]   2> 1859471 INFO  (TEST-DistributedFacetPivotLargeTest.test-seed#[AA296055E731493C]) [    ] o.a.s.s.SolrDispatchFilter |___/\___/_|_|    Start time: 2017-12-19T20:04:11.040Z
   [junit4]   2> 1859472 INFO  (TEST-DistributedFacetPivotLargeTest.test-seed#[AA296055E731493C]) [    ] o.a.s.c.SolrXmlConfig Loading container configuration from C:\Users\jenkins\workspace\Lucene-Solr-master-Windows\solr\build\solr-core\test\J0\temp\solr.handler.component.DistributedFacetPivotLargeTest_AA296055E731493C-001\tempDir-001\shard0\solr.xml
   [junit4]   2> 1859478 INFO  (TEST-DistributedFacetPivotLargeTest.test-seed#[AA296055E731493C]) [    ] o.a.s.c.SolrXmlConfig Configuration parameter autoReplicaFailoverWorkLoopDelay is ignored
   [junit4]   2> 1859478 INFO  (TEST-DistributedFacetPivotLargeTest.test-seed#[AA296055E731493C]) [    ] o.a.s.c.SolrXmlConfig Configuration parameter autoReplicaFailoverBadNodeExpiration is ignored
   [junit4]   2> 1859479 INFO  (TEST-DistributedFacetPivotLargeTest.test-seed#[AA296055E731493C]) [    ] o.a.s.c.SolrXmlConfig MBean server found: com.sun.jmx.mbeanserver.JmxMBeanServer@695e9ca4, but no JMX reporters were configured - adding default JMX reporter.
   [junit4]   2> 1859589 INFO  (TEST-DistributedFacetPivotLargeTest.test-seed#[AA296055E731493C]) [    ] o.a.s.m.r.SolrJmxReporter JMX monitoring for 'solr.node' (registry 'solr.node') enabled at server: com.sun.jmx.mbeanserver.JmxMBeanServer@695e9ca4
   [junit4]   2> 1859603 INFO  (TEST-DistributedFacetPivotLargeTest.test-seed#[AA296055E731493C]) [    ] o.a.s.m.r.SolrJmxReporter JMX monitoring for 'solr.jvm' (registry 'solr.jvm') enabled at server: com.sun.jmx.mbeanserver.JmxMBeanServer@695e9ca4
   [junit4]   2> 1859603 INFO  (TEST-DistributedFacetPivotLargeTest.test-seed#[AA296055E731493C]) [    ] o.a.s.m.r.SolrJmxReporter JMX monitoring for 'solr.jetty' (registry 'solr.jetty') enabled at server: com.sun.jmx.mbeanserver.JmxMBeanServer@695e9ca4
   [junit4]   2> 1859609 INFO  (TEST-DistributedFacetPivotLargeTest.test-seed#[AA296055E731493C]) [    ] o.a.s.c.CorePropertiesLocator Found 1 core definitions underneath C:\Users\jenkins\workspace\Lucene-Solr-master-Windows\solr\build\solr-core\test\J0\temp\solr.handler.component.DistributedFacetPivotLargeTest_AA296055E731493C-001\tempDir-001\shard0\cores
   [junit4]   2> 1859609 INFO  (TEST-DistributedFacetPivotLargeTest.test-seed#[AA296055E731493C]) [    ] o.a.s.c.CorePropertiesLocator Cores are: [collection1]
   [junit4]   2> 1859610 INFO  (coreLoadExecutor-7983-thread-1) [    ] o.a.s.c.TransientSolrCoreCacheDefault Allocating transient cache for 4 transient cores
   [junit4]   2> 1859612 INFO  (coreLoadExecutor-7983-thread-1) [    x:collection1] o.a.s.c.SolrResourceLoader [null] Added 2 libs to classloader, from paths: [/C:/Users/jenkins/workspace/Lucene-Solr-master-Windows/solr/core/src/test-files/solr/collection1/lib, /C:/Users/jenkins/workspace/Lucene-Solr-master-Windows/solr/core/src/test-files/solr/collection1/lib/classes]
   [junit4]   2> 1859701 INFO  (coreLoadExecutor-7983-thread-1) [    x:collection1] o.a.s.c.SolrConfig Using Lucene MatchVersion: 8.0.0
   [junit4]   2> 1859720 INFO  (coreLoadExecutor-7983-thread-1) [    x:collection1] o.a.s.s.IndexSchema [collection1] Schema name=test
   [junit4]   2> 1859832 INFO  (coreLoadExecutor-7983-thread-1) [    x:collection1] o.a.s.s.IndexSchema Loaded schema test/1.0 with uniqueid field id
   [junit4]   2> 1859846 INFO  (coreLoadExecutor-7983-thread-1) [    x:collection1] o.a.s.c.CoreContainer Creating SolrCore 'collection1' using configuration from configset C:\Users\jenkins\workspace\Lucene-Solr-master-Windows\solr\core\src\test-files\solr\collection1, trusted=true
   [junit4]   2> 1859847 INFO  (coreLoadExecutor-7983-thread-1) [    x:collection1] o.a.s.m.r.SolrJmxReporter JMX monitoring for 'solr.core.collection1' (registry 'solr.core.collection1') enabled at server: com.sun.jmx.mbeanserver.JmxMBeanServer@695e9ca4
   [junit4]   2> 1859847 INFO  (coreLoadExecutor-7983-thread-1) [    x:collection1] o.a.s.c.SolrCore solr.RecoveryStrategy.Builder
   [junit4]   2> 1859847 INFO  (coreLoadExecutor-7983-thread-1) [    x:collection1] o.a.s.c.SolrCore [[collection1] ] Opening new SolrCore at [C:\Users\jenkins\workspace\Lucene-Solr-master-Windows\solr\core\src\test-files\solr\collection1], dataDir=[C:\Users\jenkins\workspace\Lucene-Solr-master-Windows\solr\build\solr-core\test\J0\temp\solr.handler.component.DistributedFacetPivotLargeTest_AA296055E731493C-001\tempDir-001\shard0\cores\collection1\data\]
   [junit4]   2> 1859848 INFO  (coreLoadExecutor-7983-thread-1) [    x:collection1] o.a.s.u.RandomMergePolicy RandomMergePolicy wrapping class org.apache.lucene.index.TieredMergePolicy: [TieredMergePolicy: maxMergeAtOnce=42, maxMergeAtOnceExplicit=39, maxMergedSegmentMB=19.1318359375, floorSegmentMB=1.0517578125, forceMergeDeletesPctAllowed=16.92658141744472, segmentsPerTier=19.0, maxCFSSegmentSizeMB=8.796093022207999E12, noCFSRatio=0.38970875313473197
   [junit4]   2> 1859984 INFO  (coreLoadExecutor-7983-thread-1) [    x:collection1] o.a.s.u.UpdateHandler Using UpdateLog implementation: org.apache.solr.update.UpdateLog
   [junit4]   2> 1859984 INFO  (coreLoadExecutor-7983-thread-1) [    x:collection1] o.a.s.u.UpdateLog Initializing UpdateLog: dataDir= defaultSyncLevel=FLUSH numRecordsToKeep=100 maxNumLogsToKeep=10 numVersionBuckets=65536
   [junit4]   2> 1859985 INFO  (coreLoadExecutor-7983-thread-1) [    x:collection1] o.a.s.u.CommitTracker Hard AutoCommit: disabled
   [junit4]   2> 1859985 INFO  (coreLoadExecutor-7983-thread-1) [    x:collection1] o.a.s.u.CommitTracker Soft AutoCommit: disabled
   [junit4]   2> 1859987 INFO  (coreLoadExecutor-7983-thread-1) [    x:collection1] o.a.s.u.RandomMergePolicy RandomMergePolicy wrapping class org.apache.lucene.index.LogByteSizeMergePolicy: [LogByteSizeMergePolicy: minMergeSize=1677721, mergeFactor=16, maxMergeSize=2147483648, maxMergeSizeForForcedMerge=9223372036854775807, calibrateSizeByDeletes=false, maxMergeDocs=2147483647, maxCFSSegmentSizeMB=8.796093022207999E12, noCFSRatio=0.0]
   [junit4]   2> 1859987 INFO  (coreLoadExecutor-7983-thread-1) [    x:collection1] o.a.s.s.SolrIndexSearcher Opening [Searcher@c4be953[collection1] main]
   [junit4]   2> 1859988 INFO  (coreLoadExecutor-7983-thread-1) [    x:collection1] o.a.s.h.c.SpellCheckComponent Initializing spell checkers
   [junit4]   2> 1859999 INFO  (coreLoadExecutor-7983-thread-1) [    x:collection1] o.a.s.s.DirectSolrSpellChecker init: {name=direct,classname=DirectSolrSpellChecker,field=lowerfilt,minQueryLength=3}
   [junit4]   2> 1860069 INFO  (coreLoadExecutor-7983-thread-1) [    x:collection1] o.a.s.h.ReplicationHandler Commits will be reserved for 10000ms.
   [junit4]   2> 1860069 INFO  (searcherExecutor-7984-thread-1-processing-x:collection1) [    x:collection1] o.a.s.h.c.SpellCheckComponent Loading spell index for spellchecker: default
   [junit4]   2> 1860069 INFO  (coreLoadExecutor-7983-thread-1) [    x:collection1] o.a.s.u.UpdateLog Could not find max version in index or recent updates, using new clock 1587244015695167488
   [junit4]   2> 1860071 INFO  (searcherExecutor-7984-thread-1-processing-x:collection1) [    x:collection1] o.a.s.h.c.SpellCheckComponent Loading spell index for spellchecker: direct
   [junit4]   2> 1860071 INFO  (searcherExecutor-7984-thread-1-processing-x:collection1) [    x:collection1] o.a.s.h.c.SpellCheckComponent Loading spell index for spellchecker: wordbreak
   [junit4]   2> 1860071 INFO  (searcherExecutor-7984-thread-1-processing-x:collection1) [    x:collection1] o.a.s.h.c.SpellCheckComponent Loading spell index for spellchecker: multipleFields
   [junit4]   2> 1860071 INFO  (searcherExecutor-7984-thread-1-processing-x:collection1) [    x:collection1] o.a.s.h.c.SpellCheckComponent Loading spell index for spellchecker: jarowinkler
   [junit4]   2> 1860071 INFO  (searcherExecutor-7984-thread-1-processing-x:collection1) [    x:collection1] o.a.s.h.c.SpellCheckComponent Loading spell index for spellchecker: external
   [junit4]   2> 1860072 INFO  (searcherExecutor-7984-thread-1-processing-x:collection1) [    x:collection1] o.a.s.h.c.SpellCheckComponent Loading spell index for spellchecker: freq
   [junit4]   2> 1860073 INFO  (searcherExecutor-7984-thread-1-processing-x:collection1) [    x:collection1] o.a.s.h.c.SpellCheckComponent Loading spell index for spellchecker: fqcn
   [junit4]   2> 1860074 INFO  (searcherExecutor-7984-thread-1-processing-x:collection1) [    x:collection1] o.a.s.h.c.SpellCheckComponent Loading spell index for spellchecker: perDict
   [junit4]   2> 1860076 INFO  (searcherExecutor-7984-thread-1-processing-x:collection1) [    x:collection1] o.a.s.c.SolrCore [collection1] Registered new searcher Searcher@c4be953[collection1] main{ExitableDirectoryReader(UninvertingDirectoryReader())}
   [junit4]   2> 1860855 INFO  (TEST-DistributedFacetPivotLargeTest.test-seed#[AA296055E731493C]) [    ] o.a.s.SolrTestCaseJ4 Writing core.properties file to C:\Users\jenkins\workspace\Lucene-Solr-master-Windows\solr\build\solr-core\test\J0\temp\solr.handler.component.DistributedFacetPivotLargeTest_AA296055E731493C-001\tempDir-001\shard1\cores\collection1
   [junit4]   2> 1860858 INFO  (TEST-DistributedFacetPivotLargeTest.test-seed#[AA296055E731493C]) [    ] o.e.j.s.Server jetty-9.3.20.v20170531
   [junit4]   2> 1860858 INFO  (TEST-DistributedFacetPivotLargeTest.test-seed#[AA296055E731493C]) [    ] o.e.j.s.h.ContextHandler Started o.e.j.s.ServletContextHandler@58816556{/,null,AVAILABLE}
   [junit4]   2> 1860859 INFO  (TEST-DistributedFacetPivotLargeTest.test-seed#[AA296055E731493C]) [    ] o.e.j.s.AbstractConnector Started ServerConnector@7c6b126d{HTTP/1.1,[http/1.1]}{127.0.0.1:65106}
   [junit4]   2> 1860859 INFO  (TEST-DistributedFacetPivotLargeTest.test-seed#[AA296055E731493C]) [    ] o.e.j.s.Server Started @1870110ms
   [junit4]   2> 1860860 INFO  (TEST-DistributedFacetPivotLargeTest.test-seed#[AA296055E731493C]) [    ] o.a.s.c.s.e.JettySolrRunner Jetty properties: {hostContext=/, hostPort=65106, coreRootDirectory=C:\Users\jenkins\workspace\Lucene-Solr-master-Windows\solr\build\solr-core\test\J0\temp\solr.handler.component.DistributedFacetPivotLargeTest_AA296055E731493C-001\tempDir-001\shard1\cores}
   [junit4]   2> 1860860 ERROR (TEST-DistributedFacetPivotLargeTest.test-seed#[AA296055E731493C]) [    ] o.a.s.u.StartupLoggingUtils Missing Java Option solr.log.dir. Logging may be missing or incomplete.
   [junit4]   2> 1860861 INFO  (TEST-DistributedFacetPivotLargeTest.test-seed#[AA296055E731493C]) [    ] o.a.s.s.SolrDispatchFilter  ___      _       Welcome to Apache Solr? version 8.0.0
   [junit4]   2> 1860861 INFO  (TEST-DistributedFacetPivotLargeTest.test-seed#[AA296055E731493C]) [    ] o.a.s.s.SolrDispatchFilter / __| ___| |_ _   Starting in standalone mode on port null
   [junit4]   2> 1860861 INFO  (TEST-DistributedFacetPivotLargeTest.test-seed#[AA296055E731493C]) [    ] o.a.s.s.SolrDispatchFilter \__ \/ _ \ | '_|  Install dir: null
   [junit4]   2> 1860861 INFO  (TEST-DistributedFacetPivotLargeTest.test-seed#[AA296055E731493C]) [    ] o.a.s.s.SolrDispatchFilter |___/\___/_|_|    Start time: 2017-12-19T20:04:12.430Z
   [junit4]   2> 1860862 INFO  (TEST-DistributedFacetPivotLargeTest.test-seed#[AA296055E731493C]) [    ] o.a.s.c.SolrXmlConfig Loading container configuration from C:\Users\jenkins\workspace\Lucene-Solr-master-Windows\solr\build\solr-core\test\J0\temp\solr.handler.component.DistributedFacetPivotLargeTest_AA296055E731493C-001\tempDir-001\shard1\solr.xml
   [junit4]   2> 1860874 INFO  (TEST-DistributedFacetPivotLargeTest.test-seed#[AA296055E731493C]) [    ] o.a.s.c.SolrXmlConfig Configuration parameter autoReplicaFailoverWorkLoopDelay is ignored
   [junit4]   2> 1860874 INFO  (TEST-DistributedFacetPivotLargeTest.test-seed#[AA296055E731493C]) [    ] o.a.s.c.SolrXmlConfig Configuration parameter autoReplicaFailoverBadNodeExpiration is ignored
   [junit4]   2> 1860875 INFO  (TEST-DistributedFacetPivotLargeTest.test-seed#[AA296055E731493C]) [    ] o.a.s.c.SolrXmlConfig MBean server found: com.sun.jmx.mbeanserver.JmxMBeanServer@695e9ca4, but no JMX reporters were configured - adding default JMX reporter.
   [junit4]   2> 1860982 INFO  (TEST-DistributedFacetPivotLargeTest.test-seed#[AA296055E731493C]) [    ] o.a.s.m.r.SolrJmxReporter JMX monitoring for 'solr.node' (registry 'solr.node') enabled at server: com.sun.jmx.mbeanserver.JmxMBeanServer@695e9ca4
   [junit4]   2> 1861016 INFO  (TEST-DistributedFacetPivotLargeTest.test-seed#[AA296055E731493C]) [    ] o.a.s.m.r.SolrJmxReporter JMX monitoring for 'solr.jvm' (registry 'solr.jvm') enabled at server: com.sun.jmx.mbeanserver.JmxMBeanServer@695e9ca4
   [junit4]   2> 1861017 INFO  (TEST-DistributedFacetPivotLargeTest.test-seed#[AA296055E731493C]) [    ] o.a.s.m.r.SolrJmxReporter JMX monitoring for 'solr.jetty' (registry 'solr.jetty') enabled at server: com.sun.jmx.mbeanserver.JmxMBeanServer@695e9ca4
   [junit4]   2> 1861021 INFO  (TEST-DistributedFacetPivotLargeTest.test-seed#[AA296055E731493C]) [    ] o.a.s.c.CorePropertiesLocator Found 1 core definitions underneath C:\Users\jenkins\workspace\Lucene-Solr-master-Windows\solr\build\solr-core\test\J0\temp\solr.handler.component.DistributedFacetPivotLargeTest_AA296055E731493C-001\tempDir-001\shard1\cores
   [junit4]   2> 1861021 INFO  (TEST-DistributedFacetPivotLargeTest.test-seed#[AA296055E731493C]) [    ] o.a.s.c.CorePropertiesLocator Cores are: [collection1]
   [junit4]   2> 1861021 INFO  (coreLoadExecutor-7994-thread-1) [    ] o.a.s.c.TransientSolrCoreCacheDefault Allocating transient cache for 4 transient cores
   [junit4]   2> 1861023 INFO  (coreLoadExecutor-7994-thread-1) [    x:collection1] o.a.s.c.SolrResourceLoader [null] Added 2 libs to classloader, from paths: [/C:/Users/jenkins/workspace/Lucene-Solr-master-Windows/solr/core/src/test-files/solr/collection1/lib, /C:/Users/jenkins/workspace/Lucene-Solr-master-Windows/solr/core/src/test-files/solr/collection1/lib/classes]
   [junit4]   2> 1861113 INFO  (coreLoadExecutor-7994-thread-1) [    x:collection1] o.a.s.c.SolrConfig Using Lucene MatchVersion: 8.0.0
   [junit4]   2> 1861138 INFO  (coreLoadExecutor-7994-thread-1) [    x:collection1] o.a.s.s.IndexSchema [collection1] Schema name=test
   [junit4]   2> 1861270 INFO  (coreLoadExecutor-7994-thread-1) [    x:collection1] o.a.s.s.IndexSchema Loaded schema test/1.0 with uniqueid field id
   [junit4]   2> 1861285 INFO  (coreLoadExecutor-7994-thread-1) [    x:collection1] o.a.s.c.CoreContainer Creating SolrCore 'collection1' using configuration from configset C:\Users\jenkins\workspace\Lucene-Solr-master-Windows\solr\core\src\test-files\solr\collection1, trusted=true
   [junit4]   2> 1861286 INFO  (coreLoadExecutor-7994-thread-1) [    x:collection1] o.a.s.m.r.SolrJmxReporter JMX monitoring for 'solr.core.collection1' (registry 'solr.core.collection1') enabled at server: com.sun.jmx.mbeanserver.JmxMBeanServer@695e9ca4
   [junit4]   2> 1861286 INFO  (coreLoadExecutor-7994-thread-1) [    x:collection1] o.a.s.c.SolrCore solr.RecoveryStrategy.Builder
   [junit4]   2> 1861286 INFO  (coreLoadExecutor-7994-thread-1) [    x:collection1] o.a.s.c.SolrCore [[collection1] ] Opening new SolrCore at [C:\Users\jenkins\workspace\Lucene-Solr-master-Windows\solr\core\src\test-files\solr\collection1], dataDir=[C:\Users\jenkins\workspace\Lucene-Solr-master-Windows\solr\build\solr-core\test\J0\temp\solr.handler.component.DistributedFacetPivotLargeTest_AA296055E731493C-001\tempDir-001\shard1\cores\collection1\data\]
   [junit4]   2> 1861288 INFO  (coreLoadExecutor-7994-thread-1) [    x:collection1] o.a.s.u.RandomMergePolicy RandomMergePolicy wrapping class org.apache.lucene.index.TieredMergePolicy: [TieredMergePolicy: maxMergeAtOnce=42, maxMergeAtOnceExplicit=39, maxMergedSegmentMB=19.1318359375, floorSegmentMB=1.0517578125, forceMergeDeletesPctAllowed=16.92658141744472, segmentsPerTier=19.0, maxCFSSegmentSizeMB=8.796093022207999E12, noCFSRatio=0.38970875313473197
   [junit4]   2> 1861449 INFO  (coreLoadExecutor-7994-thread-1) [    x:collection1] o.a.s.u.UpdateHandler Using UpdateLog implementation: org.apache.solr.update.UpdateLog
   [junit4]   2> 1861449 INFO  (coreLoadExecutor-7994-thread-1) [    x:collection1] o.a.s.u.UpdateLog Initializing UpdateLog: dataDir= defaultSyncLevel=FLUSH numRecordsToKeep=100 maxNumLogsToKeep=10 numVersionBuckets=65536
   [junit4]   2> 1861452 INFO  (coreLoadExecutor-7994-thread-1) [    x:collection1] o.a.s.u.CommitTracker Hard AutoCommit: disabled
   [junit4]   2> 1861452 INFO  (coreLoadExecutor-7994-thread-1) [    x:collection1] o.a.s.u.CommitTracker Soft AutoCommit: disabled
   [junit4]   2> 1861453 INFO  (coreLoadExecutor-7994-thread-1) [    x:collection1] o.a.s.u.RandomMergePolicy RandomMergePolicy wrapping class org.apache.lucene.index.LogByteSizeMergePolicy: [LogByteSizeMergePolicy: minMergeSize=1677721, mergeFactor=16, maxMergeSize=2147483648, maxMergeSizeForForcedMerge=9223372036854775807, calibrateSizeByDeletes=false, maxMergeDocs=2147483647, maxCFSSegmentSizeMB=8.796093022207999E12, noCFSRatio=0.0]
   [junit4]   2> 1861453 INFO  (coreLoadExecutor-7994-thread-1) [    x:collection1] o.a.s.s.SolrIndexSearcher Opening [Searcher@797191e8[collection1] main]
   [junit4]   2> 1861454 INFO  (coreLoadExecutor-7994-thread-1) [    x:collection1] o.a.s.h.c.SpellCheckComponent Initializing spell checkers
   [junit4]   2> 1861472 INFO  (coreLoadExecutor-7994-thread-1) [    x:collection1] o.a.s.s.DirectSolrSpellChecker init: {name=direct,classname=DirectSolrSpellChecker,field=lowerfilt,minQueryLength=3}
   [junit4]   2> 1861528 INFO  (coreLoadExecutor-7994-thread-1) [    x:collection1] o.a.s.h.ReplicationHandler Commits will be reserved for 10000ms.
   [junit4]   2> 1861529 INFO  (searcherExecutor-7995-thread-1-processing-x:collection1) [    x:collection1] o.a.s.h.c.SpellCheckComponent Loading spell index for spellchecker: default
   [junit4]   2> 1861529 INFO  (coreLoadExecutor-7994-thread-1) [    x:collection1] o.a.s.u.UpdateLog Could not find max version in index or recent updates, using new clock 1587244017226088448
   [junit4]   2> 1861530 INFO  (searcherExecutor-7995-thread-1-processing-x:collection1) [    x:collection1] o.a.s.h.c.SpellCheckComponent Loading spell index for spellchecker: direct
   [junit4]   2> 1861530 INFO  (searcherExecutor-7995-thread-1-processing-x:collection1) [    x:collection1] o.a.s.h.c.SpellCheckComponent Loading spell index for spellchecker: wordbreak
   [junit4]   2> 1861530 INFO  (searcherExecutor-7995-thread-1-processing-x:collection1) [    x:collection1] o.a.s.h.c.SpellCheckComponent Loading spell index for spellchecker: multipleFields
   [junit4]   2> 1861530 INFO  (searcherExecutor-7995-thread-1-processing-x:collection1) [    x:collection1] o.a.s.h.c.SpellCheckComponent Loading spell index for spellchecker: jarowinkler
   [junit4]   2> 1861531 INFO  (searcherExecutor-7995-thread-1-processing-x:collection1) [    x:collection1] o.a.s.h.c.SpellCheckComponent Loading spell index for spellchecker: external
   [junit4]   2> 1861531 INFO  (searcherExecutor-7995-thread-1-processing-x:collection1) [    x:collection1] o.a.s.h.c.SpellCheckComponent Loading spell index for spellchecker: freq
   [junit4]   2> 1861531 INFO  (searcherExecutor-7995-thread-1-processing-x:collection1) [    x:collection1] o.a.s.h.c.SpellCheckComponent Loading spell index for spellchecker: fqcn
   [junit4]   2> 1861532 INFO  (searcherExecutor-7995-thread-1-processing-x:collection1) [    x:collection1] o.a.s.h.c.SpellCheckComponent Loading spell index for spellchecker: perDict
   [junit4]   2> 1861533 INFO  (searcherExecutor-7995-thread-1-processing-x:collection1) [    x:collection1] o.a.s.c.SolrCore [collection1] Registered new searcher Searcher@797191e8[collection1] main{ExitableDirectoryReader(UninvertingDirectoryReader())}
   [junit4]   2> 1862774 INFO  (TEST-DistributedFacetPivotLargeTest.test-seed#[AA296055E731493C]) [    ] o.a.s.SolrTestCaseJ4 Writing core.properties file to C:\Users\jenkins\workspace\Lucene-Solr-master-Windows\solr\build\solr-core\test\J0\temp\solr.handler.component.DistributedFacetPivotLargeTest_AA296055E731493C-001\tempDir-001\shard2\cores\collection1
   [junit4]   2> 1862780 INFO  (TEST-DistributedFacetPivotLargeTest.test-seed#[AA296055E731493C]) [    ] o.e.j.s.Server jetty-9.3.20.v20170531
   [junit4]   2> 1862781 INFO  (TEST-DistributedFacetPivotLargeTest.test-seed#[AA296055E731493C]) [    ] o.e.j.s.h.ContextHandler Started o.e.j.s.ServletContextHandler@7cc01c12{/,null,AVAILABLE}
   [junit4]   2> 1862781 INFO  (TEST-DistributedFacetPivotLargeTest.test-seed#[AA296055E731493C]) [    ] o.e.j.s.AbstractConnector Started ServerConnector@10fe5f14{HTTP/1.1,[http/1.1]}{127.0.0.1:65113}
   [junit4]   2> 1862782 INFO  (TEST-DistributedFacetPivotLargeTest.test-seed#[AA296055E731493C]) [    ] o.e.j.s.Server Started @1872033ms
   [junit4]   2> 1862782 INFO  (TEST-DistributedFacetPivotLargeTest.test-seed#[AA296055E731493C]) [    ] o.a.s.c.s.e.JettySolrRunner Jetty properties: {hostContext=/, hostPort=65113, coreRootDirectory=C:\Users\jenkins\workspace\Lucene-Solr-master-Windows\solr\build\solr-core\test\J0\temp\solr.handler.component.DistributedFacetPivotLargeTest_AA296055E731493C-001\tempDir-001\shard2\cores}
   [junit4]   2> 1862783 ERROR (TEST-DistributedFacetPivotLargeTest.test-seed#[AA296055E731493C]) [    ] o.a.s.u.StartupLoggingUtils Missing Java Option solr.log.dir. Logging may be missing or incomplete.
   [junit4]   2> 1862783 INFO  (TEST-DistributedFacetPivotLargeTest.test-seed#[AA296055E731493C]) [    ] o.a.s.s.SolrDispatchFilter  ___      _       Welcome to Apache Solr? version 8.0.0
   [junit4]   2> 1862783 INFO

[...truncated too long message...]

nfoBeanTest, TestSurroundQueryParser, TestReversedWildcardFilterFactory, TestOmitPositions, DocumentBuilderTest, FieldAnalysisRequestHandlerTest, FastVectorHighlighterTest, IndexSchemaRuntimeFieldTest, RegexBoostProcessorTest, TestCollationField, TestCSVResponseWriter, UniqFieldsUpdateProcessorFactoryTest, TestPartialUpdateDeduplication, PingRequestHandlerTest, TestLFUCache, TestPostingsSolrHighlighter, TestLuceneMatchVersion, TestCodecSupport, TestFastWriter, URLClassifyProcessorTest, DateMathParserTest, TestSuggestSpellingConverter, DateFieldTest, SpellingQueryConverterTest, DOMUtilTest, RAMDirectoryFactoryTest, TestSolrJ, TestUtils, TestDocumentBuilder, SliceStateTest, SystemInfoHandlerTest, UUIDFieldTest, SolrTestCaseJ4Test, TestCrossCoreJoin, TestSimpleTrackingShardHandler, TestTolerantSearch, TestEmbeddedSolrServerConstructors, TestEmbeddedSolrServerSchemaAPI, ActionThrottleTest, AddReplicaTest, AssignTest, AsyncCallRequestStatusResponseTest, ChaosMonkeyNothingIsSafeWithPullReplicasTest, ConcurrentDeleteAndCreateCollectionTest, ConfigSetsAPITest, ConnectionManagerTest, CreateCollectionCleanupTest, DeleteNodeTest, DistributedVersionInfoTest, HttpPartitionTest]
   [junit4] Completed [519/764 (3!)] on J1 in 138.58s, 1 test, 1 failure <<< FAILURES!

[...truncated 3178 lines...]
   [junit4] Suite: org.apache.solr.update.processor.TestOpenNLPExtractNamedEntitiesUpdateProcessorFactory
   [junit4]   2> Creating dataDir: C:\Users\jenkins\workspace\Lucene-Solr-master-Windows\solr\build\contrib\solr-analysis-extras\test\J1\temp\solr.update.processor.TestOpenNLPExtractNamedEntitiesUpdateProcessorFactory_695D5F4558349EAF-001\init-core-data-001
   [junit4]   2> NOTE: test params are: codec=Asserting(Lucene70): {}, docValues:{}, maxPointsInLeafNode=1867, maxMBSortInHeap=5.477747296021313, sim=Asserting(org.apache.lucene.search.similarities.AssertingSimilarity@2f849675), locale=sr-Latn-ME, timezone=Africa/Blantyre
   [junit4]   2> NOTE: Windows 10 10.0 amd64/Oracle Corporation 1.8.0_144 (64-bit)/cpus=3,threads=1,free=63863488,total=97386496
   [junit4]   2> NOTE: All tests run in this JVM: [TestICUCollationFieldOptions, TestOpenNLPExtractNamedEntitiesUpdateProcessorFactory]
   [junit4]   2> NOTE: reproduce with: ant test  -Dtestcase=TestOpenNLPExtractNamedEntitiesUpdateProcessorFactory -Dtests.seed=695D5F4558349EAF -Dtests.slow=true -Dtests.locale=sr-Latn-ME -Dtests.timezone=Africa/Blantyre -Dtests.asserts=true -Dtests.file.encoding=UTF-8
   [junit4] ERROR   0.00s J1 | TestOpenNLPExtractNamedEntitiesUpdateProcessorFactory (suite) <<<
   [junit4]    > Throwable #1: java.io.IOException: Could not remove the following files (in the order of attempts):
   [junit4]    >    C:\Users\jenkins\workspace\Lucene-Solr-master-Windows\solr\build\contrib\solr-analysis-extras\test\J1\temp\solr.update.processor.TestOpenNLPExtractNamedEntitiesUpdateProcessorFactory_695D5F4558349EAF-001\tempDir-001\collection1\conf: java.nio.file.DirectoryNotEmptyException: C:\Users\jenkins\workspace\Lucene-Solr-master-Windows\solr\build\contrib\solr-analysis-extras\test\J1\temp\solr.update.processor.TestOpenNLPExtractNamedEntitiesUpdateProcessorFactory_695D5F4558349EAF-001\tempDir-001\collection1\conf
   [junit4]    >    C:\Users\jenkins\workspace\Lucene-Solr-master-Windows\solr\build\contrib\solr-analysis-extras\test\J1\temp\solr.update.processor.TestOpenNLPExtractNamedEntitiesUpdateProcessorFactory_695D5F4558349EAF-001\tempDir-001\collection1: java.nio.file.DirectoryNotEmptyException: C:\Users\jenkins\workspace\Lucene-Solr-master-Windows\solr\build\contrib\solr-analysis-extras\test\J1\temp\solr.update.processor.TestOpenNLPExtractNamedEntitiesUpdateProcessorFactory_695D5F4558349EAF-001\tempDir-001\collection1
   [junit4]    >    C:\Users\jenkins\workspace\Lucene-Solr-master-Windows\solr\build\contrib\solr-analysis-extras\test\J1\temp\solr.update.processor.TestOpenNLPExtractNamedEntitiesUpdateProcessorFactory_695D5F4558349EAF-001\tempDir-001: java.nio.file.DirectoryNotEmptyException: C:\Users\jenkins\workspace\Lucene-Solr-master-Windows\solr\build\contrib\solr-analysis-extras\test\J1\temp\solr.update.processor.TestOpenNLPExtractNamedEntitiesUpdateProcessorFactory_695D5F4558349EAF-001\tempDir-001
   [junit4]    >    C:\Users\jenkins\workspace\Lucene-Solr-master-Windows\solr\build\contrib\solr-analysis-extras\test\J1\temp\solr.update.processor.TestOpenNLPExtractNamedEntitiesUpdateProcessorFactory_695D5F4558349EAF-001\tempDir-001\collection1\conf\en-test-sent.bin: java.nio.file.AccessDeniedException: C:\Users\jenkins\workspace\Lucene-Solr-master-Windows\solr\build\contrib\solr-analysis-extras\test\J1\temp\solr.update.processor.TestOpenNLPExtractNamedEntitiesUpdateProcessorFactory_695D5F4558349EAF-001\tempDir-001\collection1\conf\en-test-sent.bin
   [junit4]    >    C:\Users\jenkins\workspace\Lucene-Solr-master-Windows\solr\build\contrib\solr-analysis-extras\test\J1\temp\solr.update.processor.TestOpenNLPExtractNamedEntitiesUpdateProcessorFactory_695D5F4558349EAF-001\tempDir-001\collection1\conf\en-test-ner-person.bin: java.nio.file.AccessDeniedException: C:\Users\jenkins\workspace\Lucene-Solr-master-Windows\solr\build\contrib\solr-analysis-extras\test\J1\temp\solr.update.processor.TestOpenNLPExtractNamedEntitiesUpdateProcessorFactory_695D5F4558349EAF-001\tempDir-001\collection1\conf\en-test-ner-person.bin
   [junit4]    >    C:\Users\jenkins\workspace\Lucene-Solr-master-Windows\solr\build\contrib\solr-analysis-extras\test\J1\temp\solr.update.processor.TestOpenNLPExtractNamedEntitiesUpdateProcessorFactory_695D5F4558349EAF-001\tempDir-001\collection1\conf\en-test-tokenizer.bin: java.nio.file.AccessDeniedException: C:\Users\jenkins\workspace\Lucene-Solr-master-Windows\solr\build\contrib\solr-analysis-extras\test\J1\temp\solr.update.processor.TestOpenNLPExtractNamedEntitiesUpdateProcessorFactory_695D5F4558349EAF-001\tempDir-001\collection1\conf\en-test-tokenizer.bin
   [junit4]    >    C:\Users\jenkins\workspace\Lucene-Solr-master-Windows\solr\build\contrib\solr-analysis-extras\test\J1\temp\solr.update.processor.TestOpenNLPExtractNamedEntitiesUpdateProcessorFactory_695D5F4558349EAF-001: java.nio.file.DirectoryNotEmptyException: C:\Users\jenkins\workspace\Lucene-Solr-master-Windows\solr\build\contrib\solr-analysis-extras\test\J1\temp\solr.update.processor.TestOpenNLPExtractNamedEntitiesUpdateProcessorFactory_695D5F4558349EAF-001
   [junit4]    > 	at __randomizedtesting.SeedInfo.seed([695D5F4558349EAF]:0)
   [junit4]    > 	at org.apache.lucene.util.IOUtils.rm(IOUtils.java:329)
   [junit4]    > 	at java.lang.Thread.run(Thread.java:748)
   [junit4] Completed [3/5 (1!)] on J1 in 1.36s, 8 tests, 1 error <<< FAILURES!

[...truncated 771 lines...]
   [junit4] Suite: org.apache.solr.analytics.value.CastingAnalyticsValueTest
   [junit4]   2> Creating dataDir: C:\Users\jenkins\workspace\Lucene-Solr-master-Windows\solr\build\contrib\solr-analytics\test\J0\temp\solr.analytics.value.CastingAnalyticsValueTest_4EE4299D6B5BD5F4-001\init-core-data-001
   [junit4]   2> NOTE: test params are: codec=Asserting(Lucene70): {}, docValues:{}, maxPointsInLeafNode=357, maxMBSortInHeap=5.836385183196903, sim=Asserting(org.apache.lucene.search.similarities.AssertingSimilarity@49cd22a2), locale=zh-CN, timezone=Asia/Tehran
   [junit4]   2> NOTE: Windows 10 10.0 amd64/Oracle Corporation 1.8.0_144 (64-bit)/cpus=3,threads=1,free=49878688,total=125345792
   [junit4]   2> NOTE: All tests run in this JVM: [ReplaceFunctionTest, ConcatFunctionTest, EqualFunctionTest, LegacyFieldFacetExtrasTest, ValueFacetTest, DateParseFunctionTest, LogFunctionTest, CastingFloatValueTest, LegacyAbstractAnalyticsFacetTest, LegacyAbstractAnalyticsTest, CastingBooleanValueTest, CastingDateValueTest, TopFunctionTest, StringCastFunctionTest, CastingStringValueTest, LegacyNoFacetTest, BottomFunctionTest, AddFunctionTest, FloorFunctionTest, LegacyFieldFacetCloudTest, OverallAnalyticsTest, QueryFacetTest, BooleanFieldsTest, DateFieldsTest, DoubleFieldsTest, FloatFieldsTest, IntFieldsTest, LongFieldsTest, StringFieldsTest, AbsoluteValueFunctionTest, FillMissingFunctionTest, FilterFunctionTest, GTFunctionTest, IfFunctionTest, LTEFunctionTest, LTFunctionTest, NegateFunctionTest, OrFunctionTest, PowerFunctionTest, RemoveFunctionTest, LegacyAbstractAnalyticsFacetCloudTest, LegacyQueryFacetCloudTest, LegacyRangeFacetTest, CastingAnalyticsValueTest]
   [junit4]   2> NOTE: reproduce with: ant test  -Dtestcase=CastingAnalyticsValueTest -Dtests.seed=4EE4299D6B5BD5F4 -Dtests.slow=true -Dtests.locale=zh-CN -Dtests.timezone=Asia/Tehran -Dtests.asserts=true -Dtests.file.encoding=US-ASCII
   [junit4] ERROR   0.00s J0 | CastingAnalyticsValueTest (suite) <<<
   [junit4]    > Throwable #1: java.io.IOException: Could not remove the following files (in the order of attempts):
   [junit4]    >    C:\Users\jenkins\workspace\Lucene-Solr-master-Windows\solr\build\contrib\solr-analytics\test\J0\temp\solr.analytics.value.CastingAnalyticsValueTest_4EE4299D6B5BD5F4-001\init-core-data-001: java.nio.file.AccessDeniedException: C:\Users\jenkins\workspace\Lucene-Solr-master-Windows\solr\build\contrib\solr-analytics\test\J0\temp\solr.analytics.value.CastingAnalyticsValueTest_4EE4299D6B5BD5F4-001\init-core-data-001
   [junit4]    >    C:\Users\jenkins\workspace\Lucene-Solr-master-Windows\solr\build\contrib\solr-analytics\test\J0\temp\solr.analytics.value.CastingAnalyticsValueTest_4EE4299D6B5BD5F4-001: java.nio.file.DirectoryNotEmptyException: C:\Users\jenkins\workspace\Lucene-Solr-master-Windows\solr\build\contrib\solr-analytics\test\J0\temp\solr.analytics.value.CastingAnalyticsValueTest_4EE4299D6B5BD5F4-001
   [junit4]    > 	at __randomizedtesting.SeedInfo.seed([4EE4299D6B5BD5F4]:0)
   [junit4]    > 	at org.apache.lucene.util.IOUtils.rm(IOUtils.java:329)
   [junit4]    > 	at java.lang.Thread.run(Thread.java:748)
   [junit4] Completed [70/78 (1!)] on J0 in 0.05s, 2 tests, 1 error <<< FAILURES!

[...truncated 44916 lines...]

Mime
View raw message