lucene-dev mailing list archives

Site index · List index
Message view « Date » · « Thread »
Top « Date » · « Thread »
From Policeman Jenkins Server <jenk...@thetaphi.de>
Subject [JENKINS] Lucene-Solr-master-Linux (32bit/jdk1.8.0_144) - Build # 21148 - Still Unstable!
Date Tue, 26 Dec 2017 17:18:15 GMT
Build: https://jenkins.thetaphi.de/job/Lucene-Solr-master-Linux/21148/
Java: 32bit/jdk1.8.0_144 -client -XX:+UseConcMarkSweepGC

5 tests failed.
FAILED:  junit.framework.TestSuite.org.apache.solr.cloud.TestSolrCloudWithSecureImpersonation

Error Message:
1 thread leaked from SUITE scope at org.apache.solr.cloud.TestSolrCloudWithSecureImpersonation:     1) Thread[id=24870, name=jetty-launcher-4892-thread-1-EventThread, state=TIMED_WAITING, group=TGRP-TestSolrCloudWithSecureImpersonation]         at sun.misc.Unsafe.park(Native Method)         at java.util.concurrent.locks.LockSupport.parkNanos(LockSupport.java:215)         at java.util.concurrent.locks.AbstractQueuedSynchronizer.doAcquireSharedNanos(AbstractQueuedSynchronizer.java:1037)         at java.util.concurrent.locks.AbstractQueuedSynchronizer.tryAcquireSharedNanos(AbstractQueuedSynchronizer.java:1328)         at java.util.concurrent.CountDownLatch.await(CountDownLatch.java:277)         at org.apache.curator.CuratorZookeeperClient.internalBlockUntilConnectedOrTimedOut(CuratorZookeeperClient.java:323)         at org.apache.curator.RetryLoop.callWithRetry(RetryLoop.java:105)         at org.apache.curator.framework.imps.GetDataBuilderImpl.pathInForeground(GetDataBuilderImpl.java:288)         at org.apache.curator.framework.imps.GetDataBuilderImpl.forPath(GetDataBuilderImpl.java:279)         at org.apache.curator.framework.imps.GetDataBuilderImpl.forPath(GetDataBuilderImpl.java:41)         at org.apache.curator.framework.recipes.shared.SharedValue.readValue(SharedValue.java:244)         at org.apache.curator.framework.recipes.shared.SharedValue.access$100(SharedValue.java:44)         at org.apache.curator.framework.recipes.shared.SharedValue$1.process(SharedValue.java:61)         at org.apache.curator.framework.imps.NamespaceWatcher.process(NamespaceWatcher.java:67)         at org.apache.zookeeper.ClientCnxn$EventThread.processEvent(ClientCnxn.java:530)         at org.apache.zookeeper.ClientCnxn$EventThread.run(ClientCnxn.java:505)

Stack Trace:
com.carrotsearch.randomizedtesting.ThreadLeakError: 1 thread leaked from SUITE scope at org.apache.solr.cloud.TestSolrCloudWithSecureImpersonation: 
   1) Thread[id=24870, name=jetty-launcher-4892-thread-1-EventThread, state=TIMED_WAITING, group=TGRP-TestSolrCloudWithSecureImpersonation]
        at sun.misc.Unsafe.park(Native Method)
        at java.util.concurrent.locks.LockSupport.parkNanos(LockSupport.java:215)
        at java.util.concurrent.locks.AbstractQueuedSynchronizer.doAcquireSharedNanos(AbstractQueuedSynchronizer.java:1037)
        at java.util.concurrent.locks.AbstractQueuedSynchronizer.tryAcquireSharedNanos(AbstractQueuedSynchronizer.java:1328)
        at java.util.concurrent.CountDownLatch.await(CountDownLatch.java:277)
        at org.apache.curator.CuratorZookeeperClient.internalBlockUntilConnectedOrTimedOut(CuratorZookeeperClient.java:323)
        at org.apache.curator.RetryLoop.callWithRetry(RetryLoop.java:105)
        at org.apache.curator.framework.imps.GetDataBuilderImpl.pathInForeground(GetDataBuilderImpl.java:288)
        at org.apache.curator.framework.imps.GetDataBuilderImpl.forPath(GetDataBuilderImpl.java:279)
        at org.apache.curator.framework.imps.GetDataBuilderImpl.forPath(GetDataBuilderImpl.java:41)
        at org.apache.curator.framework.recipes.shared.SharedValue.readValue(SharedValue.java:244)
        at org.apache.curator.framework.recipes.shared.SharedValue.access$100(SharedValue.java:44)
        at org.apache.curator.framework.recipes.shared.SharedValue$1.process(SharedValue.java:61)
        at org.apache.curator.framework.imps.NamespaceWatcher.process(NamespaceWatcher.java:67)
        at org.apache.zookeeper.ClientCnxn$EventThread.processEvent(ClientCnxn.java:530)
        at org.apache.zookeeper.ClientCnxn$EventThread.run(ClientCnxn.java:505)
	at __randomizedtesting.SeedInfo.seed([CBEBA6F3A44483A9]:0)


FAILED:  org.apache.solr.cloud.CollectionsAPISolrJTest.testCreateWithDefaultConfigSet

Error Message:


Stack Trace:
java.lang.AssertionError
	at __randomizedtesting.SeedInfo.seed([CBEBA6F3A44483A9:854007B4FBFBF95A]:0)
	at org.junit.Assert.fail(Assert.java:92)
	at org.junit.Assert.assertTrue(Assert.java:43)
	at org.junit.Assert.assertTrue(Assert.java:54)
	at org.apache.solr.cloud.CollectionsAPISolrJTest.testCreateWithDefaultConfigSet(CollectionsAPISolrJTest.java:70)
	at sun.reflect.NativeMethodAccessorImpl.invoke0(Native Method)
	at sun.reflect.NativeMethodAccessorImpl.invoke(NativeMethodAccessorImpl.java:62)
	at sun.reflect.DelegatingMethodAccessorImpl.invoke(DelegatingMethodAccessorImpl.java:43)
	at java.lang.reflect.Method.invoke(Method.java:498)
	at com.carrotsearch.randomizedtesting.RandomizedRunner.invoke(RandomizedRunner.java:1737)
	at com.carrotsearch.randomizedtesting.RandomizedRunner$8.evaluate(RandomizedRunner.java:934)
	at com.carrotsearch.randomizedtesting.RandomizedRunner$9.evaluate(RandomizedRunner.java:970)
	at com.carrotsearch.randomizedtesting.RandomizedRunner$10.evaluate(RandomizedRunner.java:984)
	at com.carrotsearch.randomizedtesting.rules.SystemPropertiesRestoreRule$1.evaluate(SystemPropertiesRestoreRule.java:57)
	at org.apache.lucene.util.TestRuleSetupTeardownChained$1.evaluate(TestRuleSetupTeardownChained.java:49)
	at org.apache.lucene.util.AbstractBeforeAfterRule$1.evaluate(AbstractBeforeAfterRule.java:45)
	at org.apache.lucene.util.TestRuleThreadAndTestName$1.evaluate(TestRuleThreadAndTestName.java:48)
	at org.apache.lucene.util.TestRuleIgnoreAfterMaxFailures$1.evaluate(TestRuleIgnoreAfterMaxFailures.java:64)
	at org.apache.lucene.util.TestRuleMarkFailure$1.evaluate(TestRuleMarkFailure.java:47)
	at com.carrotsearch.randomizedtesting.rules.StatementAdapter.evaluate(StatementAdapter.java:36)
	at com.carrotsearch.randomizedtesting.ThreadLeakControl$StatementRunner.run(ThreadLeakControl.java:368)
	at com.carrotsearch.randomizedtesting.ThreadLeakControl.forkTimeoutingTask(ThreadLeakControl.java:817)
	at com.carrotsearch.randomizedtesting.ThreadLeakControl$3.evaluate(ThreadLeakControl.java:468)
	at com.carrotsearch.randomizedtesting.RandomizedRunner.runSingleTest(RandomizedRunner.java:943)
	at com.carrotsearch.randomizedtesting.RandomizedRunner$5.evaluate(RandomizedRunner.java:829)
	at com.carrotsearch.randomizedtesting.RandomizedRunner$6.evaluate(RandomizedRunner.java:879)
	at com.carrotsearch.randomizedtesting.RandomizedRunner$7.evaluate(RandomizedRunner.java:890)
	at com.carrotsearch.randomizedtesting.rules.StatementAdapter.evaluate(StatementAdapter.java:36)
	at com.carrotsearch.randomizedtesting.rules.SystemPropertiesRestoreRule$1.evaluate(SystemPropertiesRestoreRule.java:57)
	at org.apache.lucene.util.AbstractBeforeAfterRule$1.evaluate(AbstractBeforeAfterRule.java:45)
	at com.carrotsearch.randomizedtesting.rules.StatementAdapter.evaluate(StatementAdapter.java:36)
	at org.apache.lucene.util.TestRuleStoreClassName$1.evaluate(TestRuleStoreClassName.java:41)
	at com.carrotsearch.randomizedtesting.rules.NoShadowingOrOverridesOnMethodsRule$1.evaluate(NoShadowingOrOverridesOnMethodsRule.java:40)
	at com.carrotsearch.randomizedtesting.rules.NoShadowingOrOverridesOnMethodsRule$1.evaluate(NoShadowingOrOverridesOnMethodsRule.java:40)
	at com.carrotsearch.randomizedtesting.rules.StatementAdapter.evaluate(StatementAdapter.java:36)
	at com.carrotsearch.randomizedtesting.rules.StatementAdapter.evaluate(StatementAdapter.java:36)
	at com.carrotsearch.randomizedtesting.rules.StatementAdapter.evaluate(StatementAdapter.java:36)
	at org.apache.lucene.util.TestRuleAssertionsRequired$1.evaluate(TestRuleAssertionsRequired.java:53)
	at org.apache.lucene.util.TestRuleMarkFailure$1.evaluate(TestRuleMarkFailure.java:47)
	at org.apache.lucene.util.TestRuleIgnoreAfterMaxFailures$1.evaluate(TestRuleIgnoreAfterMaxFailures.java:64)
	at org.apache.lucene.util.TestRuleIgnoreTestSuites$1.evaluate(TestRuleIgnoreTestSuites.java:54)
	at com.carrotsearch.randomizedtesting.rules.StatementAdapter.evaluate(StatementAdapter.java:36)
	at com.carrotsearch.randomizedtesting.ThreadLeakControl$StatementRunner.run(ThreadLeakControl.java:368)
	at java.lang.Thread.run(Thread.java:748)


FAILED:  org.apache.solr.cloud.LeaderFailoverAfterPartitionTest.test

Error Message:
Timeout occured while waiting response from server at: http://127.0.0.1:39297/kwb/b

Stack Trace:
org.apache.solr.client.solrj.SolrServerException: Timeout occured while waiting response from server at: http://127.0.0.1:39297/kwb/b
	at __randomizedtesting.SeedInfo.seed([CBEBA6F3A44483A9:43BF99290AB8EE51]:0)
	at org.apache.solr.client.solrj.impl.HttpSolrClient.executeMethod(HttpSolrClient.java:654)
	at org.apache.solr.client.solrj.impl.HttpSolrClient.request(HttpSolrClient.java:255)
	at org.apache.solr.client.solrj.impl.HttpSolrClient.request(HttpSolrClient.java:244)
	at org.apache.solr.client.solrj.SolrClient.request(SolrClient.java:1219)
	at org.apache.solr.cloud.AbstractFullDistribZkTestBase.createCollection(AbstractFullDistribZkTestBase.java:1666)
	at org.apache.solr.cloud.AbstractFullDistribZkTestBase.createCollection(AbstractFullDistribZkTestBase.java:1680)
	at org.apache.solr.cloud.AbstractFullDistribZkTestBase.createCollection(AbstractFullDistribZkTestBase.java:1604)
	at org.apache.solr.cloud.LeaderFailoverAfterPartitionTest.testRf3WithLeaderFailover(LeaderFailoverAfterPartitionTest.java:64)
	at org.apache.solr.cloud.LeaderFailoverAfterPartitionTest.test(LeaderFailoverAfterPartitionTest.java:56)
	at sun.reflect.NativeMethodAccessorImpl.invoke0(Native Method)
	at sun.reflect.NativeMethodAccessorImpl.invoke(NativeMethodAccessorImpl.java:62)
	at sun.reflect.DelegatingMethodAccessorImpl.invoke(DelegatingMethodAccessorImpl.java:43)
	at java.lang.reflect.Method.invoke(Method.java:498)
	at com.carrotsearch.randomizedtesting.RandomizedRunner.invoke(RandomizedRunner.java:1737)
	at com.carrotsearch.randomizedtesting.RandomizedRunner$8.evaluate(RandomizedRunner.java:934)
	at com.carrotsearch.randomizedtesting.RandomizedRunner$9.evaluate(RandomizedRunner.java:970)
	at com.carrotsearch.randomizedtesting.RandomizedRunner$10.evaluate(RandomizedRunner.java:984)
	at org.apache.solr.BaseDistributedSearchTestCase$ShardsRepeatRule$ShardsFixedStatement.callStatement(BaseDistributedSearchTestCase.java:993)
	at org.apache.solr.BaseDistributedSearchTestCase$ShardsRepeatRule$ShardsStatement.evaluate(BaseDistributedSearchTestCase.java:968)
	at com.carrotsearch.randomizedtesting.rules.SystemPropertiesRestoreRule$1.evaluate(SystemPropertiesRestoreRule.java:57)
	at org.apache.lucene.util.TestRuleSetupTeardownChained$1.evaluate(TestRuleSetupTeardownChained.java:49)
	at org.apache.lucene.util.AbstractBeforeAfterRule$1.evaluate(AbstractBeforeAfterRule.java:45)
	at org.apache.lucene.util.TestRuleThreadAndTestName$1.evaluate(TestRuleThreadAndTestName.java:48)
	at org.apache.lucene.util.TestRuleIgnoreAfterMaxFailures$1.evaluate(TestRuleIgnoreAfterMaxFailures.java:64)
	at org.apache.lucene.util.TestRuleMarkFailure$1.evaluate(TestRuleMarkFailure.java:47)
	at com.carrotsearch.randomizedtesting.rules.StatementAdapter.evaluate(StatementAdapter.java:36)
	at com.carrotsearch.randomizedtesting.ThreadLeakControl$StatementRunner.run(ThreadLeakControl.java:368)
	at com.carrotsearch.randomizedtesting.ThreadLeakControl.forkTimeoutingTask(ThreadLeakControl.java:817)
	at com.carrotsearch.randomizedtesting.ThreadLeakControl$3.evaluate(ThreadLeakControl.java:468)
	at com.carrotsearch.randomizedtesting.RandomizedRunner.runSingleTest(RandomizedRunner.java:943)
	at com.carrotsearch.randomizedtesting.RandomizedRunner$5.evaluate(RandomizedRunner.java:829)
	at com.carrotsearch.randomizedtesting.RandomizedRunner$6.evaluate(RandomizedRunner.java:879)
	at com.carrotsearch.randomizedtesting.RandomizedRunner$7.evaluate(RandomizedRunner.java:890)
	at com.carrotsearch.randomizedtesting.rules.StatementAdapter.evaluate(StatementAdapter.java:36)
	at com.carrotsearch.randomizedtesting.rules.SystemPropertiesRestoreRule$1.evaluate(SystemPropertiesRestoreRule.java:57)
	at org.apache.lucene.util.AbstractBeforeAfterRule$1.evaluate(AbstractBeforeAfterRule.java:45)
	at com.carrotsearch.randomizedtesting.rules.StatementAdapter.evaluate(StatementAdapter.java:36)
	at org.apache.lucene.util.TestRuleStoreClassName$1.evaluate(TestRuleStoreClassName.java:41)
	at com.carrotsearch.randomizedtesting.rules.NoShadowingOrOverridesOnMethodsRule$1.evaluate(NoShadowingOrOverridesOnMethodsRule.java:40)
	at com.carrotsearch.randomizedtesting.rules.NoShadowingOrOverridesOnMethodsRule$1.evaluate(NoShadowingOrOverridesOnMethodsRule.java:40)
	at com.carrotsearch.randomizedtesting.rules.StatementAdapter.evaluate(StatementAdapter.java:36)
	at com.carrotsearch.randomizedtesting.rules.StatementAdapter.evaluate(StatementAdapter.java:36)
	at com.carrotsearch.randomizedtesting.rules.StatementAdapter.evaluate(StatementAdapter.java:36)
	at org.apache.lucene.util.TestRuleAssertionsRequired$1.evaluate(TestRuleAssertionsRequired.java:53)
	at org.apache.lucene.util.TestRuleMarkFailure$1.evaluate(TestRuleMarkFailure.java:47)
	at org.apache.lucene.util.TestRuleIgnoreAfterMaxFailures$1.evaluate(TestRuleIgnoreAfterMaxFailures.java:64)
	at org.apache.lucene.util.TestRuleIgnoreTestSuites$1.evaluate(TestRuleIgnoreTestSuites.java:54)
	at com.carrotsearch.randomizedtesting.rules.StatementAdapter.evaluate(StatementAdapter.java:36)
	at com.carrotsearch.randomizedtesting.ThreadLeakControl$StatementRunner.run(ThreadLeakControl.java:368)
	at java.lang.Thread.run(Thread.java:748)
Caused by: java.net.SocketTimeoutException: Read timed out
	at java.net.SocketInputStream.socketRead0(Native Method)
	at java.net.SocketInputStream.socketRead(SocketInputStream.java:116)
	at java.net.SocketInputStream.read(SocketInputStream.java:171)
	at java.net.SocketInputStream.read(SocketInputStream.java:141)
	at org.apache.http.impl.io.SessionInputBufferImpl.streamRead(SessionInputBufferImpl.java:137)
	at org.apache.http.impl.io.SessionInputBufferImpl.fillBuffer(SessionInputBufferImpl.java:153)
	at org.apache.http.impl.io.SessionInputBufferImpl.readLine(SessionInputBufferImpl.java:282)
	at org.apache.http.impl.conn.DefaultHttpResponseParser.parseHead(DefaultHttpResponseParser.java:138)
	at org.apache.http.impl.conn.DefaultHttpResponseParser.parseHead(DefaultHttpResponseParser.java:56)
	at org.apache.http.impl.io.AbstractMessageParser.parse(AbstractMessageParser.java:259)
	at org.apache.http.impl.DefaultBHttpClientConnection.receiveResponseHeader(DefaultBHttpClientConnection.java:163)
	at org.apache.http.impl.conn.CPoolProxy.receiveResponseHeader(CPoolProxy.java:165)
	at org.apache.http.protocol.HttpRequestExecutor.doReceiveResponse(HttpRequestExecutor.java:273)
	at org.apache.http.protocol.HttpRequestExecutor.execute(HttpRequestExecutor.java:125)
	at org.apache.http.impl.execchain.MainClientExec.execute(MainClientExec.java:272)
	at org.apache.http.impl.execchain.ProtocolExec.execute(ProtocolExec.java:185)
	at org.apache.http.impl.execchain.RetryExec.execute(RetryExec.java:89)
	at org.apache.http.impl.execchain.RedirectExec.execute(RedirectExec.java:111)
	at org.apache.http.impl.client.InternalHttpClient.doExecute(InternalHttpClient.java:185)
	at org.apache.http.impl.client.CloseableHttpClient.execute(CloseableHttpClient.java:83)
	at org.apache.http.impl.client.CloseableHttpClient.execute(CloseableHttpClient.java:56)
	at org.apache.solr.client.solrj.impl.HttpSolrClient.executeMethod(HttpSolrClient.java:542)
	... 49 more


FAILED:  org.apache.solr.cloud.MultiThreadedOCPTest.test

Error Message:
Task 1 did not complete, final state: FAILED expected same:<COMPLETED> was not:<FAILED>

Stack Trace:
java.lang.AssertionError: Task 1 did not complete, final state: FAILED expected same:<COMPLETED> was not:<FAILED>
	at __randomizedtesting.SeedInfo.seed([CBEBA6F3A44483A9:43BF99290AB8EE51]:0)
	at org.junit.Assert.fail(Assert.java:93)
	at org.junit.Assert.failNotSame(Assert.java:641)
	at org.junit.Assert.assertSame(Assert.java:580)
	at org.apache.solr.cloud.MultiThreadedOCPTest.testParallelCollectionAPICalls(MultiThreadedOCPTest.java:146)
	at org.apache.solr.cloud.MultiThreadedOCPTest.test(MultiThreadedOCPTest.java:63)
	at sun.reflect.NativeMethodAccessorImpl.invoke0(Native Method)
	at sun.reflect.NativeMethodAccessorImpl.invoke(NativeMethodAccessorImpl.java:62)
	at sun.reflect.DelegatingMethodAccessorImpl.invoke(DelegatingMethodAccessorImpl.java:43)
	at java.lang.reflect.Method.invoke(Method.java:498)
	at com.carrotsearch.randomizedtesting.RandomizedRunner.invoke(RandomizedRunner.java:1737)
	at com.carrotsearch.randomizedtesting.RandomizedRunner$8.evaluate(RandomizedRunner.java:934)
	at com.carrotsearch.randomizedtesting.RandomizedRunner$9.evaluate(RandomizedRunner.java:970)
	at com.carrotsearch.randomizedtesting.RandomizedRunner$10.evaluate(RandomizedRunner.java:984)
	at org.apache.solr.BaseDistributedSearchTestCase$ShardsRepeatRule$ShardsFixedStatement.callStatement(BaseDistributedSearchTestCase.java:993)
	at org.apache.solr.BaseDistributedSearchTestCase$ShardsRepeatRule$ShardsStatement.evaluate(BaseDistributedSearchTestCase.java:968)
	at com.carrotsearch.randomizedtesting.rules.SystemPropertiesRestoreRule$1.evaluate(SystemPropertiesRestoreRule.java:57)
	at org.apache.lucene.util.TestRuleSetupTeardownChained$1.evaluate(TestRuleSetupTeardownChained.java:49)
	at org.apache.lucene.util.AbstractBeforeAfterRule$1.evaluate(AbstractBeforeAfterRule.java:45)
	at org.apache.lucene.util.TestRuleThreadAndTestName$1.evaluate(TestRuleThreadAndTestName.java:48)
	at org.apache.lucene.util.TestRuleIgnoreAfterMaxFailures$1.evaluate(TestRuleIgnoreAfterMaxFailures.java:64)
	at org.apache.lucene.util.TestRuleMarkFailure$1.evaluate(TestRuleMarkFailure.java:47)
	at com.carrotsearch.randomizedtesting.rules.StatementAdapter.evaluate(StatementAdapter.java:36)
	at com.carrotsearch.randomizedtesting.ThreadLeakControl$StatementRunner.run(ThreadLeakControl.java:368)
	at com.carrotsearch.randomizedtesting.ThreadLeakControl.forkTimeoutingTask(ThreadLeakControl.java:817)
	at com.carrotsearch.randomizedtesting.ThreadLeakControl$3.evaluate(ThreadLeakControl.java:468)
	at com.carrotsearch.randomizedtesting.RandomizedRunner.runSingleTest(RandomizedRunner.java:943)
	at com.carrotsearch.randomizedtesting.RandomizedRunner$5.evaluate(RandomizedRunner.java:829)
	at com.carrotsearch.randomizedtesting.RandomizedRunner$6.evaluate(RandomizedRunner.java:879)
	at com.carrotsearch.randomizedtesting.RandomizedRunner$7.evaluate(RandomizedRunner.java:890)
	at com.carrotsearch.randomizedtesting.rules.StatementAdapter.evaluate(StatementAdapter.java:36)
	at com.carrotsearch.randomizedtesting.rules.SystemPropertiesRestoreRule$1.evaluate(SystemPropertiesRestoreRule.java:57)
	at org.apache.lucene.util.AbstractBeforeAfterRule$1.evaluate(AbstractBeforeAfterRule.java:45)
	at com.carrotsearch.randomizedtesting.rules.StatementAdapter.evaluate(StatementAdapter.java:36)
	at org.apache.lucene.util.TestRuleStoreClassName$1.evaluate(TestRuleStoreClassName.java:41)
	at com.carrotsearch.randomizedtesting.rules.NoShadowingOrOverridesOnMethodsRule$1.evaluate(NoShadowingOrOverridesOnMethodsRule.java:40)
	at com.carrotsearch.randomizedtesting.rules.NoShadowingOrOverridesOnMethodsRule$1.evaluate(NoShadowingOrOverridesOnMethodsRule.java:40)
	at com.carrotsearch.randomizedtesting.rules.StatementAdapter.evaluate(StatementAdapter.java:36)
	at com.carrotsearch.randomizedtesting.rules.StatementAdapter.evaluate(StatementAdapter.java:36)
	at com.carrotsearch.randomizedtesting.rules.StatementAdapter.evaluate(StatementAdapter.java:36)
	at org.apache.lucene.util.TestRuleAssertionsRequired$1.evaluate(TestRuleAssertionsRequired.java:53)
	at org.apache.lucene.util.TestRuleMarkFailure$1.evaluate(TestRuleMarkFailure.java:47)
	at org.apache.lucene.util.TestRuleIgnoreAfterMaxFailures$1.evaluate(TestRuleIgnoreAfterMaxFailures.java:64)
	at org.apache.lucene.util.TestRuleIgnoreTestSuites$1.evaluate(TestRuleIgnoreTestSuites.java:54)
	at com.carrotsearch.randomizedtesting.rules.StatementAdapter.evaluate(StatementAdapter.java:36)
	at com.carrotsearch.randomizedtesting.ThreadLeakControl$StatementRunner.run(ThreadLeakControl.java:368)
	at java.lang.Thread.run(Thread.java:748)


FAILED:  org.apache.solr.cloud.RollingRestartTest.test

Error Message:
Timeout occured while waiting response from server at: https://127.0.0.1:41627

Stack Trace:
org.apache.solr.client.solrj.SolrServerException: Timeout occured while waiting response from server at: https://127.0.0.1:41627
	at __randomizedtesting.SeedInfo.seed([CBEBA6F3A44483A9:43BF99290AB8EE51]:0)
	at org.apache.solr.client.solrj.impl.HttpSolrClient.executeMethod(HttpSolrClient.java:654)
	at org.apache.solr.client.solrj.impl.HttpSolrClient.request(HttpSolrClient.java:255)
	at org.apache.solr.client.solrj.impl.HttpSolrClient.request(HttpSolrClient.java:244)
	at org.apache.solr.client.solrj.impl.LBHttpSolrClient.doRequest(LBHttpSolrClient.java:483)
	at org.apache.solr.client.solrj.impl.LBHttpSolrClient.request(LBHttpSolrClient.java:413)
	at org.apache.solr.client.solrj.impl.CloudSolrClient.sendRequest(CloudSolrClient.java:1104)
	at org.apache.solr.client.solrj.impl.CloudSolrClient.requestWithRetryOnStaleState(CloudSolrClient.java:884)
	at org.apache.solr.client.solrj.impl.CloudSolrClient.request(CloudSolrClient.java:817)
	at org.apache.solr.client.solrj.SolrRequest.process(SolrRequest.java:194)
	at org.apache.solr.client.solrj.SolrRequest.process(SolrRequest.java:211)
	at org.apache.solr.cloud.AbstractFullDistribZkTestBase.createServers(AbstractFullDistribZkTestBase.java:315)
	at org.apache.solr.BaseDistributedSearchTestCase$ShardsRepeatRule$ShardsFixedStatement.callStatement(BaseDistributedSearchTestCase.java:991)
	at org.apache.solr.BaseDistributedSearchTestCase$ShardsRepeatRule$ShardsStatement.evaluate(BaseDistributedSearchTestCase.java:968)
	at com.carrotsearch.randomizedtesting.rules.SystemPropertiesRestoreRule$1.evaluate(SystemPropertiesRestoreRule.java:57)
	at org.apache.lucene.util.TestRuleSetupTeardownChained$1.evaluate(TestRuleSetupTeardownChained.java:49)
	at org.apache.lucene.util.AbstractBeforeAfterRule$1.evaluate(AbstractBeforeAfterRule.java:45)
	at org.apache.lucene.util.TestRuleThreadAndTestName$1.evaluate(TestRuleThreadAndTestName.java:48)
	at org.apache.lucene.util.TestRuleIgnoreAfterMaxFailures$1.evaluate(TestRuleIgnoreAfterMaxFailures.java:64)
	at org.apache.lucene.util.TestRuleMarkFailure$1.evaluate(TestRuleMarkFailure.java:47)
	at com.carrotsearch.randomizedtesting.rules.StatementAdapter.evaluate(StatementAdapter.java:36)
	at com.carrotsearch.randomizedtesting.ThreadLeakControl$StatementRunner.run(ThreadLeakControl.java:368)
	at com.carrotsearch.randomizedtesting.ThreadLeakControl.forkTimeoutingTask(ThreadLeakControl.java:817)
	at com.carrotsearch.randomizedtesting.ThreadLeakControl$3.evaluate(ThreadLeakControl.java:468)
	at com.carrotsearch.randomizedtesting.RandomizedRunner.runSingleTest(RandomizedRunner.java:943)
	at com.carrotsearch.randomizedtesting.RandomizedRunner$5.evaluate(RandomizedRunner.java:829)
	at com.carrotsearch.randomizedtesting.RandomizedRunner$6.evaluate(RandomizedRunner.java:879)
	at com.carrotsearch.randomizedtesting.RandomizedRunner$7.evaluate(RandomizedRunner.java:890)
	at com.carrotsearch.randomizedtesting.rules.StatementAdapter.evaluate(StatementAdapter.java:36)
	at com.carrotsearch.randomizedtesting.rules.SystemPropertiesRestoreRule$1.evaluate(SystemPropertiesRestoreRule.java:57)
	at org.apache.lucene.util.AbstractBeforeAfterRule$1.evaluate(AbstractBeforeAfterRule.java:45)
	at com.carrotsearch.randomizedtesting.rules.StatementAdapter.evaluate(StatementAdapter.java:36)
	at org.apache.lucene.util.TestRuleStoreClassName$1.evaluate(TestRuleStoreClassName.java:41)
	at com.carrotsearch.randomizedtesting.rules.NoShadowingOrOverridesOnMethodsRule$1.evaluate(NoShadowingOrOverridesOnMethodsRule.java:40)
	at com.carrotsearch.randomizedtesting.rules.NoShadowingOrOverridesOnMethodsRule$1.evaluate(NoShadowingOrOverridesOnMethodsRule.java:40)
	at com.carrotsearch.randomizedtesting.rules.StatementAdapter.evaluate(StatementAdapter.java:36)
	at com.carrotsearch.randomizedtesting.rules.StatementAdapter.evaluate(StatementAdapter.java:36)
	at com.carrotsearch.randomizedtesting.rules.StatementAdapter.evaluate(StatementAdapter.java:36)
	at org.apache.lucene.util.TestRuleAssertionsRequired$1.evaluate(TestRuleAssertionsRequired.java:53)
	at org.apache.lucene.util.TestRuleMarkFailure$1.evaluate(TestRuleMarkFailure.java:47)
	at org.apache.lucene.util.TestRuleIgnoreAfterMaxFailures$1.evaluate(TestRuleIgnoreAfterMaxFailures.java:64)
	at org.apache.lucene.util.TestRuleIgnoreTestSuites$1.evaluate(TestRuleIgnoreTestSuites.java:54)
	at com.carrotsearch.randomizedtesting.rules.StatementAdapter.evaluate(StatementAdapter.java:36)
	at com.carrotsearch.randomizedtesting.ThreadLeakControl$StatementRunner.run(ThreadLeakControl.java:368)
	at java.lang.Thread.run(Thread.java:748)
Caused by: java.net.SocketTimeoutException: Read timed out
	at java.net.SocketInputStream.socketRead0(Native Method)
	at java.net.SocketInputStream.socketRead(SocketInputStream.java:116)
	at java.net.SocketInputStream.read(SocketInputStream.java:171)
	at java.net.SocketInputStream.read(SocketInputStream.java:141)
	at sun.security.ssl.InputRecord.readFully(InputRecord.java:465)
	at sun.security.ssl.InputRecord.read(InputRecord.java:503)
	at sun.security.ssl.SSLSocketImpl.readRecord(SSLSocketImpl.java:983)
	at sun.security.ssl.SSLSocketImpl.readDataRecord(SSLSocketImpl.java:940)
	at sun.security.ssl.AppInputStream.read(AppInputStream.java:105)
	at org.apache.http.impl.io.SessionInputBufferImpl.streamRead(SessionInputBufferImpl.java:137)
	at org.apache.http.impl.io.SessionInputBufferImpl.fillBuffer(SessionInputBufferImpl.java:153)
	at org.apache.http.impl.io.SessionInputBufferImpl.readLine(SessionInputBufferImpl.java:282)
	at org.apache.http.impl.conn.DefaultHttpResponseParser.parseHead(DefaultHttpResponseParser.java:138)
	at org.apache.http.impl.conn.DefaultHttpResponseParser.parseHead(DefaultHttpResponseParser.java:56)
	at org.apache.http.impl.io.AbstractMessageParser.parse(AbstractMessageParser.java:259)
	at org.apache.http.impl.DefaultBHttpClientConnection.receiveResponseHeader(DefaultBHttpClientConnection.java:163)
	at org.apache.http.impl.conn.CPoolProxy.receiveResponseHeader(CPoolProxy.java:165)
	at org.apache.http.protocol.HttpRequestExecutor.doReceiveResponse(HttpRequestExecutor.java:273)
	at org.apache.http.protocol.HttpRequestExecutor.execute(HttpRequestExecutor.java:125)
	at org.apache.http.impl.execchain.MainClientExec.execute(MainClientExec.java:272)
	at org.apache.http.impl.execchain.ProtocolExec.execute(ProtocolExec.java:185)
	at org.apache.http.impl.execchain.RetryExec.execute(RetryExec.java:89)
	at org.apache.http.impl.execchain.RedirectExec.execute(RedirectExec.java:111)
	at org.apache.http.impl.client.InternalHttpClient.doExecute(InternalHttpClient.java:185)
	at org.apache.http.impl.client.CloseableHttpClient.execute(CloseableHttpClient.java:83)
	at org.apache.http.impl.client.CloseableHttpClient.execute(CloseableHttpClient.java:56)
	at org.apache.solr.client.solrj.impl.HttpSolrClient.executeMethod(HttpSolrClient.java:542)
	... 43 more




Build Log:
[...truncated 11864 lines...]
   [junit4] Suite: org.apache.solr.cloud.CollectionsAPISolrJTest
   [junit4]   2> Creating dataDir: /home/jenkins/workspace/Lucene-Solr-master-Linux/solr/build/solr-core/test/J0/temp/solr.cloud.CollectionsAPISolrJTest_CBEBA6F3A44483A9-001/init-core-data-001
   [junit4]   2> 292322 INFO  (SUITE-CollectionsAPISolrJTest-seed#[CBEBA6F3A44483A9]-worker) [    ] o.a.s.SolrTestCaseJ4 Using PointFields (NUMERIC_POINTS_SYSPROP=true) w/NUMERIC_DOCVALUES_SYSPROP=false
   [junit4]   2> 292323 INFO  (SUITE-CollectionsAPISolrJTest-seed#[CBEBA6F3A44483A9]-worker) [    ] o.a.s.SolrTestCaseJ4 Randomized ssl (false) and clientAuth (true) via: @org.apache.solr.util.RandomizeSSL(reason=, ssl=NaN, value=NaN, clientAuth=NaN)
   [junit4]   2> 292324 INFO  (SUITE-CollectionsAPISolrJTest-seed#[CBEBA6F3A44483A9]-worker) [    ] o.a.s.SolrTestCaseJ4 SecureRandom sanity checks: test.solr.allowed.securerandom=null & java.security.egd=file:/dev/./urandom
   [junit4]   2> 292324 INFO  (SUITE-CollectionsAPISolrJTest-seed#[CBEBA6F3A44483A9]-worker) [    ] o.a.s.c.MiniSolrCloudCluster Starting cluster of 4 servers in /home/jenkins/workspace/Lucene-Solr-master-Linux/solr/build/solr-core/test/J0/temp/solr.cloud.CollectionsAPISolrJTest_CBEBA6F3A44483A9-001/tempDir-001
   [junit4]   2> 292324 INFO  (SUITE-CollectionsAPISolrJTest-seed#[CBEBA6F3A44483A9]-worker) [    ] o.a.s.c.ZkTestServer STARTING ZK TEST SERVER
   [junit4]   2> 292325 INFO  (Thread-1607) [    ] o.a.s.c.ZkTestServer client port:0.0.0.0/0.0.0.0:0
   [junit4]   2> 292325 INFO  (Thread-1607) [    ] o.a.s.c.ZkTestServer Starting server
   [junit4]   2> 292327 ERROR (Thread-1607) [    ] o.a.z.s.ZooKeeperServer ZKShutdownHandler is not registered, so ZooKeeper server won't take any action on ERROR or SHUTDOWN server state changes
   [junit4]   2> 292425 INFO  (SUITE-CollectionsAPISolrJTest-seed#[CBEBA6F3A44483A9]-worker) [    ] o.a.s.c.ZkTestServer start zk server on port:37889
   [junit4]   2> 292427 INFO  (zkConnectionManagerCallback-480-thread-1) [    ] o.a.s.c.c.ConnectionManager zkClient has connected
   [junit4]   2> 292432 INFO  (jetty-launcher-477-thread-1) [    ] o.e.j.s.Server jetty-9.3.20.v20170531
   [junit4]   2> 292432 INFO  (jetty-launcher-477-thread-4) [    ] o.e.j.s.Server jetty-9.3.20.v20170531
   [junit4]   2> 292433 INFO  (jetty-launcher-477-thread-2) [    ] o.e.j.s.Server jetty-9.3.20.v20170531
   [junit4]   2> 292433 INFO  (jetty-launcher-477-thread-3) [    ] o.e.j.s.Server jetty-9.3.20.v20170531
   [junit4]   2> 292434 INFO  (jetty-launcher-477-thread-1) [    ] o.e.j.s.h.ContextHandler Started o.e.j.s.ServletContextHandler@11e1a0f{/solr,null,AVAILABLE}
   [junit4]   2> 292438 INFO  (jetty-launcher-477-thread-4) [    ] o.e.j.s.h.ContextHandler Started o.e.j.s.ServletContextHandler@ca0e03{/solr,null,AVAILABLE}
   [junit4]   2> 292438 INFO  (jetty-launcher-477-thread-3) [    ] o.e.j.s.h.ContextHandler Started o.e.j.s.ServletContextHandler@da4e83{/solr,null,AVAILABLE}
   [junit4]   2> 292438 INFO  (jetty-launcher-477-thread-2) [    ] o.e.j.s.h.ContextHandler Started o.e.j.s.ServletContextHandler@baf687{/solr,null,AVAILABLE}
   [junit4]   2> 292442 INFO  (jetty-launcher-477-thread-1) [    ] o.e.j.s.AbstractConnector Started ServerConnector@c0264f{HTTP/1.1,[http/1.1]}{127.0.0.1:44839}
   [junit4]   2> 292442 INFO  (jetty-launcher-477-thread-2) [    ] o.e.j.s.AbstractConnector Started ServerConnector@1d1752d{HTTP/1.1,[http/1.1]}{127.0.0.1:37083}
   [junit4]   2> 292442 INFO  (jetty-launcher-477-thread-1) [    ] o.e.j.s.Server Started @293862ms
   [junit4]   2> 292442 INFO  (jetty-launcher-477-thread-2) [    ] o.e.j.s.Server Started @293862ms
   [junit4]   2> 292442 INFO  (jetty-launcher-477-thread-3) [    ] o.e.j.s.AbstractConnector Started ServerConnector@11f6bce{HTTP/1.1,[http/1.1]}{127.0.0.1:35467}
   [junit4]   2> 292442 INFO  (jetty-launcher-477-thread-2) [    ] o.a.s.c.s.e.JettySolrRunner Jetty properties: {hostContext=/solr, hostPort=37083}
   [junit4]   2> 292442 INFO  (jetty-launcher-477-thread-3) [    ] o.e.j.s.Server Started @293862ms
   [junit4]   2> 292442 INFO  (jetty-launcher-477-thread-1) [    ] o.a.s.c.s.e.JettySolrRunner Jetty properties: {hostContext=/solr, hostPort=44839}
   [junit4]   2> 292442 INFO  (jetty-launcher-477-thread-3) [    ] o.a.s.c.s.e.JettySolrRunner Jetty properties: {hostContext=/solr, hostPort=35467}
   [junit4]   2> 292443 ERROR (jetty-launcher-477-thread-1) [    ] o.a.s.u.StartupLoggingUtils Missing Java Option solr.log.dir. Logging may be missing or incomplete.
   [junit4]   2> 292443 ERROR (jetty-launcher-477-thread-3) [    ] o.a.s.u.StartupLoggingUtils Missing Java Option solr.log.dir. Logging may be missing or incomplete.
   [junit4]   2> 292443 INFO  (jetty-launcher-477-thread-1) [    ] o.a.s.s.SolrDispatchFilter  ___      _       Welcome to Apache Solr™ version 8.0.0
   [junit4]   2> 292443 INFO  (jetty-launcher-477-thread-4) [    ] o.e.j.s.AbstractConnector Started ServerConnector@5134b3{HTTP/1.1,[http/1.1]}{127.0.0.1:38867}
   [junit4]   2> 292443 INFO  (jetty-launcher-477-thread-1) [    ] o.a.s.s.SolrDispatchFilter / __| ___| |_ _   Starting in cloud mode on port null
   [junit4]   2> 292443 INFO  (jetty-launcher-477-thread-4) [    ] o.e.j.s.Server Started @293863ms
   [junit4]   2> 292443 INFO  (jetty-launcher-477-thread-1) [    ] o.a.s.s.SolrDispatchFilter \__ \/ _ \ | '_|  Install dir: null
   [junit4]   2> 292443 INFO  (jetty-launcher-477-thread-4) [    ] o.a.s.c.s.e.JettySolrRunner Jetty properties: {hostContext=/solr, hostPort=38867}
   [junit4]   2> 292443 INFO  (jetty-launcher-477-thread-3) [    ] o.a.s.s.SolrDispatchFilter  ___      _       Welcome to Apache Solr™ version 8.0.0
   [junit4]   2> 292443 ERROR (jetty-launcher-477-thread-2) [    ] o.a.s.u.StartupLoggingUtils Missing Java Option solr.log.dir. Logging may be missing or incomplete.
   [junit4]   2> 292443 INFO  (jetty-launcher-477-thread-3) [    ] o.a.s.s.SolrDispatchFilter / __| ___| |_ _   Starting in cloud mode on port null
   [junit4]   2> 292443 INFO  (jetty-launcher-477-thread-2) [    ] o.a.s.s.SolrDispatchFilter  ___      _       Welcome to Apache Solr™ version 8.0.0
   [junit4]   2> 292443 INFO  (jetty-launcher-477-thread-3) [    ] o.a.s.s.SolrDispatchFilter \__ \/ _ \ | '_|  Install dir: null
   [junit4]   2> 292443 INFO  (jetty-launcher-477-thread-2) [    ] o.a.s.s.SolrDispatchFilter / __| ___| |_ _   Starting in cloud mode on port null
   [junit4]   2> 292443 INFO  (jetty-launcher-477-thread-3) [    ] o.a.s.s.SolrDispatchFilter |___/\___/_|_|    Start time: 2017-12-26T16:09:08.429Z
   [junit4]   2> 292443 INFO  (jetty-launcher-477-thread-2) [    ] o.a.s.s.SolrDispatchFilter \__ \/ _ \ | '_|  Install dir: null
   [junit4]   2> 292443 INFO  (jetty-launcher-477-thread-1) [    ] o.a.s.s.SolrDispatchFilter |___/\___/_|_|    Start time: 2017-12-26T16:09:08.429Z
   [junit4]   2> 292443 INFO  (jetty-launcher-477-thread-2) [    ] o.a.s.s.SolrDispatchFilter |___/\___/_|_|    Start time: 2017-12-26T16:09:08.429Z
   [junit4]   2> 292443 ERROR (jetty-launcher-477-thread-4) [    ] o.a.s.u.StartupLoggingUtils Missing Java Option solr.log.dir. Logging may be missing or incomplete.
   [junit4]   2> 292443 INFO  (jetty-launcher-477-thread-4) [    ] o.a.s.s.SolrDispatchFilter  ___      _       Welcome to Apache Solr™ version 8.0.0
   [junit4]   2> 292443 INFO  (jetty-launcher-477-thread-4) [    ] o.a.s.s.SolrDispatchFilter / __| ___| |_ _   Starting in cloud mode on port null
   [junit4]   2> 292443 INFO  (jetty-launcher-477-thread-4) [    ] o.a.s.s.SolrDispatchFilter \__ \/ _ \ | '_|  Install dir: null
   [junit4]   2> 292443 INFO  (jetty-launcher-477-thread-4) [    ] o.a.s.s.SolrDispatchFilter |___/\___/_|_|    Start time: 2017-12-26T16:09:08.429Z
   [junit4]   2> 292449 INFO  (zkConnectionManagerCallback-484-thread-1) [    ] o.a.s.c.c.ConnectionManager zkClient has connected
   [junit4]   2> 292449 INFO  (zkConnectionManagerCallback-483-thread-1) [    ] o.a.s.c.c.ConnectionManager zkClient has connected
   [junit4]   2> 292449 INFO  (zkConnectionManagerCallback-486-thread-1) [    ] o.a.s.c.c.ConnectionManager zkClient has connected
   [junit4]   2> 292449 INFO  (zkConnectionManagerCallback-488-thread-1) [    ] o.a.s.c.c.ConnectionManager zkClient has connected
   [junit4]   2> 292449 INFO  (jetty-launcher-477-thread-2) [    ] o.a.s.s.SolrDispatchFilter solr.xml found in ZooKeeper. Loading...
   [junit4]   2> 292449 INFO  (jetty-launcher-477-thread-1) [    ] o.a.s.s.SolrDispatchFilter solr.xml found in ZooKeeper. Loading...
   [junit4]   2> 292449 INFO  (jetty-launcher-477-thread-3) [    ] o.a.s.s.SolrDispatchFilter solr.xml found in ZooKeeper. Loading...
   [junit4]   2> 292450 INFO  (jetty-launcher-477-thread-4) [    ] o.a.s.s.SolrDispatchFilter solr.xml found in ZooKeeper. Loading...
   [junit4]   2> 292468 WARN  (NIOServerCxn.Factory:0.0.0.0/0.0.0.0:0) [    ] o.a.z.s.NIOServerCnxn caught end of stream exception
   [junit4]   2> EndOfStreamException: Unable to read additional data from client sessionid 0x1609395add70001, likely client has closed socket
   [junit4]   2> 	at org.apache.zookeeper.server.NIOServerCnxn.doIO(NIOServerCnxn.java:239)
   [junit4]   2> 	at org.apache.zookeeper.server.NIOServerCnxnFactory.run(NIOServerCnxnFactory.java:203)
   [junit4]   2> 	at java.lang.Thread.run(Thread.java:748)
   [junit4]   2> 292469 WARN  (NIOServerCxn.Factory:0.0.0.0/0.0.0.0:0) [    ] o.a.z.s.NIOServerCnxn caught end of stream exception
   [junit4]   2> EndOfStreamException: Unable to read additional data from client sessionid 0x1609395add70002, likely client has closed socket
   [junit4]   2> 	at org.apache.zookeeper.server.NIOServerCnxn.doIO(NIOServerCnxn.java:239)
   [junit4]   2> 	at org.apache.zookeeper.server.NIOServerCnxnFactory.run(NIOServerCnxnFactory.java:203)
   [junit4]   2> 	at java.lang.Thread.run(Thread.java:748)
   [junit4]   2> 292470 WARN  (NIOServerCxn.Factory:0.0.0.0/0.0.0.0:0) [    ] o.a.z.s.NIOServerCnxn caught end of stream exception
   [junit4]   2> EndOfStreamException: Unable to read additional data from client sessionid 0x1609395add70003, likely client has closed socket
   [junit4]   2> 	at org.apache.zookeeper.server.NIOServerCnxn.doIO(NIOServerCnxn.java:239)
   [junit4]   2> 	at org.apache.zookeeper.server.NIOServerCnxnFactory.run(NIOServerCnxnFactory.java:203)
   [junit4]   2> 	at java.lang.Thread.run(Thread.java:748)
   [junit4]   2> 292470 WARN  (NIOServerCxn.Factory:0.0.0.0/0.0.0.0:0) [    ] o.a.z.s.NIOServerCnxn caught end of stream exception
   [junit4]   2> EndOfStreamException: Unable to read additional data from client sessionid 0x1609395add70004, likely client has closed socket
   [junit4]   2> 	at org.apache.zookeeper.server.NIOServerCnxn.doIO(NIOServerCnxn.java:239)
   [junit4]   2> 	at org.apache.zookeeper.server.NIOServerCnxnFactory.run(NIOServerCnxnFactory.java:203)
   [junit4]   2> 	at java.lang.Thread.run(Thread.java:748)
   [junit4]   2> 292474 INFO  (jetty-launcher-477-thread-1) [    ] o.a.s.c.ZkContainer Zookeeper client=127.0.0.1:37889/solr
   [junit4]   2> 292475 INFO  (jetty-launcher-477-thread-3) [    ] o.a.s.c.ZkContainer Zookeeper client=127.0.0.1:37889/solr
   [junit4]   2> 292475 INFO  (jetty-launcher-477-thread-4) [    ] o.a.s.c.ZkContainer Zookeeper client=127.0.0.1:37889/solr
   [junit4]   2> 292478 INFO  (jetty-launcher-477-thread-2) [    ] o.a.s.c.ZkContainer Zookeeper client=127.0.0.1:37889/solr
   [junit4]   2> 292479 INFO  (zkConnectionManagerCallback-494-thread-1) [    ] o.a.s.c.c.ConnectionManager zkClient has connected
   [junit4]   2> 292482 INFO  (zkConnectionManagerCallback-499-thread-1) [    ] o.a.s.c.c.ConnectionManager zkClient has connected
   [junit4]   2> 292482 INFO  (zkConnectionManagerCallback-501-thread-1) [    ] o.a.s.c.c.ConnectionManager zkClient has connected
   [junit4]   2> 292483 WARN  (NIOServerCxn.Factory:0.0.0.0/0.0.0.0:0) [    ] o.a.z.s.NIOServerCnxn caught end of stream exception
   [junit4]   2> EndOfStreamException: Unable to read additional data from client sessionid 0x1609395add70007, likely client has closed socket
   [junit4]   2> 	at org.apache.zookeeper.server.NIOServerCnxn.doIO(NIOServerCnxn.java:239)
   [junit4]   2> 	at org.apache.zookeeper.server.NIOServerCnxnFactory.run(NIOServerCnxnFactory.java:203)
   [junit4]   2> 	at java.lang.Thread.run(Thread.java:748)
   [junit4]   2> 292483 INFO  (zkConnectionManagerCallback-504-thread-1) [    ] o.a.s.c.c.ConnectionManager zkClient has connected
   [junit4]   2> 292484 INFO  (zkConnectionManagerCallback-506-thread-1-processing-n:127.0.0.1:44839_solr) [n:127.0.0.1:44839_solr    ] o.a.s.c.c.ConnectionManager zkClient has connected
   [junit4]   2> 292485 WARN  (NIOServerCxn.Factory:0.0.0.0/0.0.0.0:0) [    ] o.a.z.s.NIOServerCnxn caught end of stream exception
   [junit4]   2> EndOfStreamException: Unable to read additional data from client sessionid 0x1609395add70008, likely client has closed socket
   [junit4]   2> 	at org.apache.zookeeper.server.NIOServerCnxn.doIO(NIOServerCnxn.java:239)
   [junit4]   2> 	at org.apache.zookeeper.server.NIOServerCnxnFactory.run(NIOServerCnxnFactory.java:203)
   [junit4]   2> 	at java.lang.Thread.run(Thread.java:748)
   [junit4]   2> 292485 INFO  (zkConnectionManagerCallback-508-thread-1-processing-n:127.0.0.1:38867_solr) [n:127.0.0.1:38867_solr    ] o.a.s.c.c.ConnectionManager zkClient has connected
   [junit4]   2> 292487 INFO  (zkConnectionManagerCallback-512-thread-1-processing-n:127.0.0.1:37083_solr) [n:127.0.0.1:37083_solr    ] o.a.s.c.c.ConnectionManager zkClient has connected
   [junit4]   2> 292490 INFO  (zkConnectionManagerCallback-510-thread-1-processing-n:127.0.0.1:35467_solr) [n:127.0.0.1:35467_solr    ] o.a.s.c.c.ConnectionManager zkClient has connected
   [junit4]   2> 292517 INFO  (jetty-launcher-477-thread-2) [n:127.0.0.1:37083_solr    ] o.a.s.c.Overseer Overseer (id=null) closing
   [junit4]   2> 292517 INFO  (jetty-launcher-477-thread-2) [n:127.0.0.1:37083_solr    ] o.a.s.c.OverseerElectionContext I am going to be the leader 127.0.0.1:37083_solr
   [junit4]   2> 292518 INFO  (jetty-launcher-477-thread-2) [n:127.0.0.1:37083_solr    ] o.a.s.c.Overseer Overseer (id=99241462878109707-127.0.0.1:37083_solr-n_0000000000) starting
   [junit4]   2> 292542 INFO  (jetty-launcher-477-thread-2) [n:127.0.0.1:37083_solr    ] o.a.s.c.ZkController Register node as live in ZooKeeper:/live_nodes/127.0.0.1:37083_solr
   [junit4]   2> 292543 INFO  (OverseerStateUpdate-99241462878109707-127.0.0.1:37083_solr-n_0000000000) [n:127.0.0.1:37083_solr    ] o.a.s.c.c.ZkStateReader Updated live nodes from ZooKeeper... (0) -> (1)
   [junit4]   2> 292595 INFO  (jetty-launcher-477-thread-3) [n:127.0.0.1:35467_solr    ] o.a.s.c.c.ZkStateReader Updated live nodes from ZooKeeper... (0) -> (1)
   [junit4]   2> 292598 INFO  (jetty-launcher-477-thread-3) [n:127.0.0.1:35467_solr    ] o.a.s.c.Overseer Overseer (id=null) closing
   [junit4]   2> 292601 INFO  (jetty-launcher-477-thread-1) [n:127.0.0.1:44839_solr    ] o.a.s.c.c.ZkStateReader Updated live nodes from ZooKeeper... (0) -> (1)
   [junit4]   2> 292601 INFO  (jetty-launcher-477-thread-3) [n:127.0.0.1:35467_solr    ] o.a.s.c.ZkController Register node as live in ZooKeeper:/live_nodes/127.0.0.1:35467_solr
   [junit4]   2> 292604 INFO  (jetty-launcher-477-thread-1) [n:127.0.0.1:44839_solr    ] o.a.s.c.Overseer Overseer (id=null) closing
   [junit4]   2> 292608 INFO  (zkCallback-511-thread-1-processing-n:127.0.0.1:37083_solr) [n:127.0.0.1:37083_solr    ] o.a.s.c.c.ZkStateReader Updated live nodes from ZooKeeper... (1) -> (2)
   [junit4]   2> 292610 INFO  (zkCallback-505-thread-1-processing-n:127.0.0.1:44839_solr) [n:127.0.0.1:44839_solr    ] o.a.s.c.c.ZkStateReader Updated live nodes from ZooKeeper... (1) -> (2)
   [junit4]   2> 292614 INFO  (zkCallback-509-thread-1-processing-n:127.0.0.1:35467_solr) [n:127.0.0.1:35467_solr    ] o.a.s.c.c.ZkStateReader Updated live nodes from ZooKeeper... (1) -> (2)
   [junit4]   2> 292617 INFO  (jetty-launcher-477-thread-1) [n:127.0.0.1:44839_solr    ] o.a.s.c.ZkController Register node as live in ZooKeeper:/live_nodes/127.0.0.1:44839_solr
   [junit4]   2> 292617 INFO  (jetty-launcher-477-thread-4) [n:127.0.0.1:38867_solr    ] o.a.s.c.c.ZkStateReader Updated live nodes from ZooKeeper... (0) -> (2)
   [junit4]   2> 292622 INFO  (zkCallback-511-thread-1-processing-n:127.0.0.1:37083_solr) [n:127.0.0.1:37083_solr    ] o.a.s.c.c.ZkStateReader Updated live nodes from ZooKeeper... (2) -> (3)
   [junit4]   2> 292629 INFO  (zkCallback-509-thread-1-processing-n:127.0.0.1:35467_solr) [n:127.0.0.1:35467_solr    ] o.a.s.c.c.ZkStateReader Updated live nodes from ZooKeeper... (2) -> (3)
   [junit4]   2> 292630 INFO  (zkCallback-505-thread-1-processing-n:127.0.0.1:44839_solr) [n:127.0.0.1:44839_solr    ] o.a.s.c.c.ZkStateReader Updated live nodes from ZooKeeper... (2) -> (3)
   [junit4]   2> 292630 INFO  (zkCallback-507-thread-1-processing-n:127.0.0.1:38867_solr) [n:127.0.0.1:38867_solr    ] o.a.s.c.c.ZkStateReader Updated live nodes from ZooKeeper... (2) -> (3)
   [junit4]   2> 292630 INFO  (jetty-launcher-477-thread-4) [n:127.0.0.1:38867_solr    ] o.a.s.c.Overseer Overseer (id=null) closing
   [junit4]   2> 292632 INFO  (jetty-launcher-477-thread-4) [n:127.0.0.1:38867_solr    ] o.a.s.c.ZkController Register node as live in ZooKeeper:/live_nodes/127.0.0.1:38867_solr
   [junit4]   2> 292633 INFO  (zkCallback-511-thread-1-processing-n:127.0.0.1:37083_solr) [n:127.0.0.1:37083_solr    ] o.a.s.c.c.ZkStateReader Updated live nodes from ZooKeeper... (3) -> (4)
   [junit4]   2> 292633 INFO  (zkCallback-505-thread-1-processing-n:127.0.0.1:44839_solr) [n:127.0.0.1:44839_solr    ] o.a.s.c.c.ZkStateReader Updated live nodes from ZooKeeper... (3) -> (4)
   [junit4]   2> 292633 INFO  (zkCallback-507-thread-1-processing-n:127.0.0.1:38867_solr) [n:127.0.0.1:38867_solr    ] o.a.s.c.c.ZkStateReader Updated live nodes from ZooKeeper... (3) -> (4)
   [junit4]   2> 292644 INFO  (zkCallback-509-thread-1-processing-n:127.0.0.1:35467_solr) [n:127.0.0.1:35467_solr    ] o.a.s.c.c.ZkStateReader Updated live nodes from ZooKeeper... (3) -> (4)
   [junit4]   2> 292781 INFO  (jetty-launcher-477-thread-4) [n:127.0.0.1:38867_solr    ] o.a.s.m.r.SolrJmxReporter JMX monitoring for 'solr_38867.solr.node' (registry 'solr.node') enabled at server: com.sun.jmx.mbeanserver.JmxMBeanServer@1b868ec
   [junit4]   2> 292781 INFO  (jetty-launcher-477-thread-2) [n:127.0.0.1:37083_solr    ] o.a.s.m.r.SolrJmxReporter JMX monitoring for 'solr_37083.solr.node' (registry 'solr.node') enabled at server: com.sun.jmx.mbeanserver.JmxMBeanServer@1b868ec
   [junit4]   2> 292783 INFO  (jetty-launcher-477-thread-3) [n:127.0.0.1:35467_solr    ] o.a.s.m.r.SolrJmxReporter JMX monitoring for 'solr_35467.solr.node' (registry 'solr.node') enabled at server: com.sun.jmx.mbeanserver.JmxMBeanServer@1b868ec
   [junit4]   2> 292796 INFO  (jetty-launcher-477-thread-3) [n:127.0.0.1:35467_solr    ] o.a.s.m.r.SolrJmxReporter JMX monitoring for 'solr_35467.solr.jvm' (registry 'solr.jvm') enabled at server: com.sun.jmx.mbeanserver.JmxMBeanServer@1b868ec
   [junit4]   2> 292796 INFO  (jetty-launcher-477-thread-3) [n:127.0.0.1:35467_solr    ] o.a.s.m.r.SolrJmxReporter JMX monitoring for 'solr_35467.solr.jetty' (registry 'solr.jetty') enabled at server: com.sun.jmx.mbeanserver.JmxMBeanServer@1b868ec
   [junit4]   2> 292799 INFO  (jetty-launcher-477-thread-3) [n:127.0.0.1:35467_solr    ] o.a.s.c.CorePropertiesLocator Found 0 core definitions underneath /home/jenkins/workspace/Lucene-Solr-master-Linux/solr/build/solr-core/test/J0/temp/solr.cloud.CollectionsAPISolrJTest_CBEBA6F3A44483A9-001/tempDir-001/node3/.
   [junit4]   2> 292799 INFO  (jetty-launcher-477-thread-2) [n:127.0.0.1:37083_solr    ] o.a.s.m.r.SolrJmxReporter JMX monitoring for 'solr_37083.solr.jvm' (registry 'solr.jvm') enabled at server: com.sun.jmx.mbeanserver.JmxMBeanServer@1b868ec
   [junit4]   2> 292799 INFO  (jetty-launcher-477-thread-2) [n:127.0.0.1:37083_solr    ] o.a.s.m.r.SolrJmxReporter JMX monitoring for 'solr_37083.solr.jetty' (registry 'solr.jetty') enabled at server: com.sun.jmx.mbeanserver.JmxMBeanServer@1b868ec
   [junit4]   2> 292801 INFO  (jetty-launcher-477-thread-2) [n:127.0.0.1:37083_solr    ] o.a.s.c.CorePropertiesLocator Found 0 core definitions underneath /home/jenkins/workspace/Lucene-Solr-master-Linux/solr/build/solr-core/test/J0/temp/solr.cloud.CollectionsAPISolrJTest_CBEBA6F3A44483A9-001/tempDir-001/node2/.
   [junit4]   2> 292804 INFO  (jetty-launcher-477-thread-4) [n:127.0.0.1:38867_solr    ] o.a.s.m.r.SolrJmxReporter JMX monitoring for 'solr_38867.solr.jvm' (registry 'solr.jvm') enabled at server: com.sun.jmx.mbeanserver.JmxMBeanServer@1b868ec
   [junit4]   2> 292804 INFO  (jetty-launcher-477-thread-4) [n:127.0.0.1:38867_solr    ] o.a.s.m.r.SolrJmxReporter JMX monitoring for 'solr_38867.solr.jetty' (registry 'solr.jetty') enabled at server: com.sun.jmx.mbeanserver.JmxMBeanServer@1b868ec
   [junit4]   2> 292806 INFO  (jetty-launcher-477-thread-4) [n:127.0.0.1:38867_solr    ] o.a.s.c.CorePropertiesLocator Found 0 core definitions underneath /home/jenkins/workspace/Lucene-Solr-master-Linux/solr/build/solr-core/test/J0/temp/solr.cloud.CollectionsAPISolrJTest_CBEBA6F3A44483A9-001/tempDir-001/node4/.
   [junit4]   2> 293004 INFO  (jetty-launcher-477-thread-1) [n:127.0.0.1:44839_solr    ] o.a.s.m.r.SolrJmxReporter JMX monitoring for 'solr_44839.solr.node' (registry 'solr.node') enabled at server: com.sun.jmx.mbeanserver.JmxMBeanServer@1b868ec
   [junit4]   2> 293021 INFO  (jetty-launcher-477-thread-1) [n:127.0.0.1:44839_solr    ] o.a.s.m.r.SolrJmxReporter JMX monitoring for 'solr_44839.solr.jvm' (registry 'solr.jvm') enabled at server: com.sun.jmx.mbeanserver.JmxMBeanServer@1b868ec
   [junit4]   2> 293021 INFO  (jetty-launcher-477-thread-1) [n:127.0.0.1:44839_solr    ] o.a.s.m.r.SolrJmxReporter JMX monitoring for 'solr_44839.solr.jetty' (registry 'solr.jetty') enabled at server: com.sun.jmx.mbeanserver.JmxMBeanServer@1b868ec
   [junit4]   2> 293022 INFO  (jetty-launcher-477-thread-1) [n:127.0.0.1:44839_solr    ] o.a.s.c.CorePropertiesLocator Found 0 core definitions underneath /home/jenkins/workspace/Lucene-Solr-master-Linux/solr/build/solr-core/test/J0/temp/solr.cloud.CollectionsAPISolrJTest_CBEBA6F3A44483A9-001/tempDir-001/node1/.
   [junit4]   2> 293067 INFO  (zkConnectionManagerCallback-522-thread-1) [    ] o.a.s.c.c.ConnectionManager zkClient has connected
   [junit4]   2> 293069 WARN  (NIOServerCxn.Factory:0.0.0.0/0.0.0.0:0) [    ] o.a.z.s.NIOServerCnxn caught end of stream exception
   [junit4]   2> EndOfStreamException: Unable to read additional data from client sessionid 0x1609395add7000d, likely client has closed socket
   [junit4]   2> 	at org.apache.zookeeper.server.NIOServerCnxn.doIO(NIOServerCnxn.java:239)
   [junit4]   2> 	at org.apache.zookeeper.server.NIOServerCnxnFactory.run(NIOServerCnxnFactory.java:203)
   [junit4]   2> 	at java.lang.Thread.run(Thread.java:748)
   [junit4]   2> 293071 INFO  (zkConnectionManagerCallback-526-thread-1) [    ] o.a.s.c.c.ConnectionManager zkClient has connected
   [junit4]   2> 293072 INFO  (SUITE-CollectionsAPISolrJTest-seed#[CBEBA6F3A44483A9]-worker) [    ] o.a.s.c.c.ZkStateReader Updated live nodes from ZooKeeper... (0) -> (4)
   [junit4]   2> 293073 INFO  (SUITE-CollectionsAPISolrJTest-seed#[CBEBA6F3A44483A9]-worker) [    ] o.a.s.c.s.i.ZkClientClusterStateProvider Cluster at 127.0.0.1:37889/solr ready
   [junit4]   2> 293092 INFO  (TEST-CollectionsAPISolrJTest.testOverseerStatus-seed#[CBEBA6F3A44483A9]) [    ] o.a.s.SolrTestCaseJ4 ###Starting testOverseerStatus
   [junit4]   2> 293096 INFO  (qtp10831219-3692) [n:127.0.0.1:38867_solr    ] o.a.s.h.a.CollectionsHandler Invoked Collection Action :overseerstatus with params action=OVERSEERSTATUS&wt=javabin&version=2 and sendToOCPQueue=true
   [junit4]   2> 293104 INFO  (qtp10831219-3692) [n:127.0.0.1:38867_solr    ] o.a.s.s.HttpSolrCall [admin] webapp=null path=/admin/collections params={action=OVERSEERSTATUS&wt=javabin&version=2} status=0 QTime=8
   [junit4]   2> 293106 INFO  (TEST-CollectionsAPISolrJTest.testOverseerStatus-seed#[CBEBA6F3A44483A9]) [    ] o.a.s.SolrTestCaseJ4 ###Ending testOverseerStatus
   [junit4]   2> 293121 INFO  (TEST-CollectionsAPISolrJTest.testCreateCollectionWithPropertyParam-seed#[CBEBA6F3A44483A9]) [    ] o.a.s.SolrTestCaseJ4 ###Starting testCreateCollectionWithPropertyParam
   [junit4]   2> 293122 INFO  (qtp10831219-3694) [n:127.0.0.1:38867_solr    ] o.a.s.h.a.CollectionsHandler Invoked Collection Action :create with params replicationFactor=1&property.ulogDir=/home/jenkins/workspace/Lucene-Solr-master-Linux/solr/build/solr-core/test/J0/temp/solr.cloud.CollectionsAPISolrJTest_CBEBA6F3A44483A9-001/testPropertyParamsForCreate-001/ulogDir-j&property.dataDir=/home/jenkins/workspace/Lucene-Solr-master-Linux/solr/build/solr-core/test/J0/temp/solr.cloud.CollectionsAPISolrJTest_CBEBA6F3A44483A9-001/testPropertyParamsForCreate-001/dataDir-yxx&collection.configName=conf&name=solrj_test_core_props&nrtReplicas=1&action=CREATE&numShards=1&wt=javabin&version=2 and sendToOCPQueue=true
   [junit4]   2> 293124 INFO  (OverseerThreadFactory-1250-thread-2-processing-n:127.0.0.1:37083_solr) [n:127.0.0.1:37083_solr    ] o.a.s.c.CreateCollectionCmd Create collection solrj_test_core_props
   [junit4]   2> 293124 INFO  (OverseerCollectionConfigSetProcessor-99241462878109707-127.0.0.1:37083_solr-n_0000000000) [n:127.0.0.1:37083_solr    ] o.a.s.c.OverseerTaskQueue Response ZK path: /overseer/collection-queue-work/qnr-0000000000 doesn't exist.  Requestor may have disconnected from ZooKeeper
   [junit4]   2> 293230 INFO  (OverseerStateUpdate-99241462878109707-127.0.0.1:37083_solr-n_0000000000) [n:127.0.0.1:37083_solr    ] o.a.s.c.o.SliceMutator createReplica() {
   [junit4]   2>   "operation":"ADDREPLICA",
   [junit4]   2>   "collection":"solrj_test_core_props",
   [junit4]   2>   "shard":"shard1",
   [junit4]   2>   "core":"solrj_test_core_props_shard1_replica_n1",
   [junit4]   2>   "state":"down",
   [junit4]   2>   "base_url":"http://127.0.0.1:37083/solr",
   [junit4]   2>   "type":"NRT",
   [junit4]   2>   "waitForFinalState":"false"} 
   [junit4]   2> 293434 INFO  (qtp8791037-3698) [n:127.0.0.1:37083_solr    ] o.a.s.h.a.CoreAdminOperation core create command qt=/admin/cores&property.dataDir=/home/jenkins/workspace/Lucene-Solr-master-Linux/solr/build/solr-core/test/J0/temp/solr.cloud.CollectionsAPISolrJTest_CBEBA6F3A44483A9-001/testPropertyParamsForCreate-001/dataDir-yxx&collection.configName=conf&newCollection=true&collection=solrj_test_core_props&version=2&replicaType=NRT&property.ulogDir=/home/jenkins/workspace/Lucene-Solr-master-Linux/solr/build/solr-core/test/J0/temp/solr.cloud.CollectionsAPISolrJTest_CBEBA6F3A44483A9-001/testPropertyParamsForCreate-001/ulogDir-j&coreNodeName=core_node2&name=solrj_test_core_props_shard1_replica_n1&action=CREATE&numShards=1&shard=shard1&wt=javabin
   [junit4]   2> 293434 INFO  (qtp8791037-3698) [n:127.0.0.1:37083_solr    ] o.a.s.c.TransientSolrCoreCacheDefault Allocating transient cache for 2147483647 transient cores
   [junit4]   2> 293537 INFO  (zkCallback-511-thread-1-processing-n:127.0.0.1:37083_solr) [n:127.0.0.1:37083_solr    ] o.a.s.c.c.ZkStateReader A cluster state change: [WatchedEvent state:SyncConnected type:NodeDataChanged path:/collections/solrj_test_core_props/state.json] for collection [solrj_test_core_props] has occurred - updating... (live nodes size: [4])
   [junit4]   2> 293537 INFO  (zkCallback-511-thread-2-processing-n:127.0.0.1:37083_solr) [n:127.0.0.1:37083_solr    ] o.a.s.c.c.ZkStateReader A cluster state change: [WatchedEvent state:SyncConnected type:NodeDataChanged path:/collections/solrj_test_core_props/state.json] for collection [solrj_test_core_props] has occurred - updating... (live nodes size: [4])
   [junit4]   2> 294450 INFO  (qtp8791037-3698) [n:127.0.0.1:37083_solr c:solrj_test_core_props s:shard1 r:core_node2 x:solrj_test_core_props_shard1_replica_n1] o.a.s.c.SolrConfig Using Lucene MatchVersion: 8.0.0
   [junit4]   2> 294459 INFO  (qtp8791037-3698) [n:127.0.0.1:37083_solr c:solrj_test_core_props s:shard1 r:core_node2 x:solrj_test_core_props_shard1_replica_n1] o.a.s.s.IndexSchema [solrj_test_core_props_shard1_replica_n1] Schema name=minimal
   [junit4]   2> 294462 INFO  (qtp8791037-3698) [n:127.0.0.1:37083_solr c:solrj_test_core_props s:shard1 r:core_node2 x:solrj_test_core_props_shard1_replica_n1] o.a.s.s.IndexSchema Loaded schema minimal/1.1 with uniqueid field id
   [junit4]   2> 294463 INFO  (qtp8791037-3698) [n:127.0.0.1:37083_solr c:solrj_test_core_props s:shard1 r:core_node2 x:solrj_test_core_props_shard1_replica_n1] o.a.s.c.CoreContainer Creating SolrCore 'solrj_test_core_props_shard1_replica_n1' using configuration from collection solrj_test_core_props, trusted=true
   [junit4]   2> 294463 INFO  (qtp8791037-3698) [n:127.0.0.1:37083_solr c:solrj_test_core_props s:shard1 r:core_node2 x:solrj_test_core_props_shard1_replica_n1] o.a.s.m.r.SolrJmxReporter JMX monitoring for 'solr_37083.solr.core.solrj_test_core_props.shard1.replica_n1' (registry 'solr.core.solrj_test_core_props.shard1.replica_n1') enabled at server: com.sun.jmx.mbeanserver.JmxMBeanServer@1b868ec
   [junit4]   2> 294463 INFO  (qtp8791037-3698) [n:127.0.0.1:37083_solr c:solrj_test_core_props s:shard1 r:core_node2 x:solrj_test_core_props_shard1_replica_n1] o.a.s.c.SolrCore solr.RecoveryStrategy.Builder
   [junit4]   2> 294464 INFO  (qtp8791037-3698) [n:127.0.0.1:37083_solr c:solrj_test_core_props s:shard1 r:core_node2 x:solrj_test_core_props_shard1_replica_n1] o.a.s.c.SolrCore [[solrj_test_core_props_shard1_replica_n1] ] Opening new SolrCore at [/home/jenkins/workspace/Lucene-Solr-master-Linux/solr/build/solr-core/test/J0/temp/solr.cloud.CollectionsAPISolrJTest_CBEBA6F3A44483A9-001/tempDir-001/node2/solrj_test_core_props_shard1_replica_n1], dataDir=[/home/jenkins/workspace/Lucene-Solr-master-Linux/solr/build/solr-core/test/J0/temp/solr.cloud.CollectionsAPISolrJTest_CBEBA6F3A44483A9-001/testPropertyParamsForCreate-001/dataDir-yxx/]
   [junit4]   2> 294518 INFO  (qtp8791037-3698) [n:127.0.0.1:37083_solr c:solrj_test_core_props s:shard1 r:core_node2 x:solrj_test_core_props_shard1_replica_n1] o.a.s.u.UpdateHandler Using UpdateLog implementation: org.apache.solr.update.UpdateLog
   [junit4]   2> 294518 INFO  (qtp8791037-3698) [n:127.0.0.1:37083_solr c:solrj_test_core_props s:shard1 r:core_node2 x:solrj_test_core_props_shard1_replica_n1] o.a.s.u.UpdateLog Initializing UpdateLog: dataDir=null defaultSyncLevel=FLUSH numRecordsToKeep=100 maxNumLogsToKeep=10 numVersionBuckets=65536
   [junit4]   2> 294520 INFO  (qtp8791037-3698) [n:127.0.0.1:37083_solr c:solrj_test_core_props s:shard1 r:core_node2 x:solrj_test_core_props_shard1_replica_n1] o.a.s.u.CommitTracker Hard AutoCommit: disabled
   [junit4]   2> 294520 INFO  (qtp8791037-3698) [n:127.0.0.1:37083_solr c:solrj_test_core_props s:shard1 r:core_node2 x:solrj_test_core_props_shard1_replica_n1] o.a.s.u.CommitTracker Soft AutoCommit: disabled
   [junit4]   2> 294522 INFO  (qtp8791037-3698) [n:127.0.0.1:37083_solr c:solrj_test_core_props s:shard1 r:core_node2 x:solrj_test_core_props_shard1_replica_n1] o.a.s.s.SolrIndexSearcher Opening [Searcher@3f7433[solrj_test_core_props_shard1_replica_n1] main]
   [junit4]   2> 294523 INFO  (qtp8791037-3698) [n:127.0.0.1:37083_solr c:solrj_test_core_props s:shard1 r:core_node2 x:solrj_test_core_props_shard1_replica_n1] o.a.s.r.ManagedResourceStorage Configured ZooKeeperStorageIO with znodeBase: /configs/conf
   [junit4]   2> 294523 INFO  (qtp8791037-3698) [n:127.0.0.1:37083_solr c:solrj_test_core_props s:shard1 r:core_node2 x:solrj_test_core_props_shard1_replica_n1] o.a.s.r.ManagedResourceStorage Loaded null at path _rest_managed.json using ZooKeeperStorageIO:path=/configs/conf
   [junit4]   2> 294524 INFO  (qtp8791037-3698) [n:127.0.0.1:37083_solr c:solrj_test_core_props s:shard1 r:core_node2 x:solrj_test_core_props_shard1_replica_n1] o.a.s.h.ReplicationHandler Commits will be reserved for 10000ms.
   [junit4]   2> 294534 INFO  (searcherExecutor-1259-thread-1-processing-n:127.0.0.1:37083_solr x:solrj_test_core_props_shard1_replica_n1 s:shard1 c:solrj_test_core_props r:core_node2) [n:127.0.0.1:37083_solr c:solrj_test_core_props s:shard1 r:core_node2 x:solrj_test_core_props_shard1_replica_n1] o.a.s.c.SolrCore [solrj_test_core_props_shard1_replica_n1] Registered new searcher Searcher@3f7433[solrj_test_core_props_shard1_replica_n1] main{ExitableDirectoryReader(UninvertingDirectoryReader())}
   [junit4]   2> 294534 INFO  (qtp8791037-3698) [n:127.0.0.1:37083_solr c:solrj_test_core_props s:shard1 r:core_node2 x:solrj_test_core_props_shard1_replica_n1] o.a.s.u.UpdateLog Could not find max version in index or recent updates, using new clock 1587863408366059520
   [junit4]   2> 294537 INFO  (qtp8791037-3698) [n:127.0.0.1:37083_solr c:solrj_test_core_props s:shard1 r:core_node2 x:solrj_test_core_props_shard1_replica_n1] o.a.s.c.ShardLeaderElectionContext Enough replicas found to continue.
   [junit4]   2> 294537 INFO  (qtp8791037-3698) [n:127.0.0.1:37083_solr c:solrj_test_core_props s:shard1 r:core_node2 x:solrj_test_core_props_shard1_replica_n1] o.a.s.c.ShardLeaderElectionContext I may be the new leader - try and sync
   [junit4]   2> 294537 INFO  (qtp8791037-3698) [n:127.0.0.1:37083_solr c:solrj_test_core_props s:shard1 r:core_node2 x:solrj_test_core_props_shard1_replica_n1] o.a.s.c.SyncStrategy Sync replicas to http://127.0.0.1:37083/solr/solrj_test_core_props_shard1_replica_n1/
   [junit4]   2> 294537 INFO  (qtp8791037-3698) [n:127.0.0.1:37083_solr c:solrj_test_core_props s:shard1 r:core_node2 x:solrj_test_core_props_shard1_replica_n1] o.a.s.c.SyncStrategy Sync Success - now sync replicas to me
   [junit4]   2> 294537 INFO  (qtp8791037-3698) [n:127.0.0.1:37083_solr c:solrj_test_core_props s:shard1 r:core_node2 x:solrj_test_core_props_shard1_replica_n1] o.a.s.c.SyncStrategy http://127.0.0.1:37083/solr/solrj_test_core_props_shard1_replica_n1/ has no replicas
   [junit4]   2> 294538 INFO  (qtp8791037-3698) [n:127.0.0.1:37083_solr c:solrj_test_core_props s:shard1 r:core_node2 x:solrj_test_core_props_shard1_replica_n1] o.a.s.c.ShardLeaderElectionContext Found all replicas participating in election, clear LIR
   [junit4]   2> 294540 INFO  (qtp8791037-3698) [n:127.0.0.1:37083_solr c:solrj_test_core_props s:shard1 r:core_node2 x:solrj_test_core_props_shard1_replica_n1] o.a.s.c.ShardLeaderElectionContext I am the new leader: http://127.0.0.1:37083/solr/solrj_test_core_props_shard1_replica_n1/ shard1
   [junit4]   2> 294641 INFO  (zkCallback-511-thread-1-processing-n:127.0.0.1:37083_solr) [n:127.0.0.1:37083_solr    ] o.a.s.c.c.ZkStateReader A cluster state change: [WatchedEvent state:SyncConnected type:NodeDataChanged path:/collections/solrj_test_core_props/state.json] for collection [solrj_test_core_props] has occurred - updating... (live nodes size: [4])
   [junit4]   2> 294641 INFO  (zkCallback-511-thread-2-processing-n:127.0.0.1:37083_solr) [n:127.0.0.1:37083_solr    ] o.a.s.c.c.ZkStateReader A cluster state change: [WatchedEvent state:SyncConnected type:NodeDataChanged path:/collections/solrj_test_core_props/state.json] for collection [solrj_test_core_props] has occurred - updating... (live nodes size: [4])
   [junit4]   2> 294690 INFO  (qtp8791037-3698) [n:127.0.0.1:37083_solr c:solrj_test_core_props s:shard1 r:core_node2 x:solrj_test_core_props_shard1_replica_n1] o.a.s.c.ZkController I am the leader, no recovery necessary
   [junit4]   2> 294692 INFO  (qtp8791037-3698) [n:127.0.0.1:37083_solr c:solrj_test_core_props s:shard1 r:core_node2 x:solrj_test_core_props_shard1_replica_n1] o.a.s.s.HttpSolrCall [admin] webapp=null path=/admin/cores params={qt=/admin/cores&property.dataDir=/home/jenkins/workspace/Lucene-Solr-master-Linux/solr/build/solr-core/test/J0/temp/solr.cloud.CollectionsAPISolrJTest_CBEBA6F3A44483A9-001/testPropertyParamsForCreate-001/dataDir-yxx&collection.configName=conf&newCollection=true&collection=solrj_test_core_props&version=2&replicaType=NRT&property.ulogDir=/home/jenkins/workspace/Lucene-Solr-master-Linux/solr/build/solr-core/test/J0/temp/solr.cloud.CollectionsAPISolrJTest_CBEBA6F3A44483A9-001/testPropertyParamsForCreate-001/ulogDir-j&coreNodeName=core_node2&name=solrj_test_core_props_shard1_replica_n1&action=CREATE&numShards=1&shard=shard1&wt=javabin} status=0 QTime=1258
   [junit4]   2> 294694 INFO  (qtp10831219-3694) [n:127.0.0.1:38867_solr    ] o.a.s.h.a.CollectionsHandler Wait for new collection to be active for at most 30 seconds. Check all shard replicas
   [junit4]   2> 294792 INFO  (zkCallback-511-thread-2-processing-n:127.0.0.1:37083_solr) [n:127.0.0.1:37083_solr    ] o.a.s.c.c.ZkStateReader A cluster state change: [WatchedEvent state:SyncConnected type:NodeDataChanged path:/collections/solrj_test_core_props/state.json] for collection [solrj_test_core_props] has occurred - updating... (live nodes size: [4])
   [junit4]   2> 294792 INFO  (zkCallback-511-thread-1-processing-n:127.0.0.1:37083_solr) [n:127.0.0.1:37083_solr    ] o.a.s.c.c.ZkStateReader A cluster state change: [WatchedEvent state:SyncConnected type:NodeDataChanged path:/collections/solrj_test_core_props/state.json] for collection [solrj_test_core_props] has occurred - updating... (live nodes size: [4])
   [junit4]   2> 295127 INFO  (OverseerCollectionConfigSetProcessor-99241462878109707-127.0.0.1:37083_solr-n_0000000000) [n:127.0.0.1:37083_solr    ] o.a.s.c.OverseerTaskQueue Response ZK path: /overseer/collection-queue-work/qnr-0000000002 doesn't exist.  Requestor may have disconnected from ZooKeeper
   [junit4]   2> 295697 INFO  (qtp10831219-3694) [n:127.0.0.1:38867_solr    ] o.a.s.s.HttpSolrCall [admin] webapp=null path=/admin/collections params={replicationFactor=1&property.ulogDir=/home/jenkins/workspace/Lucene-Solr-master-Linux/solr/build/solr-core/test/J0/temp/solr.cloud.CollectionsAPISolrJTest_CBEBA6F3A44483A9-001/testPropertyParamsForCreate-001/ulogDir-j&property.dataDir=/home/jenkins/workspace/Lucene-Solr-master-Linux/solr/build/solr-core/test/J0/temp/solr.cloud.CollectionsAPISolrJTest_CBEBA6F3A44483A9-001/testPropertyParamsForCreate-001/dataDir-yxx&collection.configName=conf&name=solrj_test_core_props&nrtReplicas=1&action=CREATE&numShards=1&wt=javabin&version=2} status=0 QTime=2574
   [junit4]   2> 295703 INFO  (qtp8791037-3705) [n:127.0.0.1:37083_solr    ] o.a.s.s.HttpSolrCall [admin] webapp=null path=/admin/cores params={action=STATUS&indexInfo=true&wt=javabin&version=2} status=0 QTime=2
   [junit4]   2> 295704 INFO  (TEST-CollectionsAPISolrJTest.testCreateCollectionWithPropertyParam-seed#[CBEBA6F3A44483A9]) [    ] o.a.s.SolrTestCaseJ4 ###Ending testCreateCollectionWithPropertyParam
   [junit4]   2> 295738 INFO  (TEST-CollectionsAPISolrJTest.testCreateAndDeleteShard-seed#[CBEBA6F3A44483A9]) [    ] o.a.s.SolrTestCaseJ4 ###Starting testCreateAndDeleteShard
   [junit4]   2> 295739 INFO  (qtp10831219-3696) [n:127.0.0.1:38867_solr    ] o.a.s.h.a.CollectionsHandler Invoked Collection Action :create with params pullReplicas=1&shards=shardA,shardB&replicationFactor=1&collection.configName=conf&maxShardsPerNode=3&name=solrj_implicit&router.name=implicit&nrtReplicas=1&action=CREATE&tlogReplicas=1&wt=javabin&version=2 and sendToOCPQueue=true
   [junit4]   2> 295743 INFO  (OverseerThreadFactory-1250-thread-3-processing-n:127.0.0.1:37083_solr) [n:127.0.0.1:37083_solr    ] o.a.s.c.CreateCollectionCmd Create collection solrj_implicit
   [junit4]   2> 295953 INFO  (OverseerStateUpdate-99241462878109707-127.0.0.1:37083_solr-n_0000000000) [n:127.0.0.1:37083_solr    ] o.a.s.c.o.SliceMutator createReplica() {
   [junit4]   2>   "operation":"ADDREPLICA",
   [junit4]   2>   "collection":"solrj_implicit",
   [junit4]   2>   "shard":"shardA",
   [junit4]   2>   "core":"solrj_implicit_shardA_replica_n1",
   [junit4]   2>   "state":"down",
   [junit4]   2>   "base_url":"http://127.0.0.1:38867/solr",
   [junit4]   2>   "type":"NRT",
   [junit4]   2>   "waitForFinalState":"false"} 
   [junit4]   2> 295955 INFO  (OverseerStateUpdate-99241462878109707-127.0.0.1:37083_solr-n_0000000000) [n:127.0.0.1:37083_solr    ] o.a.s.c.o.SliceMutator createReplica() {
   [junit4]   2>   "operation":"ADDREPLICA",
   [junit4]   2>   "collection":"solrj_implicit",
   [junit4]   2>   "shard":"shardA",
   [junit4]   2>   "core":"solrj_implicit_shardA_replica_t2",
   [junit4]   2>   "state":"down",
   [junit4]   2>   "base_url":"http://127.0.0.1:37083/solr",
   [junit4]   2>   "type":"TLOG",
   [junit4]   2>   "waitForFinalState":"false"} 
   [junit4]   2> 295958 INFO  (OverseerStateUpdate-99241462878109707-127.0.0.1:37083_solr-n_0000000000) [n:127.0.0.1:37083_solr    ] o.a.s.c.o.SliceMutator createReplica() {
   [junit4]   2>   "operation":"ADDREPLICA",
   [junit4]   2>   "collection":"solrj_implicit",
   [junit4]   2>   "shard":"shardA",
   [junit4]   2>   "core":"solrj_implicit_shardA_replica_p4",
   [junit4]   2>   "state":"down",
   [junit4]   2>   "base_url":"http://127.0.0.1:44839/solr",
   [junit4]   2>   "type":"PULL",
   [junit4]   2>   "waitForFinalState":"false"} 
   [junit4]   2> 295960 INFO  (OverseerStateUpdate-99241462878109707-127.0.0.1:37083_solr-n_0000000000) [n:127.0.0.1:37083_solr    ] o.a.s.c.o.SliceMutator createReplica() {
   [junit4]   2>   "operation":"ADDREPLICA",
   [junit4]   2>   "collection":"solrj_implicit",
   [junit4]   2>   "shard":"shardB",
   [junit4]   2>   "core":"solrj_implicit_shardB_replica_n6",
   [junit4]   2>   "state":"down",
   [junit4]   2>   "base_url":"http://127.0.0.1:35467/solr",
   [junit4]   2>   "type":"NRT",
   [junit4]   2>   "waitForFinalState":"false"} 
   [junit4]   2> 295963 INFO  (OverseerStateUpdate-99241462878109707-127.0.0.1:37083_solr-n_0000000000) [n:127.0.0.1:37083_solr    ] o.a.s.c.o.SliceMutator createReplica() {
   [junit4]   2>   "operation":"ADDREPLICA",
   [junit4]   2>   "collection":"solrj_implicit",
   [junit4]   2>   "shard":"shardB",
   [junit4]   2>   "core":"solrj_implicit_shardB_replica_t8",
   [junit4]   2>   "state":"down",
   [junit4]   2>   "base_url":"http://127.0.0.1:38867/solr",
   [junit4]   2>   "type":"TLOG",
   [junit4]   2>   "waitForFinalState":"false"} 
   [junit4]   2> 295966 INFO  (OverseerStateUpdate-99241462878109707-127.0.0.1:37083_solr-n_0000000000) [n:127.0.0.1:37083_solr    ] o.a.s.c.o.SliceMutator createReplica() {
   [junit4]   2>   "operation":"ADDREPLICA",
   [junit4]   2>   "collection":"solrj_implicit",
   [junit4]   2>   "shard":"shardB",
   [junit4]   2>   "core":"solrj_implicit_shardB_replica_p10",
   [junit4]   2>   "state":"down",
   [junit4]   2>   "base_url":"http://127.0.0.1:37083/solr",
   [junit4]   2>   "type":"PULL",
   [junit4]   2>   "waitForFinalState":"false"} 
   [junit4]   2> 296168 INFO  (qtp10831219-3692) [n:127.0.0.1:38867_solr    ] o.a.s.h.a.CoreAdminOperation core create command qt=/admin/cores&coreNodeName=core_node3&collection.configName=conf&newCollection=true&name=solrj_implicit_shardA_replica_n1&action=CREATE&numShards=2&collection=solrj_implicit&shard=shardA&wt=javabin&version=2&replicaType=NRT
   [junit4]   2> 296169 INFO  (qtp10831219-3692) [n:127.0.0.1:38867_solr    ] o.a.s.c.TransientSolrCoreCacheDefault Allocating transient cache for 2147483647 transient cores
   [junit4]   2> 296172 INFO  (qtp8791037-3703) [n:127.0.0.1:37083_solr    ] o.a.s.h.a.CoreAdminOperation core create command qt=/admin/cores&coreNodeName=core_node5&collection.configName=conf&newCollection=true&name=solrj_implicit_shardA_replica_t2&action=CREATE&numShards=2&collection=solrj_implicit&shard=shardA&wt=javabin&version=2&replicaType=TLOG
   [junit4]   2> 296173 INFO  (qtp14335670-3671) [n:127.0.0.1:44839_solr    ] o.a.s.h.a.CoreAdminOperation core create command qt=/admin/cores&coreNodeName=core_node7&collection.configName=conf&newCollection=true&name=solrj_implicit_shardA_replica_p4&action=CREATE&numShards=2&collection=solrj_implicit&shard=shardA&wt=javabin&version=2&replicaType=PULL
   [junit4]   2> 296173 INFO  (qtp14335670-3671) [n:127.0.0.1:44839_solr    ] o.a.s.c.TransientSolrCoreCacheDefault Allocating transient cache for 2147483647 transient cores
   [junit4]   2> 296174 INFO  (qtp10831219-3685) [n:127.0.0.1:38867_solr    ] o.a.s.h.a.CoreAdminOperation core create command qt=/admin/cores&coreNodeName=core_node11&collection.configName=conf&newCollection=true&name=solrj_implicit_shardB_replica_t8&action=CREATE&numShards=2&collection=solrj_implicit&shard=shardB&wt=javabin&version=2&replicaType=TLOG
   [junit4]   2> 296174 INFO  (qtp8791037-3688) [n:127.0.0.1:37083_solr    ] o.a.s.h.a.CoreAdminOperation core create command qt=/admin/cores&coreNodeName=core_node12&collection.configName=conf&newCollection=true&name=solrj_implicit_shardB_replica_p10&action=CREATE&numShards=2&collection=solrj_implicit&shard=shardB&wt=javabin&version=2&replicaType=PULL
   [junit4]   2> 296178 INFO  (qtp20299406-3699) [n:127.0.0.1:35467_solr    ] o.a.s.h.a.CoreAdminOperation core create command qt=/admin/cores&coreNodeName=core_node9&collection.configName=conf&newCollection=true&name=solrj_implicit_shardB_replica_n6&action=CREATE&numShards=2&collection=solrj_implicit&shard=shardB&wt=javabin&version=2&replicaType=NRT
   [junit4]   2> 296179 INFO  (qtp20299406-3699) [n:127.0.0.1:35467_solr    ] o.a.s.c.TransientSolrCoreCacheDefault Allocating transient cache for 2147483647 transient cores
   [junit4]   2> 296288 INFO  (zkCallback-511-thread-2-processing-n:127.0.0.1:37083_solr) [n:127.0.0.1:37083_solr    ] o.a.s.c.c.ZkStateReader A cluster state change: [WatchedEvent state:SyncConnected type:NodeDataChanged path:/collections/solrj_implicit/state.json] for collection [solrj_implicit] has occurred - updating... (live nodes size: [4])
   [junit4]   2> 296288 INFO  (zkCallback-507-thread-1-processing-n:127.0.0.1:38867_solr) [n:127.0.0.1:38867_solr    ] o.a.s.c.c.ZkStateReader A cluster state change: [WatchedEvent state:SyncConnected type:NodeDataChanged path:/collections/solrj_implicit/state.json] for collection [solrj_implicit] has occurred - updating... (live nodes size: [4])
   [junit4]   2> 296289 INFO  (zkCallback-511-thread-3-processing-n:127.0.0.1:37083_solr) [n:127.0.0.1:37083_solr    ] o.a.s.c.c.ZkStateReader A cluster state change: [WatchedEvent state:SyncConnected type:NodeDataChanged path:/collections/solrj_implicit/state.json] for collection [solrj_implicit] has occurred - updating... (live nodes size: [4])
   [junit4]   2> 296289 INFO  (zkCallback-511-thread-1-processing-n:127.0.0.1:37083_solr) [n:127.0.0.1:37083_solr    ] o.a.s.c.c.ZkStateReader A cluster state change: [WatchedEvent state:SyncConnected type:NodeDataChanged path:/collections/solrj_implicit/state.json] for collection [solrj_implicit] has occurred - updating... (live nodes size: [4])
   [junit4]   2> 296289 INFO  (zkCallback-509-thread-2-processing-n:127.0.0.1:35467_solr) [n:127.0.0.1:35467_solr    ] o.a.s.c.c.ZkStateReader A cluster state change: [WatchedEvent state:SyncConnected type:NodeDataChanged path:/collections/solrj_implicit/state.json] for collection [solrj_implicit] has occurred - updating... (live nodes size: [4])
   [junit4]   2> 296289 INFO  (zkCallback-509-thread-1-processing-n:127.0.0.1:35467_solr) [n:127.0.0.1:35467_solr    ] o.a.s.c.c.ZkStateReader A cluster state change: [WatchedEvent state:SyncConnected type:NodeDataChanged path:/collections/solrj_implicit/state.json] for collection [solrj_implicit] has occurred - updating... (live nodes size: [4])
   [junit4]   2> 296289 INFO  (zkCallback-505-thread-1-processing-n:127.0.0.1:44839_solr) [n:127.0.0.1:44839_solr    ] o.a.s.c.c.ZkStateReader A cluster state change: [WatchedEvent state:SyncConnected type:NodeDataChanged path:/collections/solrj_implicit/state.json] for collection [solrj_implicit] has occurred - updating... (live nodes size: [4])
   [junit4]   2> 296290 INFO  (zkCallback-505-thread-2-processing-n:127.0.0.1:44839_solr) [n:127.0.0.1:44839_solr    ] o.a.s.c.c.ZkStateReader A cluster state change: [WatchedEvent state:SyncConnected type:NodeDataChanged path:/collections/solrj_implicit/state.json] for collection [solrj_implicit] has occurred - updating... (live nodes size: [4])
   [junit4]   2> 296294 INFO  (zkCallback-507-thread-2-processing-n:127.0.0.1:38867_solr) [n:127.0.0.1:38867_solr    ] o.a.s.c.c.ZkStateReader A cluster state change: [WatchedEvent state:SyncConnected type:NodeDataChanged path:/collections/solrj_implicit/state.json] for collection [solrj_implicit] has occurred - updating... (live nodes size: [4])
   [junit4]   2> 297195 INFO  (qtp10831219-3685) [n:127.0.0.1:38867_solr c:solrj_implicit s:shardB r:core_node11 x:solrj_implicit_shardB_replica_t8] o.a.s.c.SolrConfig Using Lucene MatchVersion: 8.0.0
   [junit4]   2> 297196 INFO  (qtp8791037-3703) [n:127.0.0.1:37083_solr c:solrj_implicit s:shardA r:core_node5 x:solrj_implicit_shardA_replica_t2] o.a.s.c.SolrConfig Using Lucene MatchVersion: 8.0.0
   [junit4]   2> 297196 INFO  (qtp10831219-3692) [n:127.0.0.1:38867_solr c:solrj_implicit s:shardA r:core_node3 x:solrj_implicit_shardA_replica_n1] o.a.s.c.SolrConfig Using Lucene MatchVersion: 8.0.0
   [junit4]   2> 297215 INFO  (qtp8791037-3688) [n:127.0.0.1:37083_solr c:solrj_implicit s:shardB r:core_node12 x:solrj_implicit_shardB_replica_p10] o.a.s.c.SolrConfig Using Lucene MatchVersion: 8.0.0
   [junit4]   2> 297230 INFO  (qtp14335670-3671) [n:127.0.0.1:44839_solr c:solrj_implicit s:shardA r:core_node7 x:solrj_implicit_shardA_replica_p4] o.a.s.c.SolrConfig Using Lucene MatchVersion: 8.0.0
   [junit4]   2> 297232 INFO  (qtp20299406-3699) [n:127.0.0.1:35467_solr c:solrj_implicit s:shardB r:core_node9 x:solrj_implicit_shardB_replica_n6] o.a.s.c.SolrConfig Using Lucene MatchVersion: 8.0.0
   [junit4]   2> 297233 INFO  (qtp10831219-3692) [n:127.0.0.1:38867_solr c:solrj_implicit s:shardA r:core_node3 x:solrj_implicit_shardA_replica_n1] o.a.s.s.IndexSchema [solrj_implicit_shardA_replica_n1] Schema name=minimal
   [junit4]   2> 297247 INFO  (qtp10831219-3685) [n:127.0.0.1:38867_solr c:solrj_implicit s:shardB r:core_node11 x:solrj_implicit_shardB_replica_t8] o.a.s.s.IndexSchema [solrj_implicit_shardB_replica_t8] Schema name=minimal
   [junit4]   2> 297248 INFO  (qtp10831219-3692) [n:127.0.0.1:38867_solr c:solrj_implicit s:shardA r:core_node3 x:solrj_implicit_shardA_replica_n1] o.a.s.s.IndexSchema Loaded schema minimal/1.1 with uniqueid field id
   [junit4]   2> 297248 INFO  (qtp10831219-3692) [n:127.0.0.1:38867_solr c:solrj_implicit s:shardA r:core_node3 x:solrj_implicit_shardA_replica_n1] o.a.s.c.CoreContainer Creating SolrCore 'solrj_implicit_shardA_replica_n1' using configuration from collection solrj_implicit, trusted=true
   [junit4]   2> 297250 INFO  (qtp10831219-3692) [n:127.0.0.1:38867_solr c:solrj_implicit s:shardA r:core_node3 x:solrj_implicit_shardA_replica_n1] o.a.s.m.r.SolrJmxReporter JMX monitoring for 'solr_38867.solr.core.solrj_implicit.shardA.replica_n1' (registry 'solr.core.solrj_implicit.shardA.replica_n1') enabled at server: com.sun.jmx.mbeanserver.JmxMBeanServer@1b868ec
   [junit4]   2> 297250 INFO  (qtp10831219-3692) [n:127.0.0.1:38867_solr c:solrj_implicit s:shardA r:core_node3 x:solrj_implicit_shardA_replica_n1] o.a.s.c.SolrCore solr.RecoveryStrategy.Builder
   [junit4]   2> 297250 INFO  (qtp10831219-3692) [n:127.0.0.1:38867_solr c:solrj_implicit s:shardA r:core_node3 x:solrj_implicit_shardA_replica_n1] o.a.s.c.SolrCore [[solrj_implicit_shardA_replica_n1] ] Opening new SolrCore at [/home/jenkins/workspace/Lucene-Solr-master-Linux/solr/build/solr-core/test/J0/temp/solr.cloud.CollectionsAPISolrJTest_CBEBA6F3A44483A9-001/tempDir-001/node4/solrj_implicit_shardA_replica_n1], dataDir=[/home/jenkins/workspace/Lucene-Solr-master-Linux/solr/build/solr-core/test/J0/temp/solr.cloud.CollectionsAPISolrJTest_CBEBA6F3A44483A9-001/tempDir-001/node4/./solrj_implicit_shardA_replica_n1/data/]
   [junit4]   2> 297251 INFO  (qtp8791037-3688) [n:127.0.0.1:37083_solr c:solrj_implicit s:shardB r:core_node12 x:solrj_implicit_shardB_replica_p10] o.a.s.s.IndexSchema [solrj_implicit_shardB_replica_p10] Schema name=minimal
   [junit4]   2> 297252 INFO  (qtp8791037-3703) [n:127.0.0.1:37083_solr c:solrj_implicit s:shardA r:core_node5 x:solrj_implicit_shardA_replica_t2] o.a.s.s.IndexSchema [solrj_implicit_shardA_replica_t2] Schema name=minimal
   [junit4]   2> 297253 INFO  (qtp10831219-3685) [n:127.0.0.1:38867_solr c:solrj_implicit s:shardB r:core_node11 x:solrj_implicit_shardB_replica_t8] o.a.s.s.IndexSchema Loaded schema minimal/1.1 with uniqueid field id
   [junit4]   2> 297253 INFO  (qtp10831219-3685) [n:127.0.0.1:38867_solr c:solrj_implicit s:shardB r:core_node11 x:solrj_implicit_shardB_replica_t8] o.a.s.c.CoreContainer Creating SolrCore 'solrj_implicit_shardB_replica_t8' using configuration from collection solrj_implicit, trusted=true
   [junit4]   2> 297254 INFO  (qtp10831219-3685) [n:127.0.0.1:38867_solr c:solrj_implicit s:shardB r:core_node11 x:solrj_implicit_shardB_replica_t8] o.a.s.m.r.SolrJmxReporter JMX monitoring for 'solr_38867.solr.core.solrj_implicit.shardB.replica_t8' (registry 'solr.core.solrj_implicit.shardB.replica_t8') enabled at server: com.sun.jmx.mbeanserver.JmxMBeanServer@1b868ec
   [junit4]   2> 297254 INFO  (qtp10831219-3685) [n:127.0.0.1:38867_solr c:solrj_implicit s:shardB r:core_node11 x:solrj_implicit_shardB_replica_t8] o.a.s.c.SolrCore solr.RecoveryStrategy.Builder
   [junit4]   2> 297254 INFO  (qtp10831219-3685) [n:127.0.0.1:38867_solr c:solrj_implicit s:shardB r:core_node11 x:solrj_implicit_shardB_replica_t8] o.a.s.c.SolrCore [[solrj_implicit_shardB_replica_t8] ] Opening new SolrCore at [/home/jenkins/workspace/Lucene-Solr-master-Linux/solr/build/solr-core/test/J0/temp/solr.cloud.CollectionsAPISolrJTest_CBEBA6F3A44483A9-001/tempDir-001/node4/solrj_implicit_shardB_replica_t8], dataDir=[/home/jenkins/workspace/Lucene-Solr-master-Linux/solr/build/solr-core/test/J0/temp/solr.cloud.CollectionsAPISolrJTest_CBEBA6F3A44483A9-001/tempDir-001/node4/./solrj_implicit_shardB_replica_t8/data/]
   [junit4]   2> 297256 INFO  (qtp14335670-3671) [n:127.0.0.1:44839_solr c:solrj_implicit s:shardA r:core_node7 x:solrj_implicit_shardA_replica_p4] o.a.s.s.IndexSchema [solrj_implicit_shardA_replica_p4] Schema name=minimal
   [junit4]   2> 297258 INFO  (qtp8791037-3688) [n:127.0.0.1:37083_solr c:solrj_implicit s:shardB r:core_node12 x:solrj_implicit_shardB_replica_p10] o.a.s.s.IndexSchema Loaded schema minimal/1.1 with uniqueid field id
   [junit4]   2> 297258 INFO  (qtp8791037-3688) [n:127.0.0.1:37083_solr c:solrj_implicit s:shardB r:core_node12 x:solrj_implicit_shardB_replica_p10] o.a.s.c.CoreContainer Creating SolrCore 'solrj_implicit_shardB_replica_p10' using configuration from collection solrj_implicit, trusted=true
   [junit4]   2> 297259 INFO  (qtp8791037-3688) [n:127.0.0.1:37083_solr c:solrj_implicit s:shardB r:core_node12 x:solrj_implicit_shardB_replica_p10] o.a.s.m.r.SolrJmxReporter JMX monitoring for 'solr_37083.solr.core.solrj_implicit.shardB.replica_p10' (registry 'solr.core.solrj_implicit.shardB.replica_p10') enabled at server: com.sun.jmx.mbeanserver.JmxMBeanServer@1b868ec
   [junit4]   2> 297259 INFO  (qtp8791037-3703) [n:127.0.0.1:37083_solr c:solrj_implicit s:shardA r:core_node5 x:solrj_implicit_shardA_replica_t2] o.a.s.s.IndexSchema Loaded schema minimal/1.1 with uniqueid field id
   [junit4]   2> 297259 INFO  (qtp8791037-3688) [n:127.0.0.1:37083_solr c:solrj_implicit s:shardB r:core_node12 x:solrj_implicit_shardB_replica_p10] o.a.s.c.SolrCore solr.RecoveryStrategy.Builder
   [junit4]   2> 297259 INFO  (qtp8791037-3703) [n:127.0.0.1:37083_solr c:solrj_implicit s:shardA r:core_node5 x:solrj_implicit_shardA_replica_t2] o.a.s.c.CoreContainer Creating SolrCore 'solrj_implicit_shardA_replica_t2' using configuration from collection solrj_implicit, trusted=true
   [junit4]   2> 297259 INFO  (qtp8791037-3688) [n:127.0.0.1:37083_solr c:solrj_implicit s:shardB r:core_node12 x:solrj_implicit_shardB_replica_p10] o.a.s.c.SolrCore [[solrj_implicit_shardB_replica_p10] ] Opening new SolrCore at [/home/jenkins/workspace/Lucene-Solr-master-Linux/solr/build/solr-core/test/J0/temp/solr.cloud.CollectionsAPISolrJTest_CBEBA6F3A44483A9-001/tempDir-001/node2/solrj_implicit_shardB_replica_p10], dataDir=[/home/jenkins/workspace/Lucene-Solr-master-Linux/solr/build/solr-core/test/J0/temp/solr.cloud.CollectionsAPISolrJTest_CBEBA6F3A44483A9-001/tempDir-001/node2/./solrj_implicit_shardB_replica_p10/data/]
   [junit4]   2> 297260 INFO  (qtp20299406-3699) [n:127.0.0.1:35467_solr c:solrj_implicit s:shardB r:core_node9 x:solrj_implicit_shardB_replica_n6] o.a.s.s.IndexSchema [solrj_implicit_shardB_replica_n6] Schema name=minimal
   [junit4]   2> 297260 INFO  (qtp8791037-3703) [n:127.0.0.1:37083_solr c:solrj_implicit s:shardA r:core_node5 x:solrj_implicit_shardA_replica_t2] o.a.s.m.r.SolrJmxReporter JMX monitoring for 'solr_37083.solr.core.solrj_implicit.shardA.replica_t2' (registry 'solr.core.solrj_implicit.shardA.replica_t2') enabled at server: com.sun.jmx.mbeanserver.JmxMBeanServer@1b868ec
   [junit4]   2> 297261 INFO  (qtp8791037-3703) [n:127.0.0.1:37083_solr c:solrj_implicit s:shardA r:core_node5 x:solrj_implicit_shardA_replica_t2] o.a.s.c.SolrCore solr.RecoveryStrategy.Builder
   [junit4]   2> 297261 INFO  (qtp8791037-3703) [n:127.0.0.1:37083_solr c:solrj_implicit s:shardA r:core_node5 x:solrj_implicit_shardA_replica_t2] o.a.s.c.SolrCore [[solrj_implicit_shardA_replica_t2] ] Opening new SolrCore at [/home/jenkins/workspace/Lucene-Solr-master-Linux/solr/build/solr-core/test/J0/temp/solr.cloud.CollectionsAPISolrJTest_CBEBA6F3A44483A9-001/tempDir-001/node2/solrj_implicit_shardA_replica_t2], dataDir=[/home/jenkins/workspace/Lucene-Solr-master-Linux/solr/build/solr-core/test/J0/temp/solr.cloud.CollectionsAPISolrJTest_CBEBA6F3A44483A9-001/tempDir-001/node2/./solrj_implicit_shardA_replica_t2/data/]
   [junit4]   2> 297264 INFO  (qtp14335670-3671) [n:127.0.0.1:44839_solr c:solrj_implicit s:shardA r:core_node7 x:solrj_implicit_shardA_replica_p4] o.a.s.s.IndexSchema Loaded schema minimal/1.1 with uniqueid field id
   [junit4]   2> 297264 INFO  (qtp14335670-3671) [n:127.0.0.1:44839_solr c:solrj_implicit s:shardA r:core_node7 x:solrj_implicit_shardA_replica_p4] o.a.s.c.CoreContainer Creating SolrCore 'solrj_implicit_shardA_replica_p4' using configuration from collection solrj_implicit, trusted=true
   [junit4]   2> 297266 INFO  (qtp14335670-3671) [n:127.0.0.1:44839_solr c:solrj_implicit s:shardA r:core_node7 x:solrj_implicit_shardA_replica_p4] o.a.s.m.r.SolrJmxReporter JMX monitoring for 'solr_44839.solr.core.solrj_implicit.shardA.replica_p4' (registry 'solr.core.solrj_implicit.shardA.replica_p4') enabled at server: com.sun.jmx.mbeanserver.JmxMBeanServer@1b868ec
   [junit4]   2> 297266 INFO  (qtp14335670-3671) [n:127.0.0.1:44839_solr c:solrj_implicit s:shardA r:core_node7 x:solrj_implicit_shardA_replica_p4] o.a.s.c.SolrCore solr.RecoveryStrategy.Builder
   [junit4]   2> 297266 INFO  (qtp14335670-3671) [n:127.0.0.1:44839_solr c:solrj_implicit s:shardA r:core_node7 x:solrj_implicit_shardA_replica_p4] o.a.s.c.SolrCore [[solrj_implicit_shardA_replica_p4] ] Opening new SolrCore at [/home/jenkins/workspace/Lucene-Solr-master-Linux/solr/build/solr-core/test/J0/temp/solr.cloud.CollectionsAPISolrJTest_CBEBA6F3A44483A9-001/tempDir-001/node1/solrj_implicit_shardA_replica_p4], dataDir=[/home/jenkins/workspace/Lucene-Solr-master-Linux/solr/build/solr-core/test/J0/temp/solr.cloud.CollectionsAPISolrJTest_CBEBA6F3A44483A9-001/tempDir-001/node1/./solrj_implicit_shardA_replica_p4/data/]
   [junit4]   2> 297267 INFO  (qtp20299406-3699) [n:127.0.0.1:35467_solr c:solrj_implicit s:shardB r:core_node9 x:solrj_implicit_shardB_replica_n6] o.a.s.s.IndexSchema Loaded schema minimal/1.1 with uniqueid field id
   [junit4]   2> 297267 INFO  (qtp20299406-3699) [n:127.0.0.1:35467_solr c:solrj_implicit s:shardB r:core_node9 x:solrj_implicit_shardB_replica_n6] o.a.s.c.CoreContainer Creating SolrCore 'solrj_implicit_shardB_replica_n6' using configuration from collection solrj_implicit, trusted=true
   [junit4]   2> 297268 INFO  (qtp20299406-3699) [n:127.0.0.1:35467_solr c:solrj_implicit s:shardB r:core_node9 x:solrj_implicit_shardB_replica_n6] o.a.s.m.r.SolrJmxReporter JMX monitoring for 'solr_35467.solr.core.solrj_implicit.shardB.replica_n6' (registry 'solr.core.solrj_implicit.shardB.replica_n6') enabled at server: com.sun.jmx.mbeanserver.JmxMBeanServer@1b868ec
   [junit4]   2> 297268 INFO  (qtp20299406-3699) [n:127.0.0.1:35467_solr c:solrj_implicit s:shardB r:core_node9 x:solrj_implicit_shardB_replica_n6] o.a.s.c.SolrCore solr.RecoveryStrategy.Builder
   [junit4]   2> 297268 INFO  (qtp20299406-3699) [n:127.0.0.1:35467_solr c:solrj_implicit s:shardB r:core_node9 x:solrj_implicit_shardB_replica_n6] o.a.s.c.SolrCore [[solrj_implicit_shardB_replica_n6] ] Opening new SolrCore at [/home/jenkins/workspace/Lucene-Solr-master-Linux/solr/build/solr-core/test/J0/temp/solr.cloud.CollectionsAPISolrJTest_CBEBA6F3A44483A9-001/tempDir-001/node3/solrj_implicit_shardB_replica_n6], dataDir=[/home/jenkins/workspace/Lucene-Solr-master-Linux/solr/build/solr-core/test/J0/temp/solr.cloud.CollectionsAPISolrJTest_CBEBA6F3A44483A9-001/tempDir-001/node3/./solrj_implicit_shardB_replica_n6/data/]
   [junit4]   2> 297358 INFO  (qtp10831219-3692) [n:127.0.0.1:38867_solr c:solrj_implicit s:shardA r:core_node3 x:solrj_implicit_shardA_replica_n1] o.a.s.u.UpdateHandler Using UpdateLog implementation: org.apache.solr.update.UpdateLog
   [junit4]   2> 297358 INFO  (qtp8791037-3703) [n:127.0.0.1:37083_solr c:solrj_implicit s:shardA r:core_node5 x:solrj_implicit_shardA_replica_t2] o.a.s.u.UpdateHandler Using UpdateLog implementation: org.apache.solr.update.UpdateLog
   [junit4]   2> 297358 INFO  (qtp10831219-3692) [n:127.0.0.1:38867_solr c:solrj_implicit s:shardA r:core_node3 x:solrj_implicit_shardA_replica_n1] o.a.s.u.UpdateLog Initializing UpdateLog: dataDir=null defaultSyncLevel=FLUSH numRecordsToKeep=100 maxNumLogsToKeep=10 numVersionBuckets=65536
   [junit4]   2> 297358 INFO  (qtp8791037-3703) [n:127.0.0.1:37083_solr c:solrj_implicit s:shardA r:core_node5 x:solrj_implicit_shardA_replica_t2] o.a.s.u.UpdateLog Initializing UpdateLog: dataDir=null defaultSyncLevel=FLUSH numRecordsToKeep=100 maxNumLogsToKeep=10 numVersionBuckets=65536
   [junit4]   2> 297359 INFO  (qtp10831219-3692) [n:127.0.0.1:38867_solr c:solrj_implicit s:shardA r:core_node3 x:solrj_implicit_shardA_replica_n1] o.a.s.u.CommitTracker Hard AutoCommit: disabled
   [junit4]   2> 297360 INFO  (qtp10831219-3692) [n:127.0.0.1:38867_solr c:solrj

[...truncated too long message...]

79)
   [junit4]   2> 	at org.apache.curator.framework.imps.GetDataBuilderImpl.forPath(GetDataBuilderImpl.java:41)
   [junit4]   2> 	at org.apache.curator.framework.recipes.shared.SharedValue.readValue(SharedValue.java:244)
   [junit4]   2> 	at org.apache.curator.framework.recipes.shared.SharedValue.access$100(SharedValue.java:44)
   [junit4]   2> 	at org.apache.curator.framework.recipes.shared.SharedValue$1.process(SharedValue.java:61)
   [junit4]   2> 	at org.apache.curator.framework.imps.NamespaceWatcher.process(NamespaceWatcher.java:67)
   [junit4]   2> 	at org.apache.zookeeper.ClientCnxn$EventThread.processEvent(ClientCnxn.java:530)
   [junit4]   2> 	at org.apache.zookeeper.ClientCnxn$EventThread.run(ClientCnxn.java:505)
   [junit4]   2> Dec 26, 2017 4:59:16 PM com.carrotsearch.randomizedtesting.ThreadLeakControl tryToInterruptAll
   [junit4]   2> INFO: All leaked threads terminated.
   [junit4]   2> NOTE: test params are: codec=Asserting(Lucene70), sim=Asserting(org.apache.lucene.search.similarities.AssertingSimilarity@1a709b), locale=de, timezone=Asia/Pyongyang
   [junit4]   2> NOTE: Linux 4.10.0-40-generic i386/Oracle Corporation 1.8.0_144 (32-bit)/cpus=8,threads=1,free=42255888,total=386605056
   [junit4]   2> NOTE: All tests run in this JVM: [DocValuesMultiTest, DistributedTermsComponentTest, SearchHandlerTest, TestRebalanceLeaders, BasicAuthIntegrationTest, RulesTest, TestOmitPositions, AddBlockUpdateTest, TestRequestStatusCollectionAPI, SolrGraphiteReporterTest, TestAuthorizationFramework, TestOverriddenPrefixQueryForCustomFieldType, ChaosMonkeySafeLeaderWithPullReplicasTest, TestSystemCollAutoCreate, CachingDirectoryFactoryTest, HdfsLockFactoryTest, TriggerIntegrationTest, HealthCheckHandlerTest, TestFilteredDocIdSet, TestStandardQParsers, TestExactSharedStatsCache, TestConfigSetImmutable, CoreMergeIndexesAdminHandlerTest, TestFreeTextSuggestions, RestartWhileUpdatingTest, DistributedSuggestComponentTest, TestNumericTerms32, SpatialRPTFieldTypeTest, TestFastWriter, SimpleCollectionCreateDeleteTest, AnalyticsQueryTest, SolrIndexSplitterTest, MetricsConfigTest, SolrSlf4jReporterTest, TestSolr4Spatial, TestOnReconnectListenerSupport, CdcrVersionReplicationTest, TestPushWriter, TestLazyCores, TestJettySolrRunner, ZkSolrClientTest, DistributedVersionInfoTest, BigEndianAscendingWordDeserializerTest, RegexBoostProcessorTest, TestMultiValuedNumericRangeQuery, TestDynamicFieldResource, LeaderInitiatedRecoveryOnShardRestartTest, QueryResultKeyTest, TestPointFields, HdfsRestartWhileUpdatingTest, SaslZkACLProviderTest, ShardRoutingCustomTest, ConvertedLegacyTest, TestSQLHandlerNonCloud, DeleteLastCustomShardedReplicaTest, BlockJoinFacetDistribTest, TestCloudPseudoReturnFields, WrapperMergePolicyFactoryTest, NotRequiredUniqueKeyTest, TimeRoutedAliasUpdateProcessorTest, TestPseudoReturnFields, TestQueryWrapperFilter, NumericFieldsTest, DistributedFacetPivotLongTailTest, TestAnalyzeInfixSuggestions, SolrIndexConfigTest, TestXIncludeConfig, TestRetrieveFieldsOptimizer, CloudMLTQParserTest, TestUseDocValuesAsStored, PathHierarchyTokenizerFactoryTest, LeaderFailoverAfterPartitionTest, SynonymTokenizerTest, AssignTest, TestReqParamsAPI, TestConfigSetsAPI, TestTestInjection, DataDrivenBlockJoinTest, CloudExitableDirectoryReaderTest, RegexBytesRefFilterTest, ManagedSchemaRoundRobinCloudTest, TestCoreBackup, TestSimpleTrackingShardHandler, SolrMetricReporterTest, TestCloudInspectUtil, TestSimpleTextCodec, TestOrdValues, TestPerFieldSimilarity, TestEmbeddedSolrServerAdminHandler, TestShortCircuitedRequests, ConcurrentDeleteAndCreateCollectionTest, TestInPlaceUpdatesDistrib, TestXmlQParser, TestLeaderElectionWithEmptyReplica, LukeRequestHandlerTest, TestAddFieldRealTimeGet, TestClusterProperties, DebugComponentTest, ClusterStateUpdateTest, TestLargeCluster, SuggestComponentContextFilterQueryTest, TestManagedSynonymFilterFactory, StatsReloadRaceTest, HLLUtilTest, SampleTest, TestObjectReleaseTracker, TestJmxIntegration, TestDFISimilarityFactory, SOLR749Test, TestCloudSchemaless, TestWriterPerf, TestSubQueryTransformer, AutoscalingHistoryHandlerTest, MoreLikeThisHandlerTest, OverseerModifyCollectionTest, ResponseHeaderTest, TestSolrCloudWithHadoopAuthPlugin, PolyFieldTest, StressHdfsTest, TestDocBasedVersionConstraints, TestAtomicUpdateErrorCases, TestPullReplicaErrorHandling, ChaosMonkeySafeLeaderTest, CollectionsAPIDistributedZkTest, OpenCloseCoreStressTest, OverseerTest, ShardRoutingTest, LeaderElectionTest, TestRandomDVFaceting, ZkCLITest, TestDistributedGrouping, TestFaceting, DistributedSpellCheckComponentTest, TermVectorComponentDistributedTest, TestRealTimeGet, TestStressReorder, TestJoin, TestReload, TestStressVersions, TestRangeQuery, TestCoreContainer, SimpleFacetsTest, StatsComponentTest, SpellCheckComponentTest, SolrCmdDistributorTest, BadIndexSchemaTest, TestFiltering, TestFunctionQuery, BasicFunctionalityTest, DirectUpdateHandlerTest, TestBadConfig, TestIndexSearcher, SoftAutoCommitTest, ShowFileRequestHandlerTest, DistributedQueryElevationComponentTest, SignatureUpdateProcessorFactoryTest, SpellCheckCollatorTest, SuggesterFSTTest, CoreAdminHandlerTest, SolrRequestParserTest, SuggesterTSTTest, SuggesterTest, TestStressLucene, TestTrie, SpatialFilterTest, SuggesterWFSTTest, TestCSVLoader, SchemaVersionSpecificBehaviorTest, SolrCoreCheckLockOnStartupTest, TestWordDelimiterFilterFactory, QueryEqualityTest, DirectUpdateHandlerOptimizeTest, DefaultValueUpdateProcessorTest, StatelessScriptUpdateProcessorFactoryTest, TestRemoteStreaming, DistanceFunctionTest, IndexBasedSpellCheckerTest, TestSurroundQueryParser, DisMaxRequestHandlerTest, TestQueryUtils, DocumentAnalysisRequestHandlerTest, TermsComponentTest, XmlUpdateRequestHandlerTest, RequestHandlersTest, TermVectorComponentTest, FieldAnalysisRequestHandlerTest, TestSolrQueryParser, IndexSchemaRuntimeFieldTest, LoggingHandlerTest, SolrPluginUtilsTest, IndexSchemaTest, TestCollationField, UpdateRequestProcessorFactoryTest, MBeansHandlerTest, TestAnalyzedSuggestions, BinaryUpdateRequestHandlerTest, TestPartialUpdateDeduplication, TestPHPSerializedResponseWriter, PingRequestHandlerTest, CSVRequestHandlerTest, SearchHandlerTest, HighlighterConfigTest, TestQuerySenderListener, UpdateParamsTest, TestQuerySenderNoQuery, CopyFieldTest, BadComponentTest, TestStressRecovery, TestMergePolicyConfig, TestSolrDeletionPolicy2, TestDocSet, TestBinaryField, MinimalSchemaTest, TestElisionMultitermQuery, OutputWriterTest, ExternalFileFieldSortTest, TestPostingsSolrHighlighter, DirectSolrConnectionTest, TestLuceneMatchVersion, SpellPossibilityIteratorTest, TestCharFilters, TestSweetSpotSimilarityFactory, TestDFRSimilarityFactory, TestLMDirichletSimilarityFactory, TestBM25SimilarityFactory, ScriptEngineTest, OpenExchangeRatesOrgProviderTest, URLClassifyProcessorTest, TestFastLRUCache, ChaosMonkeyNothingIsSafeTest, AsyncCallRequestStatusResponseTest, CollectionReloadTest, CollectionTooManyReplicasTest, DistribJoinFromCollectionTest, ForceLeaderTest, MoveReplicaTest, RemoteQueryErrorTest, SSLMigrationTest, SolrCloudExampleTest, TestCloudSearcherWarming, TestConfigSetsAPIZkFailure, TestCryptoKeys, TestDownShardTolerantSearch, TestLocalFSCloudBackupRestore, TestRandomRequestDistribution, TestRequestForwarding, TestSegmentSorting, TestSolrCloudWithSecureImpersonation]
   [junit4]   2> NOTE: reproduce with: ant test  -Dtestcase=TestSolrCloudWithSecureImpersonation -Dtests.seed=CBEBA6F3A44483A9 -Dtests.multiplier=3 -Dtests.slow=true -Dtests.locale=de -Dtests.timezone=Asia/Pyongyang -Dtests.asserts=true -Dtests.file.encoding=UTF-8
   [junit4] ERROR   0.00s J1 | TestSolrCloudWithSecureImpersonation (suite) <<<
   [junit4]    > Throwable #1: com.carrotsearch.randomizedtesting.ThreadLeakError: 1 thread leaked from SUITE scope at org.apache.solr.cloud.TestSolrCloudWithSecureImpersonation: 
   [junit4]    >    1) Thread[id=24870, name=jetty-launcher-4892-thread-1-EventThread, state=TIMED_WAITING, group=TGRP-TestSolrCloudWithSecureImpersonation]
   [junit4]    >         at sun.misc.Unsafe.park(Native Method)
   [junit4]    >         at java.util.concurrent.locks.LockSupport.parkNanos(LockSupport.java:215)
   [junit4]    >         at java.util.concurrent.locks.AbstractQueuedSynchronizer.doAcquireSharedNanos(AbstractQueuedSynchronizer.java:1037)
   [junit4]    >         at java.util.concurrent.locks.AbstractQueuedSynchronizer.tryAcquireSharedNanos(AbstractQueuedSynchronizer.java:1328)
   [junit4]    >         at java.util.concurrent.CountDownLatch.await(CountDownLatch.java:277)
   [junit4]    >         at org.apache.curator.CuratorZookeeperClient.internalBlockUntilConnectedOrTimedOut(CuratorZookeeperClient.java:323)
   [junit4]    >         at org.apache.curator.RetryLoop.callWithRetry(RetryLoop.java:105)
   [junit4]    >         at org.apache.curator.framework.imps.GetDataBuilderImpl.pathInForeground(GetDataBuilderImpl.java:288)
   [junit4]    >         at org.apache.curator.framework.imps.GetDataBuilderImpl.forPath(GetDataBuilderImpl.java:279)
   [junit4]    >         at org.apache.curator.framework.imps.GetDataBuilderImpl.forPath(GetDataBuilderImpl.java:41)
   [junit4]    >         at org.apache.curator.framework.recipes.shared.SharedValue.readValue(SharedValue.java:244)
   [junit4]    >         at org.apache.curator.framework.recipes.shared.SharedValue.access$100(SharedValue.java:44)
   [junit4]    >         at org.apache.curator.framework.recipes.shared.SharedValue$1.process(SharedValue.java:61)
   [junit4]    >         at org.apache.curator.framework.imps.NamespaceWatcher.process(NamespaceWatcher.java:67)
   [junit4]    >         at org.apache.zookeeper.ClientCnxn$EventThread.processEvent(ClientCnxn.java:530)
   [junit4]    >         at org.apache.zookeeper.ClientCnxn$EventThread.run(ClientCnxn.java:505)
   [junit4]    > 	at __randomizedtesting.SeedInfo.seed([CBEBA6F3A44483A9]:0)
   [junit4] Completed [564/765 (5!)] on J1 in 37.25s, 12 tests, 1 error <<< FAILURES!

[...truncated 44532 lines...]

Mime
View raw message