lucene-dev mailing list archives

Site index · List index
Message view « Date » · « Thread »
Top « Date » · « Thread »
From Policeman Jenkins Server <jenk...@thetaphi.de>
Subject [JENKINS-EA] Lucene-Solr-7.x-Linux (64bit/jdk-10-ea+32) - Build # 1048 - Still Unstable!
Date Mon, 25 Dec 2017 23:29:03 GMT
Build: https://jenkins.thetaphi.de/job/Lucene-Solr-7.x-Linux/1048/
Java: 64bit/jdk-10-ea+32 -XX:-UseCompressedOops -XX:+UseParallelGC

2 tests failed.
FAILED:  org.apache.solr.cloud.LegacyCloudClusterPropTest.testCreateCollectionSwitchLegacyCloud

Error Message:
Error from server at https://127.0.0.1:36815/solr: create the collection time out:180s

Stack Trace:
org.apache.solr.client.solrj.impl.HttpSolrClient$RemoteSolrException: Error from server at https://127.0.0.1:36815/solr: create the collection time out:180s
	at __randomizedtesting.SeedInfo.seed([C579D2B8092125A8:147E203DAD2EAE9A]:0)
	at org.apache.solr.client.solrj.impl.HttpSolrClient.executeMethod(HttpSolrClient.java:643)
	at org.apache.solr.client.solrj.impl.HttpSolrClient.request(HttpSolrClient.java:255)
	at org.apache.solr.client.solrj.impl.HttpSolrClient.request(HttpSolrClient.java:244)
	at org.apache.solr.client.solrj.impl.LBHttpSolrClient.doRequest(LBHttpSolrClient.java:483)
	at org.apache.solr.client.solrj.impl.LBHttpSolrClient.request(LBHttpSolrClient.java:413)
	at org.apache.solr.client.solrj.impl.CloudSolrClient.sendRequest(CloudSolrClient.java:1104)
	at org.apache.solr.client.solrj.impl.CloudSolrClient.requestWithRetryOnStaleState(CloudSolrClient.java:884)
	at org.apache.solr.client.solrj.impl.CloudSolrClient.request(CloudSolrClient.java:817)
	at org.apache.solr.client.solrj.SolrRequest.process(SolrRequest.java:194)
	at org.apache.solr.client.solrj.SolrRequest.process(SolrRequest.java:211)
	at org.apache.solr.cloud.LegacyCloudClusterPropTest.createAndTest(LegacyCloudClusterPropTest.java:86)
	at org.apache.solr.cloud.LegacyCloudClusterPropTest.testCreateCollectionSwitchLegacyCloud(LegacyCloudClusterPropTest.java:69)
	at java.base/jdk.internal.reflect.NativeMethodAccessorImpl.invoke0(Native Method)
	at java.base/jdk.internal.reflect.NativeMethodAccessorImpl.invoke(NativeMethodAccessorImpl.java:62)
	at java.base/jdk.internal.reflect.DelegatingMethodAccessorImpl.invoke(DelegatingMethodAccessorImpl.java:43)
	at java.base/java.lang.reflect.Method.invoke(Method.java:564)
	at com.carrotsearch.randomizedtesting.RandomizedRunner.invoke(RandomizedRunner.java:1737)
	at com.carrotsearch.randomizedtesting.RandomizedRunner$8.evaluate(RandomizedRunner.java:934)
	at com.carrotsearch.randomizedtesting.RandomizedRunner$9.evaluate(RandomizedRunner.java:970)
	at com.carrotsearch.randomizedtesting.RandomizedRunner$10.evaluate(RandomizedRunner.java:984)
	at com.carrotsearch.randomizedtesting.rules.SystemPropertiesRestoreRule$1.evaluate(SystemPropertiesRestoreRule.java:57)
	at org.apache.lucene.util.TestRuleSetupTeardownChained$1.evaluate(TestRuleSetupTeardownChained.java:49)
	at org.apache.lucene.util.AbstractBeforeAfterRule$1.evaluate(AbstractBeforeAfterRule.java:45)
	at org.apache.lucene.util.TestRuleThreadAndTestName$1.evaluate(TestRuleThreadAndTestName.java:48)
	at org.apache.lucene.util.TestRuleIgnoreAfterMaxFailures$1.evaluate(TestRuleIgnoreAfterMaxFailures.java:64)
	at org.apache.lucene.util.TestRuleMarkFailure$1.evaluate(TestRuleMarkFailure.java:47)
	at com.carrotsearch.randomizedtesting.rules.StatementAdapter.evaluate(StatementAdapter.java:36)
	at com.carrotsearch.randomizedtesting.ThreadLeakControl$StatementRunner.run(ThreadLeakControl.java:368)
	at com.carrotsearch.randomizedtesting.ThreadLeakControl.forkTimeoutingTask(ThreadLeakControl.java:817)
	at com.carrotsearch.randomizedtesting.ThreadLeakControl$3.evaluate(ThreadLeakControl.java:468)
	at com.carrotsearch.randomizedtesting.RandomizedRunner.runSingleTest(RandomizedRunner.java:943)
	at com.carrotsearch.randomizedtesting.RandomizedRunner$5.evaluate(RandomizedRunner.java:829)
	at com.carrotsearch.randomizedtesting.RandomizedRunner$6.evaluate(RandomizedRunner.java:879)
	at com.carrotsearch.randomizedtesting.RandomizedRunner$7.evaluate(RandomizedRunner.java:890)
	at com.carrotsearch.randomizedtesting.rules.StatementAdapter.evaluate(StatementAdapter.java:36)
	at com.carrotsearch.randomizedtesting.rules.SystemPropertiesRestoreRule$1.evaluate(SystemPropertiesRestoreRule.java:57)
	at org.apache.lucene.util.AbstractBeforeAfterRule$1.evaluate(AbstractBeforeAfterRule.java:45)
	at com.carrotsearch.randomizedtesting.rules.StatementAdapter.evaluate(StatementAdapter.java:36)
	at org.apache.lucene.util.TestRuleStoreClassName$1.evaluate(TestRuleStoreClassName.java:41)
	at com.carrotsearch.randomizedtesting.rules.NoShadowingOrOverridesOnMethodsRule$1.evaluate(NoShadowingOrOverridesOnMethodsRule.java:40)
	at com.carrotsearch.randomizedtesting.rules.NoShadowingOrOverridesOnMethodsRule$1.evaluate(NoShadowingOrOverridesOnMethodsRule.java:40)
	at com.carrotsearch.randomizedtesting.rules.StatementAdapter.evaluate(StatementAdapter.java:36)
	at com.carrotsearch.randomizedtesting.rules.StatementAdapter.evaluate(StatementAdapter.java:36)
	at org.apache.lucene.util.TestRuleAssertionsRequired$1.evaluate(TestRuleAssertionsRequired.java:53)
	at org.apache.lucene.util.TestRuleMarkFailure$1.evaluate(TestRuleMarkFailure.java:47)
	at org.apache.lucene.util.TestRuleIgnoreAfterMaxFailures$1.evaluate(TestRuleIgnoreAfterMaxFailures.java:64)
	at org.apache.lucene.util.TestRuleIgnoreTestSuites$1.evaluate(TestRuleIgnoreTestSuites.java:54)
	at com.carrotsearch.randomizedtesting.rules.StatementAdapter.evaluate(StatementAdapter.java:36)
	at com.carrotsearch.randomizedtesting.ThreadLeakControl$StatementRunner.run(ThreadLeakControl.java:368)
	at java.base/java.lang.Thread.run(Thread.java:844)


FAILED:  org.apache.solr.handler.TestReplicationHandler.doTestIndexAndConfigReplication

Error Message:
Index 0 out-of-bounds for length 0

Stack Trace:
java.lang.IndexOutOfBoundsException: Index 0 out-of-bounds for length 0
	at __randomizedtesting.SeedInfo.seed([C579D2B8092125A8:D13189ED2A2698B6]:0)
	at java.base/jdk.internal.util.Preconditions.outOfBounds(Preconditions.java:64)
	at java.base/jdk.internal.util.Preconditions.outOfBoundsCheckIndex(Preconditions.java:70)
	at java.base/jdk.internal.util.Preconditions.checkIndex(Preconditions.java:248)
	at java.base/java.util.Objects.checkIndex(Objects.java:372)
	at java.base/java.util.ArrayList.get(ArrayList.java:440)
	at org.apache.solr.handler.TestReplicationHandler.doTestIndexAndConfigReplication(TestReplicationHandler.java:561)
	at java.base/jdk.internal.reflect.NativeMethodAccessorImpl.invoke0(Native Method)
	at java.base/jdk.internal.reflect.NativeMethodAccessorImpl.invoke(NativeMethodAccessorImpl.java:62)
	at java.base/jdk.internal.reflect.DelegatingMethodAccessorImpl.invoke(DelegatingMethodAccessorImpl.java:43)
	at java.base/java.lang.reflect.Method.invoke(Method.java:564)
	at com.carrotsearch.randomizedtesting.RandomizedRunner.invoke(RandomizedRunner.java:1737)
	at com.carrotsearch.randomizedtesting.RandomizedRunner$8.evaluate(RandomizedRunner.java:934)
	at com.carrotsearch.randomizedtesting.RandomizedRunner$9.evaluate(RandomizedRunner.java:970)
	at com.carrotsearch.randomizedtesting.RandomizedRunner$10.evaluate(RandomizedRunner.java:984)
	at com.carrotsearch.randomizedtesting.rules.SystemPropertiesRestoreRule$1.evaluate(SystemPropertiesRestoreRule.java:57)
	at org.apache.lucene.util.TestRuleSetupTeardownChained$1.evaluate(TestRuleSetupTeardownChained.java:49)
	at org.apache.lucene.util.AbstractBeforeAfterRule$1.evaluate(AbstractBeforeAfterRule.java:45)
	at org.apache.lucene.util.TestRuleThreadAndTestName$1.evaluate(TestRuleThreadAndTestName.java:48)
	at org.apache.lucene.util.TestRuleIgnoreAfterMaxFailures$1.evaluate(TestRuleIgnoreAfterMaxFailures.java:64)
	at org.apache.lucene.util.TestRuleMarkFailure$1.evaluate(TestRuleMarkFailure.java:47)
	at com.carrotsearch.randomizedtesting.rules.StatementAdapter.evaluate(StatementAdapter.java:36)
	at com.carrotsearch.randomizedtesting.ThreadLeakControl$StatementRunner.run(ThreadLeakControl.java:368)
	at com.carrotsearch.randomizedtesting.ThreadLeakControl.forkTimeoutingTask(ThreadLeakControl.java:817)
	at com.carrotsearch.randomizedtesting.ThreadLeakControl$3.evaluate(ThreadLeakControl.java:468)
	at com.carrotsearch.randomizedtesting.RandomizedRunner.runSingleTest(RandomizedRunner.java:943)
	at com.carrotsearch.randomizedtesting.RandomizedRunner$5.evaluate(RandomizedRunner.java:829)
	at com.carrotsearch.randomizedtesting.RandomizedRunner$6.evaluate(RandomizedRunner.java:879)
	at com.carrotsearch.randomizedtesting.RandomizedRunner$7.evaluate(RandomizedRunner.java:890)
	at com.carrotsearch.randomizedtesting.rules.StatementAdapter.evaluate(StatementAdapter.java:36)
	at com.carrotsearch.randomizedtesting.rules.SystemPropertiesRestoreRule$1.evaluate(SystemPropertiesRestoreRule.java:57)
	at org.apache.lucene.util.AbstractBeforeAfterRule$1.evaluate(AbstractBeforeAfterRule.java:45)
	at com.carrotsearch.randomizedtesting.rules.StatementAdapter.evaluate(StatementAdapter.java:36)
	at org.apache.lucene.util.TestRuleStoreClassName$1.evaluate(TestRuleStoreClassName.java:41)
	at com.carrotsearch.randomizedtesting.rules.NoShadowingOrOverridesOnMethodsRule$1.evaluate(NoShadowingOrOverridesOnMethodsRule.java:40)
	at com.carrotsearch.randomizedtesting.rules.NoShadowingOrOverridesOnMethodsRule$1.evaluate(NoShadowingOrOverridesOnMethodsRule.java:40)
	at com.carrotsearch.randomizedtesting.rules.StatementAdapter.evaluate(StatementAdapter.java:36)
	at com.carrotsearch.randomizedtesting.rules.StatementAdapter.evaluate(StatementAdapter.java:36)
	at org.apache.lucene.util.TestRuleAssertionsRequired$1.evaluate(TestRuleAssertionsRequired.java:53)
	at org.apache.lucene.util.TestRuleMarkFailure$1.evaluate(TestRuleMarkFailure.java:47)
	at org.apache.lucene.util.TestRuleIgnoreAfterMaxFailures$1.evaluate(TestRuleIgnoreAfterMaxFailures.java:64)
	at org.apache.lucene.util.TestRuleIgnoreTestSuites$1.evaluate(TestRuleIgnoreTestSuites.java:54)
	at com.carrotsearch.randomizedtesting.rules.StatementAdapter.evaluate(StatementAdapter.java:36)
	at com.carrotsearch.randomizedtesting.ThreadLeakControl$StatementRunner.run(ThreadLeakControl.java:368)
	at java.base/java.lang.Thread.run(Thread.java:844)




Build Log:
[...truncated 12139 lines...]
   [junit4] Suite: org.apache.solr.cloud.LegacyCloudClusterPropTest
   [junit4]   2> 458054 INFO  (SUITE-LegacyCloudClusterPropTest-seed#[C579D2B8092125A8]-worker) [    ] o.a.s.SolrTestCaseJ4 SecureRandom sanity checks: test.solr.allowed.securerandom=null & java.security.egd=file:/dev/./urandom
   [junit4]   2> Creating dataDir: /home/jenkins/workspace/Lucene-Solr-7.x-Linux/solr/build/solr-core/test/J1/temp/solr.cloud.LegacyCloudClusterPropTest_C579D2B8092125A8-001/init-core-data-001
   [junit4]   2> 458055 WARN  (SUITE-LegacyCloudClusterPropTest-seed#[C579D2B8092125A8]-worker) [    ] o.a.s.SolrTestCaseJ4 startTrackingSearchers: numOpens=38 numCloses=38
   [junit4]   2> 458055 INFO  (SUITE-LegacyCloudClusterPropTest-seed#[C579D2B8092125A8]-worker) [    ] o.a.s.SolrTestCaseJ4 Using PointFields (NUMERIC_POINTS_SYSPROP=true) w/NUMERIC_DOCVALUES_SYSPROP=true
   [junit4]   2> 458055 INFO  (SUITE-LegacyCloudClusterPropTest-seed#[C579D2B8092125A8]-worker) [    ] o.a.s.SolrTestCaseJ4 Randomized ssl (true) and clientAuth (true) via: @org.apache.solr.util.RandomizeSSL(reason="", ssl=0.0/0.0, value=0.0/0.0, clientAuth=0.0/0.0)
   [junit4]   2> 458057 INFO  (SUITE-LegacyCloudClusterPropTest-seed#[C579D2B8092125A8]-worker) [    ] o.a.s.c.MiniSolrCloudCluster Starting cluster of 1 servers in /home/jenkins/workspace/Lucene-Solr-7.x-Linux/solr/build/solr-core/test/J1/temp/solr.cloud.LegacyCloudClusterPropTest_C579D2B8092125A8-001/tempDir-001
   [junit4]   2> 458057 INFO  (SUITE-LegacyCloudClusterPropTest-seed#[C579D2B8092125A8]-worker) [    ] o.a.s.c.ZkTestServer STARTING ZK TEST SERVER
   [junit4]   2> 458064 INFO  (Thread-579) [    ] o.a.s.c.ZkTestServer client port:0.0.0.0/0.0.0.0:0
   [junit4]   2> 458064 INFO  (Thread-579) [    ] o.a.s.c.ZkTestServer Starting server
   [junit4]   2> 458065 ERROR (Thread-579) [    ] o.a.z.s.ZooKeeperServer ZKShutdownHandler is not registered, so ZooKeeper server won't take any action on ERROR or SHUTDOWN server state changes
   [junit4]   2> 458164 INFO  (SUITE-LegacyCloudClusterPropTest-seed#[C579D2B8092125A8]-worker) [    ] o.a.s.c.ZkTestServer start zk server on port:40747
   [junit4]   2> 458168 INFO  (zkConnectionManagerCallback-649-thread-1) [    ] o.a.s.c.c.ConnectionManager zkClient has connected
   [junit4]   2> 458171 INFO  (jetty-launcher-646-thread-1) [    ] o.e.j.s.Server jetty-9.3.20.v20170531
   [junit4]   2> 458191 INFO  (jetty-launcher-646-thread-1) [    ] o.e.j.s.h.ContextHandler Started o.e.j.s.ServletContextHandler@603ed0f7{/solr,null,AVAILABLE}
   [junit4]   2> 458193 INFO  (jetty-launcher-646-thread-1) [    ] o.e.j.s.AbstractConnector Started ServerConnector@19ce7982{SSL,[ssl, http/1.1]}{127.0.0.1:?????}
   [junit4]   2> 458193 INFO  (jetty-launcher-646-thread-1) [    ] o.e.j.s.Server Started @??????ms
   [junit4]   2> 458193 INFO  (jetty-launcher-646-thread-1) [    ] o.a.s.c.s.e.JettySolrRunner Jetty properties: {hostContext=/solr, hostPort=36815}
   [junit4]   2> 458193 ERROR (jetty-launcher-646-thread-1) [    ] o.a.s.u.StartupLoggingUtils Missing Java Option solr.log.dir. Logging may be missing or incomplete.
   [junit4]   2> 458193 INFO  (jetty-launcher-646-thread-1) [    ] o.a.s.s.SolrDispatchFilter  ___      _       Welcome to Apache Solr? version 7.3.0
   [junit4]   2> 458193 INFO  (jetty-launcher-646-thread-1) [    ] o.a.s.s.SolrDispatchFilter / __| ___| |_ _   Starting in cloud mode on port null
   [junit4]   2> 458193 INFO  (jetty-launcher-646-thread-1) [    ] o.a.s.s.SolrDispatchFilter \__ \/ _ \ | '_|  Install dir: null
   [junit4]   2> 458193 INFO  (jetty-launcher-646-thread-1) [    ] o.a.s.s.SolrDispatchFilter |___/\___/_|_|    Start time: 2017-12-25T22:30:24.389938Z
   [junit4]   2> 458200 INFO  (zkConnectionManagerCallback-651-thread-1) [    ] o.a.s.c.c.ConnectionManager zkClient has connected
   [junit4]   2> 458201 INFO  (jetty-launcher-646-thread-1) [    ] o.a.s.s.SolrDispatchFilter solr.xml found in ZooKeeper. Loading...
   [junit4]   2> 458212 INFO  (jetty-launcher-646-thread-1) [    ] o.a.s.c.ZkContainer Zookeeper client=127.0.0.1:40747/solr
   [junit4]   2> 458215 INFO  (zkConnectionManagerCallback-655-thread-1) [    ] o.a.s.c.c.ConnectionManager zkClient has connected
   [junit4]   2> 458226 INFO  (zkConnectionManagerCallback-657-thread-1-processing-n:127.0.0.1:36815_solr) [n:127.0.0.1:36815_solr    ] o.a.s.c.c.ConnectionManager zkClient has connected
   [junit4]   2> 458260 INFO  (jetty-launcher-646-thread-1) [n:127.0.0.1:36815_solr    ] o.a.s.c.Overseer Overseer (id=null) closing
   [junit4]   2> 458261 INFO  (jetty-launcher-646-thread-1) [n:127.0.0.1:36815_solr    ] o.a.s.c.OverseerElectionContext I am going to be the leader 127.0.0.1:36815_solr
   [junit4]   2> 458261 INFO  (jetty-launcher-646-thread-1) [n:127.0.0.1:36815_solr    ] o.a.s.c.Overseer Overseer (id=99237299765968899-127.0.0.1:36815_solr-n_0000000000) starting
   [junit4]   2> 458267 INFO  (jetty-launcher-646-thread-1) [n:127.0.0.1:36815_solr    ] o.a.s.c.ZkController Register node as live in ZooKeeper:/live_nodes/127.0.0.1:36815_solr
   [junit4]   2> 458272 INFO  (zkCallback-656-thread-1-processing-n:127.0.0.1:36815_solr) [n:127.0.0.1:36815_solr    ] o.a.s.c.c.ZkStateReader Updated live nodes from ZooKeeper... (0) -> (1)
   [junit4]   2> 458296 INFO  (jetty-launcher-646-thread-1) [n:127.0.0.1:36815_solr    ] o.a.s.m.r.SolrJmxReporter JMX monitoring for 'solr_36815.solr.node' (registry 'solr.node') enabled at server: com.sun.jmx.mbeanserver.JmxMBeanServer@3fed3dbf
   [junit4]   2> 458301 INFO  (jetty-launcher-646-thread-1) [n:127.0.0.1:36815_solr    ] o.a.s.m.r.SolrJmxReporter JMX monitoring for 'solr_36815.solr.jvm' (registry 'solr.jvm') enabled at server: com.sun.jmx.mbeanserver.JmxMBeanServer@3fed3dbf
   [junit4]   2> 458301 INFO  (jetty-launcher-646-thread-1) [n:127.0.0.1:36815_solr    ] o.a.s.m.r.SolrJmxReporter JMX monitoring for 'solr_36815.solr.jetty' (registry 'solr.jetty') enabled at server: com.sun.jmx.mbeanserver.JmxMBeanServer@3fed3dbf
   [junit4]   2> 458301 INFO  (jetty-launcher-646-thread-1) [n:127.0.0.1:36815_solr    ] o.a.s.c.CorePropertiesLocator Found 0 core definitions underneath /home/jenkins/workspace/Lucene-Solr-7.x-Linux/solr/build/solr-core/test/J1/temp/solr.cloud.LegacyCloudClusterPropTest_C579D2B8092125A8-001/tempDir-001/node1/.
   [junit4]   2> 458313 INFO  (zkConnectionManagerCallback-661-thread-1) [    ] o.a.s.c.c.ConnectionManager zkClient has connected
   [junit4]   2> 458316 INFO  (zkConnectionManagerCallback-665-thread-1) [    ] o.a.s.c.c.ConnectionManager zkClient has connected
   [junit4]   2> 458316 INFO  (SUITE-LegacyCloudClusterPropTest-seed#[C579D2B8092125A8]-worker) [    ] o.a.s.c.c.ZkStateReader Updated live nodes from ZooKeeper... (0) -> (1)
   [junit4]   2> 458317 INFO  (SUITE-LegacyCloudClusterPropTest-seed#[C579D2B8092125A8]-worker) [    ] o.a.s.c.s.i.ZkClientClusterStateProvider Cluster at 127.0.0.1:40747/solr ready
   [junit4]   2> 458324 INFO  (TEST-LegacyCloudClusterPropTest.testCreateCollectionSwitchLegacyCloud-seed#[C579D2B8092125A8]) [    ] o.a.s.SolrTestCaseJ4 ###Starting testCreateCollectionSwitchLegacyCloud
   [junit4]   2> 458342 INFO  (qtp1889452164-2574) [n:127.0.0.1:36815_solr    ] o.a.s.h.a.CollectionsHandler Invoked Collection Action :clusterprop with params val=true&name=legacyCloud&action=CLUSTERPROP&wt=javabin&version=2 and sendToOCPQueue=true
   [junit4]   2> 458342 INFO  (qtp1889452164-2574) [n:127.0.0.1:36815_solr    ] o.a.s.s.HttpSolrCall [admin] webapp=null path=/admin/collections params={val=true&name=legacyCloud&action=CLUSTERPROP&wt=javabin&version=2} status=0 QTime=0
   [junit4]   2> 458344 INFO  (qtp1889452164-2579) [n:127.0.0.1:36815_solr    ] o.a.s.h.a.CollectionsHandler Invoked Collection Action :create with params replicationFactor=1&collection.configName=conf&maxShardsPerNode=1&name=legacyTrue&nrtReplicas=1&action=CREATE&numShards=1&wt=javabin&version=2 and sendToOCPQueue=true
   [junit4]   2> 458345 INFO  (OverseerThreadFactory-1003-thread-1-processing-n:127.0.0.1:36815_solr) [n:127.0.0.1:36815_solr    ] o.a.s.c.CreateCollectionCmd Create collection legacyTrue
   [junit4]   2> 458452 INFO  (qtp1889452164-2575) [n:127.0.0.1:36815_solr    ] o.a.s.h.a.CoreAdminOperation core create command qt=/admin/cores&collection.configName=conf&newCollection=true&name=legacyTrue_shard1_replica_n1&action=CREATE&numShards=1&collection=legacyTrue&shard=shard1&wt=javabin&version=2&replicaType=NRT
   [junit4]   2> 458452 INFO  (qtp1889452164-2575) [n:127.0.0.1:36815_solr    ] o.a.s.c.TransientSolrCoreCacheDefault Allocating transient cache for 2147483647 transient cores
   [junit4]   2> 458555 INFO  (zkCallback-656-thread-1-processing-n:127.0.0.1:36815_solr) [n:127.0.0.1:36815_solr    ] o.a.s.c.c.ZkStateReader A cluster state change: [WatchedEvent state:SyncConnected type:NodeDataChanged path:/collections/legacyTrue/state.json] for collection [legacyTrue] has occurred - updating... (live nodes size: [1])
   [junit4]   2> 459471 INFO  (qtp1889452164-2575) [n:127.0.0.1:36815_solr c:legacyTrue s:shard1  x:legacyTrue_shard1_replica_n1] o.a.s.c.SolrConfig Using Lucene MatchVersion: 7.3.0
   [junit4]   2> 459474 INFO  (qtp1889452164-2575) [n:127.0.0.1:36815_solr c:legacyTrue s:shard1  x:legacyTrue_shard1_replica_n1] o.a.s.s.IndexSchema [legacyTrue_shard1_replica_n1] Schema name=minimal
   [junit4]   2> 459476 INFO  (qtp1889452164-2575) [n:127.0.0.1:36815_solr c:legacyTrue s:shard1  x:legacyTrue_shard1_replica_n1] o.a.s.s.IndexSchema Loaded schema minimal/1.1 with uniqueid field id
   [junit4]   2> 459476 INFO  (qtp1889452164-2575) [n:127.0.0.1:36815_solr c:legacyTrue s:shard1  x:legacyTrue_shard1_replica_n1] o.a.s.c.CoreContainer Creating SolrCore 'legacyTrue_shard1_replica_n1' using configuration from collection legacyTrue, trusted=true
   [junit4]   2> 459476 INFO  (qtp1889452164-2575) [n:127.0.0.1:36815_solr c:legacyTrue s:shard1  x:legacyTrue_shard1_replica_n1] o.a.s.m.r.SolrJmxReporter JMX monitoring for 'solr_36815.solr.core.legacyTrue.shard1.replica_n1' (registry 'solr.core.legacyTrue.shard1.replica_n1') enabled at server: com.sun.jmx.mbeanserver.JmxMBeanServer@3fed3dbf
   [junit4]   2> 459477 INFO  (qtp1889452164-2575) [n:127.0.0.1:36815_solr c:legacyTrue s:shard1  x:legacyTrue_shard1_replica_n1] o.a.s.c.SolrCore solr.RecoveryStrategy.Builder
   [junit4]   2> 459477 INFO  (qtp1889452164-2575) [n:127.0.0.1:36815_solr c:legacyTrue s:shard1  x:legacyTrue_shard1_replica_n1] o.a.s.c.SolrCore [[legacyTrue_shard1_replica_n1] ] Opening new SolrCore at [/home/jenkins/workspace/Lucene-Solr-7.x-Linux/solr/build/solr-core/test/J1/temp/solr.cloud.LegacyCloudClusterPropTest_C579D2B8092125A8-001/tempDir-001/node1/legacyTrue_shard1_replica_n1], dataDir=[/home/jenkins/workspace/Lucene-Solr-7.x-Linux/solr/build/solr-core/test/J1/temp/solr.cloud.LegacyCloudClusterPropTest_C579D2B8092125A8-001/tempDir-001/node1/./legacyTrue_shard1_replica_n1/data/]
   [junit4]   2> 459509 INFO  (qtp1889452164-2575) [n:127.0.0.1:36815_solr c:legacyTrue s:shard1  x:legacyTrue_shard1_replica_n1] o.a.s.u.UpdateHandler Using UpdateLog implementation: org.apache.solr.update.UpdateLog
   [junit4]   2> 459509 INFO  (qtp1889452164-2575) [n:127.0.0.1:36815_solr c:legacyTrue s:shard1  x:legacyTrue_shard1_replica_n1] o.a.s.u.UpdateLog Initializing UpdateLog: dataDir=null defaultSyncLevel=FLUSH numRecordsToKeep=100 maxNumLogsToKeep=10 numVersionBuckets=65536
   [junit4]   2> 459510 INFO  (qtp1889452164-2575) [n:127.0.0.1:36815_solr c:legacyTrue s:shard1  x:legacyTrue_shard1_replica_n1] o.a.s.u.CommitTracker Hard AutoCommit: disabled
   [junit4]   2> 459510 INFO  (qtp1889452164-2575) [n:127.0.0.1:36815_solr c:legacyTrue s:shard1  x:legacyTrue_shard1_replica_n1] o.a.s.u.CommitTracker Soft AutoCommit: disabled
   [junit4]   2> 459511 INFO  (qtp1889452164-2575) [n:127.0.0.1:36815_solr c:legacyTrue s:shard1  x:legacyTrue_shard1_replica_n1] o.a.s.s.SolrIndexSearcher Opening [Searcher@34d7a38b[legacyTrue_shard1_replica_n1] main]
   [junit4]   2> 459511 INFO  (qtp1889452164-2575) [n:127.0.0.1:36815_solr c:legacyTrue s:shard1  x:legacyTrue_shard1_replica_n1] o.a.s.r.ManagedResourceStorage Configured ZooKeeperStorageIO with znodeBase: /configs/conf
   [junit4]   2> 459511 INFO  (qtp1889452164-2575) [n:127.0.0.1:36815_solr c:legacyTrue s:shard1  x:legacyTrue_shard1_replica_n1] o.a.s.r.ManagedResourceStorage Loaded null at path _rest_managed.json using ZooKeeperStorageIO:path=/configs/conf
   [junit4]   2> 459512 INFO  (qtp1889452164-2575) [n:127.0.0.1:36815_solr c:legacyTrue s:shard1  x:legacyTrue_shard1_replica_n1] o.a.s.h.ReplicationHandler Commits will be reserved for 10000ms.
   [junit4]   2> 459512 INFO  (searcherExecutor-1006-thread-1-processing-n:127.0.0.1:36815_solr x:legacyTrue_shard1_replica_n1 s:shard1 c:legacyTrue) [n:127.0.0.1:36815_solr c:legacyTrue s:shard1  x:legacyTrue_shard1_replica_n1] o.a.s.c.SolrCore [legacyTrue_shard1_replica_n1] Registered new searcher Searcher@34d7a38b[legacyTrue_shard1_replica_n1] main{ExitableDirectoryReader(UninvertingDirectoryReader())}
   [junit4]   2> 459512 INFO  (qtp1889452164-2575) [n:127.0.0.1:36815_solr c:legacyTrue s:shard1  x:legacyTrue_shard1_replica_n1] o.a.s.u.UpdateLog Could not find max version in index or recent updates, using new clock 1587796797772791808
   [junit4]   2> 459515 INFO  (qtp1889452164-2575) [n:127.0.0.1:36815_solr c:legacyTrue s:shard1  x:legacyTrue_shard1_replica_n1] o.a.s.c.ShardLeaderElectionContext Enough replicas found to continue.
   [junit4]   2> 459515 INFO  (qtp1889452164-2575) [n:127.0.0.1:36815_solr c:legacyTrue s:shard1  x:legacyTrue_shard1_replica_n1] o.a.s.c.ShardLeaderElectionContext I may be the new leader - try and sync
   [junit4]   2> 459515 INFO  (qtp1889452164-2575) [n:127.0.0.1:36815_solr c:legacyTrue s:shard1  x:legacyTrue_shard1_replica_n1] o.a.s.c.SyncStrategy Sync replicas to https://127.0.0.1:36815/solr/legacyTrue_shard1_replica_n1/
   [junit4]   2> 459515 INFO  (qtp1889452164-2575) [n:127.0.0.1:36815_solr c:legacyTrue s:shard1  x:legacyTrue_shard1_replica_n1] o.a.s.c.SyncStrategy Sync Success - now sync replicas to me
   [junit4]   2> 459515 INFO  (qtp1889452164-2575) [n:127.0.0.1:36815_solr c:legacyTrue s:shard1  x:legacyTrue_shard1_replica_n1] o.a.s.c.SyncStrategy https://127.0.0.1:36815/solr/legacyTrue_shard1_replica_n1/ has no replicas
   [junit4]   2> 459515 INFO  (qtp1889452164-2575) [n:127.0.0.1:36815_solr c:legacyTrue s:shard1  x:legacyTrue_shard1_replica_n1] o.a.s.c.ShardLeaderElectionContext Found all replicas participating in election, clear LIR
   [junit4]   2> 459516 INFO  (qtp1889452164-2575) [n:127.0.0.1:36815_solr c:legacyTrue s:shard1  x:legacyTrue_shard1_replica_n1] o.a.s.c.ShardLeaderElectionContext I am the new leader: https://127.0.0.1:36815/solr/legacyTrue_shard1_replica_n1/ shard1
   [junit4]   2> 638345 ERROR (qtp1889452164-2579) [n:127.0.0.1:36815_solr    ] o.a.s.h.RequestHandlerBase org.apache.solr.common.SolrException: create the collection time out:180s
   [junit4]   2> 	at org.apache.solr.handler.admin.CollectionsHandler.handleResponse(CollectionsHandler.java:314)
   [junit4]   2> 	at org.apache.solr.handler.admin.CollectionsHandler.invokeAction(CollectionsHandler.java:246)
   [junit4]   2> 	at org.apache.solr.handler.admin.CollectionsHandler.handleRequestBody(CollectionsHandler.java:224)
   [junit4]   2> 	at org.apache.solr.handler.RequestHandlerBase.handleRequest(RequestHandlerBase.java:177)
   [junit4]   2> 	at org.apache.solr.servlet.HttpSolrCall.handleAdmin(HttpSolrCall.java:736)
   [junit4]   2> 	at org.apache.solr.servlet.HttpSolrCall.handleAdminRequest(HttpSolrCall.java:717)
   [junit4]   2> 	at org.apache.solr.servlet.HttpSolrCall.call(HttpSolrCall.java:498)
   [junit4]   2> 	at org.apache.solr.servlet.SolrDispatchFilter.doFilter(SolrDispatchFilter.java:382)
   [junit4]   2> 	at org.apache.solr.servlet.SolrDispatchFilter.doFilter(SolrDispatchFilter.java:326)
   [junit4]   2> 	at org.eclipse.jetty.servlet.ServletHandler$CachedChain.doFilter(ServletHandler.java:1759)
   [junit4]   2> 	at org.apache.solr.client.solrj.embedded.JettySolrRunner$DebugFilter.doFilter(JettySolrRunner.java:139)
   [junit4]   2> 	at org.eclipse.jetty.servlet.ServletHandler$CachedChain.doFilter(ServletHandler.java:1759)
   [junit4]   2> 	at org.eclipse.jetty.servlet.ServletHandler.doHandle(ServletHandler.java:582)
   [junit4]   2> 	at org.eclipse.jetty.server.session.SessionHandler.doHandle(SessionHandler.java:224)
   [junit4]   2> 	at org.eclipse.jetty.server.handler.ContextHandler.doHandle(ContextHandler.java:1180)
   [junit4]   2> 	at org.eclipse.jetty.servlet.ServletHandler.doScope(ServletHandler.java:512)
   [junit4]   2> 	at org.eclipse.jetty.server.session.SessionHandler.doScope(SessionHandler.java:185)
   [junit4]   2> 	at org.eclipse.jetty.server.handler.ContextHandler.doScope(ContextHandler.java:1112)
   [junit4]   2> 	at org.eclipse.jetty.server.handler.ScopedHandler.handle(ScopedHandler.java:141)
   [junit4]   2> 	at org.eclipse.jetty.server.handler.gzip.GzipHandler.handle(GzipHandler.java:493)
   [junit4]   2> 	at org.eclipse.jetty.server.handler.HandlerWrapper.handle(HandlerWrapper.java:134)
   [junit4]   2> 	at org.eclipse.jetty.server.Server.handle(Server.java:534)
   [junit4]   2> 	at org.eclipse.jetty.server.HttpChannel.handle(HttpChannel.java:320)
   [junit4]   2> 	at org.eclipse.jetty.server.HttpConnection.onFillable(HttpConnection.java:251)
   [junit4]   2> 	at org.eclipse.jetty.io.AbstractConnection$ReadCallback.succeeded(AbstractConnection.java:283)
   [junit4]   2> 	at org.eclipse.jetty.io.FillInterest.fillable(FillInterest.java:108)
   [junit4]   2> 	at org.eclipse.jetty.io.ssl.SslConnection.onFillable(SslConnection.java:251)
   [junit4]   2> 	at org.eclipse.jetty.io.AbstractConnection$ReadCallback.succeeded(AbstractConnection.java:283)
   [junit4]   2> 	at org.eclipse.jetty.io.FillInterest.fillable(FillInterest.java:108)
   [junit4]   2> 	at org.eclipse.jetty.io.SelectChannelEndPoint$2.run(SelectChannelEndPoint.java:93)
   [junit4]   2> 	at org.eclipse.jetty.util.thread.strategy.ExecuteProduceConsume.executeProduceConsume(ExecuteProduceConsume.java:303)
   [junit4]   2> 	at org.eclipse.jetty.util.thread.strategy.ExecuteProduceConsume.produceConsume(ExecuteProduceConsume.java:148)
   [junit4]   2> 	at org.eclipse.jetty.util.thread.strategy.ExecuteProduceConsume.run(ExecuteProduceConsume.java:136)
   [junit4]   2> 	at org.eclipse.jetty.util.thread.QueuedThreadPool.runJob(QueuedThreadPool.java:671)
   [junit4]   2> 	at org.eclipse.jetty.util.thread.QueuedThreadPool$2.run(QueuedThreadPool.java:589)
   [junit4]   2> 	at java.base/java.lang.Thread.run(Thread.java:844)
   [junit4]   2> 
   [junit4]   2> 638345 INFO  (qtp1889452164-2579) [n:127.0.0.1:36815_solr    ] o.a.s.s.HttpSolrCall [admin] webapp=null path=/admin/collections params={replicationFactor=1&collection.configName=conf&maxShardsPerNode=1&name=legacyTrue&nrtReplicas=1&action=CREATE&numShards=1&wt=javabin&version=2} status=500 QTime=180001
   [junit4]   2> 638346 ERROR (qtp1889452164-2579) [n:127.0.0.1:36815_solr    ] o.a.s.s.HttpSolrCall null:org.apache.solr.common.SolrException: create the collection time out:180s
   [junit4]   2> 	at org.apache.solr.handler.admin.CollectionsHandler.handleResponse(CollectionsHandler.java:314)
   [junit4]   2> 	at org.apache.solr.handler.admin.CollectionsHandler.invokeAction(CollectionsHandler.java:246)
   [junit4]   2> 	at org.apache.solr.handler.admin.CollectionsHandler.handleRequestBody(CollectionsHandler.java:224)
   [junit4]   2> 	at org.apache.solr.handler.RequestHandlerBase.handleRequest(RequestHandlerBase.java:177)
   [junit4]   2> 	at org.apache.solr.servlet.HttpSolrCall.handleAdmin(HttpSolrCall.java:736)
   [junit4]   2> 	at org.apache.solr.servlet.HttpSolrCall.handleAdminRequest(HttpSolrCall.java:717)
   [junit4]   2> 	at org.apache.solr.servlet.HttpSolrCall.call(HttpSolrCall.java:498)
   [junit4]   2> 	at org.apache.solr.servlet.SolrDispatchFilter.doFilter(SolrDispatchFilter.java:382)
   [junit4]   2> 	at org.apache.solr.servlet.SolrDispatchFilter.doFilter(SolrDispatchFilter.java:326)
   [junit4]   2> 	at org.eclipse.jetty.servlet.ServletHandler$CachedChain.doFilter(ServletHandler.java:1759)
   [junit4]   2> 	at org.apache.solr.client.solrj.embedded.JettySolrRunner$DebugFilter.doFilter(JettySolrRunner.java:139)
   [junit4]   2> 	at org.eclipse.jetty.servlet.ServletHandler$CachedChain.doFilter(ServletHandler.java:1759)
   [junit4]   2> 	at org.eclipse.jetty.servlet.ServletHandler.doHandle(ServletHandler.java:582)
   [junit4]   2> 	at org.eclipse.jetty.server.session.SessionHandler.doHandle(SessionHandler.java:224)
   [junit4]   2> 	at org.eclipse.jetty.server.handler.ContextHandler.doHandle(ContextHandler.java:1180)
   [junit4]   2> 	at org.eclipse.jetty.servlet.ServletHandler.doScope(ServletHandler.java:512)
   [junit4]   2> 	at org.eclipse.jetty.server.session.SessionHandler.doScope(SessionHandler.java:185)
   [junit4]   2> 	at org.eclipse.jetty.server.handler.ContextHandler.doScope(ContextHandler.java:1112)
   [junit4]   2> 	at org.eclipse.jetty.server.handler.ScopedHandler.handle(ScopedHandler.java:141)
   [junit4]   2> 	at org.eclipse.jetty.server.handler.gzip.GzipHandler.handle(GzipHandler.java:493)
   [junit4]   2> 	at org.eclipse.jetty.server.handler.HandlerWrapper.handle(HandlerWrapper.java:134)
   [junit4]   2> 	at org.eclipse.jetty.server.Server.handle(Server.java:534)
   [junit4]   2> 	at org.eclipse.jetty.server.HttpChannel.handle(HttpChannel.java:320)
   [junit4]   2> 	at org.eclipse.jetty.server.HttpConnection.onFillable(HttpConnection.java:251)
   [junit4]   2> 	at org.eclipse.jetty.io.AbstractConnection$ReadCallback.succeeded(AbstractConnection.java:283)
   [junit4]   2> 	at org.eclipse.jetty.io.FillInterest.fillable(FillInterest.java:108)
   [junit4]   2> 	at org.eclipse.jetty.io.ssl.SslConnection.onFillable(SslConnection.java:251)
   [junit4]   2> 	at org.eclipse.jetty.io.AbstractConnection$ReadCallback.succeeded(AbstractConnection.java:283)
   [junit4]   2> 	at org.eclipse.jetty.io.FillInterest.fillable(FillInterest.java:108)
   [junit4]   2> 	at org.eclipse.jetty.io.SelectChannelEndPoint$2.run(SelectChannelEndPoint.java:93)
   [junit4]   2> 	at org.eclipse.jetty.util.thread.strategy.ExecuteProduceConsume.executeProduceConsume(ExecuteProduceConsume.java:303)
   [junit4]   2> 	at org.eclipse.jetty.util.thread.strategy.ExecuteProduceConsume.produceConsume(ExecuteProduceConsume.java:148)
   [junit4]   2> 	at org.eclipse.jetty.util.thread.strategy.ExecuteProduceConsume.run(ExecuteProduceConsume.java:136)
   [junit4]   2> 	at org.eclipse.jetty.util.thread.QueuedThreadPool.runJob(QueuedThreadPool.java:671)
   [junit4]   2> 	at org.eclipse.jetty.util.thread.QueuedThreadPool$2.run(QueuedThreadPool.java:589)
   [junit4]   2> 	at java.base/java.lang.Thread.run(Thread.java:844)
   [junit4]   2> 
   [junit4]   2> 638346 INFO  (TEST-LegacyCloudClusterPropTest.testCreateCollectionSwitchLegacyCloud-seed#[C579D2B8092125A8]) [    ] o.a.s.SolrTestCaseJ4 ###Ending testCreateCollectionSwitchLegacyCloud
   [junit4]   2> NOTE: reproduce with: ant test  -Dtestcase=LegacyCloudClusterPropTest -Dtests.method=testCreateCollectionSwitchLegacyCloud -Dtests.seed=C579D2B8092125A8 -Dtests.multiplier=3 -Dtests.slow=true -Dtests.locale=ar-DJ -Dtests.timezone=Europe/Gibraltar -Dtests.asserts=true -Dtests.file.encoding=US-ASCII
   [junit4] ERROR    180s J1 | LegacyCloudClusterPropTest.testCreateCollectionSwitchLegacyCloud <<<
   [junit4]    > Throwable #1: org.apache.solr.client.solrj.impl.HttpSolrClient$RemoteSolrException: Error from server at https://127.0.0.1:36815/solr: create the collection time out:180s
   [junit4]    > 	at __randomizedtesting.SeedInfo.seed([C579D2B8092125A8:147E203DAD2EAE9A]:0)
   [junit4]    > 	at org.apache.solr.client.solrj.impl.HttpSolrClient.executeMethod(HttpSolrClient.java:643)
   [junit4]    > 	at org.apache.solr.client.solrj.impl.HttpSolrClient.request(HttpSolrClient.java:255)
   [junit4]    > 	at org.apache.solr.client.solrj.impl.HttpSolrClient.request(HttpSolrClient.java:244)
   [junit4]    > 	at org.apache.solr.client.solrj.impl.LBHttpSolrClient.doRequest(LBHttpSolrClient.java:483)
   [junit4]    > 	at org.apache.solr.client.solrj.impl.LBHttpSolrClient.request(LBHttpSolrClient.java:413)
   [junit4]    > 	at org.apache.solr.client.solrj.impl.CloudSolrClient.sendRequest(CloudSolrClient.java:1104)
   [junit4]    > 	at org.apache.solr.client.solrj.impl.CloudSolrClient.requestWithRetryOnStaleState(CloudSolrClient.java:884)
   [junit4]    > 	at org.apache.solr.client.solrj.impl.CloudSolrClient.request(CloudSolrClient.java:817)
   [junit4]    > 	at org.apache.solr.client.solrj.SolrRequest.process(SolrRequest.java:194)
   [junit4]    > 	at org.apache.solr.client.solrj.SolrRequest.process(SolrRequest.java:211)
   [junit4]    > 	at org.apache.solr.cloud.LegacyCloudClusterPropTest.createAndTest(LegacyCloudClusterPropTest.java:86)
   [junit4]    > 	at org.apache.solr.cloud.LegacyCloudClusterPropTest.testCreateCollectionSwitchLegacyCloud(LegacyCloudClusterPropTest.java:69)
   [junit4]    > 	at java.base/jdk.internal.reflect.NativeMethodAccessorImpl.invoke0(Native Method)
   [junit4]    > 	at java.base/jdk.internal.reflect.NativeMethodAccessorImpl.invoke(NativeMethodAccessorImpl.java:62)
   [junit4]    > 	at java.base/jdk.internal.reflect.DelegatingMethodAccessorImpl.invoke(DelegatingMethodAccessorImpl.java:43)
   [junit4]    > 	at java.base/java.lang.reflect.Method.invoke(Method.java:564)
   [junit4]    > 	at java.base/java.lang.Thread.run(Thread.java:844)
   [junit4]   2> 638350 INFO  (jetty-closer-647-thread-1) [    ] o.e.j.s.AbstractConnector Stopped ServerConnector@19ce7982{SSL,[ssl, http/1.1]}{127.0.0.1:?}
   [junit4]   2> 638350 INFO  (jetty-closer-647-thread-1) [    ] o.a.s.c.CoreContainer Shutting down CoreContainer instance=1170076019
   [junit4]   2> 638350 INFO  (jetty-closer-647-thread-1) [    ] o.a.s.m.SolrMetricManager Closing metric reporters for registry=solr.node, tag=null
   [junit4]   2> 638350 INFO  (jetty-closer-647-thread-1) [    ] o.a.s.m.r.SolrJmxReporter Closing reporter [org.apache.solr.metrics.reporters.SolrJmxReporter@483943a3: rootName = solr_36815, domain = solr.node, service url = null, agent id = null] for registry solr.node / com.codahale.metrics.MetricRegistry@7b659f8c
   [junit4]   2> 638351 ERROR (OverseerThreadFactory-1003-thread-1-processing-n:127.0.0.1:36815_solr) [n:127.0.0.1:36815_solr    ] o.a.s.c.OverseerCollectionMessageHandler Error from shard: https://127.0.0.1:36815/solr
   [junit4]   2> org.apache.solr.client.solrj.SolrServerException: IOException occured when talking to server at: https://127.0.0.1:36815/solr
   [junit4]   2> 	at org.apache.solr.client.solrj.impl.HttpSolrClient.executeMethod(HttpSolrClient.java:657)
   [junit4]   2> 	at org.apache.solr.client.solrj.impl.HttpSolrClient.request(HttpSolrClient.java:255)
   [junit4]   2> 	at org.apache.solr.client.solrj.impl.HttpSolrClient.request(HttpSolrClient.java:244)
   [junit4]   2> 	at org.apache.solr.client.solrj.SolrClient.request(SolrClient.java:1219)
   [junit4]   2> 	at org.apache.solr.handler.component.HttpShardHandler.lambda$submit$0(HttpShardHandler.java:172)
   [junit4]   2> 	at java.base/java.util.concurrent.FutureTask.run(FutureTask.java:264)
   [junit4]   2> 	at java.base/java.util.concurrent.Executors$RunnableAdapter.call(Executors.java:514)
   [junit4]   2> 	at java.base/java.util.concurrent.FutureTask.run(FutureTask.java:264)
   [junit4]   2> 	at com.codahale.metrics.InstrumentedExecutorService$InstrumentedRunnable.run(InstrumentedExecutorService.java:176)
   [junit4]   2> 	at org.apache.solr.common.util.ExecutorUtil$MDCAwareThreadPoolExecutor.lambda$execute$0(ExecutorUtil.java:188)
   [junit4]   2> 	at java.base/java.util.concurrent.ThreadPoolExecutor.runWorker(ThreadPoolExecutor.java:1135)
   [junit4]   2> 	at java.base/java.util.concurrent.ThreadPoolExecutor$Worker.run(ThreadPoolExecutor.java:635)
   [junit4]   2> 	at java.base/java.lang.Thread.run(Thread.java:844)
   [junit4]   2> Caused by: org.apache.http.NoHttpResponseException: 127.0.0.1:36815 failed to respond
   [junit4]   2> 	at org.apache.http.impl.conn.DefaultHttpResponseParser.parseHead(DefaultHttpResponseParser.java:141)
   [junit4]   2> 	at org.apache.http.impl.conn.DefaultHttpResponseParser.parseHead(DefaultHttpResponseParser.java:56)
   [junit4]   2> 	at org.apache.http.impl.io.AbstractMessageParser.parse(AbstractMessageParser.java:259)
   [junit4]   2> 	at org.apache.http.impl.DefaultBHttpClientConnection.receiveResponseHeader(DefaultBHttpClientConnection.java:163)
   [junit4]   2> 	at org.apache.http.impl.conn.CPoolProxy.receiveResponseHeader(CPoolProxy.java:165)
   [junit4]   2> 	at org.apache.http.protocol.HttpRequestExecutor.doReceiveResponse(HttpRequestExecutor.java:273)
   [junit4]   2> 	at org.apache.http.protocol.HttpRequestExecutor.execute(HttpRequestExecutor.java:125)
   [junit4]   2> 	at org.apache.solr.util.stats.InstrumentedHttpRequestExecutor.execute(InstrumentedHttpRequestExecutor.java:118)
   [junit4]   2> 	at org.apache.http.impl.execchain.MainClientExec.execute(MainClientExec.java:272)
   [junit4]   2> 	at org.apache.http.impl.execchain.ProtocolExec.execute(ProtocolExec.java:185)
   [junit4]   2> 	at org.apache.http.impl.execchain.RetryExec.execute(RetryExec.java:89)
   [junit4]   2> 	at org.apache.http.impl.execchain.RedirectExec.execute(RedirectExec.java:111)
   [junit4]   2> 	at org.apache.http.impl.client.InternalHttpClient.doExecute(InternalHttpClient.java:185)
   [junit4]   2> 	at org.apache.http.impl.client.CloseableHttpClient.execute(CloseableHttpClient.java:83)
   [junit4]   2> 	at org.apache.http.impl.client.CloseableHttpClient.execute(CloseableHttpClient.java:56)
   [junit4]   2> 	at org.apache.solr.client.solrj.impl.HttpSolrClient.executeMethod(HttpSolrClient.java:542)
   [junit4]   2> 	... 12 more
   [junit4]   2> 638352 ERROR (OverseerThreadFactory-1003-thread-1-processing-n:127.0.0.1:36815_solr) [n:127.0.0.1:36815_solr    ] o.a.s.c.OverseerCollectionMessageHandler Cleaning up collection [legacyTrue].
   [junit4]   2> 638352 INFO  (OverseerThreadFactory-1003-thread-1-processing-n:127.0.0.1:36815_solr) [n:127.0.0.1:36815_solr    ] o.a.s.c.OverseerCollectionMessageHandler Executing Collection Cmd : action=UNLOAD&deleteInstanceDir=true&deleteDataDir=true
   [junit4]   2> 638352 ERROR (OverseerThreadFactory-1003-thread-1-processing-n:127.0.0.1:36815_solr) [n:127.0.0.1:36815_solr    ] o.a.s.c.OverseerCollectionMessageHandler Error from shard: https://127.0.0.1:36815/solr
   [junit4]   2> org.apache.solr.client.solrj.SolrServerException: Server refused connection at: https://127.0.0.1:36815/solr
   [junit4]   2> 	at org.apache.solr.client.solrj.impl.HttpSolrClient.executeMethod(HttpSolrClient.java:650)
   [junit4]   2> 	at org.apache.solr.client.solrj.impl.HttpSolrClient.request(HttpSolrClient.java:255)
   [junit4]   2> 	at org.apache.solr.client.solrj.impl.HttpSolrClient.request(HttpSolrClient.java:244)
   [junit4]   2> 	at org.apache.solr.client.solrj.SolrClient.request(SolrClient.java:1219)
   [junit4]   2> 	at org.apache.solr.handler.component.HttpShardHandler.lambda$submit$0(HttpShardHandler.java:172)
   [junit4]   2> 	at java.base/java.util.concurrent.FutureTask.run(FutureTask.java:264)
   [junit4]   2> 	at java.base/java.util.concurrent.Executors$RunnableAdapter.call(Executors.java:514)
   [junit4]   2> 	at java.base/java.util.concurrent.FutureTask.run(FutureTask.java:264)
   [junit4]   2> 	at com.codahale.metrics.InstrumentedExecutorService$InstrumentedRunnable.run(InstrumentedExecutorService.java:176)
   [junit4]   2> 	at org.apache.solr.common.util.ExecutorUtil$MDCAwareThreadPoolExecutor.lambda$execute$0(ExecutorUtil.java:188)
   [junit4]   2> 	at java.base/java.util.concurrent.ThreadPoolExecutor.runWorker(ThreadPoolExecutor.java:1135)
   [junit4]   2> 	at java.base/java.util.concurrent.ThreadPoolExecutor$Worker.run(ThreadPoolExecutor.java:635)
   [junit4]   2> 	at java.base/java.lang.Thread.run(Thread.java:844)
   [junit4]   2> Caused by: org.apache.http.conn.HttpHostConnectException: Connect to 127.0.0.1:36815 [/127.0.0.1] failed: Connection refused (Connection refused)
   [junit4]   2> 	at org.apache.http.impl.conn.DefaultHttpClientConnectionOperator.connect(DefaultHttpClientConnectionOperator.java:159)
   [junit4]   2> 	at org.apache.http.impl.conn.PoolingHttpClientConnectionManager.connect(PoolingHttpClientConnectionManager.java:359)
   [junit4]   2> 	at org.apache.http.impl.execchain.MainClientExec.establishRoute(MainClientExec.java:381)
   [junit4]   2> 	at org.apache.http.impl.execchain.MainClientExec.execute(MainClientExec.java:237)
   [junit4]   2> 	at org.apache.http.impl.execchain.ProtocolExec.execute(ProtocolExec.java:185)
   [junit4]   2> 	at org.apache.http.impl.execchain.RetryExec.execute(RetryExec.java:89)
   [junit4]   2> 	at org.apache.http.impl.execchain.RedirectExec.execute(RedirectExec.java:111)
   [junit4]   2> 	at org.apache.http.impl.client.InternalHttpClient.doExecute(InternalHttpClient.java:185)
   [junit4]   2> 	at org.apache.http.impl.client.CloseableHttpClient.execute(CloseableHttpClient.java:83)
   [junit4]   2> 	at org.apache.http.impl.client.CloseableHttpClient.execute(CloseableHttpClient.java:56)
   [junit4]   2> 	at org.apache.solr.client.solrj.impl.HttpSolrClient.executeMethod(HttpSolrClient.java:542)
   [junit4]   2> 	... 12 more
   [junit4]   2> Caused by: java.net.ConnectException: Connection refused (Connection refused)
   [junit4]   2> 	at java.base/java.net.PlainSocketImpl.socketConnect(Native Method)
   [junit4]   2> 	at java.base/java.net.AbstractPlainSocketImpl.doConnect(AbstractPlainSocketImpl.java:400)
   [junit4]   2> 	at java.base/java.net.AbstractPlainSocketImpl.connectToAddress(AbstractPlainSocketImpl.java:243)
   [junit4]   2> 	at java.base/java.net.AbstractPlainSocketImpl.connect(AbstractPlainSocketImpl.java:225)
   [junit4]   2> 	at java.base/java.net.SocksSocketImpl.connect(SocksSocketImpl.java:402)
   [junit4]   2> 	at java.base/java.net.Socket.connect(Socket.java:591)
   [junit4]   2> 	at org.apache.http.conn.ssl.SSLConnectionSocketFactory.connectSocket(SSLConnectionSocketFactory.java:339)
   [junit4]   2> 	at org.apache.http.impl.conn.DefaultHttpClientConnectionOperator.connect(DefaultHttpClientConnectionOperator.java:142)
   [junit4]   2> 	... 22 more
   [junit4]   2> 638354 INFO  (jetty-closer-647-thread-1) [    ] o.a.s.m.SolrMetricManager Closing metric reporters for registry=solr.jvm, tag=null
   [junit4]   2> 638354 INFO  (jetty-closer-647-thread-1) [    ] o.a.s.m.r.SolrJmxReporter Closing reporter [org.apache.solr.metrics.reporters.SolrJmxReporter@1645b270: rootName = solr_36815, domain = solr.jvm, service url = null, agent id = null] for registry solr.jvm / com.codahale.metrics.MetricRegistry@29b33ab6
   [junit4]   2> 638356 INFO  (jetty-closer-647-thread-1) [    ] o.a.s.m.SolrMetricManager Closing metric reporters for registry=solr.jetty, tag=null
   [junit4]   2> 638356 INFO  (jetty-closer-647-thread-1) [    ] o.a.s.m.r.SolrJmxReporter Closing reporter [org.apache.solr.metrics.reporters.SolrJmxReporter@bc48d6b: rootName = solr_36815, domain = solr.jetty, service url = null, agent id = null] for registry solr.jetty / com.codahale.metrics.MetricRegistry@2d8cbb58
   [junit4]   2> 638357 INFO  (jetty-closer-647-thread-1) [    ] o.a.s.c.ZkController Remove node as live in ZooKeeper:/live_nodes/127.0.0.1:36815_solr
   [junit4]   2> 638357 INFO  (jetty-closer-647-thread-1) [    ] o.a.s.m.SolrMetricManager Closing metric reporters for registry=solr.cluster, tag=null
   [junit4]   2> 638357 INFO  (zkCallback-656-thread-4-processing-n:127.0.0.1:36815_solr) [n:127.0.0.1:36815_solr    ] o.a.s.c.c.ZkStateReader Updated live nodes from ZooKeeper... (1) -> (0)
   [junit4]   2> 638357 INFO  (coreCloseExecutor-1011-thread-1) [n:127.0.0.1:36815_solr c:legacyTrue s:shard1 r:core_node2 x:legacyTrue_shard1_replica_n1] o.a.s.c.SolrCore [legacyTrue_shard1_replica_n1]  CLOSING SolrCore org.apache.solr.core.SolrCore@52e5f50f
   [junit4]   2> 638357 INFO  (coreCloseExecutor-1011-thread-1) [n:127.0.0.1:36815_solr c:legacyTrue s:shard1 r:core_node2 x:legacyTrue_shard1_replica_n1] o.a.s.m.SolrMetricManager Closing metric reporters for registry=solr.core.legacyTrue.shard1.replica_n1, tag=1390802191
   [junit4]   2> 638357 INFO  (coreCloseExecutor-1011-thread-1) [n:127.0.0.1:36815_solr c:legacyTrue s:shard1 r:core_node2 x:legacyTrue_shard1_replica_n1] o.a.s.m.r.SolrJmxReporter Closing reporter [org.apache.solr.metrics.reporters.SolrJmxReporter@18214d2: rootName = solr_36815, domain = solr.core.legacyTrue.shard1.replica_n1, service url = null, agent id = null] for registry solr.core.legacyTrue.shard1.replica_n1 / com.codahale.metrics.MetricRegistry@4ec8f7a2
   [junit4]   2> 638361 INFO  (coreCloseExecutor-1011-thread-1) [n:127.0.0.1:36815_solr c:legacyTrue s:shard1 r:core_node2 x:legacyTrue_shard1_replica_n1] o.a.s.m.SolrMetricManager Closing metric reporters for registry=solr.collection.legacyTrue.shard1.leader, tag=1390802191
   [junit4]   2> 638363 INFO  (jetty-closer-647-thread-1) [    ] o.a.s.c.Overseer Overseer (id=99237299765968899-127.0.0.1:36815_solr-n_0000000000) closing
   [junit4]   2> 638363 INFO  (OverseerStateUpdate-99237299765968899-127.0.0.1:36815_solr-n_0000000000) [n:127.0.0.1:36815_solr    ] o.a.s.c.Overseer Overseer Loop exiting : 127.0.0.1:36815_solr
   [junit4]   2> 668380 INFO  (zkCallback-656-thread-4-processing-n:127.0.0.1:36815_solr) [n:127.0.0.1:36815_solr    ] o.a.s.c.c.ZkStateReader A cluster state change: [WatchedEvent state:SyncConnected type:NodeDeleted path:/collections/legacyTrue/state.json] for collection [legacyTrue] has occurred - updating... (live nodes size: [0])
   [junit4]   2> 668381 ERROR (OverseerThreadFactory-1003-thread-1-processing-n:127.0.0.1:36815_solr) [n:127.0.0.1:36815_solr    ] o.a.s.c.OverseerCollectionMessageHandler Collection: legacyTrue operation: create failed:org.apache.solr.common.SolrException: Could not fully remove collection: legacyTrue
   [junit4]   2> 	at org.apache.solr.cloud.DeleteCollectionCmd.call(DeleteCollectionCmd.java:112)
   [junit4]   2> 	at org.apache.solr.cloud.OverseerCollectionMessageHandler.cleanupCollection(OverseerCollectionMessageHandler.java:688)
   [junit4]   2> 	at org.apache.solr.cloud.CreateCollectionCmd.call(CreateCollectionCmd.java:240)
   [junit4]   2> 	at org.apache.solr.cloud.OverseerCollectionMessageHandler.processMessage(OverseerCollectionMessageHandler.java:242)
   [junit4]   2> 	at org.apache.solr.cloud.OverseerTaskProcessor$Runner.run(OverseerTaskProcessor.java:464)
   [junit4]   2> 	at org.apache.solr.common.util.ExecutorUtil$MDCAwareThreadPoolExecutor.lambda$execute$0(ExecutorUtil.java:188)
   [junit4]   2> 	at java.base/java.util.concurrent.ThreadPoolExecutor.runWorker(ThreadPoolExecutor.java:1135)
   [junit4]   2> 	at java.base/java.util.concurrent.ThreadPoolExecutor$Worker.run(ThreadPoolExecutor.java:635)
   [junit4]   2> 	at java.base/java.lang.Thread.run(Thread.java:844)
   [junit4]   2> 
   [junit4]   2> 668381 INFO  (OverseerThreadFactory-1003-thread-1-processing-n:127.0.0.1:36815_solr) [n:127.0.0.1:36815_solr    ] o.a.s.c.OverseerTaskQueue Response ZK path: /overseer/collection-queue-work/qnr-0000000000 doesn't exist.  Requestor may have disconnected from ZooKeeper
   [junit4]   2> 668382 WARN  (OverseerAutoScalingTriggerThread-99237299765968899-127.0.0.1:36815_solr-n_0000000000) [n:127.0.0.1:36815_solr    ] o.a.s.c.a.OverseerTriggerThread OverseerTriggerThread woken up but we are closed, exiting.
   [junit4]   2> 668383 INFO  (jetty-closer-647-thread-1) [    ] o.e.j.s.h.ContextHandler Stopped o.e.j.s.ServletContextHandler@603ed0f7{/solr,null,UNAVAILABLE}
   [junit4]   2> 668408 ERROR (qtp1889452164-2575) [n:127.0.0.1:36815_solr c:legacyTrue s:shard1  x:legacyTrue_shard1_replica_n1] o.a.s.c.ZkController Error getting leader from zk
   [junit4]   2> org.apache.solr.common.SolrException: No registered leader was found after waiting for 1220000ms , collection: legacyTrue slice: shard1 saw state=null with live_nodes=[]
   [junit4]   2> 	at org.apache.solr.common.cloud.ZkStateReader.getLeaderRetry(ZkStateReader.java:771)
   [junit4]   2> 	at org.apache.solr.common.cloud.ZkStateReader.getLeaderUrl(ZkStateReader.java:736)
   [junit4]   2> 	at org.apache.solr.cloud.ZkController.getLeader(ZkController.java:1178)
   [junit4]   2> 	at org.apache.solr.cloud.ZkController.register(ZkController.java:1079)
   [junit4]   2> 	at org.apache.solr.cloud.ZkController.register(ZkController.java:1014)
   [junit4]   2> 	at org.apache.solr.core.ZkContainer.lambda$registerInZk$0(ZkContainer.java:181)
   [junit4]   2> 	at org.apache.solr.core.ZkContainer.registerInZk(ZkContainer.java:208)
   [junit4]   2> 	at org.apache.solr.core.CoreContainer.registerCore(CoreContainer.java:888)
   [junit4]   2> 	at org.apache.solr.core.CoreContainer.createFromDescriptor(CoreContainer.java:1049)
   [junit4]   2> 	at org.apache.solr.core.CoreContainer.create(CoreContainer.java:950)
   [junit4]   2> 	at org.apache.solr.handler.admin.CoreAdminOperation.lambda$static$0(CoreAdminOperation.java:91)
   [junit4]   2> 	at org.apache.solr.handler.admin.CoreAdminOperation.execute(CoreAdminOperation.java:384)
   [junit4]   2> 	at org.apache.solr.handler.admin.CoreAdminHandler$CallInfo.call(CoreAdminHandler.java:389)
   [junit4]   2> 	at org.apache.solr.handler.admin.CoreAdminHandler.handleRequestBody(CoreAdminHandler.java:174)
   [junit4]   2> 	at org.apache.solr.handler.RequestHandlerBase.handleRequest(RequestHandlerBase.java:177)
   [junit4]   2> 	at org.apache.solr.servlet.HttpSolrCall.handleAdmin(HttpSolrCall.java:736)
   [junit4]   2> 	at org.apache.solr.servlet.HttpSolrCall.handleAdminRequest(HttpSolrCall.java:717)
   [junit4]   2> 	at org.apache.solr.servlet.HttpSolrCall.call(HttpSolrCall.java:498)
   [junit4]   2> 	at org.apache.solr.servlet.SolrDispatchFilter.doFilter(SolrDispatchFilter.java:382)
   [junit4]   2> 	at org.apache.solr.servlet.SolrDispatchFilter.doFilter(SolrDispatchFilter.java:326)
   [junit4]   2> 	at org.eclipse.jetty.servlet.ServletHandler$CachedChain.doFilter(ServletHandler.java:1759)
   [junit4]   2> 	at org.apache.solr.client.solrj.embedded.JettySolrRunner$DebugFilter.doFilter(JettySolrRunner.java:139)
   [junit4]   2> 	at org.eclipse.jetty.servlet.ServletHandler$CachedChain.doFilter(ServletHandler.java:1759)
   [junit4]   2> 	at org.eclipse.jetty.servlet.ServletHandler.doHandle(ServletHandler.java:582)
   [junit4]   2> 	at org.eclipse.jetty.server.session.SessionHandler.doHandle(SessionHandler.java:224)
   [junit4]   2> 	at org.eclipse.jetty.server.handler.ContextHandler.doHandle(ContextHandler.java:1180)
   [junit4]   2> 	at org.eclipse.jetty.servlet.ServletHandler.doScope(ServletHandler.java:512)
   [junit4]   2> 	at org.eclipse.jetty.server.session.SessionHandler.doScope(SessionHandler.java:185)
   [junit4]   2> 	at org.eclipse.jetty.server.handler.ContextHandler.doScope(ContextHandler.java:1112)
   [junit4]   2> 	at org.eclipse.jetty.server.handler.ScopedHandler.handle(ScopedHandler.java:141)
   [junit4]   2> 	at org.eclipse.jetty.server.handler.gzip.GzipHandler.handle(GzipHandler.java:426)
   [junit4]   2> 	at org.eclipse.jetty.server.handler.HandlerWrapper.handle(HandlerWrapper.java:134)
   [junit4]   2> 	at org.eclipse.jetty.server.Server.handle(Server.java:534)
   [junit4]   2> 	at org.eclipse.jetty.server.HttpChannel.handle(HttpChannel.java:320)
   [junit4]   2> 	at org.eclipse.jetty.server.HttpConnection.onFillable(HttpConnection.java:251)
   [junit4]   2> 	at org.eclipse.jetty.io.AbstractConnection$ReadCallback.succeeded(AbstractConnection.java:283)
   [junit4]   2> 	at org.eclipse.jetty.io.FillInterest.fillable(FillInterest.java:108)
   [junit4]   2> 	at org.eclipse.jetty.io.ssl.SslConnection.onFillable(SslConnection.java:251)
   [junit4]   2> 	at org.eclipse.jetty.io.AbstractConnection$ReadCallback.succeeded(AbstractConnection.java:283)
   [junit4]   2> 	at org.eclipse.jetty.io.FillInterest.fillable(FillInterest.java:108)
   [junit4]   2> 	at org.eclipse.jetty.io.SelectChannelEndPoint$2.run(SelectChannelEndPoint.java:93)
   [junit4]   2> 	at org.eclipse.jetty.util.thread.strategy.ExecuteProduceConsume.executeProduceConsume(ExecuteProduceConsume.java:303)
   [junit4]   2> 	at org.eclipse.jetty.util.thread.strategy.ExecuteProduceConsume.produceConsume(ExecuteProduceConsume.java:148)
   [junit4]   2> 	at org.eclipse.jetty.util.thread.strategy.ExecuteProduceConsume.run(ExecuteProduceConsume.java:136)
   [junit4]   2> 	at org.eclipse.jetty.util.thread.QueuedThreadPool.runJob(QueuedThreadPool.java:671)
   [junit4]   2> 	at org.eclipse.jetty.util.thread.QueuedThreadPool$2.run(QueuedThreadPool.java:589)
   [junit4]   2> 	at java.base/java.lang.Thread.run(Thread.java:844)
   [junit4]   2> 668409 ERROR (qtp1889452164-2575) [n:127.0.0.1:36815_solr c:legacyTrue s:shard1  x:legacyTrue_shard1_replica_n1] o.a.s.c.ZkContainer :org.apache.solr.common.SolrException: Error getting leader from zk for shard shard1
   [junit4]   2> 	at org.apache.solr.cloud.ZkController.getLeader(ZkController.java:1207)
   [junit4]   2> 	at org.apache.solr.cloud.ZkController.register(ZkController.java:1079)
   [junit4]   2> 	at org.apache.solr.cloud.ZkController.register(ZkController.java:1014)
   [junit4]   2> 	at org.apache.solr.core.ZkContainer.lambda$registerInZk$0(ZkContainer.java:181)
   [junit4]   2> 	at org.apache.solr.core.ZkContainer.registerInZk(ZkContainer.java:208)
   [junit4]   2> 	at org.apache.solr.core.CoreContainer.registerCore(CoreContainer.java:888)
   [junit4]   2> 	at org.apache.solr.core.CoreContainer.createFromDescriptor(CoreContainer.java:1049)
   [junit4]   2> 	at org.apache.solr.core.CoreContainer.create(CoreContainer.java:950)
   [junit4]   2> 	at org.apache.solr.handler.admin.CoreAdminOperation.lambda$static$0(CoreAdminOperation.java:91)
   [junit4]   2> 	at org.apache.solr.handler.admin.CoreAdminOperation.execute(CoreAdminOperation.java:384)
   [junit4]   2> 	at org.apache.solr.handler.admin.CoreAdminHandler$CallInfo.call(CoreAdminHandler.java:389)
   [junit4]   2> 	at org.apache.solr.handler.admin.CoreAdminHandler.handleRequestBody(CoreAdminHandler.java:174)
   [junit4]   2> 	at org.apache.solr.handler.RequestHandlerBase.handleRequest(RequestHandlerBase.java:177)
   [junit4]   2> 	at org.apache.solr.servlet.HttpSolrCall.handleAdmin(HttpSolrCall.java:736)
   [junit4]   2> 	at org.apache.solr.servlet.HttpSolrCall.handleAdminRequest(HttpSolrCall.java:717)
   [junit4]   2> 	at org.apache.solr.servlet.HttpSolrCall.call(HttpSolrCall.java:498)
   [junit4]   2> 	at org.apache.solr.servlet.SolrDispatchFilter.doFilter(SolrDispatchFilter.java:382)
   [junit4]   2> 	at org.apache.solr.servlet.SolrDispatchFilter.doFilter(SolrDispatchFilter.java:326)
   [junit4]   2> 	at org.eclipse.jetty.servlet.ServletHandler$CachedChain.doFilter(ServletHandler.java:1759)
   [junit4]   2> 	at org.apache.solr.client.solrj.embedded.JettySolrRunner$DebugFilter.doFilter(JettySolrRunner.java:139)
   [junit4]   2> 	at org.eclipse.jetty.servlet.ServletHandler$CachedChain.doFilter(ServletHandler.java:1759)
   [junit4]   2> 	at org.eclipse.jetty.servlet.ServletHandler.doHandle(ServletHandler.java:582)
   [junit4]   2> 	at org.eclipse.jetty.server.session.SessionHandler.doHandle(SessionHandler.java:224)
   [junit4]   2> 	at org.eclipse.jetty.server.handler.ContextHandler.doHandle(ContextHandler.java:1180)
   [junit4]   2> 	at org.eclipse.jetty.servlet.ServletHandler.doScope(ServletHandler.java:512)
   [junit4]   2> 	at org.eclipse.jetty.server.session.SessionHandler.doScope(SessionHandler.java:185)
   [junit4]   2> 	at org.eclipse.jetty.server.handler.ContextHandler.doScope(ContextHandler.java:1112)
   [junit4]   2> 	at org.eclipse.jetty.server.handler.ScopedHandler.handle(ScopedHandler.java:141)
   [junit4]   2> 	at org.eclipse.jetty.server.handler.gzip.GzipHandler.handle(GzipHandler.java:426)
   [junit4]   2> 	at org.eclipse.jetty.server.handler.HandlerWrapper.handle(HandlerWrapper.java:134)
   [junit4]   2> 	at org.eclipse.jetty.server.Server.handle(Server.java:534)
   [junit4]   2> 	at org.eclipse.jetty.server.HttpChannel.handle(HttpChannel.java:320)
   [junit4]   2> 	at org.eclipse.jetty.server.HttpConnection.onFillable(HttpConnection.java:251)
   [junit4]   2> 	at org.eclipse.jetty.io.AbstractConnection$ReadCallback.succeeded(AbstractConnection.java:283)
   [junit4]   2> 	at org.eclipse.jetty.io.FillInterest.fillable(FillInterest.java:108)
   [junit4]   2> 	at org.eclipse.jetty.io.ssl.SslConnection.onFillable(SslConnection.java:251)
   [junit4]   2> 	at org.eclipse.jetty.io.AbstractConnection$ReadCallback.succeeded(AbstractConnection.java:283)
   [junit4]   2> 	at org.eclipse.jetty.io.FillInterest.fillable(FillInterest.java:108)
   [junit4]   2> 	at org.eclipse.jetty.io.SelectChannelEndPoint$2.run(SelectChannelEndPoint.java:93)
   [junit4]   2> 	at org.eclipse.jetty.util.thread.strategy.ExecuteProduceConsume.executeProduceConsume(ExecuteProduceConsume.java:303)
   [junit4]   2> 	at org.eclipse.jetty.util.thread.strategy.ExecuteProduceConsume.produceConsume(ExecuteProduceConsume.java:148)
   [junit4]   2> 	at org.eclipse.jetty.util.thread.strategy.ExecuteProduceConsume.run(ExecuteProduceConsume.java:136)
   [junit4]   2> 	at org.eclipse.jetty.util.thread.QueuedThreadPool.runJob(QueuedThreadPool.java:671)
   [junit4]   2> 	at org.eclipse.jetty.util.thread.QueuedThreadPool$2.run(QueuedThreadPool.java:589)
   [junit4]   2> 	at java.base/java.lang.Thread.run(Thread.java:844)
   [junit4]   2> Caused by: org.apache.solr.common.SolrException: No registered leader was found after waiting for 1220000ms , collection: legacyTrue slice: shard1 saw state=null with live_nodes=[]
   [junit4]   2> 	at org.apache.solr.common.cloud.ZkStateReader.getLeaderRetry(ZkStateReader.java:771)
   [junit4]   2> 	at org.apache.solr.common.cloud.ZkStateReader.getLeaderUrl(ZkStateReader.java:736)
   [junit4]   2> 	at org.apache.solr.cloud.ZkController.getLeader(ZkController.java:1178)
   [junit4]   2> 	... 44 more
   [junit4]   2> 
   [junit4]   2> 668420 INFO  (qtp1889452164-2575) [n:127.0.0.1:36815_solr c:legacyTrue s:shard1  x:legacyTrue_shard1_replica_n1] o.a.s.s.HttpSolrCall [admin] webapp=null path=/admin/cores params={qt=/admin/cores&collection.configName=conf&newCollection=true&name=legacyTrue_shard1_replica_n1&action=CREATE&numShards=1&collection=legacyTrue&shard=shard1&wt=javabin&version=2&replicaType=NRT} status=0 QTime=209967
   [junit4]   2> 668420 ERROR (SUITE-LegacyCloudClusterPropTest-seed#[C579D2B8092125A8]-worker) [    ] o.a.z.s.ZooKeeperServer ZKShutdownHandler is not registered, so ZooKeeper server won't take any action on ERROR or SHUTDOWN server state changes
   [junit4]   2> 668420 INFO  (SUITE-LegacyCloudClusterPropTest-seed#[C579D2B8092125A8]-worker) [    ] o.a.s.c.ZkTestServer connecting to 127.0.0.1:40747 40747
   [junit4]   2> 675733 INFO  (Thread-579) [    ] o.a.s.c.ZkTestServer connecting to 127.0.0.1:40747 40747
   [junit4]   2> 675733 WARN  (Thread-579) [    ] o.a.s.c.ZkTestServer Watch limit violations: 
   [junit4]   2> Maximum concurrent create/delete watches above limit:
   [junit4]   2> 
   [junit4]   2> 	2	/solr/aliases.json
   [junit4]   2> 
   [junit4]   2> Maximum concurrent data watches above limit:
   [junit4]   2> 
   [junit4]   2> 	2	/solr/clusterstate.json
   [junit4]   2> 	2	/solr/clusterprops.json
   [junit4]   2> 
   [junit4]   2> Maximum concurrent children watches above limit:
   [junit4]   2> 
   [junit4]   2> 	2	/solr/live_nodes
   [junit4]   2> 	2	/solr/collections
   [junit4]   2> 
   [junit4]   2> NOTE: leaving temporary files on disk at: /home/jenkins/workspace/Lucene-Solr-7.x-Linux/solr/build/solr-core/test/J1/temp/solr.cloud.LegacyCloudClusterPropTest_C579D2B8092125A8-001
   [junit4]   2> NOTE: test params are: codec=Asserting(Lucene70): {}, docValues:{}, maxPointsInLeafNode=461, maxMBSortInHeap=5.4639128221335955, sim=RandomSimilarity(queryNorm=true): {}, locale=ar-DJ, timezone=Europe/Gibraltar
   [junit4]   2> NOTE: Linux 4.10.0-40-generic amd64/Oracle Corporation 10-ea (64-bit)/cpus=8,threads=1,free=242820920,total=456130560
   [junit4]   2> NOTE: All tests run in this JVM: [TestFieldCollectionResource, TestExecutePlanAction, BadIndexSchemaTest, ParsingFieldUpdateProcessorsTest, DistributedVersionInfoTest, TestStressRecovery, NotRequiredUniqueKeyTest, TestGraphMLResponseWriter, TestBlobHandler, DistributedIntervalFacetingTest, TestHighFrequencyDictionaryFactory, TestRangeQuery, OverseerRolesTest, TemplateUpdateProcessorTest, ZkFailoverTest, TestLockTree, TestPrepRecovery, TestLegacyNumericRangeQueryBuilder, AddReplicaTest, PolyFieldTest, SOLR749Test, V2ApiIntegrationTest, CollectionTooManyReplicasTest, TestSimpleQParserPlugin, PrimUtilsTest, NodeAddedTriggerTest, OverriddenZkACLAndCredentialsProvidersTest, TestExceedMaxTermLength, TestBlendedInfixSuggestions, FacetPivotSmallTest, DOMUtilTest, LegacyCloudClusterPropTest]
   [junit4] Completed [127/764 (1!)] on J1 in 217.70s, 1 test, 1 error <<< FAILURES!

[...truncated 1238 lines...]
   [junit4] Suite: org.apache.solr.handler.TestReplicationHandler
   [junit4]   2> 2191966 INFO  (SUITE-TestReplicationHandler-seed#[C579D2B8092125A8]-worker) [    ] o.a.s.SolrTestCaseJ4 SecureRandom sanity checks: test.solr.allowed.securerandom=null & java.security.egd=file:/dev/./urandom
   [junit4]   2> Creating dataDir: /home/jenkins/workspace/Lucene-Solr-7.x-Linux/solr/build/solr-core/test/J0/temp/solr.handler.TestReplicationHandler_C579D2B8092125A8-001/init-core-data-001
   [junit4]   2> 2191966 WARN  (SUITE-TestReplicationHandler-seed#[C579D2B8092125A8]-worker) [    ] o.a.s.SolrTestCaseJ4 startTrackingSearchers: numOpens=3 numCloses=3
   [junit4]   2> 2191966 INFO  (SUITE-TestReplicationHandler-seed#[C579D2B8092125A8]-worker) [    ] o.a.s.SolrTestCaseJ4 Using PointFields (NUMERIC_POINTS_SYSPROP=true) w/NUMERIC_DOCVALUES_SYSPROP=false
   [junit4]   2> 2191966 INFO  (SUITE-TestReplicationHandler-seed#[C579D2B8092125A8]-worker) [    ] o.a.s.SolrTestCaseJ4 Randomized ssl (false) and clientAuth (false) via: @org.apache.solr.SolrTestCaseJ4$SuppressSSL(bugUrl="None")
   [junit4]   2> 2191967 INFO  (TEST-TestReplicationHandler.doTestReplicateAfterCoreReload-seed#[C579D2B8092125A8]) [    ] o.a.s.SolrTestCaseJ4 ###Starting doTestReplicateAfterCoreReload
   [junit4]   2> 2191967 INFO  (TEST-TestReplicationHandler.doTestReplicateAfterCoreReload-seed#[C579D2B8092125A8]) [    ] o.a.s.SolrTestCaseJ4 Writing core.properties file to /home/jenkins/workspace/Lucene-Solr-7.x-Linux/solr/build/solr-core/test/J0/temp/solr.handler.TestReplicationHandler_C579D2B8092125A8-001/solr-instance-001/collection1
   [junit4]   2> 2191969 INFO  (TEST-TestReplicationHandler.doTestReplicateAfterCoreReload-seed#[C579D2B8092125A8]) [    ] o.e.j.s.Server jetty-9.3.20.v20170531
   [junit4]   2> 2191969 INFO  (TEST-TestReplicationHandler.doTestReplicateAfterCoreReload-seed#[C579D2B8092125A8]) [    ] o.e.j.s.h.ContextHandler Started o.e.j.s.ServletContextHandler@1412007c{/solr,null,AVAILABLE}
   [junit4]   2> 2191970 INFO  (TEST-TestReplicationHandler.doTestReplicateAfterCoreReload-seed#[C579D2B8092125A8]) [    ] o.e.j.s.AbstractConnector Started ServerConnector@728e26ad{HTTP/1.1,[http/1.1]}{127.0.0.1:41397}
   [junit4]   2> 2191970 INFO  (TEST-TestReplicationHandler.doTestReplicateAfterCoreReload-seed#[C579D2B8092125A8]) [    ] o.e.j.s.Server Started @2194287ms
   [junit4]   2> 2191970 INFO  (TEST-TestReplicationHandler.doTestReplicateAfterCoreReload-seed#[C579D2B8092125A8]) [    ] o.a.s.c.s.e.JettySolrRunner Jetty properties: {hostContext=/solr, solr.data.dir=/home/jenkins/workspace/Lucene-Solr-7.x-Linux/solr/build/solr-core/test/J0/temp/solr.handler.TestReplicationHandler_C579D2B8092125A8-001/solr-instance-001/collection1/data, hostPort=41397}
   [junit4]   2> 2191970 ERROR (TEST-TestReplicationHandler.doTestReplicateAfterCoreReload-seed#[C579D2B8092125A8]) [    ] o.a.s.u.StartupLoggingUtils Missing Java Option solr.log.dir. Logging may be missing or incomplete.
   [junit4]   2> 2191970 INFO  (TEST-TestReplicationHandler.doTestReplicateAfterCoreReload-seed#[C579D2B8092125A8]) [    ] o.a.s.s.SolrDispatchFilter  ___      _       Welcome to Apache Solr? version 7.3.0
   [junit4]   2> 2191970 INFO  (TEST-TestReplicationHandler.doTestReplicateAfterCoreReload-seed#[C579D2B8092125A8]) [    ] o.a.s.s.SolrDispatchFilter / __| ___| |_ _   Starting in standalone mode on port null
   [junit4]   2> 2191970 INFO  (TEST-TestReplicationHandler.doTestReplicateAfterCoreReload-seed#[C579D2B8092125A8]) [    ] o.a.s.s.SolrDispatchFilter \__ \/ _ \ | '_|  Install dir: null
   [junit4]   2> 2191971 INFO  (TEST-TestReplicationHandler.doTestReplicateAfterCoreReload-seed#[C579D2B8092125A8]) [    ] o.a.s.s.SolrDispatchFilter |___/\___/_|_|    Start time: 2017-12-25T22:59:18.357006Z
   [junit4]   2> 2191971 INFO  (TEST-TestReplicationHandler.doTestReplicateAfterCoreReload-seed#[C579D2B8092125A8]) [    ] o.a.s.c.SolrXmlConfig Loading container configuration from /home/jenkins/workspace/Lucene-Solr-7.x-Linux/solr/build/solr-core/test/J0/temp/solr.handler.TestReplicationHandler_C579D2B8092125A8-001/solr-instance-001/solr.xml
   [junit4]   2> 2191972 INFO  (TEST-TestReplicationHandler.doTestReplicateAfterCoreReload-seed#[C579D2B8092125A8]) [    ] o.a.s.c.SolrXmlConfig Configuration parameter autoReplicaFailoverWorkLoopDelay is ignored
   [junit4]   2> 2191972 INFO  (TEST-TestReplicationHandler.doTestReplicateAfterCoreReload-seed#[C579D2B8092125A8]) [    ] o.a.s.c.SolrXmlConfig Configuration parameter autoReplicaFailoverBadNodeExpiration is ignored
   [junit4]   2> 2191972 INFO  (TEST-TestReplicationHandler.doTestReplicateAfterCoreReload-seed#[C579D2B8092125A8]) [    ] o.a.s.c.SolrXmlConfig MBean server found: com.sun.jmx.mbeanserver.JmxMBeanServer@fd3e3b, but no JMX reporters were configured - adding default JMX reporter.
   [junit4]   2> 2191990 INFO  (TEST-TestReplicationHandler.doTestReplicateAfterCoreReload-seed#[C579D2B8092125A8]) [    ] o.a.s.m.r.SolrJmxReporter JMX monitoring for 'solr.node' (registry 'solr.node') enabled at server: com.sun.jmx.mbeanserver.JmxMBeanServer@fd3e3b
   [junit4]   2> 2191995 INFO  (TEST-TestReplicationHandler.doTestReplicateAfterCoreReload-seed#[C579D2B8092125A8]) [    ] o.a.s.m.r.SolrJmxReporter JMX monitoring for 'solr.jvm' (registry 'solr.jvm') enabled at server: com.sun.jmx.mbeanserver.JmxMBeanServer@fd3e3b
   [junit4]   2> 2191995 INFO  (TEST-TestReplicationHandler.doTestReplicateAfterCoreReload-seed#[C579D2B8092125A8]) [    ] o.a.s.m.r.SolrJmxReporter JMX monitoring for 'solr.jetty' (registry 'solr.jetty') enabled at server: com.sun.jmx.mbeanserver.JmxMBeanServer@fd3e3b
   [junit4]   2> 2191997 INFO  (TEST-TestReplicationHandler.doTestReplicateAfterCoreReload-seed#[C579D2B8092125A8]) [    ] o.a.s.c.CorePropertiesLocator Found 1 core definitions underneath /home/jenkins/workspace/Lucene-Solr-7.x-Linux/solr/build/solr-core/test/J0/temp/solr.handler.TestReplicationHandler_C579D2B8092125A8-001/solr-instance-001/.
   [junit4]   2> 2191997 INFO  (TEST-TestReplicationHandler.doTestReplicateAfterCoreReload-seed#[C579D2B8092125A8]) [    ] o.a.s.c.CorePropertiesLocator Cores are: [collection1]
   [junit4]   2> 2191997 INFO  (coreLoadExecutor-3145-thread-1) [    ] o.a.s.c.TransientSolrCoreCacheDefault Allocating transient cache for 4 transient cores
   [junit4]   2> 2192000 INFO  (coreLoadExecutor-3145-thread-1) [    x:collection1] o.a.s.c.SolrConfig Using Lucene MatchVersion: 7.3.0
   [junit4]   2> 2192004 INFO  (coreLoadExecutor-3145-thread-1) [    x:collection1] o.a.s.s.IndexSchema [collection1] Schema name=test
   [junit4]   2> 2192004 INFO  (coreLoadExecutor-3145-thread-1) [    x:collection1] o.a.s.s.IndexSchema Loaded schema test/1.2 with uniqueid field id
   [junit4]   2> 2192004 INFO  (coreLoadExecutor-3145-thread-1) [    x:collection1] o.a.s.c.CoreContainer Creating SolrCore 'collection1' using configuration from instancedir /home/jenkins/workspace/Lucene-Solr-7.x-Linux/solr/build/solr-core/test/J0/temp/solr.handler.TestReplicationHandler_C579D2B8092125A8-001/solr-instance-001/./collection1, trusted=true
   [junit4]   2> 2192005 INFO  (coreLoadExecutor-3145-thread-1) [    x:collection1] o.a.s.m.r.SolrJmxReporter JMX monitoring for 'solr.core.collection1' (registry 'solr.core.collection1') enabled at server: com.sun.jmx.mbeanserver.JmxMBeanServer@fd3e3b
   [junit4]   2> 2192005 INFO  (coreLoadExecutor-3145-thread-1) [    x:collection1] o.a.s.c.SolrCore solr.RecoveryStrategy.Builder
   [junit4]   2> 2192005 INFO  (coreLoadExecutor-3145-thread-1) [    x:collection1] o.a.s.c.SolrCore [[collection1] ] Opening new SolrCore at [/home/jenkins/workspace/Lucene-Solr-7.x-Linux/solr/build/solr-core/test/J0/temp/solr.handler.TestReplicationHandler_C579D2B8092125A8-001/solr-instance-001/collection1], dataDir=[/home/jenkins/workspace/Lucene-Solr-7.x-Linux/solr/build/solr-core/test/J0/temp/solr.handler.TestReplicationHandler_C579D2B8092125A8-001/solr-instance-001/./collection1/data/]
   [junit4]   2> 2192006 INFO  (coreLoadExecutor-3145-thread-1) [    x:collection1] o.a.s.u.RandomMergePolicy RandomMergePolicy wrapping class org.apache.lucene.index.TieredMergePolicy: [TieredMergePolicy: maxMergeAtOnce=30, maxMergeAtOnceExplicit=40, maxMergedSegmentMB=85.6416015625, floorSegmentMB=1.421875, forceMergeDeletesPctAllowed=17.611669535233656, segmentsPerTier=14.0, maxCFSSegmentSizeMB=8.796093022207999E12, noCFSRatio=0.5367347143123841
   [junit4]   2> 2192026 INFO  (coreLoadExecutor-3145-thread-1) [    x:collection1] o.a.s.u.CommitTracker Hard AutoCommit: disabled
   [junit4]   2> 2192026 INFO  (coreLoadExecutor-3145-thread-1) [    x:collection1] o.a.s.u.CommitTracker Soft AutoCommit: disabled
   [junit4]   2> 2192026 INFO  (coreLoadExecutor-3145-thread-1) [    x:collection1] o.a.s.u.RandomMergePolicy RandomMergePolicy wrapping class org.apache.lucene.index.TieredMergePolicy: [TieredMergePolicy: maxMergeAtOnce=5, maxMergeAtOnceExplicit=9, maxMergedSegmentMB=85.990234375, floorSegmentMB=1.4853515625, forceMergeDeletesPctAllowed=3.002189946498736, segmentsPerTier=33.0, maxCFSSegmentSizeMB=1.041015625, noCFSRatio=1.0
   [junit4]   2> 2192027 INFO  (coreLoadExecutor-3145-thread-1) [    x:collection1] o.a.s.s.SolrIndexSearcher Opening [Searcher@6ce7745[collection1] main]
   [junit4]   2> 2192027 INFO  (coreLoadExecutor-3145-thread-1) [    x:collection1] o.a.s.r.ManagedResourceStorage File-based storage initialized to use dir: /home/jenkins/workspace/Lucene-Solr-7.x-Linux/solr/build/solr-core/test/J0/temp/solr.handler.TestReplicationHandler_C579D2B8092125A8-001/solr-instance-001/collection1/conf
   [junit4]   2> 2192027 INFO  (coreLoadExecutor-3145-thread-1) [    x:collection1] o.a.s.h.ReplicationHandler Replication enabled for following config files: schema.xml,xslt/dummy.xsl
   [junit4]   2> 2192027 INFO  (coreLoadExecutor-3145-thread-1) [    x:collection1] o.a.s.h.ReplicationHandler Commits will be reserved for 10000ms.
   [junit4]   2> 2192028 INFO  (searcherExecutor-3146-thread-1-processing-x:collection1) [    x:collection1] o.a.s.c.SolrCore [collection1] Registered new searcher Searcher@6ce7745[collection1] main{ExitableDirectoryReader(UninvertingDirectoryReader())}
   [junit4]   2> 2192028 INFO  (TEST-TestReplicationHandler.doTestReplicateAfterCoreReload-seed#[C579D2B8092125A8]) [    ] o.a.s.SolrTestCaseJ4 Writing core.properties file to /home/jenkins/workspace/Lucene-Solr-7.x-Linux/solr/build/solr-core/test/J0/temp/solr.handler.TestReplicationHandler_C579D2B8092125A8-001/solr-instance-002/collection1
   [junit4]   2> 2192029 INFO  (TEST-TestReplicationHandler.doTestReplicateAfterCoreReload-seed#[C579D2B8092125A8]) [    ] o.e.j.s.Server jetty-9.3.20.v20170531
   [junit4]   2> 2192030 INFO  (TEST-TestReplicationHandler.doTestReplicateAfterCoreReload-seed#[C579D2B8092125A8]) [    ] o.e.j.s.h.ContextHandler Started o.e.j.s.ServletContextHandler@57f79a96{/solr,null,AVAILABLE}
   [junit4]   2> 2192030 INFO  (TEST-TestReplicationHandler.doTestReplicateAfterCoreReload-seed#[C579D2B8092125A8]) [    ] o.e.j.s.AbstractConnector Started ServerConnector@30cf9441{HTTP/1.1,[http/1.1]}{127.0.0.1:35839}
   [junit4]   2> 2192030 INFO  (TEST-TestReplicationHandler.doTestReplicateAfterCoreReload-seed#[C579D2B8092125A8]) [    ] o.e.j.s.Server Started @2194347ms
   [junit4]   2> 2192030 INFO  (TEST-TestReplicationHandler.doTestReplicateAfterCoreReload-seed#[C579D2B8092125A8]) [    ] o.a.s.c.s.e.JettySolrRunner Jetty properties: {hostContext=/solr, solr.data.dir=/home/jenkins/workspace/Lucene-Solr-7.x-Linux/solr/build/solr-core/test/J0/temp/solr.handler.TestReplicationHandler_C579D2B8092125A8-001/solr-instance-002/collection1/data, hostPort=35839}
   [junit4]   2> 2192030 ERROR (TEST-TestReplicationHandler.doTestReplicateAfterCoreReload-seed#[C579D2B8092125A8]) [    ] o.a.s.u.StartupLoggingUtils Missing Java Option solr.log.dir. Logging may be missing or incomplete.
   [junit4]   2> 2192030 INFO  (TEST-TestReplicationHandler.doTestReplicateAfterCoreReload-seed#[C579D2B8092125A8]) [    ] o.a.s.s.SolrDispatchFilter  ___      _       Welcome to Apache Solr? version 7.3.0
   [junit4]   2> 2192030 INFO  (TEST-TestReplicationHandler.doTestReplicateAfterCoreReload-seed#[C579D2B8092125A8]) [    ] o.a.s.s.SolrDispatchFilter / __| ___| |_ _   Starting in standalone mode on port null
   [junit4]   2> 2192030 INFO  (TEST-TestReplicationHandler.doTestReplicateAfterCoreReload-seed#[C579D2B8092125A8]) [    ] o.a.s.s.SolrDispatchFilter \__ \/ _ \ | '_|  Install dir: null
   [junit4]   2> 2192030 INFO  (TEST-TestReplicationHandler.doTestReplicateAfterCoreReload-seed#[C579D2B8092125A8]) [    ] o.a.s.s.SolrDispatchFilter |___/\___/_|_|    Start time: 2017-12-25T22:59:18.416817Z
   [junit4]   2> 2192030 INFO  (TEST-TestReplicationHandler.doTestReplicateAfterCoreReload-seed#[C579D2B8092125A8]) [    ] o.a.s.c.SolrXmlConfig Loading container configuration from /home/jenkins/workspace/Lucene-Solr-7.x-Linux/solr/build/solr-core/test/J0/temp/solr.handler.TestReplicationHandler_C579D2B8092125A8-001/solr-instance-002/solr.xml
   [junit4]   2> 2192032 INFO  (TEST-TestReplicationHandler.doTestReplicateAfterCoreReload-seed#[C579D2B8092125A8]) [    ] o.a.s.c.SolrXmlConfig Configuration parameter autoReplicaFailoverWorkLoopDelay is ignored
   [junit4]   2> 2192032 INFO  (TEST-TestReplicationHandler.doTestReplicateAfterCoreReload-seed#[C579D2B8092125A8]) [    ] o.a.s.c.SolrXmlConfig Configuration parameter autoReplicaFailoverBadNodeExpiration is ignored
   [junit4]   2> 2192032 INFO  (TEST-TestReplicationHandler.doTestReplicateAfterCoreReload-seed#[C579D2B8092125A8]) [    ] o.a.s.c.SolrXmlConfig MBean server found: com.sun.jmx.mbeanserver.JmxMBeanServer@fd3e3b, but no JMX reporters were configured - adding default JMX reporter.
   [junit4]   2> 2192047 INFO  (TEST-TestReplicationHandler.doTestReplicateAfterCoreReload-seed#[C579D2B8092125A8]) [    ] o.a.s.m.r.SolrJmxReporter JMX monitoring for 'solr.node' (registry 'solr.node') enabled at server: com.sun.jmx.mbeanserver.JmxMBeanServer@fd3e3b
   [junit4]   2> 2192053 INFO  (TEST-TestReplicationHandler.doTestReplicateAfterCoreReload-seed#[C579D2B8092125A8]) [    ] o.a.s.m.r.SolrJmxReporter JMX monitoring for 'solr.jvm' (registry 'solr.jvm') enabled at server: com.sun.jmx.mbeanserver.JmxMBeanServer@fd3e3b
   [junit4]   2> 2192053 INFO  (TEST-TestReplicationHandler.doTestReplicateAfterCoreReload-seed#[C579D2B8092125A8]) [    ] o.a.s.m.r.SolrJmxReporter JMX monitoring for 'solr.jetty' (registry 'solr.jetty') enabled at server: com.sun.jmx.mbeanserver.JmxMBeanServer@fd3e3b
   [junit4]   2> 2192054 INFO  (TEST-TestReplicationHandler.doTestReplicateAfterCoreReload-seed#[C579D2B8092125A8]) [    ] o.a.s.c.CorePropertiesLocator Found 1 core definitions underneath /home/jenkins/workspace/Lucene-Solr-7.x-Linux/solr/build/solr-core/test/J0/temp/solr.handler.TestReplicationHandler_C579D2B8092125A8-001/solr-instance-002/.
   [junit4]   2> 2192054 INFO  (TEST-TestReplicationHandler.doTestReplicateAfterCoreReload-seed#[C579D2B8092125A8]) [    ] o.a.s.c.CorePropertiesLocator Cores are: [collection1]
   [junit4]   2> 2192054 INFO  (coreLoadExecutor-3155-thread-1) [    ] o.a.s.c.TransientSolrCoreCacheDefault Allocating transient cache for 4 transient cores
   [junit4]   2> 2192062 INFO  (coreLoadExecutor-3155-thread-1) [    x:collection1] o.a.s.c.SolrConfig Using Lucene MatchVersion: 7.3.0
   [junit4]   2> 2192065 INFO  (coreLoadExecutor-3155-thread-1) [    x:collection1] o.a.s.s.IndexSchema [collection1] Schema name=test
   [junit4]   2> 2192066 INFO  (coreLoadExecutor-3155-thread-1) [    x:collection1] o.a.s.s.IndexSchema Loaded schema test/1.2 with uniqueid field id
   [junit4]   2> 2192066 INFO  (coreLoadExecutor-3155-thread-1) [    x:collection1] o.a.s.c.CoreContainer Creating SolrCore 'collection1' using configuration from instancedir /home/jenkins/workspace/Lucene-Solr-7.x-Linux/solr/build/solr-core/test/J0/temp/solr.handler.TestReplicationHandler_C579D2B8092125A8-001/solr-instance-002/./collection1, trusted=true
   [junit4]   2> 2192066 INFO  (coreLoadExecutor-3155-thread-1) [    x:collection1] o.a.s.m.r.SolrJmxReporter JMX monitoring for 'solr.core.collection1' (registry 'solr.core.collection1') enabled at server: com.sun.jmx.mbeanserver.JmxMBeanServer@fd3e3b
   [junit4]   2> 2192066 INFO  (coreLoadExecutor-3155-thread-1) [    x:collection1] o.a.s.c.SolrCore solr.RecoveryStrategy.Builder
   [junit4]   2> 2192066 INFO  (coreLoadExecutor-3155-thread-1) [    x:collection1] o.a.s.c.SolrCore [[collection1] ] Opening new SolrCore at [/home/jenkins/workspace/Lucene-Solr-7.x-Linux/solr/build/solr-core/test/J0/temp/solr.handler.TestReplicationHandler_C579D2B8092125A8-001/solr-instance-002/collection1], dataDir=[/home/jenkins/workspace/Lucene-Solr-7.x-Linux/solr/build/solr-core/test/J0/temp/solr.handler.TestReplicationHandler_C579D2B8092125A8-001/solr-instance-002/./collection1/data/]
   [junit4]   2> 2192067 INFO  (coreLoadExecutor-3155-thread-1) [    x:collection1] o.a.s.u.RandomMergePolicy RandomMergePolicy wrapping class org.apache.lucene.index.TieredMergePolicy: [TieredMergePolicy: maxMergeAtOnce=30, maxMergeAtOnceExplicit=40, maxMergedSegmentMB=85.6416015625, floorSegmentMB=1.421875, forceMergeDeletesPctAllowed=17.611669535233656, segmentsPerTier=14.0, maxCFSSegmentSizeMB=8.796093022207999E12, noCFSRatio=0.5367347143123841
   [junit4]   2> 2192088 INFO  (coreLoadExecutor-3155-thread-1) [    x:collection1] o.a.s.u.CommitTracker Hard AutoCommit: disabled
   [junit4]   2> 2192088 INFO  (coreLoadExecutor-3155-thread-1) [    x:collection1] o.a.s.u.CommitTracker Soft AutoCommit: disabled
   [junit4]   2> 2192088 INFO  (coreLoadExecutor-3155-thread-1) [    x:collection1] o.a.s.u.RandomMergePolicy RandomMergePolicy wrapping class org.apache.lucene.index.TieredMergePolicy: [TieredMergePolicy: maxMergeAtOnce=5, maxMergeAtOnceExplicit=9, maxMergedSegmentMB=85.990234375, floorSegmentMB=1.4853515625, forceMergeDeletesPctAllowed=3.002189946498736, segmentsPerTier=33.0, maxCFSSegmentSizeMB=1.041015625, noCFSRatio=1.0
   [junit4]   2> 2192088 INFO  (coreLoadExecutor-3155-thread-1) [    x:collection1] o.a.s.s.SolrIndexSearcher Opening [Searcher@83c175b[collection1] main]
   [junit4]   2> 2192089 INFO  (coreLoadExecutor-3155-thread-1) [    x:collection1] o.a.s.r.ManagedResourceStorage File-based storage initialized to use dir: /home/jenkins/workspace/Lucene-Solr-7.x-Linux/solr/build/solr-core/test/J0/temp/solr.handler.TestReplicationHandler_C579D2B8092125A8-001/solr-instance-002/collection1/conf
   [junit4]   2> 2192089 INFO  (coreLoadExecutor-3155-thread-1) [    x:collection1] o.a.s.h.ReplicationHandler Poll scheduled at an interval of 1000ms
   [junit4]   2> 2192089 INFO  (coreLoadExecutor-3155-thread-1) [    x:collection1] o.a.s.h.ReplicationHandler Commits will be reserved for 10000ms.
   [junit4]   2> 2192090 INFO  (searcherExecutor-3156-thread-1-processing-x:collection1) [    x:collection1] o.a.s.c.SolrCore [collection1] Registered new searcher Searcher@83c175b[collection1] main{ExitableDirectoryReader(UninvertingDirectoryReader())}
   [junit4]   2> 2192091 INFO  (TEST-TestReplicationHandler.doTestReplicateAfterCoreReload-seed#[C579D2B8092125A8]) [    ] o.e.j.s.AbstractConnector Stopped ServerConnector@30cf9441{HTTP/1.1,[http/1.1]}{127.0.0.1:0}
   [junit4]   2> 2192091 INFO  (TEST-TestReplicationHandler.doTestReplicateAfterCoreReload-seed#[C579D2B8092125A8]) [    ] o.a.s.c.CoreContainer Shutting down CoreContainer instance=1138421689
   [junit4]   2> 2192091 INFO  (TEST-TestReplicationHandler.doTestReplicateAfterCoreReload-seed#[C579D2B8092125A8]) [    ] o.a.s.m.SolrMetricManager Closing metric reporters for registry=solr.node, tag=null
   [junit4]   2> 2192091 INFO  (TEST-TestReplicationHandler.doTestReplicateAfterCoreReload-seed#[C579D2B8092125A8]) [    ] o.a.s.m.r.SolrJmxReporter Closing reporter [org.apache.solr.metrics.reporters.SolrJmxReporter@2f21b8c9: rootName = null, domain = solr.node, service url = null, agent id = null] for registry solr.node / com.codahale.metrics.MetricRegistry@146ac509
   [junit4]   2> 2192091 INFO  (qtp2019892034-13027) [    x:collection1] o.a.s.c.S.Request [collection1]  webapp=/solr path=/replication params={qt=/replication&wt=javabin&version=2&command=indexversion} status=0 QTime=0
   [junit4]   2> 2192091 INFO  (indexFetcher-3160-thread-1) [    x:collection1] o.a.s.h.IndexFetcher Master's generation: 1
   [junit4]   2> 2192091 INFO  (indexFetcher-3160-thread-1) [    x:collection1] o.a.s.h.IndexFetcher Master's version: 0
   [junit4]   2> 2192092 INFO  (indexFetcher-3160-thread-1) [    x:collection1] o.a.s.h.IndexFetcher Slave's generation: 1
   [junit4]   2> 2192092 INFO  (indexFetcher-3160-thread-1) [    x:collection1] o.a.s.h.IndexFetcher Slave's version: 0
   [junit4]   2> 2192092 INFO  (indexFetcher-3160-thread-1) [    x:collection1] o.a.s.h.IndexFetcher New index in Master. Deleting mine...
   [junit4]   2> 2192092 INFO  (indexFetcher-3160-thread-1) [    x:collection1] o.a.s.u.DirectUpdateHandler2 start commit{,optimize=false,openSearcher=true,waitSearcher=true,expungeDeletes=false,softCommit=false,prepareCommit=false}
   [junit4]   2> 2192092 INFO  (indexFetcher-3160-thread-1) [    x:collection1] o.a.s.u.SolrIndexWriter Calling setCommitData with IW:org.apache.solr.update.SolrIndexWriter@64e5575a commitCommandVersion:0
   [junit4]   2> 2192092 INFO  (indexFetcher-3160-thread-1) [    x:collection1] o.a.s.s.SolrIndexSearcher Opening [Searcher@5aa61c70[collection1] main]
   [junit4]   2> 2192092 INFO  (indexFetcher-3160-thread-1) [    x:collection1] o.a.s.u.DirectUpdateHandler2 end_commit_flush
   [junit4]   2> 2192093 INFO  (searcherExecutor-3156-thread-1-processing-x:collection1) [    x:collection1] o.a.s.c.SolrCore [collection1] Registered new searcher Searcher@5aa61c70[collection1] main{ExitableDirectoryReader(UninvertingDirectoryReader())}
   [junit4]   2> 2192095 INFO  (TEST-TestReplicationHandler.doTestReplicateAfterCoreReload-seed#[C579D2B8092125A8]) [    ] o.a.s.m.SolrMetricManager Closing metric reporters for registry=solr.jvm, tag=null
   [junit4]   2> 2192095 INFO  (TEST-TestReplicationHandler.doTestReplicateAfterCoreReload-seed#[C579D2B8092125A8]) [    ] o.a.s.m.r.SolrJmxReporter Closing reporter [org.apache.solr.metrics.reporters.SolrJmxReporter@f71126e: rootName = null, domain = solr.jvm, service url = null, agent id = null] for registry solr.jvm / com.codahale.metrics.MetricRegistry@5d86c5da
   [junit4]   2> 2192098 INFO  (TEST-TestReplicationHandler.doTestReplicateAfterCoreReload-seed#[C579D2B8092125A8]) [    ] o.a.s.m.SolrMetricManager Closing metric reporters for registry=solr.jetty, tag=null
   [junit4]   2> 2192098 INFO  (TEST-TestReplicationHandler.doTestReplicateAfterCoreReload-seed#[C579D2B8092125A8]) [    ] o.a.s.m.r.SolrJmxReporter Closing reporter [org.apache.solr.metrics.reporters.SolrJmxReporter@7ef764b: rootName = null, domain = solr.jetty, service url = null, agent id = null] for registry solr.jetty / com.codahale.metrics.MetricRegistry@516b0ae2
   [junit4]   2> 2192098 INFO  (coreCloseExecutor-3161-thread-1) [    x:collection1] o.a.s.c.SolrCore [collection1]  CLOSING SolrCore org.apache.solr.core.SolrCore@6a558c0b
   [junit4]   2> 2192098 INFO  (coreCloseExecutor-3161-thread-1) [    x:collection1] o.a.s.m.SolrMetricManager Closing metric reporters for registry=solr.core.collection1, tag=1783991307
   [junit4]   2> 2192098 INFO  (coreCloseExecutor-3161-thread-1) [    x:collection1] o.a.s.m.r.SolrJmxReporter Closing reporter [org.apache.solr.metrics.reporters.SolrJmxReporter@2f571f25: rootName = null, domain = solr.core.collection1, service url = null, agent id = null] for registry solr.core.collection1 / com.codahale.metrics.MetricRegistry@f778f9b
   [junit4]   2> 2192104 INFO  (TEST-TestReplicationHandler.doTestReplicateAfterCoreReload-seed#[C579D2B8092125A8]) [    ] o.e.j.s.h.ContextHandler Stopped o.e.j.s.ServletContextHandler@57f79a96{/solr,null,UNAVAILABLE}
   [junit4]   2> 2192111 INFO  (TEST-TestReplicationHandler.doTestReplicateAfterCoreReload-seed#[C579D2B8092125A8]) [    ] o.e.j.s.AbstractConnector Stopped ServerConnector@728e26ad{HTTP/1.1,[http/1.1]}{127.0.0.1:0}
   [junit4]   2> 2192111 INFO  (TEST-TestReplicationHandler.doTestReplicateAfterCoreReload-seed#[C579D2B8092125A8]) [    ] o.a.s.c.CoreContainer Shutting down CoreContainer instance=2076352106
   [junit4]   2> 2192111 INFO  (TEST-TestReplicationHandler.doTestReplicateAfterCoreReload-seed#[C579D2B8092125A8]) [    ] o.a.s.m.SolrMetricManager Closing metric reporters for registry=solr.node, tag=null
   [junit4]   2> 2192111 INFO  (TEST-TestReplicationHandler.doTestReplicateAfterCoreReload-seed#[C579D2B8092125A8]) [    ] o.a.s.m.r.SolrJmxReporter Closing reporter [org.apache.solr.metrics.reporters.SolrJmxReporter@2c1e8a0e: rootName = null, domain = solr.node, service url = null, agent id = null] for registry solr.node / com.codahale.metrics.MetricRegistry@5b8c7855
   [junit4]   2> 2192112 INFO  (TEST-TestReplicationHandler.doTestReplicateAfterCoreReload-seed#[C579D2B8092125A8]) [    ] o.a.s.m.SolrMetricManager Closing metric reporters for registry=solr.jvm, tag=null
   [junit4]   2> 2192112 INFO  (TEST-TestReplicationHandler.doTestReplicateAfterCoreReload-seed#[C579D2B8092125A8]) [    ] o.a.s.m.r.SolrJmxReporter Closing reporter [org.apache.solr.metrics.reporters.SolrJmxReporter@7026e7d3: rootName = null, domain = solr.jvm, service url = null, agent id = null] for registry solr.jvm / com.codahale.metrics.MetricRegistry@5d86c5da
   [junit4]   2> 2192113 INFO  (TEST-TestReplicationHandler.doTestReplicateAfterCoreReload-seed#[C579D2B8092125A8]) [    ] o.a.s.m.SolrMetricManager Closing metric reporters for registry=solr.jetty, tag=null
   [junit4]   2> 2192113 INFO  (TEST-TestReplicationHandler.doTestReplicateAfterCoreReload-seed#[C579D2B8092125A8]) [    ] o.a.s.m.r.SolrJmxReporter Closing reporter [org.apache.solr.metrics.reporters.SolrJmxReporter@682107b4: rootName = null, domain = solr.jetty, service url = null, agent id = null] for registry solr.jetty / com.codahale.metrics.MetricRegistry@516b0ae2
   [junit4]   2> 2192113 INFO  (coreCloseExecutor-3163-thread-1) [    x:collection1] o.a.s.c.SolrCore [collection1]  CLOSING SolrCore org.apache.solr.core.SolrCore@65fce74c
   [junit4]   2> 2192113 INFO  (coreCloseExecutor-3163-thread-1) [    x:collection1] o.a.s.m.SolrMetricManager Closing metric reporters for registry=solr.core.collection1, tag=1711073100
   [junit4]   2> 2192113 INFO  (coreCloseExecutor-3163-thread-1) [    x:collection1] o.a.s.m.r.SolrJmxReporter Closing reporter [org.apache.

[...truncated too long message...]

579D2B8092125A8]) [    ] o.a.s.m.r.SolrJmxReporter Closing reporter [org.apache.solr.metrics.reporters.SolrJmxReporter@3a1e5a79: rootName = null, domain = solr.jetty, service url = null, agent id = null] for registry solr.jetty / com.codahale.metrics.MetricRegistry@516b0ae2
   [junit4]   2> 2282756 INFO  (coreCloseExecutor-3817-thread-1) [    x:collection1] o.a.s.c.SolrCore [collection1]  CLOSING SolrCore org.apache.solr.core.SolrCore@64c73a41
   [junit4]   2> 2282756 INFO  (coreCloseExecutor-3817-thread-1) [    x:collection1] o.a.s.m.SolrMetricManager Closing metric reporters for registry=solr.core.collection1, tag=1690778177
   [junit4]   2> 2282756 INFO  (coreCloseExecutor-3817-thread-1) [    x:collection1] o.a.s.m.r.SolrJmxReporter Closing reporter [org.apache.solr.metrics.reporters.SolrJmxReporter@21c5a8bd: rootName = null, domain = solr.core.collection1, service url = null, agent id = null] for registry solr.core.collection1 / com.codahale.metrics.MetricRegistry@44ffb7c
   [junit4]   2> 2282766 INFO  (TEST-TestReplicationHandler.doTestRepeater-seed#[C579D2B8092125A8]) [    ] o.e.j.s.h.ContextHandler Stopped o.e.j.s.ServletContextHandler@51c1c5b6{/solr,null,UNAVAILABLE}
   [junit4]   2> 2282766 INFO  (TEST-TestReplicationHandler.doTestRepeater-seed#[C579D2B8092125A8]) [    ] o.a.s.SolrTestCaseJ4 ###Ending doTestRepeater
   [junit4]   2> 2282766 INFO  (TEST-TestReplicationHandler.doTestRepeater-seed#[C579D2B8092125A8]) [    ] o.e.j.s.AbstractConnector Stopped ServerConnector@70967707{HTTP/1.1,[http/1.1]}{127.0.0.1:0}
   [junit4]   2> 2282766 INFO  (TEST-TestReplicationHandler.doTestRepeater-seed#[C579D2B8092125A8]) [    ] o.a.s.c.CoreContainer Shutting down CoreContainer instance=298311968
   [junit4]   2> 2282766 INFO  (TEST-TestReplicationHandler.doTestRepeater-seed#[C579D2B8092125A8]) [    ] o.a.s.m.SolrMetricManager Closing metric reporters for registry=solr.node, tag=null
   [junit4]   2> 2282767 INFO  (TEST-TestReplicationHandler.doTestRepeater-seed#[C579D2B8092125A8]) [    ] o.a.s.m.r.SolrJmxReporter Closing reporter [org.apache.solr.metrics.reporters.SolrJmxReporter@1d2c582c: rootName = null, domain = solr.node, service url = null, agent id = null] for registry solr.node / com.codahale.metrics.MetricRegistry@6ca42eb
   [junit4]   2> 2282768 INFO  (TEST-TestReplicationHandler.doTestRepeater-seed#[C579D2B8092125A8]) [    ] o.a.s.m.SolrMetricManager Closing metric reporters for registry=solr.jvm, tag=null
   [junit4]   2> 2282768 INFO  (TEST-TestReplicationHandler.doTestRepeater-seed#[C579D2B8092125A8]) [    ] o.a.s.m.r.SolrJmxReporter Closing reporter [org.apache.solr.metrics.reporters.SolrJmxReporter@410eec49: rootName = null, domain = solr.jvm, service url = null, agent id = null] for registry solr.jvm / com.codahale.metrics.MetricRegistry@5d86c5da
   [junit4]   2> 2282769 INFO  (TEST-TestReplicationHandler.doTestRepeater-seed#[C579D2B8092125A8]) [    ] o.a.s.m.SolrMetricManager Closing metric reporters for registry=solr.jetty, tag=null
   [junit4]   2> 2282769 INFO  (TEST-TestReplicationHandler.doTestRepeater-seed#[C579D2B8092125A8]) [    ] o.a.s.m.r.SolrJmxReporter Closing reporter [org.apache.solr.metrics.reporters.SolrJmxReporter@1be36fce: rootName = null, domain = solr.jetty, service url = null, agent id = null] for registry solr.jetty / com.codahale.metrics.MetricRegistry@516b0ae2
   [junit4]   2> 2282770 INFO  (coreCloseExecutor-3819-thread-1) [    x:collection1] o.a.s.c.SolrCore [collection1]  CLOSING SolrCore org.apache.solr.core.SolrCore@2dc29260
   [junit4]   2> 2282770 INFO  (coreCloseExecutor-3819-thread-1) [    x:collection1] o.a.s.m.SolrMetricManager Closing metric reporters for registry=solr.core.collection1, tag=767726176
   [junit4]   2> 2282770 INFO  (coreCloseExecutor-3819-thread-1) [    x:collection1] o.a.s.m.r.SolrJmxReporter Closing reporter [org.apache.solr.metrics.reporters.SolrJmxReporter@68c009bc: rootName = null, domain = solr.core.collection1, service url = null, agent id = null] for registry solr.core.collection1 / com.codahale.metrics.MetricRegistry@fd95139
   [junit4]   2> 2282773 INFO  (TEST-TestReplicationHandler.doTestRepeater-seed#[C579D2B8092125A8]) [    ] o.e.j.s.h.ContextHandler Stopped o.e.j.s.ServletContextHandler@29f0eaa8{/solr,null,UNAVAILABLE}
   [junit4]   2> 2282773 INFO  (TEST-TestReplicationHandler.doTestRepeater-seed#[C579D2B8092125A8]) [    ] o.e.j.s.AbstractConnector Stopped ServerConnector@61a2b4f{HTTP/1.1,[http/1.1]}{127.0.0.1:0}
   [junit4]   2> 2282773 INFO  (TEST-TestReplicationHandler.doTestRepeater-seed#[C579D2B8092125A8]) [    ] o.a.s.c.CoreContainer Shutting down CoreContainer instance=933960234
   [junit4]   2> 2282773 INFO  (TEST-TestReplicationHandler.doTestRepeater-seed#[C579D2B8092125A8]) [    ] o.a.s.m.SolrMetricManager Closing metric reporters for registry=solr.node, tag=null
   [junit4]   2> 2282773 INFO  (TEST-TestReplicationHandler.doTestRepeater-seed#[C579D2B8092125A8]) [    ] o.a.s.m.r.SolrJmxReporter Closing reporter [org.apache.solr.metrics.reporters.SolrJmxReporter@545ee08c: rootName = null, domain = solr.node, service url = null, agent id = null] for registry solr.node / com.codahale.metrics.MetricRegistry@1411786f
   [junit4]   2> 2282774 INFO  (TEST-TestReplicationHandler.doTestRepeater-seed#[C579D2B8092125A8]) [    ] o.a.s.m.SolrMetricManager Closing metric reporters for registry=solr.jvm, tag=null
   [junit4]   2> 2282774 INFO  (TEST-TestReplicationHandler.doTestRepeater-seed#[C579D2B8092125A8]) [    ] o.a.s.m.r.SolrJmxReporter Closing reporter [org.apache.solr.metrics.reporters.SolrJmxReporter@60ad4b7e: rootName = null, domain = solr.jvm, service url = null, agent id = null] for registry solr.jvm / com.codahale.metrics.MetricRegistry@5d86c5da
   [junit4]   2> 2282775 INFO  (TEST-TestReplicationHandler.doTestRepeater-seed#[C579D2B8092125A8]) [    ] o.a.s.m.SolrMetricManager Closing metric reporters for registry=solr.jetty, tag=null
   [junit4]   2> 2282775 INFO  (TEST-TestReplicationHandler.doTestRepeater-seed#[C579D2B8092125A8]) [    ] o.a.s.m.r.SolrJmxReporter Closing reporter [org.apache.solr.metrics.reporters.SolrJmxReporter@27328ce1: rootName = null, domain = solr.jetty, service url = null, agent id = null] for registry solr.jetty / com.codahale.metrics.MetricRegistry@516b0ae2
   [junit4]   2> 2282775 INFO  (coreCloseExecutor-3821-thread-1) [    x:collection1] o.a.s.c.SolrCore [collection1]  CLOSING SolrCore org.apache.solr.core.SolrCore@5c5b1bde
   [junit4]   2> 2282776 INFO  (coreCloseExecutor-3821-thread-1) [    x:collection1] o.a.s.m.SolrMetricManager Closing metric reporters for registry=solr.core.collection1, tag=1549474782
   [junit4]   2> 2282776 INFO  (coreCloseExecutor-3821-thread-1) [    x:collection1] o.a.s.m.r.SolrJmxReporter Closing reporter [org.apache.solr.metrics.reporters.SolrJmxReporter@19598e31: rootName = null, domain = solr.core.collection1, service url = null, agent id = null] for registry solr.core.collection1 / com.codahale.metrics.MetricRegistry@10799826
   [junit4]   2> 2282778 INFO  (TEST-TestReplicationHandler.doTestRepeater-seed#[C579D2B8092125A8]) [    ] o.e.j.s.h.ContextHandler Stopped o.e.j.s.ServletContextHandler@2bd2b08{/solr,null,UNAVAILABLE}
   [junit4]   2> NOTE: leaving temporary files on disk at: /home/jenkins/workspace/Lucene-Solr-7.x-Linux/solr/build/solr-core/test/J0/temp/solr.handler.TestReplicationHandler_C579D2B8092125A8-001
   [junit4]   2> NOTE: test params are: codec=Asserting(Lucene70): {name=BlockTreeOrds(blocksize=128), id=BlockTreeOrds(blocksize=128), newname=BlockTreeOrds(blocksize=128)}, docValues:{}, maxPointsInLeafNode=620, maxMBSortInHeap=7.953848444155751, sim=RandomSimilarity(queryNorm=false): {}, locale=en-SX, timezone=America/Coral_Harbour
   [junit4]   2> NOTE: Linux 4.10.0-40-generic amd64/Oracle Corporation 10-ea (64-bit)/cpus=8,threads=1,free=188877752,total=498073600
   [junit4]   2> NOTE: All tests run in this JVM: [TestManagedResource, MetricTriggerTest, TestSerializedLuceneMatchVersion, StatelessScriptUpdateProcessorFactoryTest, DeleteInactiveReplicaTest, TestJsonFacetRefinement, DateRangeFieldTest, TestBinaryResponseWriter, TestSolrCloudSnapshots, BasicFunctionalityTest, TestFieldCacheVsDocValues, TestSearcherReuse, LeaderInitiatedRecoveryOnShardRestartTest, UpdateRequestProcessorFactoryTest, TestStressCloudBlindAtomicUpdates, TestConfigSetsAPI, TestCryptoKeys, TestMissingGroups, TestReversedWildcardFilterFactory, IndexSchemaRuntimeFieldTest, DirectoryFactoryTest, TestCoreBackup, BasicDistributedZkTest, TestSolrJ, TestFastOutputStream, ZkControllerTest, LeaderFailoverAfterPartitionTest, TestUnifiedSolrHighlighter, VersionInfoTest, TestFieldCacheReopen, DistributedQueryElevationComponentTest, FileUtilsTest, DistributedQueueTest, TermVectorComponentTest, SolrSlf4jReporterTest, TestTestInjection, RAMDirectoryFactoryTest, TestClusterProperties, TestPostingsSolrHighlighter, HdfsLockFactoryTest, BooleanFieldTest, TestSimpleTextCodec, TestSolrDeletionPolicy1, TestFreeTextSuggestions, SaslZkACLProviderTest, DistributedFacetPivotWhiteBoxTest, AutoAddReplicasPlanActionTest, TestSolrIndexConfig, TestEmbeddedSolrServerSchemaAPI, TestGeoJSONResponseWriter, TestInitQParser, TestNumericTerms32, TestLeaderElectionWithEmptyReplica, SliceStateTest, BlockJoinFacetDistribTest, ForceLeaderTest, ChaosMonkeyNothingIsSafeWithPullReplicasTest, TestSort, TestScoreJoinQPNoScore, StatsReloadRaceTest, TestPushWriter, TestLegacyFieldReuse, TestSchemaResource, TestUseDocValuesAsStored, ResponseHeaderTest, RulesTest, TestUtilizeNode, SolrMetricReporterTest, TestCorePropertiesReload, TestPullReplicaErrorHandling, DateFieldTest, PropertiesRequestHandlerTest, DistributedFacetPivotLongTailTest, TestImplicitCoreProperties, DistanceUnitsTest, TestAuthorizationFramework, PeerSyncTest, TestObjectReleaseTracker, TestConfigSetImmutable, TestReplicationHandler]
   [junit4] Completed [494/764 (2!)] on J0 in 90.82s, 16 tests, 1 error, 1 skipped <<< FAILURES!

[...truncated 41753 lines...]

Mime
View raw message