lucene-dev mailing list archives

Site index · List index
Message view « Date » · « Thread »
Top « Date » · « Thread »
From Policeman Jenkins Server <jenk...@thetaphi.de>
Subject [JENKINS] Lucene-Solr-master-Windows (64bit/jdk-9.0.1) - Build # 7068 - Still Unstable!
Date Sun, 24 Dec 2017 01:51:53 GMT
Build: https://jenkins.thetaphi.de/job/Lucene-Solr-master-Windows/7068/
Java: 64bit/jdk-9.0.1 -XX:+UseCompressedOops -XX:+UseParallelGC

4 tests failed.
FAILED:  junit.framework.TestSuite.org.apache.lucene.store.TestTrackingDirectoryWrapper

Error Message:
Could not remove the following files (in the order of attempts):    C:\Users\jenkins\workspace\Lucene-Solr-master-Windows\lucene\build\core\test\J1\temp\lucene.store.TestTrackingDirectoryWrapper_E2C7F68AF74E5E98-001\testRename-001: java.nio.file.AccessDeniedException: C:\Users\jenkins\workspace\Lucene-Solr-master-Windows\lucene\build\core\test\J1\temp\lucene.store.TestTrackingDirectoryWrapper_E2C7F68AF74E5E98-001\testRename-001    C:\Users\jenkins\workspace\Lucene-Solr-master-Windows\lucene\build\core\test\J1\temp\lucene.store.TestTrackingDirectoryWrapper_E2C7F68AF74E5E98-001: java.nio.file.DirectoryNotEmptyException: C:\Users\jenkins\workspace\Lucene-Solr-master-Windows\lucene\build\core\test\J1\temp\lucene.store.TestTrackingDirectoryWrapper_E2C7F68AF74E5E98-001 

Stack Trace:
java.io.IOException: Could not remove the following files (in the order of attempts):
   C:\Users\jenkins\workspace\Lucene-Solr-master-Windows\lucene\build\core\test\J1\temp\lucene.store.TestTrackingDirectoryWrapper_E2C7F68AF74E5E98-001\testRename-001: java.nio.file.AccessDeniedException: C:\Users\jenkins\workspace\Lucene-Solr-master-Windows\lucene\build\core\test\J1\temp\lucene.store.TestTrackingDirectoryWrapper_E2C7F68AF74E5E98-001\testRename-001
   C:\Users\jenkins\workspace\Lucene-Solr-master-Windows\lucene\build\core\test\J1\temp\lucene.store.TestTrackingDirectoryWrapper_E2C7F68AF74E5E98-001: java.nio.file.DirectoryNotEmptyException: C:\Users\jenkins\workspace\Lucene-Solr-master-Windows\lucene\build\core\test\J1\temp\lucene.store.TestTrackingDirectoryWrapper_E2C7F68AF74E5E98-001

	at __randomizedtesting.SeedInfo.seed([E2C7F68AF74E5E98]:0)
	at org.apache.lucene.util.IOUtils.rm(IOUtils.java:329)
	at org.apache.lucene.util.TestRuleTemporaryFilesCleanup.afterAlways(TestRuleTemporaryFilesCleanup.java:216)
	at com.carrotsearch.randomizedtesting.rules.TestRuleAdapter$1.afterAlways(TestRuleAdapter.java:31)
	at com.carrotsearch.randomizedtesting.rules.StatementAdapter.evaluate(StatementAdapter.java:43)
	at com.carrotsearch.randomizedtesting.rules.StatementAdapter.evaluate(StatementAdapter.java:36)
	at org.apache.lucene.util.TestRuleAssertionsRequired$1.evaluate(TestRuleAssertionsRequired.java:53)
	at org.apache.lucene.util.TestRuleMarkFailure$1.evaluate(TestRuleMarkFailure.java:47)
	at org.apache.lucene.util.TestRuleIgnoreAfterMaxFailures$1.evaluate(TestRuleIgnoreAfterMaxFailures.java:64)
	at org.apache.lucene.util.TestRuleIgnoreTestSuites$1.evaluate(TestRuleIgnoreTestSuites.java:54)
	at com.carrotsearch.randomizedtesting.rules.StatementAdapter.evaluate(StatementAdapter.java:36)
	at com.carrotsearch.randomizedtesting.ThreadLeakControl$StatementRunner.run(ThreadLeakControl.java:368)
	at java.base/java.lang.Thread.run(Thread.java:844)


FAILED:  junit.framework.TestSuite.org.apache.solr.TestHighlightDedupGrouping

Error Message:
Could not remove the following files (in the order of attempts):    C:\Users\jenkins\workspace\Lucene-Solr-master-Windows\solr\build\solr-core\test\J0\temp\solr.TestHighlightDedupGrouping_8F7D1D906AFFC04D-001\tempDir-001\shard1\collection1: java.nio.file.DirectoryNotEmptyException: C:\Users\jenkins\workspace\Lucene-Solr-master-Windows\solr\build\solr-core\test\J0\temp\solr.TestHighlightDedupGrouping_8F7D1D906AFFC04D-001\tempDir-001\shard1\collection1    C:\Users\jenkins\workspace\Lucene-Solr-master-Windows\solr\build\solr-core\test\J0\temp\solr.TestHighlightDedupGrouping_8F7D1D906AFFC04D-001\tempDir-001\shard1: java.nio.file.DirectoryNotEmptyException: C:\Users\jenkins\workspace\Lucene-Solr-master-Windows\solr\build\solr-core\test\J0\temp\solr.TestHighlightDedupGrouping_8F7D1D906AFFC04D-001\tempDir-001\shard1    C:\Users\jenkins\workspace\Lucene-Solr-master-Windows\solr\build\solr-core\test\J0\temp\solr.TestHighlightDedupGrouping_8F7D1D906AFFC04D-001\tempDir-001: java.nio.file.DirectoryNotEmptyException: C:\Users\jenkins\workspace\Lucene-Solr-master-Windows\solr\build\solr-core\test\J0\temp\solr.TestHighlightDedupGrouping_8F7D1D906AFFC04D-001\tempDir-001 

Stack Trace:
java.io.IOException: Could not remove the following files (in the order of attempts):
   C:\Users\jenkins\workspace\Lucene-Solr-master-Windows\solr\build\solr-core\test\J0\temp\solr.TestHighlightDedupGrouping_8F7D1D906AFFC04D-001\tempDir-001\shard1\collection1: java.nio.file.DirectoryNotEmptyException: C:\Users\jenkins\workspace\Lucene-Solr-master-Windows\solr\build\solr-core\test\J0\temp\solr.TestHighlightDedupGrouping_8F7D1D906AFFC04D-001\tempDir-001\shard1\collection1
   C:\Users\jenkins\workspace\Lucene-Solr-master-Windows\solr\build\solr-core\test\J0\temp\solr.TestHighlightDedupGrouping_8F7D1D906AFFC04D-001\tempDir-001\shard1: java.nio.file.DirectoryNotEmptyException: C:\Users\jenkins\workspace\Lucene-Solr-master-Windows\solr\build\solr-core\test\J0\temp\solr.TestHighlightDedupGrouping_8F7D1D906AFFC04D-001\tempDir-001\shard1
   C:\Users\jenkins\workspace\Lucene-Solr-master-Windows\solr\build\solr-core\test\J0\temp\solr.TestHighlightDedupGrouping_8F7D1D906AFFC04D-001\tempDir-001: java.nio.file.DirectoryNotEmptyException: C:\Users\jenkins\workspace\Lucene-Solr-master-Windows\solr\build\solr-core\test\J0\temp\solr.TestHighlightDedupGrouping_8F7D1D906AFFC04D-001\tempDir-001

	at __randomizedtesting.SeedInfo.seed([8F7D1D906AFFC04D]:0)
	at org.apache.lucene.util.IOUtils.rm(IOUtils.java:329)
	at org.apache.lucene.util.TestRuleTemporaryFilesCleanup.afterAlways(TestRuleTemporaryFilesCleanup.java:216)
	at com.carrotsearch.randomizedtesting.rules.TestRuleAdapter$1.afterAlways(TestRuleAdapter.java:31)
	at com.carrotsearch.randomizedtesting.rules.StatementAdapter.evaluate(StatementAdapter.java:43)
	at com.carrotsearch.randomizedtesting.rules.StatementAdapter.evaluate(StatementAdapter.java:36)
	at org.apache.lucene.util.TestRuleAssertionsRequired$1.evaluate(TestRuleAssertionsRequired.java:53)
	at org.apache.lucene.util.TestRuleMarkFailure$1.evaluate(TestRuleMarkFailure.java:47)
	at org.apache.lucene.util.TestRuleIgnoreAfterMaxFailures$1.evaluate(TestRuleIgnoreAfterMaxFailures.java:64)
	at org.apache.lucene.util.TestRuleIgnoreTestSuites$1.evaluate(TestRuleIgnoreTestSuites.java:54)
	at com.carrotsearch.randomizedtesting.rules.StatementAdapter.evaluate(StatementAdapter.java:36)
	at com.carrotsearch.randomizedtesting.ThreadLeakControl$StatementRunner.run(ThreadLeakControl.java:368)
	at java.base/java.lang.Thread.run(Thread.java:844)


FAILED:  junit.framework.TestSuite.org.apache.solr.handler.component.DistributedSuggestComponentTest

Error Message:
Could not remove the following files (in the order of attempts):    C:\Users\jenkins\workspace\Lucene-Solr-master-Windows\solr\build\solr-core\test\J0\temp\solr.handler.component.DistributedSuggestComponentTest_8F7D1D906AFFC04D-001\tempDir-001\shard2\collection1: java.nio.file.DirectoryNotEmptyException: C:\Users\jenkins\workspace\Lucene-Solr-master-Windows\solr\build\solr-core\test\J0\temp\solr.handler.component.DistributedSuggestComponentTest_8F7D1D906AFFC04D-001\tempDir-001\shard2\collection1    C:\Users\jenkins\workspace\Lucene-Solr-master-Windows\solr\build\solr-core\test\J0\temp\solr.handler.component.DistributedSuggestComponentTest_8F7D1D906AFFC04D-001\tempDir-001\shard2: java.nio.file.DirectoryNotEmptyException: C:\Users\jenkins\workspace\Lucene-Solr-master-Windows\solr\build\solr-core\test\J0\temp\solr.handler.component.DistributedSuggestComponentTest_8F7D1D906AFFC04D-001\tempDir-001\shard2    C:\Users\jenkins\workspace\Lucene-Solr-master-Windows\solr\build\solr-core\test\J0\temp\solr.handler.component.DistributedSuggestComponentTest_8F7D1D906AFFC04D-001\tempDir-001: java.nio.file.DirectoryNotEmptyException: C:\Users\jenkins\workspace\Lucene-Solr-master-Windows\solr\build\solr-core\test\J0\temp\solr.handler.component.DistributedSuggestComponentTest_8F7D1D906AFFC04D-001\tempDir-001 

Stack Trace:
java.io.IOException: Could not remove the following files (in the order of attempts):
   C:\Users\jenkins\workspace\Lucene-Solr-master-Windows\solr\build\solr-core\test\J0\temp\solr.handler.component.DistributedSuggestComponentTest_8F7D1D906AFFC04D-001\tempDir-001\shard2\collection1: java.nio.file.DirectoryNotEmptyException: C:\Users\jenkins\workspace\Lucene-Solr-master-Windows\solr\build\solr-core\test\J0\temp\solr.handler.component.DistributedSuggestComponentTest_8F7D1D906AFFC04D-001\tempDir-001\shard2\collection1
   C:\Users\jenkins\workspace\Lucene-Solr-master-Windows\solr\build\solr-core\test\J0\temp\solr.handler.component.DistributedSuggestComponentTest_8F7D1D906AFFC04D-001\tempDir-001\shard2: java.nio.file.DirectoryNotEmptyException: C:\Users\jenkins\workspace\Lucene-Solr-master-Windows\solr\build\solr-core\test\J0\temp\solr.handler.component.DistributedSuggestComponentTest_8F7D1D906AFFC04D-001\tempDir-001\shard2
   C:\Users\jenkins\workspace\Lucene-Solr-master-Windows\solr\build\solr-core\test\J0\temp\solr.handler.component.DistributedSuggestComponentTest_8F7D1D906AFFC04D-001\tempDir-001: java.nio.file.DirectoryNotEmptyException: C:\Users\jenkins\workspace\Lucene-Solr-master-Windows\solr\build\solr-core\test\J0\temp\solr.handler.component.DistributedSuggestComponentTest_8F7D1D906AFFC04D-001\tempDir-001

	at __randomizedtesting.SeedInfo.seed([8F7D1D906AFFC04D]:0)
	at org.apache.lucene.util.IOUtils.rm(IOUtils.java:329)
	at org.apache.lucene.util.TestRuleTemporaryFilesCleanup.afterAlways(TestRuleTemporaryFilesCleanup.java:216)
	at com.carrotsearch.randomizedtesting.rules.TestRuleAdapter$1.afterAlways(TestRuleAdapter.java:31)
	at com.carrotsearch.randomizedtesting.rules.StatementAdapter.evaluate(StatementAdapter.java:43)
	at com.carrotsearch.randomizedtesting.rules.StatementAdapter.evaluate(StatementAdapter.java:36)
	at org.apache.lucene.util.TestRuleAssertionsRequired$1.evaluate(TestRuleAssertionsRequired.java:53)
	at org.apache.lucene.util.TestRuleMarkFailure$1.evaluate(TestRuleMarkFailure.java:47)
	at org.apache.lucene.util.TestRuleIgnoreAfterMaxFailures$1.evaluate(TestRuleIgnoreAfterMaxFailures.java:64)
	at org.apache.lucene.util.TestRuleIgnoreTestSuites$1.evaluate(TestRuleIgnoreTestSuites.java:54)
	at com.carrotsearch.randomizedtesting.rules.StatementAdapter.evaluate(StatementAdapter.java:36)
	at com.carrotsearch.randomizedtesting.ThreadLeakControl$StatementRunner.run(ThreadLeakControl.java:368)
	at java.base/java.lang.Thread.run(Thread.java:844)


FAILED:  junit.framework.TestSuite.org.apache.solr.update.processor.TestOpenNLPExtractNamedEntitiesUpdateProcessorFactory

Error Message:
Could not remove the following files (in the order of attempts):    C:\Users\jenkins\workspace\Lucene-Solr-master-Windows\solr\build\contrib\solr-analysis-extras\test\J1\temp\solr.update.processor.TestOpenNLPExtractNamedEntitiesUpdateProcessorFactory_121B9D86FD36B1CF-001\tempDir-001\collection1\conf: java.nio.file.DirectoryNotEmptyException: C:\Users\jenkins\workspace\Lucene-Solr-master-Windows\solr\build\contrib\solr-analysis-extras\test\J1\temp\solr.update.processor.TestOpenNLPExtractNamedEntitiesUpdateProcessorFactory_121B9D86FD36B1CF-001\tempDir-001\collection1\conf    C:\Users\jenkins\workspace\Lucene-Solr-master-Windows\solr\build\contrib\solr-analysis-extras\test\J1\temp\solr.update.processor.TestOpenNLPExtractNamedEntitiesUpdateProcessorFactory_121B9D86FD36B1CF-001\tempDir-001\collection1: java.nio.file.DirectoryNotEmptyException: C:\Users\jenkins\workspace\Lucene-Solr-master-Windows\solr\build\contrib\solr-analysis-extras\test\J1\temp\solr.update.processor.TestOpenNLPExtractNamedEntitiesUpdateProcessorFactory_121B9D86FD36B1CF-001\tempDir-001\collection1    C:\Users\jenkins\workspace\Lucene-Solr-master-Windows\solr\build\contrib\solr-analysis-extras\test\J1\temp\solr.update.processor.TestOpenNLPExtractNamedEntitiesUpdateProcessorFactory_121B9D86FD36B1CF-001\tempDir-001: java.nio.file.DirectoryNotEmptyException: C:\Users\jenkins\workspace\Lucene-Solr-master-Windows\solr\build\contrib\solr-analysis-extras\test\J1\temp\solr.update.processor.TestOpenNLPExtractNamedEntitiesUpdateProcessorFactory_121B9D86FD36B1CF-001\tempDir-001    C:\Users\jenkins\workspace\Lucene-Solr-master-Windows\solr\build\contrib\solr-analysis-extras\test\J1\temp\solr.update.processor.TestOpenNLPExtractNamedEntitiesUpdateProcessorFactory_121B9D86FD36B1CF-001\tempDir-001\collection1\conf\en-test-ner-person.bin: java.nio.file.AccessDeniedException: C:\Users\jenkins\workspace\Lucene-Solr-master-Windows\solr\build\contrib\solr-analysis-extras\test\J1\temp\solr.update.processor.TestOpenNLPExtractNamedEntitiesUpdateProcessorFactory_121B9D86FD36B1CF-001\tempDir-001\collection1\conf\en-test-ner-person.bin    C:\Users\jenkins\workspace\Lucene-Solr-master-Windows\solr\build\contrib\solr-analysis-extras\test\J1\temp\solr.update.processor.TestOpenNLPExtractNamedEntitiesUpdateProcessorFactory_121B9D86FD36B1CF-001\tempDir-001\collection1\conf\en-test-sent.bin: java.nio.file.AccessDeniedException: C:\Users\jenkins\workspace\Lucene-Solr-master-Windows\solr\build\contrib\solr-analysis-extras\test\J1\temp\solr.update.processor.TestOpenNLPExtractNamedEntitiesUpdateProcessorFactory_121B9D86FD36B1CF-001\tempDir-001\collection1\conf\en-test-sent.bin    C:\Users\jenkins\workspace\Lucene-Solr-master-Windows\solr\build\contrib\solr-analysis-extras\test\J1\temp\solr.update.processor.TestOpenNLPExtractNamedEntitiesUpdateProcessorFactory_121B9D86FD36B1CF-001\tempDir-001\collection1\conf\en-test-tokenizer.bin: java.nio.file.AccessDeniedException: C:\Users\jenkins\workspace\Lucene-Solr-master-Windows\solr\build\contrib\solr-analysis-extras\test\J1\temp\solr.update.processor.TestOpenNLPExtractNamedEntitiesUpdateProcessorFactory_121B9D86FD36B1CF-001\tempDir-001\collection1\conf\en-test-tokenizer.bin    C:\Users\jenkins\workspace\Lucene-Solr-master-Windows\solr\build\contrib\solr-analysis-extras\test\J1\temp\solr.update.processor.TestOpenNLPExtractNamedEntitiesUpdateProcessorFactory_121B9D86FD36B1CF-001: java.nio.file.DirectoryNotEmptyException: C:\Users\jenkins\workspace\Lucene-Solr-master-Windows\solr\build\contrib\solr-analysis-extras\test\J1\temp\solr.update.processor.TestOpenNLPExtractNamedEntitiesUpdateProcessorFactory_121B9D86FD36B1CF-001 

Stack Trace:
java.io.IOException: Could not remove the following files (in the order of attempts):
   C:\Users\jenkins\workspace\Lucene-Solr-master-Windows\solr\build\contrib\solr-analysis-extras\test\J1\temp\solr.update.processor.TestOpenNLPExtractNamedEntitiesUpdateProcessorFactory_121B9D86FD36B1CF-001\tempDir-001\collection1\conf: java.nio.file.DirectoryNotEmptyException: C:\Users\jenkins\workspace\Lucene-Solr-master-Windows\solr\build\contrib\solr-analysis-extras\test\J1\temp\solr.update.processor.TestOpenNLPExtractNamedEntitiesUpdateProcessorFactory_121B9D86FD36B1CF-001\tempDir-001\collection1\conf
   C:\Users\jenkins\workspace\Lucene-Solr-master-Windows\solr\build\contrib\solr-analysis-extras\test\J1\temp\solr.update.processor.TestOpenNLPExtractNamedEntitiesUpdateProcessorFactory_121B9D86FD36B1CF-001\tempDir-001\collection1: java.nio.file.DirectoryNotEmptyException: C:\Users\jenkins\workspace\Lucene-Solr-master-Windows\solr\build\contrib\solr-analysis-extras\test\J1\temp\solr.update.processor.TestOpenNLPExtractNamedEntitiesUpdateProcessorFactory_121B9D86FD36B1CF-001\tempDir-001\collection1
   C:\Users\jenkins\workspace\Lucene-Solr-master-Windows\solr\build\contrib\solr-analysis-extras\test\J1\temp\solr.update.processor.TestOpenNLPExtractNamedEntitiesUpdateProcessorFactory_121B9D86FD36B1CF-001\tempDir-001: java.nio.file.DirectoryNotEmptyException: C:\Users\jenkins\workspace\Lucene-Solr-master-Windows\solr\build\contrib\solr-analysis-extras\test\J1\temp\solr.update.processor.TestOpenNLPExtractNamedEntitiesUpdateProcessorFactory_121B9D86FD36B1CF-001\tempDir-001
   C:\Users\jenkins\workspace\Lucene-Solr-master-Windows\solr\build\contrib\solr-analysis-extras\test\J1\temp\solr.update.processor.TestOpenNLPExtractNamedEntitiesUpdateProcessorFactory_121B9D86FD36B1CF-001\tempDir-001\collection1\conf\en-test-ner-person.bin: java.nio.file.AccessDeniedException: C:\Users\jenkins\workspace\Lucene-Solr-master-Windows\solr\build\contrib\solr-analysis-extras\test\J1\temp\solr.update.processor.TestOpenNLPExtractNamedEntitiesUpdateProcessorFactory_121B9D86FD36B1CF-001\tempDir-001\collection1\conf\en-test-ner-person.bin
   C:\Users\jenkins\workspace\Lucene-Solr-master-Windows\solr\build\contrib\solr-analysis-extras\test\J1\temp\solr.update.processor.TestOpenNLPExtractNamedEntitiesUpdateProcessorFactory_121B9D86FD36B1CF-001\tempDir-001\collection1\conf\en-test-sent.bin: java.nio.file.AccessDeniedException: C:\Users\jenkins\workspace\Lucene-Solr-master-Windows\solr\build\contrib\solr-analysis-extras\test\J1\temp\solr.update.processor.TestOpenNLPExtractNamedEntitiesUpdateProcessorFactory_121B9D86FD36B1CF-001\tempDir-001\collection1\conf\en-test-sent.bin
   C:\Users\jenkins\workspace\Lucene-Solr-master-Windows\solr\build\contrib\solr-analysis-extras\test\J1\temp\solr.update.processor.TestOpenNLPExtractNamedEntitiesUpdateProcessorFactory_121B9D86FD36B1CF-001\tempDir-001\collection1\conf\en-test-tokenizer.bin: java.nio.file.AccessDeniedException: C:\Users\jenkins\workspace\Lucene-Solr-master-Windows\solr\build\contrib\solr-analysis-extras\test\J1\temp\solr.update.processor.TestOpenNLPExtractNamedEntitiesUpdateProcessorFactory_121B9D86FD36B1CF-001\tempDir-001\collection1\conf\en-test-tokenizer.bin
   C:\Users\jenkins\workspace\Lucene-Solr-master-Windows\solr\build\contrib\solr-analysis-extras\test\J1\temp\solr.update.processor.TestOpenNLPExtractNamedEntitiesUpdateProcessorFactory_121B9D86FD36B1CF-001: java.nio.file.DirectoryNotEmptyException: C:\Users\jenkins\workspace\Lucene-Solr-master-Windows\solr\build\contrib\solr-analysis-extras\test\J1\temp\solr.update.processor.TestOpenNLPExtractNamedEntitiesUpdateProcessorFactory_121B9D86FD36B1CF-001

	at __randomizedtesting.SeedInfo.seed([121B9D86FD36B1CF]:0)
	at org.apache.lucene.util.IOUtils.rm(IOUtils.java:329)
	at org.apache.lucene.util.TestRuleTemporaryFilesCleanup.afterAlways(TestRuleTemporaryFilesCleanup.java:216)
	at com.carrotsearch.randomizedtesting.rules.TestRuleAdapter$1.afterAlways(TestRuleAdapter.java:31)
	at com.carrotsearch.randomizedtesting.rules.StatementAdapter.evaluate(StatementAdapter.java:43)
	at com.carrotsearch.randomizedtesting.rules.StatementAdapter.evaluate(StatementAdapter.java:36)
	at org.apache.lucene.util.TestRuleAssertionsRequired$1.evaluate(TestRuleAssertionsRequired.java:53)
	at org.apache.lucene.util.TestRuleMarkFailure$1.evaluate(TestRuleMarkFailure.java:47)
	at org.apache.lucene.util.TestRuleIgnoreAfterMaxFailures$1.evaluate(TestRuleIgnoreAfterMaxFailures.java:64)
	at org.apache.lucene.util.TestRuleIgnoreTestSuites$1.evaluate(TestRuleIgnoreTestSuites.java:54)
	at com.carrotsearch.randomizedtesting.rules.StatementAdapter.evaluate(StatementAdapter.java:36)
	at com.carrotsearch.randomizedtesting.ThreadLeakControl$StatementRunner.run(ThreadLeakControl.java:368)
	at java.base/java.lang.Thread.run(Thread.java:844)




Build Log:
[...truncated 664 lines...]
   [junit4] Suite: org.apache.lucene.store.TestTrackingDirectoryWrapper
   [junit4] IGNOR/A 0.00s J1 | TestTrackingDirectoryWrapper.testPendingDeletions
   [junit4]    > Assumption #1: we can only install VirusCheckingFS on an FSDirectory
   [junit4] IGNOR/A 0.00s J1 | TestTrackingDirectoryWrapper.testFsyncDoesntCreateNewFiles
   [junit4]    > Assumption #1: test only works for FSDirectory subclasses
   [junit4]   2> NOTE: test params are: codec=Asserting(Lucene70): {}, docValues:{}, maxPointsInLeafNode=2013, maxMBSortInHeap=6.849464479479833, sim=Asserting(org.apache.lucene.search.similarities.AssertingSimilarity@5c325c41), locale=en-MT, timezone=America/Anchorage
   [junit4]   2> NOTE: Windows 10 10.0 amd64/Oracle Corporation 9.0.1 (64-bit)/cpus=3,threads=1,free=190832160,total=347602944
   [junit4]   2> NOTE: All tests run in this JVM: [TestLongBitSet, TestOfflineSorter, TestPerSegmentDeletes, TestOrdinalMap, TestSentinelIntSet, TestMutableValues, TestBooleanRewrites, TestTimSorter, TestFixedBitDocIdSet, TestIndexReaderClose, TestNativeFSLockFactory, TestTermRangeQuery, Test2BBinaryDocValues, TestGraphTokenizers, TestSimpleSearchEquivalence, TestTotalHitCountCollector, TestPrefixCodedTerms, TestMaxPosition, TestFastDecompressionMode, TestSimpleFSDirectory, TestDateTools, TestFieldType, TestFilterDirectoryReader, Test2BPagedBytes, TestAxiomaticF2LOG, TestSetOnce, TestDeletionPolicy, TestReaderClosed, TestIsCurrent, TestField, TestTopFieldCollectorEarlyTermination, TestFilterWeight, TestTransactionRollback, TestCustomTermFreq, TestNearSpansOrdered, TestCharsRefBuilder, TestConcurrentMergeScheduler, TestNotDocIdSet, TestBasicModelIne, TestTermsEnum, TestMultiTermConstantScore, TestRadixSelector, TestCustomSearcherSort, TestLogMergePolicy, TestLMDirichletSimilarity, TestSynonymQuery, TestSmallFloat, TestByteBlockPool, TestBytesRefHash, TestSPIClassIterator, TestMultiset, TestMutablePointsReaderUtils, TestNoDeletionPolicy, TestIndexWriterConfig, TestLucene50CompoundFormat, TestBooleanScorer, TestMmapDirectory, TestSpanOrQuery, TestTrackingDirectoryWrapper]
   [junit4]   2> NOTE: reproduce with: ant test  -Dtestcase=TestTrackingDirectoryWrapper -Dtests.seed=E2C7F68AF74E5E98 -Dtests.slow=true -Dtests.locale=en-MT -Dtests.timezone=America/Anchorage -Dtests.asserts=true -Dtests.file.encoding=UTF-8
   [junit4] ERROR   0.00s J1 | TestTrackingDirectoryWrapper (suite) <<<
   [junit4]    > Throwable #1: java.io.IOException: Could not remove the following files (in the order of attempts):
   [junit4]    >    C:\Users\jenkins\workspace\Lucene-Solr-master-Windows\lucene\build\core\test\J1\temp\lucene.store.TestTrackingDirectoryWrapper_E2C7F68AF74E5E98-001\testRename-001: java.nio.file.AccessDeniedException: C:\Users\jenkins\workspace\Lucene-Solr-master-Windows\lucene\build\core\test\J1\temp\lucene.store.TestTrackingDirectoryWrapper_E2C7F68AF74E5E98-001\testRename-001
   [junit4]    >    C:\Users\jenkins\workspace\Lucene-Solr-master-Windows\lucene\build\core\test\J1\temp\lucene.store.TestTrackingDirectoryWrapper_E2C7F68AF74E5E98-001: java.nio.file.DirectoryNotEmptyException: C:\Users\jenkins\workspace\Lucene-Solr-master-Windows\lucene\build\core\test\J1\temp\lucene.store.TestTrackingDirectoryWrapper_E2C7F68AF74E5E98-001
   [junit4]    > 	at __randomizedtesting.SeedInfo.seed([E2C7F68AF74E5E98]:0)
   [junit4]    > 	at org.apache.lucene.util.IOUtils.rm(IOUtils.java:329)
   [junit4]    > 	at java.base/java.lang.Thread.run(Thread.java:844)
   [junit4] Completed [139/475 (1!)] on J1 in 0.37s, 47 tests, 1 error, 2 skipped <<< FAILURES!

[...truncated 11103 lines...]
   [junit4] Suite: org.apache.solr.handler.component.DistributedSuggestComponentTest
   [junit4]   2> 178792 INFO  (SUITE-DistributedSuggestComponentTest-seed#[8F7D1D906AFFC04D]-worker) [    ] o.a.s.SolrTestCaseJ4 SecureRandom sanity checks: test.solr.allowed.securerandom=null & java.security.egd=file:/dev/./urandom
   [junit4]   2> Creating dataDir: C:\Users\jenkins\workspace\Lucene-Solr-master-Windows\solr\build\solr-core\test\J0\temp\solr.handler.component.DistributedSuggestComponentTest_8F7D1D906AFFC04D-001\init-core-data-001
   [junit4]   2> 178794 WARN  (SUITE-DistributedSuggestComponentTest-seed#[8F7D1D906AFFC04D]-worker) [    ] o.a.s.SolrTestCaseJ4 startTrackingSearchers: numOpens=6 numCloses=6
   [junit4]   2> 178794 INFO  (SUITE-DistributedSuggestComponentTest-seed#[8F7D1D906AFFC04D]-worker) [    ] o.a.s.SolrTestCaseJ4 Using PointFields (NUMERIC_POINTS_SYSPROP=true) w/NUMERIC_DOCVALUES_SYSPROP=true
   [junit4]   2> 178795 INFO  (SUITE-DistributedSuggestComponentTest-seed#[8F7D1D906AFFC04D]-worker) [    ] o.a.s.SolrTestCaseJ4 Randomized ssl (false) and clientAuth (false) via: @org.apache.solr.util.RandomizeSSL(reason="", value=0.0/0.0, ssl=0.0/0.0, clientAuth=0.0/0.0)
   [junit4]   2> 178797 INFO  (SUITE-DistributedSuggestComponentTest-seed#[8F7D1D906AFFC04D]-worker) [    ] o.a.s.BaseDistributedSearchTestCase Setting hostContext system property: /
   [junit4]   2> 179263 INFO  (TEST-DistributedSuggestComponentTest.test-seed#[8F7D1D906AFFC04D]) [    ] o.a.s.SolrTestCaseJ4 Writing core.properties file to C:\Users\jenkins\workspace\Lucene-Solr-master-Windows\solr\build\solr-core\test\J0\temp\solr.handler.component.DistributedSuggestComponentTest_8F7D1D906AFFC04D-001\tempDir-001\control\cores\collection1
   [junit4]   2> 179265 INFO  (TEST-DistributedSuggestComponentTest.test-seed#[8F7D1D906AFFC04D]) [    ] o.e.j.s.Server jetty-9.3.20.v20170531
   [junit4]   2> 179266 INFO  (TEST-DistributedSuggestComponentTest.test-seed#[8F7D1D906AFFC04D]) [    ] o.e.j.s.h.ContextHandler Started o.e.j.s.ServletContextHandler@4738443d{/,null,AVAILABLE}
   [junit4]   2> 179269 INFO  (TEST-DistributedSuggestComponentTest.test-seed#[8F7D1D906AFFC04D]) [    ] o.e.j.s.AbstractConnector Started ServerConnector@3abe7856{HTTP/1.1,[http/1.1]}{127.0.0.1:54539}
   [junit4]   2> 179269 INFO  (TEST-DistributedSuggestComponentTest.test-seed#[8F7D1D906AFFC04D]) [    ] o.e.j.s.Server Started @189938ms
   [junit4]   2> 179269 INFO  (TEST-DistributedSuggestComponentTest.test-seed#[8F7D1D906AFFC04D]) [    ] o.a.s.c.s.e.JettySolrRunner Jetty properties: {hostContext=/, solrconfig=solrconfig-suggestercomponent.xml, hostPort=54539, coreRootDirectory=C:\Users\jenkins\workspace\Lucene-Solr-master-Windows\solr\build\solr-core\test\J0\temp\solr.handler.component.DistributedSuggestComponentTest_8F7D1D906AFFC04D-001\tempDir-001\control\cores}
   [junit4]   2> 179270 ERROR (TEST-DistributedSuggestComponentTest.test-seed#[8F7D1D906AFFC04D]) [    ] o.a.s.u.StartupLoggingUtils Missing Java Option solr.log.dir. Logging may be missing or incomplete.
   [junit4]   2> 179270 INFO  (TEST-DistributedSuggestComponentTest.test-seed#[8F7D1D906AFFC04D]) [    ] o.a.s.s.SolrDispatchFilter  ___      _       Welcome to Apache Solr? version 8.0.0
   [junit4]   2> 179270 INFO  (TEST-DistributedSuggestComponentTest.test-seed#[8F7D1D906AFFC04D]) [    ] o.a.s.s.SolrDispatchFilter / __| ___| |_ _   Starting in standalone mode on port null
   [junit4]   2> 179270 INFO  (TEST-DistributedSuggestComponentTest.test-seed#[8F7D1D906AFFC04D]) [    ] o.a.s.s.SolrDispatchFilter \__ \/ _ \ | '_|  Install dir: null
   [junit4]   2> 179270 INFO  (TEST-DistributedSuggestComponentTest.test-seed#[8F7D1D906AFFC04D]) [    ] o.a.s.s.SolrDispatchFilter |___/\___/_|_|    Start time: 2017-12-24T00:37:50.630404600Z
   [junit4]   2> 179280 INFO  (TEST-DistributedSuggestComponentTest.test-seed#[8F7D1D906AFFC04D]) [    ] o.a.s.c.SolrXmlConfig Loading container configuration from C:\Users\jenkins\workspace\Lucene-Solr-master-Windows\solr\build\solr-core\test\J0\temp\solr.handler.component.DistributedSuggestComponentTest_8F7D1D906AFFC04D-001\tempDir-001\control\solr.xml
   [junit4]   2> 179284 INFO  (TEST-DistributedSuggestComponentTest.test-seed#[8F7D1D906AFFC04D]) [    ] o.a.s.c.SolrXmlConfig Configuration parameter autoReplicaFailoverWorkLoopDelay is ignored
   [junit4]   2> 179284 INFO  (TEST-DistributedSuggestComponentTest.test-seed#[8F7D1D906AFFC04D]) [    ] o.a.s.c.SolrXmlConfig Configuration parameter autoReplicaFailoverBadNodeExpiration is ignored
   [junit4]   2> 179285 INFO  (TEST-DistributedSuggestComponentTest.test-seed#[8F7D1D906AFFC04D]) [    ] o.a.s.c.SolrXmlConfig MBean server found: com.sun.jmx.mbeanserver.JmxMBeanServer@3857a98b, but no JMX reporters were configured - adding default JMX reporter.
   [junit4]   2> 179334 INFO  (TEST-DistributedSuggestComponentTest.test-seed#[8F7D1D906AFFC04D]) [    ] o.a.s.m.r.SolrJmxReporter JMX monitoring for 'solr.node' (registry 'solr.node') enabled at server: com.sun.jmx.mbeanserver.JmxMBeanServer@3857a98b
   [junit4]   2> 179343 INFO  (TEST-DistributedSuggestComponentTest.test-seed#[8F7D1D906AFFC04D]) [    ] o.a.s.m.r.SolrJmxReporter JMX monitoring for 'solr.jvm' (registry 'solr.jvm') enabled at server: com.sun.jmx.mbeanserver.JmxMBeanServer@3857a98b
   [junit4]   2> 179344 INFO  (TEST-DistributedSuggestComponentTest.test-seed#[8F7D1D906AFFC04D]) [    ] o.a.s.m.r.SolrJmxReporter JMX monitoring for 'solr.jetty' (registry 'solr.jetty') enabled at server: com.sun.jmx.mbeanserver.JmxMBeanServer@3857a98b
   [junit4]   2> 179346 INFO  (TEST-DistributedSuggestComponentTest.test-seed#[8F7D1D906AFFC04D]) [    ] o.a.s.c.CorePropertiesLocator Found 1 core definitions underneath C:\Users\jenkins\workspace\Lucene-Solr-master-Windows\solr\build\solr-core\test\J0\temp\solr.handler.component.DistributedSuggestComponentTest_8F7D1D906AFFC04D-001\tempDir-001\control\cores
   [junit4]   2> 179346 INFO  (TEST-DistributedSuggestComponentTest.test-seed#[8F7D1D906AFFC04D]) [    ] o.a.s.c.CorePropertiesLocator Cores are: [collection1]
   [junit4]   2> 179348 INFO  (coreLoadExecutor-1138-thread-1) [    ] o.a.s.c.TransientSolrCoreCacheDefault Allocating transient cache for 4 transient cores
   [junit4]   2> 179350 INFO  (coreLoadExecutor-1138-thread-1) [    x:collection1] o.a.s.c.SolrResourceLoader [null] Added 2 libs to classloader, from paths: [/C:/Users/jenkins/workspace/Lucene-Solr-master-Windows/solr/core/src/test-files/solr/collection1/lib, /C:/Users/jenkins/workspace/Lucene-Solr-master-Windows/solr/core/src/test-files/solr/collection1/lib/classes]
   [junit4]   2> 179381 INFO  (coreLoadExecutor-1138-thread-1) [    x:collection1] o.a.s.c.SolrConfig Using Lucene MatchVersion: 8.0.0
   [junit4]   2> 179394 INFO  (coreLoadExecutor-1138-thread-1) [    x:collection1] o.a.s.s.IndexSchema [collection1] Schema name=test
   [junit4]   2> 179484 INFO  (coreLoadExecutor-1138-thread-1) [    x:collection1] o.a.s.s.IndexSchema Loaded schema test/1.0 with uniqueid field id
   [junit4]   2> 179504 INFO  (coreLoadExecutor-1138-thread-1) [    x:collection1] o.a.s.c.CoreContainer Creating SolrCore 'collection1' using configuration from configset C:\Users\jenkins\workspace\Lucene-Solr-master-Windows\solr\core\src\test-files\solr\collection1, trusted=true
   [junit4]   2> 179505 INFO  (coreLoadExecutor-1138-thread-1) [    x:collection1] o.a.s.m.r.SolrJmxReporter JMX monitoring for 'solr.core.collection1' (registry 'solr.core.collection1') enabled at server: com.sun.jmx.mbeanserver.JmxMBeanServer@3857a98b
   [junit4]   2> 179505 INFO  (coreLoadExecutor-1138-thread-1) [    x:collection1] o.a.s.c.SolrCore solr.RecoveryStrategy.Builder
   [junit4]   2> 179505 INFO  (coreLoadExecutor-1138-thread-1) [    x:collection1] o.a.s.c.SolrCore [[collection1] ] Opening new SolrCore at [C:\Users\jenkins\workspace\Lucene-Solr-master-Windows\solr\core\src\test-files\solr\collection1], dataDir=[C:\Users\jenkins\workspace\Lucene-Solr-master-Windows\solr\build\solr-core\test\J0\temp\solr.handler.component.DistributedSuggestComponentTest_8F7D1D906AFFC04D-001\tempDir-001\control\cores\collection1\data\]
   [junit4]   2> 179511 INFO  (coreLoadExecutor-1138-thread-1) [    x:collection1] o.a.s.u.RandomMergePolicy RandomMergePolicy wrapping class org.apache.lucene.index.AlcoholicMergePolicy: [AlcoholicMergePolicy: minMergeSize=0, mergeFactor=10, maxMergeSize=95229942, maxMergeSizeForForcedMerge=9223372036854775807, calibrateSizeByDeletes=true, maxMergeDocs=2147483647, maxCFSSegmentSizeMB=8.796093022207999E12, noCFSRatio=0.1]
   [junit4]   2> 179601 INFO  (coreLoadExecutor-1138-thread-1) [    x:collection1] o.a.s.u.CommitTracker Hard AutoCommit: disabled
   [junit4]   2> 179601 INFO  (coreLoadExecutor-1138-thread-1) [    x:collection1] o.a.s.u.CommitTracker Soft AutoCommit: disabled
   [junit4]   2> 179602 INFO  (coreLoadExecutor-1138-thread-1) [    x:collection1] o.a.s.u.RandomMergePolicy RandomMergePolicy wrapping class org.apache.lucene.index.LogDocMergePolicy: [LogDocMergePolicy: minMergeSize=1000, mergeFactor=32, maxMergeSize=9223372036854775807, maxMergeSizeForForcedMerge=9223372036854775807, calibrateSizeByDeletes=false, maxMergeDocs=2147483647, maxCFSSegmentSizeMB=8.796093022207999E12, noCFSRatio=0.0]
   [junit4]   2> 179602 INFO  (coreLoadExecutor-1138-thread-1) [    x:collection1] o.a.s.s.SolrIndexSearcher Opening [Searcher@43d4c8db[collection1] main]
   [junit4]   2> 179603 WARN  (coreLoadExecutor-1138-thread-1) [    x:collection1] o.a.s.r.ManagedResourceStorage Cannot write to config directory C:\Users\jenkins\workspace\Lucene-Solr-master-Windows\solr\core\src\test-files\solr\collection1\conf; switching to use InMemory storage instead.
   [junit4]   2> 179603 INFO  (coreLoadExecutor-1138-thread-1) [    x:collection1] o.a.s.h.c.SuggestComponent Initializing SuggestComponent
   [junit4]   2> 179606 INFO  (coreLoadExecutor-1138-thread-1) [    x:collection1] o.a.s.s.s.SolrSuggester init: {name=suggest_fuzzy_with_high_freq_dict,lookupImpl=FuzzyLookupFactory,field=cat,storeDir=suggest_fuzzy_with_high_freq_dict,suggestAnalyzerFieldType=text,buildOnCommit=true,threshold=0.0}
   [junit4]   2> 179625 INFO  (coreLoadExecutor-1138-thread-1) [    x:collection1] o.a.s.s.s.SolrSuggester No dictionaryImpl parameter was provided falling back to org.apache.solr.spelling.suggest.HighFrequencyDictionaryFactory
   [junit4]   2> 179625 INFO  (coreLoadExecutor-1138-thread-1) [    x:collection1] o.a.s.s.s.SolrSuggester Dictionary loaded with params: {name=suggest_fuzzy_with_high_freq_dict,lookupImpl=FuzzyLookupFactory,field=cat,storeDir=suggest_fuzzy_with_high_freq_dict,suggestAnalyzerFieldType=text,buildOnCommit=true,threshold=0.0}
   [junit4]   2> 179627 INFO  (coreLoadExecutor-1138-thread-1) [    x:collection1] o.a.s.h.c.SuggestComponent Registering searcher listener for suggester: suggest_fuzzy_with_high_freq_dict - SuggesterListener [core=org.apache.solr.core.SolrCore@ea93658, suggester=SolrSuggester [ name=suggest_fuzzy_with_high_freq_dict, sourceLocation=null, storeDir=C:\Users\jenkins\workspace\Lucene-Solr-master-Windows\solr\build\solr-core\test\J0\temp\solr.handler.component.DistributedSuggestComponentTest_8F7D1D906AFFC04D-001\tempDir-001\control\cores\collection1\data\suggest_fuzzy_with_high_freq_dict, lookupImpl=FuzzyLookupFactory, dictionaryImpl=org.apache.solr.spelling.suggest.HighFrequencyDictionaryFactory, sizeInBytes=0 ], buildOnCommit=true, buildOnOptimize=false, buildOnStartup=true, isCoreReload=false]
   [junit4]   2> 179627 INFO  (coreLoadExecutor-1138-thread-1) [    x:collection1] o.a.s.s.s.SolrSuggester init: {name=suggest_fuzzy_file_based,lookupImpl=FuzzyLookupFactory,sourceLocation=fuzzysuggest.txt,storeDir=suggest_fuzzy_file_based,suggestAnalyzerFieldType=text,buildOnCommit=true}
   [junit4]   2> 179627 INFO  (coreLoadExecutor-1138-thread-1) [    x:collection1] o.a.s.s.s.SolrSuggester No dictionaryImpl parameter was provided falling back to org.apache.solr.spelling.suggest.FileDictionaryFactory
   [junit4]   2> 179627 INFO  (coreLoadExecutor-1138-thread-1) [    x:collection1] o.a.s.s.s.SolrSuggester Dictionary loaded with params: {name=suggest_fuzzy_file_based,lookupImpl=FuzzyLookupFactory,sourceLocation=fuzzysuggest.txt,storeDir=suggest_fuzzy_file_based,suggestAnalyzerFieldType=text,buildOnCommit=true}
   [junit4]   2> 179627 INFO  (coreLoadExecutor-1138-thread-1) [    x:collection1] o.a.s.h.c.SuggestComponent Registering searcher listener for suggester: suggest_fuzzy_file_based - SuggesterListener [core=org.apache.solr.core.SolrCore@ea93658, suggester=SolrSuggester [ name=suggest_fuzzy_file_based, sourceLocation=fuzzysuggest.txt, storeDir=C:\Users\jenkins\workspace\Lucene-Solr-master-Windows\solr\build\solr-core\test\J0\temp\solr.handler.component.DistributedSuggestComponentTest_8F7D1D906AFFC04D-001\tempDir-001\control\cores\collection1\data\suggest_fuzzy_file_based, lookupImpl=FuzzyLookupFactory, dictionaryImpl=org.apache.solr.spelling.suggest.FileDictionaryFactory, sizeInBytes=0 ], buildOnCommit=true, buildOnOptimize=false, buildOnStartup=true, isCoreReload=false]
   [junit4]   2> 179627 INFO  (coreLoadExecutor-1138-thread-1) [    x:collection1] o.a.s.s.s.SolrSuggester init: {name=suggest_fuzzy_doc_dict,lookupImpl=FuzzyLookupFactory,dictionaryImpl=DocumentDictionaryFactory,field=cat,weightField=price,suggestAnalyzerFieldType=text,buildOnCommit=true,buildOnStartup=false}
   [junit4]   2> 179638 INFO  (coreLoadExecutor-1138-thread-1) [    x:collection1] o.a.s.s.s.SolrSuggester Dictionary loaded with params: {name=suggest_fuzzy_doc_dict,lookupImpl=FuzzyLookupFactory,dictionaryImpl=DocumentDictionaryFactory,field=cat,weightField=price,suggestAnalyzerFieldType=text,buildOnCommit=true,buildOnStartup=false}
   [junit4]   2> 179639 INFO  (coreLoadExecutor-1138-thread-1) [    x:collection1] o.a.s.h.c.SuggestComponent Registering searcher listener for suggester: suggest_fuzzy_doc_dict - SuggesterListener [core=org.apache.solr.core.SolrCore@ea93658, suggester=SolrSuggester [ name=suggest_fuzzy_doc_dict, sourceLocation=null, storeDir=, lookupImpl=FuzzyLookupFactory, dictionaryImpl=DocumentDictionaryFactory, sizeInBytes=0 ], buildOnCommit=true, buildOnOptimize=false, buildOnStartup=false, isCoreReload=false]
   [junit4]   2> 179639 INFO  (coreLoadExecutor-1138-thread-1) [    x:collection1] o.a.s.s.s.SolrSuggester init: {name=suggest_fuzzy_doc_expr_dict,dictionaryImpl=DocumentExpressionDictionaryFactory,lookupImpl=FuzzyLookupFactory,field=cat,weightExpression=((price * 2) + weight),sortField=weight,sortField=price,storeDir=suggest_fuzzy_doc_expr_dict,suggestAnalyzerFieldType=text,buildOnCommit=true}
   [junit4]   2> 179648 INFO  (coreLoadExecutor-1138-thread-1) [    x:collection1] o.a.s.s.s.SolrSuggester Dictionary loaded with params: {name=suggest_fuzzy_doc_expr_dict,dictionaryImpl=DocumentExpressionDictionaryFactory,lookupImpl=FuzzyLookupFactory,field=cat,weightExpression=((price * 2) + weight),sortField=weight,sortField=price,storeDir=suggest_fuzzy_doc_expr_dict,suggestAnalyzerFieldType=text,buildOnCommit=true}
   [junit4]   2> 179648 INFO  (coreLoadExecutor-1138-thread-1) [    x:collection1] o.a.s.h.c.SuggestComponent Registering searcher listener for suggester: suggest_fuzzy_doc_expr_dict - SuggesterListener [core=org.apache.solr.core.SolrCore@ea93658, suggester=SolrSuggester [ name=suggest_fuzzy_doc_expr_dict, sourceLocation=null, storeDir=C:\Users\jenkins\workspace\Lucene-Solr-master-Windows\solr\build\solr-core\test\J0\temp\solr.handler.component.DistributedSuggestComponentTest_8F7D1D906AFFC04D-001\tempDir-001\control\cores\collection1\data\suggest_fuzzy_doc_expr_dict, lookupImpl=FuzzyLookupFactory, dictionaryImpl=DocumentExpressionDictionaryFactory, sizeInBytes=0 ], buildOnCommit=true, buildOnOptimize=false, buildOnStartup=true, isCoreReload=false]
   [junit4]   2> 179648 INFO  (coreLoadExecutor-1138-thread-1) [    x:collection1] o.a.s.s.s.SolrSuggester init: {name=suggest_fuzzy_doc_dict_build_startup,lookupImpl=FuzzyLookupFactory,dictionaryImpl=DocumentDictionaryFactory,field=cat,weightField=price,suggestAnalyzerFieldType=text,buildOnCommit=false,buildOnStartup=true}
   [junit4]   2> 179648 INFO  (coreLoadExecutor-1138-thread-1) [    x:collection1] o.a.s.s.s.SolrSuggester Dictionary loaded with params: {name=suggest_fuzzy_doc_dict_build_startup,lookupImpl=FuzzyLookupFactory,dictionaryImpl=DocumentDictionaryFactory,field=cat,weightField=price,suggestAnalyzerFieldType=text,buildOnCommit=false,buildOnStartup=true}
   [junit4]   2> 179648 INFO  (coreLoadExecutor-1138-thread-1) [    x:collection1] o.a.s.h.c.SuggestComponent Registering searcher listener for suggester: suggest_fuzzy_doc_dict_build_startup - SuggesterListener [core=org.apache.solr.core.SolrCore@ea93658, suggester=SolrSuggester [ name=suggest_fuzzy_doc_dict_build_startup, sourceLocation=null, storeDir=, lookupImpl=FuzzyLookupFactory, dictionaryImpl=DocumentDictionaryFactory, sizeInBytes=0 ], buildOnCommit=false, buildOnOptimize=false, buildOnStartup=true, isCoreReload=false]
   [junit4]   2> 179648 INFO  (coreLoadExecutor-1138-thread-1) [    x:collection1] o.a.s.s.s.SolrSuggester init: {name=suggest_fuzzy_doc_manal_build,lookupImpl=FuzzyLookupFactory,dictionaryImpl=DocumentDictionaryFactory,field=cat,weightField=price,suggestAnalyzerFieldType=text,buildOnCommit=false,buildOnStartup=false,storeDir=suggest_fuzzy_doc_manal_build}
   [junit4]   2> 179649 INFO  (coreLoadExecutor-1138-thread-1) [    x:collection1] o.a.s.s.s.SolrSuggester Dictionary loaded with params: {name=suggest_fuzzy_doc_manal_build,lookupImpl=FuzzyLookupFactory,dictionaryImpl=DocumentDictionaryFactory,field=cat,weightField=price,suggestAnalyzerFieldType=text,buildOnCommit=false,buildOnStartup=false,storeDir=suggest_fuzzy_doc_manal_build}
   [junit4]   2> 179649 INFO  (coreLoadExecutor-1138-thread-1) [    x:collection1] o.a.s.s.s.SolrSuggester init: {name=suggest_doc_default_startup,lookupImpl=AnalyzingLookupFactory,dictionaryImpl=DocumentDictionaryFactory,field=cat,weightField=price,suggestAnalyzerFieldType=text,buildOnCommit=false,storeDir=suggest_doc_default_startup}
   [junit4]   2> 179657 INFO  (coreLoadExecutor-1138-thread-1) [    x:collection1] o.a.s.s.s.SolrSuggester Dictionary loaded with params: {name=suggest_doc_default_startup,lookupImpl=AnalyzingLookupFactory,dictionaryImpl=DocumentDictionaryFactory,field=cat,weightField=price,suggestAnalyzerFieldType=text,buildOnCommit=false,storeDir=suggest_doc_default_startup}
   [junit4]   2> 179657 INFO  (coreLoadExecutor-1138-thread-1) [    x:collection1] o.a.s.h.c.SuggestComponent Registering searcher listener for suggester: suggest_doc_default_startup - SuggesterListener [core=org.apache.solr.core.SolrCore@ea93658, suggester=SolrSuggester [ name=suggest_doc_default_startup, sourceLocation=null, storeDir=C:\Users\jenkins\workspace\Lucene-Solr-master-Windows\solr\build\solr-core\test\J0\temp\solr.handler.component.DistributedSuggestComponentTest_8F7D1D906AFFC04D-001\tempDir-001\control\cores\collection1\data\suggest_doc_default_startup, lookupImpl=AnalyzingLookupFactory, dictionaryImpl=DocumentDictionaryFactory, sizeInBytes=0 ], buildOnCommit=false, buildOnOptimize=false, buildOnStartup=true, isCoreReload=false]
   [junit4]   2> 179657 INFO  (coreLoadExecutor-1138-thread-1) [    x:collection1] o.a.s.s.s.SolrSuggester init: {name=suggest_doc_default_startup_no_store,lookupImpl=AnalyzingLookupFactory,dictionaryImpl=DocumentDictionaryFactory,field=cat,weightField=price,suggestAnalyzerFieldType=text,buildOnCommit=false}
   [junit4]   2> 179657 INFO  (coreLoadExecutor-1138-thread-1) [    x:collection1] o.a.s.s.s.SolrSuggester Dictionary loaded with params: {name=suggest_doc_default_startup_no_store,lookupImpl=AnalyzingLookupFactory,dictionaryImpl=DocumentDictionaryFactory,field=cat,weightField=price,suggestAnalyzerFieldType=text,buildOnCommit=false}
   [junit4]   2> 179657 INFO  (coreLoadExecutor-1138-thread-1) [    x:collection1] o.a.s.h.c.SuggestComponent Registering searcher listener for suggester: suggest_doc_default_startup_no_store - SuggesterListener [core=org.apache.solr.core.SolrCore@ea93658, suggester=SolrSuggester [ name=suggest_doc_default_startup_no_store, sourceLocation=null, storeDir=, lookupImpl=AnalyzingLookupFactory, dictionaryImpl=DocumentDictionaryFactory, sizeInBytes=0 ], buildOnCommit=false, buildOnOptimize=false, buildOnStartup=true, isCoreReload=false]
   [junit4]   2> 179658 INFO  (coreLoadExecutor-1138-thread-1) [    x:collection1] o.a.s.h.ReplicationHandler Commits will be reserved for 10000ms.
   [junit4]   2> 179658 INFO  (searcherExecutor-1139-thread-1-processing-x:collection1) [    x:collection1] o.a.s.h.c.SuggestComponent buildOnStartup: suggest_fuzzy_with_high_freq_dict
   [junit4]   2> 179658 INFO  (searcherExecutor-1139-thread-1-processing-x:collection1) [    x:collection1] o.a.s.s.s.SolrSuggester SolrSuggester.build(suggest_fuzzy_with_high_freq_dict)
   [junit4]   2> 179677 ERROR (searcherExecutor-1139-thread-1-processing-x:collection1) [    x:collection1] o.a.s.s.s.SolrSuggester Store Lookup build failed
   [junit4]   2> 179678 INFO  (searcherExecutor-1139-thread-1-processing-x:collection1) [    x:collection1] o.a.s.h.c.SuggestComponent buildOnStartup: suggest_fuzzy_file_based
   [junit4]   2> 179678 INFO  (searcherExecutor-1139-thread-1-processing-x:collection1) [    x:collection1] o.a.s.s.s.SolrSuggester SolrSuggester.build(suggest_fuzzy_file_based)
   [junit4]   2> 179699 INFO  (searcherExecutor-1139-thread-1-processing-x:collection1) [    x:collection1] o.a.s.s.s.SolrSuggester Stored suggest data to: C:\Users\jenkins\workspace\Lucene-Solr-master-Windows\solr\build\solr-core\test\J0\temp\solr.handler.component.DistributedSuggestComponentTest_8F7D1D906AFFC04D-001\tempDir-001\control\cores\collection1\data\suggest_fuzzy_file_based\fwfsta.bin
   [junit4]   2> 179700 INFO  (searcherExecutor-1139-thread-1-processing-x:collection1) [    x:collection1] o.a.s.h.c.SuggestComponent buildOnStartup: suggest_fuzzy_doc_expr_dict
   [junit4]   2> 179700 INFO  (searcherExecutor-1139-thread-1-processing-x:collection1) [    x:collection1] o.a.s.s.s.SolrSuggester SolrSuggester.build(suggest_fuzzy_doc_expr_dict)
   [junit4]   2> 179718 ERROR (searcherExecutor-1139-thread-1-processing-x:collection1) [    x:collection1] o.a.s.s.s.SolrSuggester Store Lookup build failed
   [junit4]   2> 179718 INFO  (searcherExecutor-1139-thread-1-processing-x:collection1) [    x:collection1] o.a.s.h.c.SuggestComponent buildOnStartup: suggest_fuzzy_doc_dict_build_startup
   [junit4]   2> 179718 INFO  (searcherExecutor-1139-thread-1-processing-x:collection1) [    x:collection1] o.a.s.s.s.SolrSuggester SolrSuggester.build(suggest_fuzzy_doc_dict_build_startup)
   [junit4]   2> 179725 INFO  (searcherExecutor-1139-thread-1-processing-x:collection1) [    x:collection1] o.a.s.h.c.SuggestComponent buildOnStartup: suggest_doc_default_startup
   [junit4]   2> 179726 INFO  (searcherExecutor-1139-thread-1-processing-x:collection1) [    x:collection1] o.a.s.s.s.SolrSuggester SolrSuggester.build(suggest_doc_default_startup)
   [junit4]   2> 179728 ERROR (searcherExecutor-1139-thread-1-processing-x:collection1) [    x:collection1] o.a.s.s.s.SolrSuggester Store Lookup build failed
   [junit4]   2> 179729 INFO  (searcherExecutor-1139-thread-1-processing-x:collection1) [    x:collection1] o.a.s.h.c.SuggestComponent buildOnStartup: suggest_doc_default_startup_no_store
   [junit4]   2> 179729 INFO  (searcherExecutor-1139-thread-1-processing-x:collection1) [    x:collection1] o.a.s.s.s.SolrSuggester SolrSuggester.build(suggest_doc_default_startup_no_store)
   [junit4]   2> 179731 INFO  (searcherExecutor-1139-thread-1-processing-x:collection1) [    x:collection1] o.a.s.c.SolrCore [collection1] Registered new searcher Searcher@43d4c8db[collection1] main{ExitableDirectoryReader(UninvertingDirectoryReader())}
   [junit4]   2> 180165 INFO  (TEST-DistributedSuggestComponentTest.test-seed#[8F7D1D906AFFC04D]) [    ] o.a.s.SolrTestCaseJ4 Writing core.properties file to C:\Users\jenkins\workspace\Lucene-Solr-master-Windows\solr\build\solr-core\test\J0\temp\solr.handler.component.DistributedSuggestComponentTest_8F7D1D906AFFC04D-001\tempDir-001\shard0\cores\collection1
   [junit4]   2> 180166 INFO  (TEST-DistributedSuggestComponentTest.test-seed#[8F7D1D906AFFC04D]) [    ] o.e.j.s.Server jetty-9.3.20.v20170531
   [junit4]   2> 180167 INFO  (TEST-DistributedSuggestComponentTest.test-seed#[8F7D1D906AFFC04D]) [    ] o.e.j.s.h.ContextHandler Started o.e.j.s.ServletContextHandler@14a08a75{/,null,AVAILABLE}
   [junit4]   2> 180168 INFO  (TEST-DistributedSuggestComponentTest.test-seed#[8F7D1D906AFFC04D]) [    ] o.e.j.s.AbstractConnector Started ServerConnector@17b5c192{HTTP/1.1,[http/1.1]}{127.0.0.1:54542}
   [junit4]   2> 180168 INFO  (TEST-DistributedSuggestComponentTest.test-seed#[8F7D1D906AFFC04D]) [    ] o.e.j.s.Server Started @190836ms
   [junit4]   2> 180168 INFO  (TEST-DistributedSuggestComponentTest.test-seed#[8F7D1D906AFFC04D]) [    ] o.a.s.c.s.e.JettySolrRunner Jetty properties: {hostContext=/, solrconfig=solrconfig-suggestercomponent.xml, hostPort=54542, coreRootDirectory=C:\Users\jenkins\workspace\Lucene-Solr-master-Windows\solr\build\solr-core\test\J0\temp\solr.handler.component.DistributedSuggestComponentTest_8F7D1D906AFFC04D-001\tempDir-001\shard0\cores}
   [junit4]   2> 180168 ERROR (TEST-DistributedSuggestComponentTest.test-seed#[8F7D1D906AFFC04D]) [    ] o.a.s.u.StartupLoggingUtils Missing Java Option solr.log.dir. Logging may be missing or incomplete.
   [junit4]   2> 180169 INFO  (TEST-DistributedSuggestComponentTest.test-seed#[8F7D1D906AFFC04D]) [    ] o.a.s.s.SolrDispatchFilter  ___      _       Welcome to Apache Solr? version 8.0.0
   [junit4]   2> 180169 INFO  (TEST-DistributedSuggestComponentTest.test-seed#[8F7D1D906AFFC04D]) [    ] o.a.s.s.SolrDispatchFilter / __| ___| |_ _   Starting in standalone mode on port null
   [junit4]   2> 180169 INFO  (TEST-DistributedSuggestComponentTest.test-seed#[8F7D1D906AFFC04D]) [    ] o.a.s.s.SolrDispatchFilter \__ \/ _ \ | '_|  Install dir: null
   [junit4]   2> 180169 INFO  (TEST-DistributedSuggestComponentTest.test-seed#[8F7D1D906AFFC04D]) [    ] o.a.s.s.SolrDispatchFilter |___/\___/_|_|    Start time: 2017-12-24T00:37:51.529142900Z
   [junit4]   2> 180172 INFO  (TEST-DistributedSuggestComponentTest.test-seed#[8F7D1D906AFFC04D]) [    ] o.a.s.c.SolrXmlConfig Loading container configuration from C:\Users\jenkins\workspace\Lucene-Solr-master-Windows\solr\build\solr-core\test\J0\temp\solr.handler.component.DistributedSuggestComponentTest_8F7D1D906AFFC04D-001\tempDir-001\shard0\solr.xml
   [junit4]   2> 180173 INFO  (TEST-DistributedSuggestComponentTest.test-seed#[8F7D1D906AFFC04D]) [    ] o.a.s.c.SolrXmlConfig Configuration parameter autoReplicaFailoverWorkLoopDelay is ignored
   [junit4]   2> 180174 INFO  (TEST-DistributedSuggestComponentTest.test-seed#[8F7D1D906AFFC04D]) [    ] o.a.s.c.SolrXmlConfig Configuration parameter autoReplicaFailoverBadNodeExpiration is ignored
   [junit4]   2> 180174 INFO  (TEST-DistributedSuggestComponentTest.test-seed#[8F7D1D906AFFC04D]) [    ] o.a.s.c.SolrXmlConfig MBean server found: com.sun.jmx.mbeanserver.JmxMBeanServer@3857a98b, but no JMX reporters were configured - adding default JMX reporter.
   [junit4]   2> 180215 INFO  (TEST-DistributedSuggestComponentTest.test-seed#[8F7D1D906AFFC04D]) [    ] o.a.s.m.r.SolrJmxReporter JMX monitoring for 'solr.node' (registry 'solr.node') enabled at server: com.sun.jmx.mbeanserver.JmxMBeanServer@3857a98b
   [junit4]   2> 180223 INFO  (TEST-DistributedSuggestComponentTest.test-seed#[8F7D1D906AFFC04D]) [    ] o.a.s.m.r.SolrJmxReporter JMX monitoring for 'solr.jvm' (registry 'solr.jvm') enabled at server: com.sun.jmx.mbeanserver.JmxMBeanServer@3857a98b
   [junit4]   2> 180223 INFO  (TEST-DistributedSuggestComponentTest.test-seed#[8F7D1D906AFFC04D]) [    ] o.a.s.m.r.SolrJmxReporter JMX monitoring for 'solr.jetty' (registry 'solr.jetty') enabled at server: com.sun.jmx.mbeanserver.JmxMBeanServer@3857a98b
   [junit4]   2> 180225 INFO  (TEST-DistributedSuggestComponentTest.test-seed#[8F7D1D906AFFC04D]) [    ] o.a.s.c.CorePropertiesLocator Found 1 core definitions underneath C:\Users\jenkins\workspace\Lucene-Solr-master-Windows\solr\build\solr-core\test\J0\temp\solr.handler.component.DistributedSuggestComponentTest_8F7D1D906AFFC04D-001\tempDir-001\shard0\cores
   [junit4]   2> 180225 INFO  (TEST-DistributedSuggestComponentTest.test-seed#[8F7D1D906AFFC04D]) [    ] o.a.s.c.CorePropertiesLocator Cores are: [collection1]
   [junit4]   2> 180243 INFO  (coreLoadExecutor-1148-thread-1) [    ] o.a.s.c.TransientSolrCoreCacheDefault Allocating transient cache for 4 transient cores
   [junit4]   2> 180243 INFO  (coreLoadExecutor-1148-thread-1) [    x:collection1] o.a.s.c.SolrResourceLoader [null] Added 2 libs to classloader, from paths: [/C:/Users/jenkins/workspace/Lucene-Solr-master-Windows/solr/core/src/test-files/solr/collection1/lib, /C:/Users/jenkins/workspace/Lucene-Solr-master-Windows/solr/core/src/test-files/solr/collection1/lib/classes]
   [junit4]   2> 180271 INFO  (coreLoadExecutor-1148-thread-1) [    x:collection1] o.a.s.c.SolrConfig Using Lucene MatchVersion: 8.0.0
   [junit4]   2> 180283 INFO  (coreLoadExecutor-1148-thread-1) [    x:collection1] o.a.s.s.IndexSchema [collection1] Schema name=test
   [junit4]   2> 180375 INFO  (coreLoadExecutor-1148-thread-1) [    x:collection1] o.a.s.s.IndexSchema Loaded schema test/1.0 with uniqueid field id
   [junit4]   2> 180395 INFO  (coreLoadExecutor-1148-thread-1) [    x:collection1] o.a.s.c.CoreContainer Creating SolrCore 'collection1' using configuration from configset C:\Users\jenkins\workspace\Lucene-Solr-master-Windows\solr\core\src\test-files\solr\collection1, trusted=true
   [junit4]   2> 180395 INFO  (coreLoadExecutor-1148-thread-1) [    x:collection1] o.a.s.m.r.SolrJmxReporter JMX monitoring for 'solr.core.collection1' (registry 'solr.core.collection1') enabled at server: com.sun.jmx.mbeanserver.JmxMBeanServer@3857a98b
   [junit4]   2> 180395 INFO  (coreLoadExecutor-1148-thread-1) [    x:collection1] o.a.s.c.SolrCore solr.RecoveryStrategy.Builder
   [junit4]   2> 180395 INFO  (coreLoadExecutor-1148-thread-1) [    x:collection1] o.a.s.c.SolrCore [[collection1] ] Opening new SolrCore at [C:\Users\jenkins\workspace\Lucene-Solr-master-Windows\solr\core\src\test-files\solr\collection1], dataDir=[C:\Users\jenkins\workspace\Lucene-Solr-master-Windows\solr\build\solr-core\test\J0\temp\solr.handler.component.DistributedSuggestComponentTest_8F7D1D906AFFC04D-001\tempDir-001\shard0\cores\collection1\data\]
   [junit4]   2> 180404 INFO  (coreLoadExecutor-1148-thread-1) [    x:collection1] o.a.s.u.RandomMergePolicy RandomMergePolicy wrapping class org.apache.lucene.index.AlcoholicMergePolicy: [AlcoholicMergePolicy: minMergeSize=0, mergeFactor=10, maxMergeSize=95229942, maxMergeSizeForForcedMerge=9223372036854775807, calibrateSizeByDeletes=true, maxMergeDocs=2147483647, maxCFSSegmentSizeMB=8.796093022207999E12, noCFSRatio=0.1]
   [junit4]   2> 180474 INFO  (coreLoadExecutor-1148-thread-1) [    x:collection1] o.a.s.u.CommitTracker Hard AutoCommit: disabled
   [junit4]   2> 180474 INFO  (coreLoadExecutor-1148-thread-1) [    x:collection1] o.a.s.u.CommitTracker Soft AutoCommit: disabled
   [junit4]   2> 180475 INFO  (coreLoadExecutor-1148-thread-1) [    x:collection1] o.a.s.u.RandomMergePolicy RandomMergePolicy wrapping class org.apache.lucene.index.LogDocMergePolicy: [LogDocMergePolicy: minMergeSize=1000, mergeFactor=32, maxMergeSize=9223372036854775807, maxMergeSizeForForcedMerge=9223372036854775807, calibrateSizeByDeletes=false, maxMergeDocs=2147483647, maxCFSSegmentSizeMB=8.796093022207999E12, noCFSRatio=0.0]
   [junit4]   2> 180488 INFO  (coreLoadExecutor-1148-thread-1) [    x:collection1] o.a.s.s.SolrIndexSearcher Opening [Searcher@420c9e1[collection1] main]
   [junit4]   2> 180488 WARN  (coreLoadExecutor-1148-thread-1) [    x:collection1] o.a.s.r.ManagedResourceStorage Cannot write to config directory C:\Users\jenkins\workspace\Lucene-Solr-master-Windows\solr\core\src\test-files\solr\collection1\conf; switching to use InMemory storage instead.
   [junit4]   2> 180489 INFO  (coreLoadExecutor-1148-thread-1) [    x:collection1] o.a.s.h.c.SuggestComponent Initializing SuggestComponent
   [junit4]   2> 180489 INFO  (coreLoadExecutor-1148-thread-1) [    x:collection1] o.a.s.s.s.SolrSuggester init: {name=suggest_fuzzy_with_high_freq_dict,lookupImpl=FuzzyLookupFactory,field=cat,storeDir=suggest_fuzzy_with_high_freq_dict,suggestAnalyzerFieldType=text,buildOnCommit=true,threshold=0.0}
   [junit4]   2> 180492 INFO  (coreLoadExecutor-1148-thread-1) [    x:collection1] o.a.s.s.s.SolrSuggester No dictionaryImpl parameter was provided falling back to org.apache.solr.spelling.suggest.HighFrequencyDictionaryFactory
   [junit4]   2> 180492 INFO  (coreLoadExecutor-1148-thread-1) [    x:collection1] o.a.s.s.s.SolrSuggester Dictionary loaded with params: {name=suggest_fuzzy_with_high_freq_dict,lookupImpl=FuzzyLookupFactory,field=cat,storeDir=suggest_fuzzy_with_high_freq_dict,suggestAnalyzerFieldType=text,buildOnCommit=true,threshold=0.0}
   [junit4]   2> 180492 INFO  (coreLoadExecutor-1148-thread-1) [    x:collection1] o.a.s.h.c.SuggestComponent Registering searcher listener for suggester: suggest_fuzzy_with_high_freq_dict - SuggesterListener [core=org.apache.solr.core.SolrCore@7bfb8e1b, suggester=SolrSuggester [ name=suggest_fuzzy_with_high_freq_dict, sourceLocation=null, storeDir=C:\Users\jenkins\workspace\Lucene-Solr-master-Windows\solr\build\solr-core\test\J0\temp\solr.handler.component.DistributedSuggestComponentTest_8F7D1D906AFFC04D-001\tempDir-001\shard0\cores\collection1\data\suggest_fuzzy_with_high_freq_dict, lookupImpl=FuzzyLookupFactory, dictionaryImpl=org.apache.solr.spelling.suggest.HighFrequencyDictionaryFactory, sizeInBytes=0 ], buildOnCommit=true, buildOnOptimize=false, buildOnStartup=true, isCoreReload=false]
   [junit4]   2> 180492 INFO  (coreLoadExecutor-1148-thread-1) [    x:collection1] o.a.s.s.s.SolrSuggester init: {name=suggest_fuzzy_file_based,lookupImpl=FuzzyLookupFactory,sourceLocation=fuzzysuggest.txt,storeDir=suggest_fuzzy_file_based,suggestAnalyzerFieldType=text,buildOnCommit=true}
   [junit4]   2> 180493 INFO  (coreLoadExecutor-1148-thread-1) [    x:collection1] o.a.s.s.s.SolrSuggester No dictionaryImpl parameter was provided falling back to org.apache.solr.spelling.suggest.FileDictionaryFactory
   [junit4]   2> 180493 INFO  (coreLoadExecutor-1148-thread-1) [    x:collection1] o.a.s.s.s.SolrSuggester Dictionary loaded with params: {name=suggest_fuzzy_file_based,lookupImpl=FuzzyLookupFactory,sourceLocation=fuzzysuggest.txt,storeDir=suggest_fuzzy_file_based,suggestAnalyzerFieldType=text,buildOnCommit=true}
   [junit4]   2> 180493 INFO  (coreLoadExecutor-1148-thread-1) [    x:collection1] o.a.s.h.c.SuggestComponent Registering searcher listener for suggester: suggest_fuzzy_file_based - SuggesterListener [core=org.apache.solr.core.SolrCore@7bfb8e1b, suggester=SolrSuggester [ name=suggest_fuzzy_file_based, sourceLocation=fuzzysuggest.txt, storeDir=C:\Users\jenkins\workspace\Lucene-Solr-master-Windows\solr\build\solr-core\test\J0\temp\solr.handler.component.DistributedSuggestComponentTest_8F7D1D906AFFC04D-001\tempDir-001\shard0\cores\collection1\data\suggest_fuzzy_file_based, lookupImpl=FuzzyLookupFactory, dictionaryImpl=org.apache.solr.spelling.suggest.FileDictionaryFactory, sizeInBytes=0 ], buildOnCommit=true, buildOnOptimize=false, buildOnStartup=true, isCoreReload=false]
   [junit4]   2> 180493 INFO  (coreLoadExecutor-1148-thread-1) [    x:collection1] o.a.s.s.s.SolrSuggester init: {name=suggest_fuzzy_doc_dict,lookupImpl=FuzzyLookupFactory,dictionaryImpl=DocumentDictionaryFactory,field=cat,weightField=price,suggestAnalyzerFieldType=text,buildOnCommit=true,buildOnStartup=false}
   [junit4]   2> 180493 INFO  (coreLoadExecutor-1148-thread-1) [    x:collection1] o.a.s.s.s.SolrSuggester Dictionary loaded with params: {name=suggest_fuzzy_doc_dict,lookupImpl=FuzzyLookupFactory,dictionaryImpl=DocumentDictionaryFactory,field=cat,weightField=price,suggestAnalyzerFieldType=text,buildOnCommit=true,buildOnStartup=false}
   [junit4]   2> 180493 INFO  (coreLoadExecutor-1148-thread-1) [    x:collection1] o.a.s.h.c.SuggestComponent Registering searcher listener for suggester: suggest_fuzzy_doc_dict - SuggesterListener [core=org.apache.solr.core.SolrCore@7bfb8e1b, suggester=SolrSuggester [ name=suggest_fuzzy_doc_dict, sourceLocation=null, storeDir=, lookupImpl=FuzzyLookupFactory, dictionaryImpl=DocumentDictionaryFactory, sizeInBytes=0 ], buildOnCommit=true, buildOnOptimize=false, buildOnStartup=false, isCoreReload=false]
   [junit4]   2> 180493 INFO  (coreLoadExecutor-1148-thread-1) [    x:collection1] o.a.s.s.s.SolrSuggester init: {name=suggest_fuzzy_doc_expr_dict,dictionaryImpl=DocumentExpressionDictionaryFactory,lookupImpl=FuzzyLookupFactory,field=cat,weightExpression=((price * 2) + weight),sortField=weight,sortField=price,storeDir=suggest_fuzzy_doc_expr_dict,suggestAnalyzerFieldType=text,buildOnCommit=true}
   [junit4]   2> 180494 INFO  (coreLoadExecutor-1148-thread-1) [    x:collection1] o.a.s.s.s.SolrSuggester Dictionary loaded with params: {name=suggest_fuzzy_doc_expr_dict,dictionaryImpl=DocumentExpressionDictionaryFactory,lookupImpl=FuzzyLookupFactory,field=cat,weightExpression=((price * 2) + weight),sortField=weight,sortField=price,storeDir=suggest_fuzzy_doc_expr_dict,suggestAnalyzerFieldType=text,buildOnCommit=true}
   [junit4]   2> 180494 INFO  (coreLoadExecutor-1148-thread-1) [    x:collection1] o.a.s.h.c.SuggestComponent Registering searcher listener for suggester: suggest_fuzzy_doc_expr_dict - SuggesterListener [core=org.apache.solr.core.SolrCore@7bfb8e1b, suggester=SolrSuggester [ name=suggest_fuzzy_doc_expr_dict, sourceLocation=null, storeDir=C:\Users\jenkins\workspace\Lucene-Solr-master-Windows\solr\build\solr-core\test\J0\temp\solr.handler.component.DistributedSuggestComponentTest_8F7D1D906AFFC04D-001\tempDir-001\shard0\cores\collection1\data\suggest_fuzzy_doc_expr_dict, lookupImpl=FuzzyLookupFactory, dictionaryImpl=DocumentExpressionDictionaryFactory, sizeInBytes=0 ], buildOnCommit=true, buildOnOptimize=false, buildOnStartup=true, isCoreReload=false]
   [junit4]   2> 180494 INFO  (coreLoadExecutor-1148-thread-1) [    x:collection1] o.a.s.s.s.SolrSuggester init: {name=suggest_fuzzy_doc_dict_build_startup,lookupImpl=FuzzyLookupFactory,dictionaryImpl=DocumentDictionaryFactory,field=cat,weightField=price,suggestAnalyzerFieldType=text,buildOnCommit=false,buildOnStartup=true}
   [junit4]   2> 180494 INFO  (coreLoadExecutor-1148-thread-1) [    x:collection1] o.a.s.s.s.SolrSuggester Dictionary loaded with params: {name=suggest_fuzzy_doc_dict_build_startup,lookupImpl=FuzzyLookupFactory,dictionaryImpl=DocumentDictionaryFactory,field=cat,weightField=price,suggestAnalyzerFieldType=text,buildOnCommit=false,buildOnStartup=true}
   [junit4]   2> 180494 INFO  (coreLoadExecutor-1148-thread-1) [    x:collection1] o.a.s.h.c.SuggestComponent Registering searcher listener for suggester: suggest_fuzzy_doc_dict_build_startup - SuggesterListener [core=org.apache.solr.core.SolrCore@7bfb8e1b, suggester=SolrSuggester [ name=suggest_fuzzy_doc_dict_build_startup, sourceLocation=null, storeDir=, lookupImpl=FuzzyLookupFactory, dictionaryImpl=DocumentDictionaryFactory, sizeInBytes=0 ], buildOnCommit=false, buildOnOptimize=false, buildOnStartup=true, isCoreReload=false]
   [junit4]   2> 180494 INFO  (coreLoadExecutor-1148-thread-1) [    x:collection1] o.a.s.s.s.SolrSuggester init: {name=suggest_fuzzy_doc_manal_build,lookupImpl=FuzzyLookupFactory,dictionaryImpl=DocumentDictionaryFactory,field=cat,weightField=price,suggestAnalyzerFieldType=text,buildOnCommit=false,buildOnStartup=false,storeDir=suggest_fuzzy_doc_manal_build}
   [junit4]   2> 180495 INFO  (coreLoadExecutor-1148-thread-1) [    x:collection1] o.a.s.s.s.SolrSuggester Dictionary loaded with params: {name=suggest_fuzzy_doc_manal_build,lookupImpl=FuzzyLookupFactory,dictionaryImpl=DocumentDictionaryFactory,field=cat,weightField=price,suggestAnalyzerFieldType=text,buildOnCommit=false,buildOnStartup=false,storeDir=suggest_fuzzy_doc_manal_build}
   [junit4]   2> 180495 INFO  (coreLoadExecutor-1148-thread-1) [    x:collection1] o.a.s.s.s.SolrSuggester init: {name=suggest_doc_default_startup,lookupImpl=AnalyzingLookupFactory,dictionaryImpl=DocumentDictionaryFactory,field=cat,weightField=price,suggestAnalyzerFieldType=text,buildOnCommit=false,storeDir=suggest_doc_default_startup}
   [junit4]   2> 180495 INFO  (coreLoadExecutor-1148-thread-1) [    x:collection1] o.a.s.s.s.SolrSuggester Dictionary loaded with params: {name=suggest_doc_default_startup,lookupImpl=AnalyzingLookupFactory,dictionaryImpl=DocumentDictionaryFactory,field=cat,weightField=price,suggestAnalyzerFieldType=text,buildOnCommit=false,storeDir=suggest_doc_default_startup}
   [junit4]   2> 180495 INFO  (coreLoadExecutor-1148-thread-1) [    x:collection1] o.a.s.h.c.SuggestComponent Registering searcher listener for suggester: suggest_doc_default_startup - SuggesterListener [core=org.apache.solr.core.SolrCore@7bfb8e1b, suggester=SolrSuggester [ name=suggest_doc_default_startup, sourceLocation=null, storeDir=C:\Users\jenkins\workspace\Lucene-Solr-master-Windows\solr\build\solr-core\test\J0\temp\solr.handler.component.DistributedSuggestComponentTest_8F7D1D906AFFC04D-001\tempDir-001\shard0\cores\collection1\data\suggest_doc_default_startup, lookupImpl=AnalyzingLookupFactory, dictionaryImpl=DocumentDictionaryFactory, sizeInBytes=0 ], buildOnCommit=false, buildOnOptimize=false, buildOnStartup=true, isCoreReload=false]
   [junit4]   2> 180495 INFO  (coreLoadExecutor-1148-thread-1) [    x:collection1] o.a.s.s.s.SolrSuggester init: {name=suggest_doc_default_startup_no_store,lookupImpl=AnalyzingLookupFactory,dictionaryImpl=DocumentDictionaryFactory,field=cat,weightField=price,suggestAnalyzerFieldType=text,buildOnCommit=false}
   [junit4]   2> 180495 INFO  (coreLoadExecutor-1148-thread-1) [    x:collection1] o.a.s.s.s.SolrSuggester Dictionary loaded with params: {name=suggest_doc_default_startup_no_store,lookupImpl=AnalyzingLookupFactory,dictionaryImpl=DocumentDictionaryFactory,field=cat,weightField=price,suggestAnalyzerFieldType=text,buildOnCommit=false}
   [junit4]   2> 180495 INFO  (coreLoadExecutor-1148-thread-1) [    x:collection1] o.a.s.h.c.SuggestComponent Registering searcher listener for suggester: suggest_doc_default_startup_no_store - SuggesterListener [core=org.apache.solr.core.SolrCore@7bfb8e1b, suggester=SolrSuggester [ name=suggest_doc_default_startup_no_store, sourceLocation=null, storeDir=, lookupImpl=AnalyzingLookupFactory, dictionaryImpl=DocumentDictionaryFactory, sizeInBytes=0 ], buildOnCommit=false, buildOnOptimize=false, buildOnStartup=true, isCoreReload=false]
   [junit4]   2> 180495 INFO  (coreLoadExecutor-1148-thread-1) [    x:collection1] o.a.s.h.ReplicationHandler Commits will be reserved for 10000ms.
   [junit4]   2> 180502 INFO  (TEST-DistributedSuggestComponentTest.test-seed#[8F7D1D906AFFC04D]) [    ] o.a.s.SolrTestCaseJ4 ###Starting test
   [junit4]   2> 180507 INFO  (qtp392220826-2362) [    x:collection1] o.a.s.u.DirectUpdateHandler2 [collection1] REMOVING ALL DOCUMENTS FROM INDEX
   [junit4]   2> 180509 INFO  (searcherExecutor-1149-thread-1-processing-x:collection1) [    x:collection1] o.a.s.h.c.SuggestComponent buildOnStartup: suggest_fuzzy_with_high_freq_dict
   [junit4]   2> 180509 INFO  (searcherExecutor-1149-thread-1-processing-x:collection1) [    x:collection1] o.a.s.s.s.SolrSuggester SolrSuggester.build(suggest_fuzzy_with_high_freq_dict)
   [junit4]   2> 180509 INFO  (qtp392220826-2362) [    x:collection1] o.a.s.u.p.LogUpdateProcessorFactory [collection1]  webapp= path=/update params={wt=javabin&version=2}{deleteByQuery=*:*} 0 2
   [junit4]   2> 180512 INFO  (qtp1339477207-2382) [    x:collection1] o.a.s.u.DirectUpdateHandler2 [collection1] REMOVING ALL DOCUMENTS FROM INDEX
   [junit4]   2> 180513 INFO  (qtp1339477207-2382) [    x:collection1] o.a.s.u.p.LogUpdateProcessorFactory [collection1]  webapp= path=/update params={wt=javabin&version=2}{deleteByQuery=*:*} 0 1
   [junit4]   2> 180514 ERROR (searcherExecutor-1149-thread-1-processing-x:collection1) [    x:collection1] o.a.s.s.s.SolrSuggester Store Lookup build failed
   [junit4]   2> 180524 INFO  (searcherExecutor-1149-thread-1-processing-x:collection1) [    x:collection1] o.a.s.h.c.SuggestComponent buildOnStartup: suggest_fuzzy_file_based
   [junit4]   2> 180524 INFO  (qtp392220826-2362) [    x:collection1] o.a.s.u.p.LogUpdateProcessorFactory [collection1]  webapp= path=/update params={wt=javabin&version=2}{add=[1]} 0 10
   [junit4]   2> 180524 INFO  (searcherExecutor-1149-thread-1-processing-x:collection1) [    x:collection1] o.a.s.s.s.SolrSuggester SolrSuggester.build(suggest_fuzzy_file_based)
   [junit4]   2> 180528 INFO  (qtp1339477207-2393) [    x:collection1] o.a.s.u.p.LogUpdateProcessorFactory [collection1]  webapp= path=/update params={wt=javabin&version=2}{add=[1]} 0 3
   [junit4]   2> 180528 INFO  (qtp392220826-2368) [    x:collection1] o.a.s.u.p.LogUpdateProcessorFactory [collection1]  webapp= path=/update params={wt=javabin&version=2}{add=[2]} 0 0
   [junit4]   2> 180529 INFO  (qtp1339477207-2393) [    x:collection1] o.a.s.u.p.LogUpdateProcessorFactory [collection1]  webapp= path=/update params={wt=javabin&version=2}{add=[2]} 0 0
   [junit4]   2> 180530 INFO  (qtp392220826-2368) [    x:collection1] o.a.s.u.p.LogUpdateProcessorFactory [collection1]  webapp= path=/update params={wt=javabin&version=2}{add=[3]} 0 0
   [junit4]   2> 180531 INFO  (qtp1339477207-2393) [    x:collection1] o.a.s.u.p.LogUpdateProcessorFactory [collection1]  webapp= path=/update params={wt=javabin&version=2}{add=[3]} 0 0
   [junit4]   2> 180531 INFO  (qtp392220826-2369) [    x:collection1] o.a.s.u.p.LogUpdateProcessorFactory [collection1]  webapp= path=/update params={wt=javabin&version=2}{add=[4]} 0 0
   [junit4]   2> 180533 INFO  (qtp1339477207-2388) [    x:collection1] o.a.s.u.p.LogUpdateProcessorFactory [collection1]  webapp= path=/update params={wt=javabin&version=2}{add=[4]} 0 0
   [junit4]   2> 180534 INFO  (qtp392220826-2367) [    x:collection1] o.a.s.u.p.LogUpdateProcessorFactory [collection1]  webapp= path=/update params={wt=javabin&version=2}{add=[5]} 0 0
   [junit4]   2> 180534 INFO  (qtp1339477207-2388) [    x:collection1] o.a.s.u.p.LogUpdateProcessorFactory [collection1]  webapp= path=/update params={wt=javabin&version=2}{add=[5]} 0 0
   [junit4]   2> 180535 INFO  (qtp392220826-2367) [    x:collection1] o.a.s.u.p.LogUpdateProcessorFactory [collection1]  webapp= path=/update params={wt=javabin&version=2}{add=[6]} 0 0
   [junit4]   2> 180535 INFO  (qtp1339477207-2388) [    x:collection1] o.a.s.u.p.LogUpdateProcessorFactory [collection1]  webapp= path=/update params={wt=javabin&version=2}{add=[6]} 0 0
   [junit4]   2> 180536 INFO  (qtp392220826-2367) [    x:collection1] o.a.s.u.p.LogUpdateProcessorFactory [collection1]  webapp= path=/update params={wt=javabin&version=2}{add=[7]} 0 0
   [junit4]   2> 180536 INFO  (qtp1339477207-2388) [    x:collection1] o.a.s.u.p.LogUpdateProcessorFactory [collection1]  webapp= path=/update params={wt=javabin&version=2}{add=[7]} 0 0
   [junit4]   2> 180536 INFO  (qtp392220826-2367) [    x:collection1] o.a.s.u.p.LogUpdateProcessorFactory [collection1]  webapp= path=/update params={wt=javabin&version=2}{add=[8]} 0 0
   [junit4]   2> 180536 INFO  (qtp1339477207-2388) [    x:collection1] o.a.s.u.p.LogUpdateProcessorFactory [collection1]  webapp= path=/update params={wt=javabin&version=2}{add=[8]} 0 0
   [junit4]   2> 180537 INFO  (qtp392220826-2367) [    x:collection1] o.a.s.u.p.LogUpdateProcessorFactory [collection1]  webapp= path=/update params={wt=javabin&version=2}{add=[9]} 0 0
   [junit4]   2> 180537 INFO  (qtp1339477207-2388) [    x:collection1] o.a.s.u.p.LogUpdateProcessorFactory [collection1]  webapp= path=/update params={wt=javabin&version=2}{add=[9]} 0 0
   [junit4]   2> 180538 INFO  (qtp392220826-2367) [    x:collection1] o.a.s.u.p.LogUpdateProcessorFactory [collection1]  webapp= path=/update params={wt=javabin&version=2}{add=[10]} 0 0
   [junit4]   2> 180538 INFO  (qtp1339477207-2388) [    x:collection1] o.a.s.u.p.LogUpdateProcessorFactory [collection1]  webapp= path=/update params={wt=javabin&version=2}{add=[10]} 0 0
   [junit4]   2> 180539 INFO  (qtp392220826-2367) [    x:collection1] o.a.s.u.DirectUpdateHandler2 start commit{,optimize=false,openSearcher=true,waitSearcher=true,expungeDeletes=false,softCommit=false,prepareCommit=false}
   [junit4]   2> 180539 INFO  (qtp392220826-2367) [    x:collection1] o.a.s.u.SolrIndexWriter Calling setCommitData with IW:org.apache.solr.update.SolrIndexWriter@6cdee849 commitCommandVersion:0
   [junit4]   2> 180565 INFO  (searcherExecutor-1149-thread-1-processing-x:collection1) [    x:collection1] o.a.s.s.s.SolrSuggester Stored suggest data to: C:\Users\jenkins\workspace\Lucene-Solr-master-Windows\solr\build\solr-core\test\J0\temp\solr.handler.component.DistributedSuggestComponentTest_8F7D1D906AFFC04D-001\tempDir-001\shard0\cores\collection1\data\suggest_fuzzy_file_based\fwfsta.bin
   [junit4]   2> 180565 INFO  (searcherExecutor-1149-thread-1-processing-x:collection1) [    x:collection1] o.a.s.h.c.SuggestComponent buildOnStartup: suggest_fuzzy_doc_expr_dict
   [junit4]   2> 180565 INFO  (searcherExecutor-1149-thread-1-processing-x:collection1) [    x:collection1] o.a.s.s.s.SolrSuggester SolrSuggester.build(suggest_fuzzy_doc_expr_dict)
   [junit4]   2> 180614 ERROR (searcherExecutor-1149-thread-1-processing-x:collection1) [    x:collection1] o.a.s.s.s.SolrSuggester Store Lookup build failed
   [junit4]   2> 180614 INFO  (searcherExecutor-1149-thread-1-processing-x:collection1) [    x:collection1] o.a.s.h.c.SuggestComponent buildOnStartup: suggest_fuzzy_doc_dict_build_startup
   [junit4]   2> 180614 INFO  (searcherExecutor-1149-thread-1-processing-x:collection1) [    x:collection1] o.a.s.s.s.SolrSuggester SolrSuggester.build(suggest_fuzzy_doc_dict_build_startup)
   [junit4]   2> 180617 INFO  (qtp392220826-2367) [    x:collection1] o.a.s.s.SolrIndexSearcher Opening [Searcher@71607a58[collection1] main]
   [junit4]   2> 180618 INFO  (searcherExecutor-1139-thread-1-processing-x:collection1) [    x:collection1] o.a.s.h.c.SuggestComponent buildOnCommit: suggest_fuzzy_with_high_freq_dict
   [junit4]   2> 180618 INFO  (searcherExecutor-1139-thread-1-processing-x:collection1) [    x:collection1] o.a.s.s.s.SolrSuggester SolrSuggester.build(suggest_fuzzy_with_high_freq_dict)
   [junit4]   2> 180619 INFO  (qtp392220826-2367) [    x:collection1] o.a.s.u.DirectUpdateHandler2 end_commit_flush
   [junit4]   2> 180634 INFO  (searcherExecutor-1149-thread-1-processing-x:collection1) [    x:collection1] o.a.s.h.c.SuggestComponent buildOnStartup: suggest_doc_default_startup
   [junit4]   2> 180634 INFO  (searcherExecutor-1149-thread-1-processing-x:collection1) [    x:collection1] o.a.s.s.s.SolrSuggester SolrSuggester.build(suggest_doc_default_startup)
   [junit4]   2> 180660 INFO  (searcherExecutor-1139-thread-1-processing-x:collection1) [    x:collection1] o.a.s.s.s.SolrSuggester Stored suggest data to: C:\Users\jenkins\workspace\Lucene-Solr-master-Windows\solr\build\solr-core\test\J0\temp\solr.handler.component.DistributedSuggestComponentTest_8F7D1D906AFFC04D-001\tempDir-001\control\cores\collection1\data\suggest_fuzzy_with_high_freq_dict\fwfsta.bin
   [junit4]   2> 180662 INFO  (searcherExecutor-1139-thread-1-processing-x:collection1) [    x:collection1] o.a.s.h.c.SuggestComponent buildOnCommit: suggest_fuzzy_file_based
   [junit4]   2> 180662 INFO  (searcherExecutor-1139-thread-1-processing-x:collection1) [    x:collection1] o.a.s.s.s.SolrSuggester SolrSuggester.build(suggest_fuzzy_file_based)
   [junit4]   2> 180690 ERROR (searcherExecutor-1149-thread-1-processing-x:collection1) [    x:collection1] o.a.s.s.s.SolrSuggester Store Lookup build failed
   [junit4]   2> 180690 INFO  (searcherExecutor-1149-thread-1-processing-x:collection1) [    x:collection1] o.a.s.h.c.SuggestComponent buildOnStartup: suggest_doc_default_startup_no_store
   [junit4]   2> 180690 INFO  (searcherExecutor-1149-thread-1-processing-x:collection1) [    x:collection1] o.a.s.s.s.SolrSuggester SolrSuggester.build(suggest_doc_default_startup_no_store)
   [junit4]   2> 180698 INFO  (searcherExecutor-1139-thread-1-processing-x:collection1) [    x:collection1] o.a.s.s.s.SolrSuggester Stored suggest data to: C:\Users\jenkins\workspace\Lucene-Solr-master-Windows\solr\build\solr-core\test\J0\temp\solr.handler.component.DistributedSuggestComponentTest_8F7D1D906AFFC04D-001\tempDir-001\control\cores\collection1\data\suggest_fuzzy_file_based\fwfsta.bin
   [junit4]   2> 180698 INFO  (searcherExecutor-1139-thread-1-processing-x:collection1) [    x:collection1] o.a.s.h.c.SuggestComponent buildOnCommit: suggest_fuzzy_doc_dict
   [junit4]   2> 180698 INFO  (searcherExecutor-1139-thread-1-processing-x:collection1) [    x:collection1] o.a.s.s.s.SolrSuggester SolrSuggester.build(suggest_fuzzy_doc_dict)
   [junit4]   2> 180747 INFO  (searcherExecutor-1149-thread-1-processing-x:collection1) [    x:collection1] o.a.s.c.SolrCore [collection1] Registered new searcher Searcher@420c9e1[collection1] main{ExitableDirectoryReader(UninvertingDirectoryReader())}
   [junit4]   2> 180757 INFO  (searcherExecutor-1139-thread-1-processing-x:collection1) [    x:collection1] o.a.s.h.c.SuggestComponent buildOnCommit: suggest_fuzzy_doc_expr_dict
   [junit4]   2> 180757 INFO  (searcherExecutor-1139-thread-1-processing-x:collection1) [    x:collection1] o.a.s.s.s.SolrSuggester SolrSuggester.build(suggest_fuzzy_doc_expr_dict)
   [junit4]   2> 180779 INFO  (searcherExecutor-1139-thread-1-processing-x:collection1) [    x:collection1] o.a.s.s.s.SolrSuggester Stored suggest data to: C:\Users\jenkins\workspace\Lucene-Solr-master-Windows\solr\build\solr-core\test\J0\temp\solr.handler.component.DistributedSuggestComponentTest_8F7D1D906AFFC04D-001\tempDir-001\control\cores\collection1\data\suggest_fuzzy_doc_expr_dict\fwfsta.bin
   [junit4]   2> 180780 INFO  (searcherExecutor-1139-thread-1-processing-x:collection1) [    x:collection1] o.a.s.c.SolrCore [collection1] Registered new searcher Searcher@71607a58[collection1] main{ExitableDirectoryReader(UninvertingDirectoryReader(Uninverting(_0(8.0.0):C10)))}
   [junit4]   2> 180782 INFO  (qtp392220826-2367) [    x:collection1] o.a.s.u.p.LogUpdateProcessorFactory [collection1]  webapp= path=/update params={waitSearcher=true&commit=true&softCommit=false&wt=javabin&version=2}{commit=} 0 242
   [junit4]   2> 180782 INFO  (qtp1339477207-2388) [    x:collection1] o.a.s.u.DirectUpdateHandler2 start commit{,optimize=false,openSearcher=true,waitSearcher=true,expungeDeletes=false,softCommit=false,prepareCommit=false}
   [junit4]   2> 180782 INFO  (qtp1339477207-2388) [    x:collection1] o.a.s.u.SolrIndexWriter Calling setCommitData with IW:org.apache.solr.update.SolrIndexWriter@418b6d66 commitCommandVersion:0
   [junit4]   2> 180870 INFO  (qtp1339477207-2388) [    x:collection1] o.a.s.s.SolrIndexSearcher Opening [Searcher@77a1a0ed[collection1] main]
   [junit4]   2> 180870 INFO  (searcherExecutor-1149-thread-1-processing-x:collection1) [    x:collection1] o.a.s.h.c.SuggestComponent buildOnCommit: suggest_fuzzy_with_high_freq_dict
   [junit4]   2> 180870 INFO  (searcherExecutor-1149-thread-1-processing-x:collection1) [    x:collection1] o.a.s.s.s.SolrSuggester SolrSuggester.build(suggest_fuzzy_with_high_freq_dict)
   [junit4]   2> 180874 INFO  (qtp1339477207-2388) [    x:collection1] o.a.s.u.DirectUpdateHandler2 end_commit_flush
   [junit4]   2> 180877 INFO  (searcherExecutor-1149-thread-1-processing-x:collection1) [    x:collection1] o.a.s.s.s.SolrSuggester Stored suggest data to: C:\Users\jenkins\workspace\Lucene-Solr-master-Windows\solr\build\solr-core\test\J0\temp\solr.handler.component.DistributedSuggestComponentTest_8F7D1D906AFFC04D-001\tempDir-001\shard0\cores\collection1\data\suggest_fuzzy_with_high_freq_dict\fwfsta.bin
   [junit4]   2> 180877 INFO  (searcherExecutor-1149-thread-1-processing-x:collection1) [    x:collection1] o.a.s.h.c.SuggestComponent buildOnCommit: suggest_fuzzy_file_based
   [junit4]   2> 180877 INFO  (searcherExecutor-1149-thread-1-processing-x:collection1) [    x:collection1] o.a.s.s.s.SolrSuggester SolrSuggester.build(suggest_fuzzy_file_based)
   [junit4]   2> 180897 INFO  (searcherExecutor-1149-thread-1-processing-x:collection1) [    x:collection1] o.a.s.s.s.SolrSuggester Stored suggest data to: C:\Users\jenkins\workspace\Lucene-Solr-master-Windows\solr\build\solr-core\test\J0\temp\solr.handler.component.DistributedSuggestComponentTest_8F7D1D906AFFC04D-001\tempDir-001\shard0\cores\collection1\data\suggest_fuzzy_file_based\fwfsta.bin
   [junit4]   2> 180897 INFO  (searcherExecutor-1149-thread-1-processing-x:collection1) [    x:collection1] o.a.s.h.c.SuggestComponent buildOnCommit: suggest_fuzzy_doc_dict
   [junit4]   2> 180897 INFO  (searcherExecutor-1149-thread-1-processing-x:collection1) [    x:collection1] o.a.s.s.s.SolrSuggester SolrSuggester.build(suggest_fuzzy_doc_dict)
   [junit4]   2> 180909 INFO  (searcherExecutor-1149-thread-1-processing-x:collection1) [    x:collection1] o.a.s.h.c.SuggestComponent buildOnCommit: suggest_fuzzy_doc_expr_dict
   [junit4]   2> 180909 INFO  (searcherExecutor-1149-thread-1-processing-x:collection1) [    x:collection1] o.a.s.s.s.SolrSuggester SolrSuggester.build(suggest_fuzzy_doc_expr_dict)
   [junit4]   2> 180968 INFO  (searcherExecutor-1149-thread-1-processing-x:collection1) [    x:collection1] o.a.s.s.s.SolrSuggester Stored suggest data to: C:\Users\jenkins\workspace\Lucene-Solr-master-Windows\solr\build\solr-core\test\J0\temp\solr.handler.component.DistributedSuggestComponentTest_8F7D1D906AFFC04D-001\tempDir-001\shard0\cores\collection1\data\suggest_fuzzy_doc_expr_dict\fwfsta.bin
   [junit4]   2> 180970 INFO  (searcherExecutor-1149-thread-1-processing-x:collection1) [    x:collection1] o.a.s.c.SolrCore [collection1] Registered new searcher Searcher@77a1a0ed[collection1] main{ExitableDirectoryReader(UninvertingDirectoryReader(Uninverting(_0(8.0.0):C10)))}
   [junit4]   2> 180970 INFO  (qtp1339477207-2388) [    x:collection1] o.a.s.u.p.LogUpdateProcessorFactory [collection1]  webapp= path=/update params={waitSearcher=true&commit=true&softCommit=false&wt=javabin&version=2}{commit=} 0 188
   [junit4]   2> 180972 INFO  (qtp392220826-2366) [    x:collection1] o.a.s.h.c.SuggestComponent SuggestComponent prepare with : distrib=false&qt=/suggest&suggest.build=true&suggest.q=&suggest=true&suggest.dictionary=suggest_fuzzy_doc_dict&wt=javabin&version=2&shards.qt=/suggest
   [junit4]   2> 180972 INFO  (qtp392220826-2366) [    x:collection1] o.a.s.s.s.SolrSuggester SolrSuggester.build(suggest_fuzzy_doc_dict)
   [junit4]   2> 180983 INFO  (qtp392220826-2366) [    x:collection1] o.a.s.h.c.SuggestComponent SuggestComponent process with : distrib=false&qt=/suggest&suggest.build=true&suggest.q=&suggest=true&suggest.dictionary=suggest_fuzzy_doc_dict&wt=javabin&version=2&shards.qt=/suggest
   [junit4]   2> 181011 INFO  (qtp392220826-2366) [    x:collection1] o.a.s.c.S.Request [collection1]  webapp= path=/suggest params={distrib=false&qt=/suggest&suggest.build=true&suggest.q=&suggest.dictionary=suggest_fuzzy_doc_dict&wt=javabin&version=2&shards.qt=/suggest} status=0 QTime=39
   [junit4]   2> 181014 INFO  (qtp1339477207-2387) [    x:collection1] o.a.s.h.c.SuggestComponent SuggestComponent prepare with : shards=http://127.0.0.1:54542//collection1|[ff01::083]:33332/|[ff01::114]:33332/|[ff01::213]:33332/&qt=/suggest&suggest.build=true&suggest.q=&suggest=true&suggest.dictionary=suggest_fuzzy_doc_dict&wt=javabin&version=2&shards.qt=/suggest
   [junit4]   2> 181014 INFO  (qtp1339477207-2387) [    x:collection1] o.a.s.s.s.SolrSuggester SolrSuggester.build(suggest_fuzzy_doc_dict)
   [junit4]   2> 181018 INFO  (qtp1339477207-2387) [    x:collection1] o.a.s.h.c.SuggestComponent SuggestComponent distributedProcess with : shards=http://127.0.0.1:54542//collection1|[ff01::083]:33332/|[ff01::114]:33332/|[ff01::213]:33332/&qt=/suggest&suggest.build=true&suggest.q=&suggest=true&suggest.dictionary=suggest_fuzzy_doc_dict&wt=javabin&version=2&shards.qt=/suggest
   [junit4]   2> 181018 INFO  (qtp1339477207-2387) [    x:collection1] o.a.s.h.c.SuggestComponent SuggestComponent finishStage with : shards=http://127.0.0.1:54542//collection1|[ff01::083]:33332/|[ff01::114]:33332/|[ff01::213]:33332/&qt=/suggest&suggest.build=true&suggest.q=&suggest=true&suggest.dictionary=suggest_fuzzy_doc_dict&wt=javabin&version=2&shards.qt=/suggest
   [junit4]   2> 181019 INFO  (qtp1339477207-2387) [    x:collection1] o.a.s.h.c.SuggestComponent SuggestComponent distributedProcess with : shards=http://127.0.0.1:54542//collection1|[ff01::083]:33332/|[ff01::114]:33332/|[ff01::213]:33332/&qt=/suggest&suggest.build=true&suggest.q=&suggest=true&suggest.dictionary=suggest_fuzzy_doc_dict&wt=javabin&version=2&shards.qt=/suggest
   [junit4]   2> 181060 INFO  (qtp1339477207-2386) [    x:collection1] o.a.s.h.c.SuggestComponent SuggestComponent prepare with : distrib=false&qt=/suggest&shards.purpose=4&suggest=true&shard.url=http://127.0.0.1:54542//collection1|[ff01::083]:33332/|[ff01::114]:33332/|[ff01::213]:33332/&version=2&shards.qt=/suggest&suggest.build=true&suggest.q=&NOW=1514075872374&isShard=true&suggest.dictionary=suggest_fuzzy_doc_dict&wt=javabin
   [junit4]   2> 181060 INFO  (qtp1339477207-2386) [    x:collection1] o.a.s.s.s.SolrSuggester SolrSuggester.build(suggest_fuzzy_doc_dict)
   [junit4]   2> 181077 INFO  (qtp1339477207-2386) [    x:collection1] o.a.s.h.c.SuggestComponent SuggestComponent process with : distrib=false&qt=/suggest&shards.purpose=4&suggest=true&shard.url=http://127.0.0.1:54542//collection1|[ff01::083]:33332/|[ff01::114]:33332/|[ff01::213]:33332/&version=2&shards.qt=/suggest&suggest.build=true&suggest.q=&NOW=1514075872374&isShard=true&suggest.dictionary=suggest_fuzzy_doc_dict&wt=javabin
   [junit4]   2> 181077 INFO  (qtp1339477207-2386) [    x:collection1] o.a.s.c.S.Request [collection1]  webapp= path=/suggest params={distrib=false&qt=/suggest&shards.purpose=4&suggest=true&shard.url=http://127.0.0.1:54542//collection1|[ff01::083]:33332/|[ff01::114]:33332/|[ff01::213]:33332/&version=2&shards.qt=/suggest&suggest.build=true&suggest.q=&NOW=1514075872374&isShard=true&suggest.dictionary=suggest_fuzzy_doc_dict&wt=javabin} status=0 QTime=16
   [junit4]   2> 181078 INFO  (qtp1339477207-2387) [    x:collection1] o.a.s.h.c.SuggestComponent SuggestComponent finishStage with : shards=http://127.0.0.1:54542//collection1|[ff01::083]:33332/|[ff01::114]:33332/|[ff01::213]:33332/&qt=/suggest&suggest.build=true&suggest.q=&suggest=true&suggest.dictionary=suggest_fuzzy_doc_dict&wt=javabin&version=2&shards.qt=/suggest
   [junit4]   2> 181078 INFO  (qtp1339477207-2387) [    x:collection1] o.a.s.h.c.SuggestComponent SuggestComponent distributedProcess with : shards=http://127.0.0.1:54542//collection1|[ff01::083]:33332/|[ff01::114]:33332/|[ff01::213]:33332/&qt=/suggest&suggest.build=true&suggest.q=&suggest=true&suggest.dictionary=suggest_fuzzy_doc_dict&wt=javabin&version=2&shards.qt=/suggest
   [junit4]   2> 181078 INFO  (qtp1339477207-2387) [    x:collection1] o.a.s.h.c.SuggestComponent SuggestComponent finishStage with : shards=http://127.0.0.1:54542//collection1|[ff01::083]:33332/|[ff01::114]:33332/|[ff01::213]:33332/&qt=/suggest&suggest.build=true&suggest.q=&suggest=true&suggest.dictionary=suggest_fuzzy_doc_dict&wt=javabin&version=2&shards.qt=/suggest
   [junit4]   2> 181078 INFO  (qtp1339477207-2387) [    x:collection1] o.a.s.h.c.SuggestComponent http://127.0.0.1:54542//collection1|[ff01::083]:33332/|[ff01::114]:33332/|[ff01::213]:33332/ : {suggest_fuzzy_doc_dict={={numFound=0,suggestions=[]}}}
   [junit4]   2> 181079 INFO  (qtp1339477207-2387) [    x:collection1] o.a.s.c.S.Request [collection1]  webapp= path=/suggest params={shards=http://127.0.0.1:54542//collection1|[ff01::083]:33332/|[ff01::114]:33332/|[ff01::213]:33332/&qt=/suggest&suggest.build=true&suggest.q=&suggest.dictionary=suggest_fuzzy_doc_dict&wt=javabin&version=2&shards.qt=/suggest} status=0 QTime=65
   [junit4]   2> 181079 INFO  (qtp392220826-2365) [    x:collection1] o.a.s.h.c.SuggestComponent SuggestComponent prepare with : distrib=false&qt=/suggest&suggest.build=true&suggest.q=&suggest=true&suggest.dictionary=suggest_fuzzy_doc_expr_dict&wt=javabin&version=2&shards.qt=/suggest
   [junit4]   2> 181079 INFO  (qtp392220826-2365) [    x:collection1] o.a.s.s.s.SolrSuggester SolrSuggester.build(suggest_fuzzy_doc_expr_dict)
   [junit4]   2> 181087 INFO  (qtp392220826-2365) [    x:collection1] o.a.s.s.s.SolrSuggester Stored suggest data to: C:\Users\jenkins\workspace\Lucene-Solr-master-Windows\solr\build\solr-core\test\J0\temp\solr.handler.component.DistributedSuggestComponentTest_8F7D1D906AFFC04D-001\tempDir-001\control\cores\collection1\data\suggest_fuzzy_doc_expr_dict\fwfsta.bin
   [junit4]   2> 181087 INFO  (qtp392220826-2365) [    x:collection1] o.a.s.h.c.SuggestComponent SuggestComponent process with : distrib=false&qt=/suggest&suggest.build=true&suggest.q=&suggest=true&suggest.dictionary=suggest_fuzzy_doc_expr_dict&wt=javabin&version=2&shards.qt=/suggest
   [junit4]   2> 181087 INFO  (qtp392220826-2365) [    x:collection1] o.a.s.c.S.Request [collection1]  webapp= path=/suggest params={distrib=false&qt=/suggest&suggest.build=true&suggest.q=&suggest.dictionary=suggest_fuzzy_doc_expr_dict&wt=javabin&version=2&shards.qt=/suggest} status=0 QTime=7
   [junit4]   2> 181088 INFO  (qtp1339477207-2395) [    x:collection1] o.a.s.h.c.SuggestComponent SuggestComponent prepare with : shards=[ff01::083]:33332/|http://127.0.0.1:54542//collection1|[ff01::213]:33332/&qt=/suggest&suggest.build=true&suggest.q=&suggest=true&suggest.dictionary=suggest_fuzzy_doc_expr_dict&wt=javabin&version=2&shards.qt=/suggest
   [junit4]   2> 181088 INFO  (qtp1339477207-2395) [    x:collection1] o.a.s.s.s.SolrSuggester SolrSuggester.build(suggest_fuzzy_doc_expr_dict)
   [junit4]   2> 181098 INFO  (qtp1339477207-2395) [    x:collection1] o.a.s.s.s.SolrSuggester Stored suggest data to: C:\Users\jenkins\workspace\Lucene-Solr-master-Windows\solr\build\solr-core\test\J0\temp\solr.handler.component.DistributedSuggestComponentTest_8F7D1D906AFFC04D-001\tempDir-001\shard0\cores\collection1\data\suggest_fuzzy_doc_expr_dict\fwfsta.bin
   [junit4]   2> 181098 INFO  (qtp1339477207-2395) [    x:collection1] o.a

[...truncated too long message...]

TolerantSearch, CleanupOldIndexTest, TestSolr4Spatial2, TestShortCircuitedRequests, TriggerIntegrationTest, TestCursorMarkWithoutUniqueKey, TestUtilizeNode, SolrRequestParserTest, BasicDistributedZkTest, TestRawResponseWriter, TestSweetSpotSimilarityFactory, TestFieldResource, DateMathParserTest, ClusterStateUpdateTest, TestPKIAuthenticationPlugin, TestStressRecovery, TestNRTOpen, SliceStateTest, MetricTriggerTest, ChangedSchemaMergeTest, TestJoin, DirectUpdateHandlerTest, ReturnFieldsTest, TestSchemaVersionResource, TestNamedUpdateProcessors, DistanceFunctionTest, TestManagedSchemaThreadSafety, TestManagedSynonymFilterFactory, QueryParsingTest, NumericFieldsTest, TestDynamicLoading, SolrMetricManagerTest, TestDFRSimilarityFactory, ConvertedLegacyTest, TestConfigOverlay, TestCoreDiscovery, StatsComponentTest, TolerantUpdateProcessorTest, OverseerTaskQueueTest, MetricsConfigTest, TestUniqueKeyFieldResource, TestPayloadScoreQParserPlugin, TestRequestForwarding, TestUpdate, MissingSegmentRecoveryTest, TestComplexPhraseQParserPlugin, SystemLogListenerTest, AssignBackwardCompatibilityTest, TestUseDocValuesAsStored, TestCSVResponseWriter, TestOnReconnectListenerSupport, SuggesterFSTTest, UUIDFieldTest, FieldAnalysisRequestHandlerTest, TestCollationFieldDocValues, BufferStoreTest, ReplaceNodeTest, LeaderElectionTest, TestSlowCompositeReaderWrapper, SolrMetricsIntegrationTest, BlockCacheTest, TestCloudManagedSchema, TestOrdValues, TestExecutePlanAction, LeaderInitiatedRecoveryOnCommitTest, ClusterStateTest, AsyncCallRequestStatusResponseTest, TestRandomCollapseQParserPlugin, TestRetrieveFieldsOptimizer, WrapperMergePolicyFactoryTest, ZkControllerTest, TestComputePlanAction, TestExactStatsCache, TestSkipOverseerOperations, ConfigSetsAPITest, TestNonDefinedSimilarityFactory, TestLegacyNumericUtils, VersionInfoTest, MultiTermTest, CdcrBootstrapTest, ParsingFieldUpdateProcessorsTest, ZkCLITest, CursorMarkTest, OverseerRolesTest, HdfsAutoAddReplicasIntegrationTest, PrimitiveFieldTypeTest, TestDocBasedVersionConstraints, ScriptEngineTest, TestPhraseSuggestions, TestUtils, TestPseudoReturnFields, TestChildDocTransformer, RegexBytesRefFilterTest, RAMDirectoryFactoryTest, SSLMigrationTest, TestLockTree, V2ApiIntegrationTest, ConnectionReuseTest, CreateCollectionCleanupTest, CoreSorterTest, NodeLostTriggerTest, CloudMLTQParserTest, TestBlobHandler, TestSolrCloudSnapshots, TestSolrConfigHandler, ZkStateWriterTest, QueryResultKeyTest, TestMultiWordSynonyms, XsltUpdateRequestHandlerTest, TestRestoreCore, BadCopyFieldTest, TestSimpleQParserPlugin, ResponseHeaderTest, CollectionsAPISolrJTest, RegexBoostProcessorTest, SolrTestCaseJ4Test, TestCrossCoreJoin, TestHighlightDedupGrouping]
   [junit4]   2> NOTE: reproduce with: ant test  -Dtestcase=TestHighlightDedupGrouping -Dtests.seed=8F7D1D906AFFC04D -Dtests.slow=true -Dtests.locale=so -Dtests.timezone=America/Guyana -Dtests.asserts=true -Dtests.file.encoding=ISO-8859-1
   [junit4] ERROR   0.00s J0 | TestHighlightDedupGrouping (suite) <<<
   [junit4]    > Throwable #1: java.io.IOException: Could not remove the following files (in the order of attempts):
   [junit4]    >    C:\Users\jenkins\workspace\Lucene-Solr-master-Windows\solr\build\solr-core\test\J0\temp\solr.TestHighlightDedupGrouping_8F7D1D906AFFC04D-001\tempDir-001\shard1\collection1: java.nio.file.DirectoryNotEmptyException: C:\Users\jenkins\workspace\Lucene-Solr-master-Windows\solr\build\solr-core\test\J0\temp\solr.TestHighlightDedupGrouping_8F7D1D906AFFC04D-001\tempDir-001\shard1\collection1
   [junit4]    >    C:\Users\jenkins\workspace\Lucene-Solr-master-Windows\solr\build\solr-core\test\J0\temp\solr.TestHighlightDedupGrouping_8F7D1D906AFFC04D-001\tempDir-001\shard1: java.nio.file.DirectoryNotEmptyException: C:\Users\jenkins\workspace\Lucene-Solr-master-Windows\solr\build\solr-core\test\J0\temp\solr.TestHighlightDedupGrouping_8F7D1D906AFFC04D-001\tempDir-001\shard1
   [junit4]    >    C:\Users\jenkins\workspace\Lucene-Solr-master-Windows\solr\build\solr-core\test\J0\temp\solr.TestHighlightDedupGrouping_8F7D1D906AFFC04D-001\tempDir-001: java.nio.file.DirectoryNotEmptyException: C:\Users\jenkins\workspace\Lucene-Solr-master-Windows\solr\build\solr-core\test\J0\temp\solr.TestHighlightDedupGrouping_8F7D1D906AFFC04D-001\tempDir-001
   [junit4]    > 	at __randomizedtesting.SeedInfo.seed([8F7D1D906AFFC04D]:0)
   [junit4]    > 	at org.apache.lucene.util.IOUtils.rm(IOUtils.java:329)
   [junit4]    > 	at java.base/java.lang.Thread.run(Thread.java:844)
   [junit4] Completed [500/765 (2!)] on J0 in 3.92s, 1 test, 1 error <<< FAILURES!

[...truncated 3308 lines...]
   [junit4] Suite: org.apache.solr.update.processor.TestOpenNLPExtractNamedEntitiesUpdateProcessorFactory
   [junit4]   2> Creating dataDir: C:\Users\jenkins\workspace\Lucene-Solr-master-Windows\solr\build\contrib\solr-analysis-extras\test\J1\temp\solr.update.processor.TestOpenNLPExtractNamedEntitiesUpdateProcessorFactory_121B9D86FD36B1CF-001\init-core-data-001
   [junit4]   2> NOTE: test params are: codec=Asserting(Lucene70), sim=Asserting(org.apache.lucene.search.similarities.AssertingSimilarity@476f5a78), locale=lt, timezone=America/Thunder_Bay
   [junit4]   2> NOTE: Windows 10 10.0 amd64/Oracle Corporation 9.0.1 (64-bit)/cpus=3,threads=1,free=142980480,total=220725248
   [junit4]   2> NOTE: All tests run in this JVM: [TestFoldingMultitermExtrasQuery, TestOpenNLPExtractNamedEntitiesUpdateProcessorFactory]
   [junit4]   2> NOTE: reproduce with: ant test  -Dtestcase=TestOpenNLPExtractNamedEntitiesUpdateProcessorFactory -Dtests.seed=121B9D86FD36B1CF -Dtests.slow=true -Dtests.locale=lt -Dtests.timezone=America/Thunder_Bay -Dtests.asserts=true -Dtests.file.encoding=ISO-8859-1
   [junit4] ERROR   0.00s J1 | TestOpenNLPExtractNamedEntitiesUpdateProcessorFactory (suite) <<<
   [junit4]    > Throwable #1: java.io.IOException: Could not remove the following files (in the order of attempts):
   [junit4]    >    C:\Users\jenkins\workspace\Lucene-Solr-master-Windows\solr\build\contrib\solr-analysis-extras\test\J1\temp\solr.update.processor.TestOpenNLPExtractNamedEntitiesUpdateProcessorFactory_121B9D86FD36B1CF-001\tempDir-001\collection1\conf: java.nio.file.DirectoryNotEmptyException: C:\Users\jenkins\workspace\Lucene-Solr-master-Windows\solr\build\contrib\solr-analysis-extras\test\J1\temp\solr.update.processor.TestOpenNLPExtractNamedEntitiesUpdateProcessorFactory_121B9D86FD36B1CF-001\tempDir-001\collection1\conf
   [junit4]    >    C:\Users\jenkins\workspace\Lucene-Solr-master-Windows\solr\build\contrib\solr-analysis-extras\test\J1\temp\solr.update.processor.TestOpenNLPExtractNamedEntitiesUpdateProcessorFactory_121B9D86FD36B1CF-001\tempDir-001\collection1: java.nio.file.DirectoryNotEmptyException: C:\Users\jenkins\workspace\Lucene-Solr-master-Windows\solr\build\contrib\solr-analysis-extras\test\J1\temp\solr.update.processor.TestOpenNLPExtractNamedEntitiesUpdateProcessorFactory_121B9D86FD36B1CF-001\tempDir-001\collection1
   [junit4]    >    C:\Users\jenkins\workspace\Lucene-Solr-master-Windows\solr\build\contrib\solr-analysis-extras\test\J1\temp\solr.update.processor.TestOpenNLPExtractNamedEntitiesUpdateProcessorFactory_121B9D86FD36B1CF-001\tempDir-001: java.nio.file.DirectoryNotEmptyException: C:\Users\jenkins\workspace\Lucene-Solr-master-Windows\solr\build\contrib\solr-analysis-extras\test\J1\temp\solr.update.processor.TestOpenNLPExtractNamedEntitiesUpdateProcessorFactory_121B9D86FD36B1CF-001\tempDir-001
   [junit4]    >    C:\Users\jenkins\workspace\Lucene-Solr-master-Windows\solr\build\contrib\solr-analysis-extras\test\J1\temp\solr.update.processor.TestOpenNLPExtractNamedEntitiesUpdateProcessorFactory_121B9D86FD36B1CF-001\tempDir-001\collection1\conf\en-test-ner-person.bin: java.nio.file.AccessDeniedException: C:\Users\jenkins\workspace\Lucene-Solr-master-Windows\solr\build\contrib\solr-analysis-extras\test\J1\temp\solr.update.processor.TestOpenNLPExtractNamedEntitiesUpdateProcessorFactory_121B9D86FD36B1CF-001\tempDir-001\collection1\conf\en-test-ner-person.bin
   [junit4]    >    C:\Users\jenkins\workspace\Lucene-Solr-master-Windows\solr\build\contrib\solr-analysis-extras\test\J1\temp\solr.update.processor.TestOpenNLPExtractNamedEntitiesUpdateProcessorFactory_121B9D86FD36B1CF-001\tempDir-001\collection1\conf\en-test-sent.bin: java.nio.file.AccessDeniedException: C:\Users\jenkins\workspace\Lucene-Solr-master-Windows\solr\build\contrib\solr-analysis-extras\test\J1\temp\solr.update.processor.TestOpenNLPExtractNamedEntitiesUpdateProcessorFactory_121B9D86FD36B1CF-001\tempDir-001\collection1\conf\en-test-sent.bin
   [junit4]    >    C:\Users\jenkins\workspace\Lucene-Solr-master-Windows\solr\build\contrib\solr-analysis-extras\test\J1\temp\solr.update.processor.TestOpenNLPExtractNamedEntitiesUpdateProcessorFactory_121B9D86FD36B1CF-001\tempDir-001\collection1\conf\en-test-tokenizer.bin: java.nio.file.AccessDeniedException: C:\Users\jenkins\workspace\Lucene-Solr-master-Windows\solr\build\contrib\solr-analysis-extras\test\J1\temp\solr.update.processor.TestOpenNLPExtractNamedEntitiesUpdateProcessorFactory_121B9D86FD36B1CF-001\tempDir-001\collection1\conf\en-test-tokenizer.bin
   [junit4]    >    C:\Users\jenkins\workspace\Lucene-Solr-master-Windows\solr\build\contrib\solr-analysis-extras\test\J1\temp\solr.update.processor.TestOpenNLPExtractNamedEntitiesUpdateProcessorFactory_121B9D86FD36B1CF-001: java.nio.file.DirectoryNotEmptyException: C:\Users\jenkins\workspace\Lucene-Solr-master-Windows\solr\build\contrib\solr-analysis-extras\test\J1\temp\solr.update.processor.TestOpenNLPExtractNamedEntitiesUpdateProcessorFactory_121B9D86FD36B1CF-001
   [junit4]    > 	at __randomizedtesting.SeedInfo.seed([121B9D86FD36B1CF]:0)
   [junit4]    > 	at org.apache.lucene.util.IOUtils.rm(IOUtils.java:329)
   [junit4]    > 	at java.base/java.lang.Thread.run(Thread.java:844)
   [junit4] Completed [3/5 (1!)] on J1 in 0.64s, 8 tests, 1 error <<< FAILURES!

[...truncated 38408 lines...]

Mime
View raw message