lucene-dev mailing list archives

Site index · List index
Message view « Date » · « Thread »
Top « Date » · « Thread »
From Policeman Jenkins Server <jenk...@thetaphi.de>
Subject [JENKINS] Lucene-Solr-7.2-Linux (64bit/jdk-9.0.1) - Build # 110 - Still Unstable!
Date Sun, 24 Dec 2017 13:52:06 GMT
Build: https://jenkins.thetaphi.de/job/Lucene-Solr-7.2-Linux/110/
Java: 64bit/jdk-9.0.1 -XX:+UseCompressedOops -XX:+UseParallelGC

6 tests failed.
FAILED:  junit.framework.TestSuite.org.apache.solr.analytics.legacy.facet.LegacyQueryFacetCloudTest

Error Message:
Error from server at https://127.0.0.1:33569/solr: Could not fully create collection: collection1

Stack Trace:
org.apache.solr.client.solrj.impl.HttpSolrClient$RemoteSolrException: Error from server at https://127.0.0.1:33569/solr: Could not fully create collection: collection1
	at __randomizedtesting.SeedInfo.seed([3462FD99EE04FA94]:0)
	at org.apache.solr.client.solrj.impl.HttpSolrClient.executeMethod(HttpSolrClient.java:643)
	at org.apache.solr.client.solrj.impl.HttpSolrClient.request(HttpSolrClient.java:255)
	at org.apache.solr.client.solrj.impl.HttpSolrClient.request(HttpSolrClient.java:244)
	at org.apache.solr.client.solrj.impl.LBHttpSolrClient.doRequest(LBHttpSolrClient.java:483)
	at org.apache.solr.client.solrj.impl.LBHttpSolrClient.request(LBHttpSolrClient.java:413)
	at org.apache.solr.client.solrj.impl.CloudSolrClient.sendRequest(CloudSolrClient.java:1103)
	at org.apache.solr.client.solrj.impl.CloudSolrClient.requestWithRetryOnStaleState(CloudSolrClient.java:883)
	at org.apache.solr.client.solrj.impl.CloudSolrClient.request(CloudSolrClient.java:816)
	at org.apache.solr.client.solrj.SolrRequest.process(SolrRequest.java:194)
	at org.apache.solr.client.solrj.SolrRequest.process(SolrRequest.java:211)
	at org.apache.solr.analytics.legacy.LegacyAbstractAnalyticsCloudTest.setupCollection(LegacyAbstractAnalyticsCloudTest.java:50)
	at java.base/jdk.internal.reflect.NativeMethodAccessorImpl.invoke0(Native Method)
	at java.base/jdk.internal.reflect.NativeMethodAccessorImpl.invoke(NativeMethodAccessorImpl.java:62)
	at java.base/jdk.internal.reflect.DelegatingMethodAccessorImpl.invoke(DelegatingMethodAccessorImpl.java:43)
	at java.base/java.lang.reflect.Method.invoke(Method.java:564)
	at com.carrotsearch.randomizedtesting.RandomizedRunner.invoke(RandomizedRunner.java:1737)
	at com.carrotsearch.randomizedtesting.RandomizedRunner$6.evaluate(RandomizedRunner.java:874)
	at com.carrotsearch.randomizedtesting.RandomizedRunner$7.evaluate(RandomizedRunner.java:890)
	at com.carrotsearch.randomizedtesting.rules.StatementAdapter.evaluate(StatementAdapter.java:36)
	at com.carrotsearch.randomizedtesting.rules.SystemPropertiesRestoreRule$1.evaluate(SystemPropertiesRestoreRule.java:57)
	at org.apache.lucene.util.AbstractBeforeAfterRule$1.evaluate(AbstractBeforeAfterRule.java:45)
	at com.carrotsearch.randomizedtesting.rules.StatementAdapter.evaluate(StatementAdapter.java:36)
	at org.apache.lucene.util.TestRuleStoreClassName$1.evaluate(TestRuleStoreClassName.java:41)
	at com.carrotsearch.randomizedtesting.rules.NoShadowingOrOverridesOnMethodsRule$1.evaluate(NoShadowingOrOverridesOnMethodsRule.java:40)
	at com.carrotsearch.randomizedtesting.rules.NoShadowingOrOverridesOnMethodsRule$1.evaluate(NoShadowingOrOverridesOnMethodsRule.java:40)
	at com.carrotsearch.randomizedtesting.rules.StatementAdapter.evaluate(StatementAdapter.java:36)
	at com.carrotsearch.randomizedtesting.rules.StatementAdapter.evaluate(StatementAdapter.java:36)
	at org.apache.lucene.util.TestRuleAssertionsRequired$1.evaluate(TestRuleAssertionsRequired.java:53)
	at org.apache.lucene.util.TestRuleMarkFailure$1.evaluate(TestRuleMarkFailure.java:47)
	at org.apache.lucene.util.TestRuleIgnoreAfterMaxFailures$1.evaluate(TestRuleIgnoreAfterMaxFailures.java:64)
	at org.apache.lucene.util.TestRuleIgnoreTestSuites$1.evaluate(TestRuleIgnoreTestSuites.java:54)
	at com.carrotsearch.randomizedtesting.rules.StatementAdapter.evaluate(StatementAdapter.java:36)
	at com.carrotsearch.randomizedtesting.ThreadLeakControl$StatementRunner.run(ThreadLeakControl.java:368)
	at java.base/java.lang.Thread.run(Thread.java:844)


FAILED:  junit.framework.TestSuite.org.apache.solr.core.TestLazyCores

Error Message:
1 thread leaked from SUITE scope at org.apache.solr.core.TestLazyCores:     1) Thread[id=6528, name=searcherExecutor-1930-thread-1, state=WAITING, group=TGRP-TestLazyCores]         at java.base@9.0.1/jdk.internal.misc.Unsafe.park(Native Method)         at java.base@9.0.1/java.util.concurrent.locks.LockSupport.park(LockSupport.java:194)         at java.base@9.0.1/java.util.concurrent.locks.AbstractQueuedSynchronizer$ConditionObject.await(AbstractQueuedSynchronizer.java:2062)         at java.base@9.0.1/java.util.concurrent.LinkedBlockingQueue.take(LinkedBlockingQueue.java:435)         at java.base@9.0.1/java.util.concurrent.ThreadPoolExecutor.getTask(ThreadPoolExecutor.java:1092)         at java.base@9.0.1/java.util.concurrent.ThreadPoolExecutor.runWorker(ThreadPoolExecutor.java:1152)         at java.base@9.0.1/java.util.concurrent.ThreadPoolExecutor$Worker.run(ThreadPoolExecutor.java:641)         at java.base@9.0.1/java.lang.Thread.run(Thread.java:844)

Stack Trace:
com.carrotsearch.randomizedtesting.ThreadLeakError: 1 thread leaked from SUITE scope at org.apache.solr.core.TestLazyCores: 
   1) Thread[id=6528, name=searcherExecutor-1930-thread-1, state=WAITING, group=TGRP-TestLazyCores]
        at java.base@9.0.1/jdk.internal.misc.Unsafe.park(Native Method)
        at java.base@9.0.1/java.util.concurrent.locks.LockSupport.park(LockSupport.java:194)
        at java.base@9.0.1/java.util.concurrent.locks.AbstractQueuedSynchronizer$ConditionObject.await(AbstractQueuedSynchronizer.java:2062)
        at java.base@9.0.1/java.util.concurrent.LinkedBlockingQueue.take(LinkedBlockingQueue.java:435)
        at java.base@9.0.1/java.util.concurrent.ThreadPoolExecutor.getTask(ThreadPoolExecutor.java:1092)
        at java.base@9.0.1/java.util.concurrent.ThreadPoolExecutor.runWorker(ThreadPoolExecutor.java:1152)
        at java.base@9.0.1/java.util.concurrent.ThreadPoolExecutor$Worker.run(ThreadPoolExecutor.java:641)
        at java.base@9.0.1/java.lang.Thread.run(Thread.java:844)
	at __randomizedtesting.SeedInfo.seed([7AF6155C5F2F79BC]:0)


FAILED:  junit.framework.TestSuite.org.apache.solr.core.TestLazyCores

Error Message:
There are still zombie threads that couldn't be terminated:    1) Thread[id=6528, name=searcherExecutor-1930-thread-1, state=WAITING, group=TGRP-TestLazyCores]         at java.base@9.0.1/jdk.internal.misc.Unsafe.park(Native Method)         at java.base@9.0.1/java.util.concurrent.locks.LockSupport.park(LockSupport.java:194)         at java.base@9.0.1/java.util.concurrent.locks.AbstractQueuedSynchronizer$ConditionObject.await(AbstractQueuedSynchronizer.java:2062)         at java.base@9.0.1/java.util.concurrent.LinkedBlockingQueue.take(LinkedBlockingQueue.java:435)         at java.base@9.0.1/java.util.concurrent.ThreadPoolExecutor.getTask(ThreadPoolExecutor.java:1092)         at java.base@9.0.1/java.util.concurrent.ThreadPoolExecutor.runWorker(ThreadPoolExecutor.java:1152)         at java.base@9.0.1/java.util.concurrent.ThreadPoolExecutor$Worker.run(ThreadPoolExecutor.java:641)         at java.base@9.0.1/java.lang.Thread.run(Thread.java:844)

Stack Trace:
com.carrotsearch.randomizedtesting.ThreadLeakError: There are still zombie threads that couldn't be terminated:
   1) Thread[id=6528, name=searcherExecutor-1930-thread-1, state=WAITING, group=TGRP-TestLazyCores]
        at java.base@9.0.1/jdk.internal.misc.Unsafe.park(Native Method)
        at java.base@9.0.1/java.util.concurrent.locks.LockSupport.park(LockSupport.java:194)
        at java.base@9.0.1/java.util.concurrent.locks.AbstractQueuedSynchronizer$ConditionObject.await(AbstractQueuedSynchronizer.java:2062)
        at java.base@9.0.1/java.util.concurrent.LinkedBlockingQueue.take(LinkedBlockingQueue.java:435)
        at java.base@9.0.1/java.util.concurrent.ThreadPoolExecutor.getTask(ThreadPoolExecutor.java:1092)
        at java.base@9.0.1/java.util.concurrent.ThreadPoolExecutor.runWorker(ThreadPoolExecutor.java:1152)
        at java.base@9.0.1/java.util.concurrent.ThreadPoolExecutor$Worker.run(ThreadPoolExecutor.java:641)
        at java.base@9.0.1/java.lang.Thread.run(Thread.java:844)
	at __randomizedtesting.SeedInfo.seed([7AF6155C5F2F79BC]:0)


FAILED:  org.apache.solr.cloud.ChaosMonkeyNothingIsSafeTest.test

Error Message:
Timeout occured while waiting response from server at: http://127.0.0.1:43455/ay/f

Stack Trace:
org.apache.solr.client.solrj.SolrServerException: Timeout occured while waiting response from server at: http://127.0.0.1:43455/ay/f
	at __randomizedtesting.SeedInfo.seed([7AF6155C5F2F79BC:F2A22A86F1D31444]:0)
	at org.apache.solr.client.solrj.impl.HttpSolrClient.executeMethod(HttpSolrClient.java:654)
	at org.apache.solr.client.solrj.impl.HttpSolrClient.request(HttpSolrClient.java:255)
	at org.apache.solr.client.solrj.impl.HttpSolrClient.request(HttpSolrClient.java:244)
	at org.apache.solr.client.solrj.impl.LBHttpSolrClient.doRequest(LBHttpSolrClient.java:483)
	at org.apache.solr.client.solrj.impl.LBHttpSolrClient.request(LBHttpSolrClient.java:413)
	at org.apache.solr.client.solrj.impl.CloudSolrClient.sendRequest(CloudSolrClient.java:1103)
	at org.apache.solr.client.solrj.impl.CloudSolrClient.requestWithRetryOnStaleState(CloudSolrClient.java:883)
	at org.apache.solr.client.solrj.impl.CloudSolrClient.request(CloudSolrClient.java:816)
	at org.apache.solr.client.solrj.SolrRequest.process(SolrRequest.java:194)
	at org.apache.solr.client.solrj.SolrRequest.process(SolrRequest.java:211)
	at org.apache.solr.cloud.AbstractFullDistribZkTestBase.createServers(AbstractFullDistribZkTestBase.java:314)
	at org.apache.solr.BaseDistributedSearchTestCase$ShardsRepeatRule$ShardsFixedStatement.callStatement(BaseDistributedSearchTestCase.java:991)
	at org.apache.solr.BaseDistributedSearchTestCase$ShardsRepeatRule$ShardsStatement.evaluate(BaseDistributedSearchTestCase.java:968)
	at com.carrotsearch.randomizedtesting.rules.SystemPropertiesRestoreRule$1.evaluate(SystemPropertiesRestoreRule.java:57)
	at org.apache.lucene.util.TestRuleSetupTeardownChained$1.evaluate(TestRuleSetupTeardownChained.java:49)
	at org.apache.lucene.util.AbstractBeforeAfterRule$1.evaluate(AbstractBeforeAfterRule.java:45)
	at org.apache.lucene.util.TestRuleThreadAndTestName$1.evaluate(TestRuleThreadAndTestName.java:48)
	at org.apache.lucene.util.TestRuleIgnoreAfterMaxFailures$1.evaluate(TestRuleIgnoreAfterMaxFailures.java:64)
	at org.apache.lucene.util.TestRuleMarkFailure$1.evaluate(TestRuleMarkFailure.java:47)
	at com.carrotsearch.randomizedtesting.rules.StatementAdapter.evaluate(StatementAdapter.java:36)
	at com.carrotsearch.randomizedtesting.ThreadLeakControl$StatementRunner.run(ThreadLeakControl.java:368)
	at com.carrotsearch.randomizedtesting.ThreadLeakControl.forkTimeoutingTask(ThreadLeakControl.java:817)
	at com.carrotsearch.randomizedtesting.ThreadLeakControl$3.evaluate(ThreadLeakControl.java:468)
	at com.carrotsearch.randomizedtesting.RandomizedRunner.runSingleTest(RandomizedRunner.java:943)
	at com.carrotsearch.randomizedtesting.RandomizedRunner$5.evaluate(RandomizedRunner.java:829)
	at com.carrotsearch.randomizedtesting.RandomizedRunner$6.evaluate(RandomizedRunner.java:879)
	at com.carrotsearch.randomizedtesting.RandomizedRunner$7.evaluate(RandomizedRunner.java:890)
	at com.carrotsearch.randomizedtesting.rules.StatementAdapter.evaluate(StatementAdapter.java:36)
	at com.carrotsearch.randomizedtesting.rules.SystemPropertiesRestoreRule$1.evaluate(SystemPropertiesRestoreRule.java:57)
	at org.apache.lucene.util.AbstractBeforeAfterRule$1.evaluate(AbstractBeforeAfterRule.java:45)
	at com.carrotsearch.randomizedtesting.rules.StatementAdapter.evaluate(StatementAdapter.java:36)
	at org.apache.lucene.util.TestRuleStoreClassName$1.evaluate(TestRuleStoreClassName.java:41)
	at com.carrotsearch.randomizedtesting.rules.NoShadowingOrOverridesOnMethodsRule$1.evaluate(NoShadowingOrOverridesOnMethodsRule.java:40)
	at com.carrotsearch.randomizedtesting.rules.NoShadowingOrOverridesOnMethodsRule$1.evaluate(NoShadowingOrOverridesOnMethodsRule.java:40)
	at com.carrotsearch.randomizedtesting.rules.StatementAdapter.evaluate(StatementAdapter.java:36)
	at com.carrotsearch.randomizedtesting.rules.StatementAdapter.evaluate(StatementAdapter.java:36)
	at org.apache.lucene.util.TestRuleAssertionsRequired$1.evaluate(TestRuleAssertionsRequired.java:53)
	at org.apache.lucene.util.TestRuleMarkFailure$1.evaluate(TestRuleMarkFailure.java:47)
	at org.apache.lucene.util.TestRuleIgnoreAfterMaxFailures$1.evaluate(TestRuleIgnoreAfterMaxFailures.java:64)
	at org.apache.lucene.util.TestRuleIgnoreTestSuites$1.evaluate(TestRuleIgnoreTestSuites.java:54)
	at com.carrotsearch.randomizedtesting.rules.StatementAdapter.evaluate(StatementAdapter.java:36)
	at com.carrotsearch.randomizedtesting.ThreadLeakControl$StatementRunner.run(ThreadLeakControl.java:368)
	at java.base/java.lang.Thread.run(Thread.java:844)
Caused by: java.net.SocketTimeoutException: Read timed out
	at java.base/java.net.SocketInputStream.socketRead0(Native Method)
	at java.base/java.net.SocketInputStream.socketRead(SocketInputStream.java:116)
	at java.base/java.net.SocketInputStream.read(SocketInputStream.java:171)
	at java.base/java.net.SocketInputStream.read(SocketInputStream.java:141)
	at org.apache.http.impl.io.SessionInputBufferImpl.streamRead(SessionInputBufferImpl.java:137)
	at org.apache.http.impl.io.SessionInputBufferImpl.fillBuffer(SessionInputBufferImpl.java:153)
	at org.apache.http.impl.io.SessionInputBufferImpl.readLine(SessionInputBufferImpl.java:282)
	at org.apache.http.impl.conn.DefaultHttpResponseParser.parseHead(DefaultHttpResponseParser.java:138)
	at org.apache.http.impl.conn.DefaultHttpResponseParser.parseHead(DefaultHttpResponseParser.java:56)
	at org.apache.http.impl.io.AbstractMessageParser.parse(AbstractMessageParser.java:259)
	at org.apache.http.impl.DefaultBHttpClientConnection.receiveResponseHeader(DefaultBHttpClientConnection.java:163)
	at org.apache.http.impl.conn.CPoolProxy.receiveResponseHeader(CPoolProxy.java:165)
	at org.apache.http.protocol.HttpRequestExecutor.doReceiveResponse(HttpRequestExecutor.java:273)
	at org.apache.http.protocol.HttpRequestExecutor.execute(HttpRequestExecutor.java:125)
	at org.apache.http.impl.execchain.MainClientExec.execute(MainClientExec.java:272)
	at org.apache.http.impl.execchain.ProtocolExec.execute(ProtocolExec.java:185)
	at org.apache.http.impl.execchain.RetryExec.execute(RetryExec.java:89)
	at org.apache.http.impl.execchain.RedirectExec.execute(RedirectExec.java:111)
	at org.apache.http.impl.client.InternalHttpClient.doExecute(InternalHttpClient.java:185)
	at org.apache.http.impl.client.CloseableHttpClient.execute(CloseableHttpClient.java:83)
	at org.apache.http.impl.client.CloseableHttpClient.execute(CloseableHttpClient.java:56)
	at org.apache.solr.client.solrj.impl.HttpSolrClient.executeMethod(HttpSolrClient.java:542)
	... 42 more


FAILED:  org.apache.solr.cloud.TestLocalFSCloudBackupRestore.test

Error Message:
Error from server at https://127.0.0.1:34935/solr: Could not fully create collection: backuprestore

Stack Trace:
org.apache.solr.client.solrj.impl.HttpSolrClient$RemoteSolrException: Error from server at https://127.0.0.1:34935/solr: Could not fully create collection: backuprestore
	at __randomizedtesting.SeedInfo.seed([7AF6155C5F2F79BC:F2A22A86F1D31444]:0)
	at org.apache.solr.client.solrj.impl.HttpSolrClient.executeMethod(HttpSolrClient.java:643)
	at org.apache.solr.client.solrj.impl.HttpSolrClient.request(HttpSolrClient.java:255)
	at org.apache.solr.client.solrj.impl.HttpSolrClient.request(HttpSolrClient.java:244)
	at org.apache.solr.client.solrj.impl.LBHttpSolrClient.doRequest(LBHttpSolrClient.java:483)
	at org.apache.solr.client.solrj.impl.LBHttpSolrClient.request(LBHttpSolrClient.java:413)
	at org.apache.solr.client.solrj.impl.CloudSolrClient.sendRequest(CloudSolrClient.java:1103)
	at org.apache.solr.client.solrj.impl.CloudSolrClient.requestWithRetryOnStaleState(CloudSolrClient.java:883)
	at org.apache.solr.client.solrj.impl.CloudSolrClient.request(CloudSolrClient.java:816)
	at org.apache.solr.client.solrj.SolrRequest.process(SolrRequest.java:194)
	at org.apache.solr.client.solrj.SolrRequest.process(SolrRequest.java:211)
	at org.apache.solr.cloud.AbstractCloudBackupRestoreTestCase.test(AbstractCloudBackupRestoreTestCase.java:121)
	at java.base/jdk.internal.reflect.NativeMethodAccessorImpl.invoke0(Native Method)
	at java.base/jdk.internal.reflect.NativeMethodAccessorImpl.invoke(NativeMethodAccessorImpl.java:62)
	at java.base/jdk.internal.reflect.DelegatingMethodAccessorImpl.invoke(DelegatingMethodAccessorImpl.java:43)
	at java.base/java.lang.reflect.Method.invoke(Method.java:564)
	at com.carrotsearch.randomizedtesting.RandomizedRunner.invoke(RandomizedRunner.java:1737)
	at com.carrotsearch.randomizedtesting.RandomizedRunner$8.evaluate(RandomizedRunner.java:934)
	at com.carrotsearch.randomizedtesting.RandomizedRunner$9.evaluate(RandomizedRunner.java:970)
	at com.carrotsearch.randomizedtesting.RandomizedRunner$10.evaluate(RandomizedRunner.java:984)
	at com.carrotsearch.randomizedtesting.rules.SystemPropertiesRestoreRule$1.evaluate(SystemPropertiesRestoreRule.java:57)
	at org.apache.lucene.util.TestRuleSetupTeardownChained$1.evaluate(TestRuleSetupTeardownChained.java:49)
	at org.apache.lucene.util.AbstractBeforeAfterRule$1.evaluate(AbstractBeforeAfterRule.java:45)
	at org.apache.lucene.util.TestRuleThreadAndTestName$1.evaluate(TestRuleThreadAndTestName.java:48)
	at org.apache.lucene.util.TestRuleIgnoreAfterMaxFailures$1.evaluate(TestRuleIgnoreAfterMaxFailures.java:64)
	at org.apache.lucene.util.TestRuleMarkFailure$1.evaluate(TestRuleMarkFailure.java:47)
	at com.carrotsearch.randomizedtesting.rules.StatementAdapter.evaluate(StatementAdapter.java:36)
	at com.carrotsearch.randomizedtesting.ThreadLeakControl$StatementRunner.run(ThreadLeakControl.java:368)
	at com.carrotsearch.randomizedtesting.ThreadLeakControl.forkTimeoutingTask(ThreadLeakControl.java:817)
	at com.carrotsearch.randomizedtesting.ThreadLeakControl$3.evaluate(ThreadLeakControl.java:468)
	at com.carrotsearch.randomizedtesting.RandomizedRunner.runSingleTest(RandomizedRunner.java:943)
	at com.carrotsearch.randomizedtesting.RandomizedRunner$5.evaluate(RandomizedRunner.java:829)
	at com.carrotsearch.randomizedtesting.RandomizedRunner$6.evaluate(RandomizedRunner.java:879)
	at com.carrotsearch.randomizedtesting.RandomizedRunner$7.evaluate(RandomizedRunner.java:890)
	at com.carrotsearch.randomizedtesting.rules.StatementAdapter.evaluate(StatementAdapter.java:36)
	at com.carrotsearch.randomizedtesting.rules.SystemPropertiesRestoreRule$1.evaluate(SystemPropertiesRestoreRule.java:57)
	at org.apache.lucene.util.AbstractBeforeAfterRule$1.evaluate(AbstractBeforeAfterRule.java:45)
	at com.carrotsearch.randomizedtesting.rules.StatementAdapter.evaluate(StatementAdapter.java:36)
	at org.apache.lucene.util.TestRuleStoreClassName$1.evaluate(TestRuleStoreClassName.java:41)
	at com.carrotsearch.randomizedtesting.rules.NoShadowingOrOverridesOnMethodsRule$1.evaluate(NoShadowingOrOverridesOnMethodsRule.java:40)
	at com.carrotsearch.randomizedtesting.rules.NoShadowingOrOverridesOnMethodsRule$1.evaluate(NoShadowingOrOverridesOnMethodsRule.java:40)
	at com.carrotsearch.randomizedtesting.rules.StatementAdapter.evaluate(StatementAdapter.java:36)
	at com.carrotsearch.randomizedtesting.rules.StatementAdapter.evaluate(StatementAdapter.java:36)
	at org.apache.lucene.util.TestRuleAssertionsRequired$1.evaluate(TestRuleAssertionsRequired.java:53)
	at org.apache.lucene.util.TestRuleMarkFailure$1.evaluate(TestRuleMarkFailure.java:47)
	at org.apache.lucene.util.TestRuleIgnoreAfterMaxFailures$1.evaluate(TestRuleIgnoreAfterMaxFailures.java:64)
	at org.apache.lucene.util.TestRuleIgnoreTestSuites$1.evaluate(TestRuleIgnoreTestSuites.java:54)
	at com.carrotsearch.randomizedtesting.rules.StatementAdapter.evaluate(StatementAdapter.java:36)
	at com.carrotsearch.randomizedtesting.ThreadLeakControl$StatementRunner.run(ThreadLeakControl.java:368)
	at java.base/java.lang.Thread.run(Thread.java:844)


FAILED:  org.apache.solr.core.TestLazyCores.testNoCommit

Error Message:
Exception during query

Stack Trace:
java.lang.RuntimeException: Exception during query
	at __randomizedtesting.SeedInfo.seed([7AF6155C5F2F79BC:A596B48D94081A19]:0)
	at org.apache.solr.SolrTestCaseJ4.assertQ(SolrTestCaseJ4.java:901)
	at org.apache.solr.core.TestLazyCores.check10(TestLazyCores.java:847)
	at org.apache.solr.core.TestLazyCores.testNoCommit(TestLazyCores.java:829)
	at java.base/jdk.internal.reflect.NativeMethodAccessorImpl.invoke0(Native Method)
	at java.base/jdk.internal.reflect.NativeMethodAccessorImpl.invoke(NativeMethodAccessorImpl.java:62)
	at java.base/jdk.internal.reflect.DelegatingMethodAccessorImpl.invoke(DelegatingMethodAccessorImpl.java:43)
	at java.base/java.lang.reflect.Method.invoke(Method.java:564)
	at com.carrotsearch.randomizedtesting.RandomizedRunner.invoke(RandomizedRunner.java:1737)
	at com.carrotsearch.randomizedtesting.RandomizedRunner$8.evaluate(RandomizedRunner.java:934)
	at com.carrotsearch.randomizedtesting.RandomizedRunner$9.evaluate(RandomizedRunner.java:970)
	at com.carrotsearch.randomizedtesting.RandomizedRunner$10.evaluate(RandomizedRunner.java:984)
	at com.carrotsearch.randomizedtesting.rules.SystemPropertiesRestoreRule$1.evaluate(SystemPropertiesRestoreRule.java:57)
	at org.apache.lucene.util.TestRuleSetupTeardownChained$1.evaluate(TestRuleSetupTeardownChained.java:49)
	at org.apache.lucene.util.AbstractBeforeAfterRule$1.evaluate(AbstractBeforeAfterRule.java:45)
	at org.apache.lucene.util.TestRuleThreadAndTestName$1.evaluate(TestRuleThreadAndTestName.java:48)
	at org.apache.lucene.util.TestRuleIgnoreAfterMaxFailures$1.evaluate(TestRuleIgnoreAfterMaxFailures.java:64)
	at org.apache.lucene.util.TestRuleMarkFailure$1.evaluate(TestRuleMarkFailure.java:47)
	at com.carrotsearch.randomizedtesting.rules.StatementAdapter.evaluate(StatementAdapter.java:36)
	at com.carrotsearch.randomizedtesting.ThreadLeakControl$StatementRunner.run(ThreadLeakControl.java:368)
	at com.carrotsearch.randomizedtesting.ThreadLeakControl.forkTimeoutingTask(ThreadLeakControl.java:817)
	at com.carrotsearch.randomizedtesting.ThreadLeakControl$3.evaluate(ThreadLeakControl.java:468)
	at com.carrotsearch.randomizedtesting.RandomizedRunner.runSingleTest(RandomizedRunner.java:943)
	at com.carrotsearch.randomizedtesting.RandomizedRunner$5.evaluate(RandomizedRunner.java:829)
	at com.carrotsearch.randomizedtesting.RandomizedRunner$6.evaluate(RandomizedRunner.java:879)
	at com.carrotsearch.randomizedtesting.RandomizedRunner$7.evaluate(RandomizedRunner.java:890)
	at com.carrotsearch.randomizedtesting.rules.StatementAdapter.evaluate(StatementAdapter.java:36)
	at com.carrotsearch.randomizedtesting.rules.SystemPropertiesRestoreRule$1.evaluate(SystemPropertiesRestoreRule.java:57)
	at org.apache.lucene.util.AbstractBeforeAfterRule$1.evaluate(AbstractBeforeAfterRule.java:45)
	at com.carrotsearch.randomizedtesting.rules.StatementAdapter.evaluate(StatementAdapter.java:36)
	at org.apache.lucene.util.TestRuleStoreClassName$1.evaluate(TestRuleStoreClassName.java:41)
	at com.carrotsearch.randomizedtesting.rules.NoShadowingOrOverridesOnMethodsRule$1.evaluate(NoShadowingOrOverridesOnMethodsRule.java:40)
	at com.carrotsearch.randomizedtesting.rules.NoShadowingOrOverridesOnMethodsRule$1.evaluate(NoShadowingOrOverridesOnMethodsRule.java:40)
	at com.carrotsearch.randomizedtesting.rules.StatementAdapter.evaluate(StatementAdapter.java:36)
	at com.carrotsearch.randomizedtesting.rules.StatementAdapter.evaluate(StatementAdapter.java:36)
	at org.apache.lucene.util.TestRuleAssertionsRequired$1.evaluate(TestRuleAssertionsRequired.java:53)
	at org.apache.lucene.util.TestRuleMarkFailure$1.evaluate(TestRuleMarkFailure.java:47)
	at org.apache.lucene.util.TestRuleIgnoreAfterMaxFailures$1.evaluate(TestRuleIgnoreAfterMaxFailures.java:64)
	at org.apache.lucene.util.TestRuleIgnoreTestSuites$1.evaluate(TestRuleIgnoreTestSuites.java:54)
	at com.carrotsearch.randomizedtesting.rules.StatementAdapter.evaluate(StatementAdapter.java:36)
	at com.carrotsearch.randomizedtesting.ThreadLeakControl$StatementRunner.run(ThreadLeakControl.java:368)
	at java.base/java.lang.Thread.run(Thread.java:844)
Caused by: java.lang.RuntimeException: REQUEST FAILED: xpath=//result[@numFound='10']
	xml response was: <?xml version="1.0" encoding="UTF-8"?>
<response>
<lst name="responseHeader"><int name="status">0</int><int name="QTime">0</int><lst name="params"><str name="q">*:*</str></lst></lst><result name="response" numFound="0" start="0"></result>
</response>

	request was:q=*:*
	at org.apache.solr.SolrTestCaseJ4.assertQ(SolrTestCaseJ4.java:894)
	... 40 more




Build Log:
[...truncated 12188 lines...]
   [junit4] Suite: org.apache.solr.cloud.TestLocalFSCloudBackupRestore
   [junit4]   2> Creating dataDir: /home/jenkins/workspace/Lucene-Solr-7.2-Linux/solr/build/solr-core/test/J0/temp/solr.cloud.TestLocalFSCloudBackupRestore_7AF6155C5F2F79BC-001/init-core-data-001
   [junit4]   2> 638034 WARN  (SUITE-TestLocalFSCloudBackupRestore-seed#[7AF6155C5F2F79BC]-worker) [    ] o.a.s.SolrTestCaseJ4 startTrackingSearchers: numOpens=17 numCloses=17
   [junit4]   2> 638034 INFO  (SUITE-TestLocalFSCloudBackupRestore-seed#[7AF6155C5F2F79BC]-worker) [    ] o.a.s.SolrTestCaseJ4 Using PointFields (NUMERIC_POINTS_SYSPROP=true) w/NUMERIC_DOCVALUES_SYSPROP=true
   [junit4]   2> 638035 INFO  (SUITE-TestLocalFSCloudBackupRestore-seed#[7AF6155C5F2F79BC]-worker) [    ] o.a.s.SolrTestCaseJ4 Randomized ssl (true) and clientAuth (true) via: @org.apache.solr.util.RandomizeSSL(reason="", ssl=0.0/0.0, value=0.0/0.0, clientAuth=0.0/0.0)
   [junit4]   2> 638036 INFO  (SUITE-TestLocalFSCloudBackupRestore-seed#[7AF6155C5F2F79BC]-worker) [    ] o.a.s.SolrTestCaseJ4 SecureRandom sanity checks: test.solr.allowed.securerandom=null & java.security.egd=file:/dev/./urandom
   [junit4]   2> 638036 INFO  (SUITE-TestLocalFSCloudBackupRestore-seed#[7AF6155C5F2F79BC]-worker) [    ] o.a.s.c.MiniSolrCloudCluster Starting cluster of 2 servers in /home/jenkins/workspace/Lucene-Solr-7.2-Linux/solr/build/solr-core/test/J0/temp/solr.cloud.TestLocalFSCloudBackupRestore_7AF6155C5F2F79BC-001/tempDir-001
   [junit4]   2> 638036 INFO  (SUITE-TestLocalFSCloudBackupRestore-seed#[7AF6155C5F2F79BC]-worker) [    ] o.a.s.c.ZkTestServer STARTING ZK TEST SERVER
   [junit4]   2> 638037 INFO  (Thread-992) [    ] o.a.s.c.ZkTestServer client port:0.0.0.0/0.0.0.0:0
   [junit4]   2> 638037 INFO  (Thread-992) [    ] o.a.s.c.ZkTestServer Starting server
   [junit4]   2> 638038 ERROR (Thread-992) [    ] o.a.z.s.ZooKeeperServer ZKShutdownHandler is not registered, so ZooKeeper server won't take any action on ERROR or SHUTDOWN server state changes
   [junit4]   2> 638137 INFO  (SUITE-TestLocalFSCloudBackupRestore-seed#[7AF6155C5F2F79BC]-worker) [    ] o.a.s.c.ZkTestServer start zk server on port:40253
   [junit4]   2> 638139 INFO  (zkConnectionManagerCallback-1133-thread-1) [    ] o.a.s.c.c.ConnectionManager zkClient has connected
   [junit4]   2> 638142 INFO  (jetty-launcher-1130-thread-1) [    ] o.e.j.s.Server jetty-9.3.20.v20170531
   [junit4]   2> 638142 INFO  (jetty-launcher-1130-thread-2) [    ] o.e.j.s.Server jetty-9.3.20.v20170531
   [junit4]   2> 638144 INFO  (jetty-launcher-1130-thread-1) [    ] o.e.j.s.h.ContextHandler Started o.e.j.s.ServletContextHandler@20e5ee21{/solr,null,AVAILABLE}
   [junit4]   2> 638144 INFO  (jetty-launcher-1130-thread-2) [    ] o.e.j.s.h.ContextHandler Started o.e.j.s.ServletContextHandler@3956628b{/solr,null,AVAILABLE}
   [junit4]   2> 638146 INFO  (jetty-launcher-1130-thread-2) [    ] o.e.j.s.AbstractConnector Started ServerConnector@2e3496f1{SSL,[ssl, http/1.1]}{127.0.0.1:39291}
   [junit4]   2> 638146 INFO  (jetty-launcher-1130-thread-2) [    ] o.e.j.s.Server Started @640715ms
   [junit4]   2> 638146 INFO  (jetty-launcher-1130-thread-2) [    ] o.a.s.c.s.e.JettySolrRunner Jetty properties: {hostContext=/solr, hostPort=39291}
   [junit4]   2> 638146 ERROR (jetty-launcher-1130-thread-2) [    ] o.a.s.u.StartupLoggingUtils Missing Java Option solr.log.dir. Logging may be missing or incomplete.
   [junit4]   2> 638146 INFO  (jetty-launcher-1130-thread-2) [    ] o.a.s.s.SolrDispatchFilter  ___      _       Welcome to Apache Solr? version 7.2.1
   [junit4]   2> 638146 INFO  (jetty-launcher-1130-thread-2) [    ] o.a.s.s.SolrDispatchFilter / __| ___| |_ _   Starting in cloud mode on port null
   [junit4]   2> 638146 INFO  (jetty-launcher-1130-thread-2) [    ] o.a.s.s.SolrDispatchFilter \__ \/ _ \ | '_|  Install dir: null
   [junit4]   2> 638146 INFO  (jetty-launcher-1130-thread-2) [    ] o.a.s.s.SolrDispatchFilter |___/\___/_|_|    Start time: 2017-12-24T13:25:16.070805Z
   [junit4]   2> 638147 INFO  (jetty-launcher-1130-thread-1) [    ] o.e.j.s.AbstractConnector Started ServerConnector@1bf87af{SSL,[ssl, http/1.1]}{127.0.0.1:34935}
   [junit4]   2> 638147 INFO  (jetty-launcher-1130-thread-1) [    ] o.e.j.s.Server Started @640716ms
   [junit4]   2> 638147 INFO  (jetty-launcher-1130-thread-1) [    ] o.a.s.c.s.e.JettySolrRunner Jetty properties: {hostContext=/solr, hostPort=34935}
   [junit4]   2> 638147 ERROR (jetty-launcher-1130-thread-1) [    ] o.a.s.u.StartupLoggingUtils Missing Java Option solr.log.dir. Logging may be missing or incomplete.
   [junit4]   2> 638147 INFO  (jetty-launcher-1130-thread-1) [    ] o.a.s.s.SolrDispatchFilter  ___      _       Welcome to Apache Solr? version 7.2.1
   [junit4]   2> 638147 INFO  (jetty-launcher-1130-thread-1) [    ] o.a.s.s.SolrDispatchFilter / __| ___| |_ _   Starting in cloud mode on port null
   [junit4]   2> 638147 INFO  (jetty-launcher-1130-thread-1) [    ] o.a.s.s.SolrDispatchFilter \__ \/ _ \ | '_|  Install dir: null
   [junit4]   2> 638147 INFO  (jetty-launcher-1130-thread-1) [    ] o.a.s.s.SolrDispatchFilter |___/\___/_|_|    Start time: 2017-12-24T13:25:16.071665Z
   [junit4]   2> 638148 INFO  (zkConnectionManagerCallback-1135-thread-1) [    ] o.a.s.c.c.ConnectionManager zkClient has connected
   [junit4]   2> 638148 INFO  (jetty-launcher-1130-thread-2) [    ] o.a.s.s.SolrDispatchFilter solr.xml found in ZooKeeper. Loading...
   [junit4]   2> 638148 INFO  (zkConnectionManagerCallback-1137-thread-1) [    ] o.a.s.c.c.ConnectionManager zkClient has connected
   [junit4]   2> 638148 INFO  (jetty-launcher-1130-thread-1) [    ] o.a.s.s.SolrDispatchFilter solr.xml found in ZooKeeper. Loading...
   [junit4]   2> 638153 INFO  (jetty-launcher-1130-thread-1) [    ] o.a.s.c.ZkContainer Zookeeper client=127.0.0.1:40253/solr
   [junit4]   2> 638153 INFO  (jetty-launcher-1130-thread-2) [    ] o.a.s.c.ZkContainer Zookeeper client=127.0.0.1:40253/solr
   [junit4]   2> 638154 INFO  (zkConnectionManagerCallback-1145-thread-1) [    ] o.a.s.c.c.ConnectionManager zkClient has connected
   [junit4]   2> 638154 INFO  (zkConnectionManagerCallback-1142-thread-1) [    ] o.a.s.c.c.ConnectionManager zkClient has connected
   [junit4]   2> 638156 INFO  (zkConnectionManagerCallback-1148-thread-1-processing-n:127.0.0.1:34935_solr) [n:127.0.0.1:34935_solr    ] o.a.s.c.c.ConnectionManager zkClient has connected
   [junit4]   2> 638156 INFO  (zkConnectionManagerCallback-1149-thread-1-processing-n:127.0.0.1:39291_solr) [n:127.0.0.1:39291_solr    ] o.a.s.c.c.ConnectionManager zkClient has connected
   [junit4]   2> 638207 INFO  (jetty-launcher-1130-thread-1) [n:127.0.0.1:34935_solr    ] o.a.s.c.Overseer Overseer (id=null) closing
   [junit4]   2> 638208 INFO  (jetty-launcher-1130-thread-1) [n:127.0.0.1:34935_solr    ] o.a.s.c.OverseerElectionContext I am going to be the leader 127.0.0.1:34935_solr
   [junit4]   2> 638208 INFO  (jetty-launcher-1130-thread-1) [n:127.0.0.1:34935_solr    ] o.a.s.c.Overseer Overseer (id=99229493884485637-127.0.0.1:34935_solr-n_0000000000) starting
   [junit4]   2> 638213 INFO  (jetty-launcher-1130-thread-1) [n:127.0.0.1:34935_solr    ] o.a.s.c.ZkController Register node as live in ZooKeeper:/live_nodes/127.0.0.1:34935_solr
   [junit4]   2> 638215 INFO  (jetty-launcher-1130-thread-2) [n:127.0.0.1:39291_solr    ] o.a.s.c.Overseer Overseer (id=null) closing
   [junit4]   2> 638220 INFO  (zkCallback-1146-thread-1-processing-n:127.0.0.1:39291_solr) [n:127.0.0.1:39291_solr    ] o.a.s.c.c.ZkStateReader Updated live nodes from ZooKeeper... (0) -> (1)
   [junit4]   2> 638224 INFO  (OverseerStateUpdate-99229493884485637-127.0.0.1:34935_solr-n_0000000000) [n:127.0.0.1:34935_solr    ] o.a.s.c.c.ZkStateReader Updated live nodes from ZooKeeper... (0) -> (1)
   [junit4]   2> 638225 INFO  (jetty-launcher-1130-thread-2) [n:127.0.0.1:39291_solr    ] o.a.s.c.ZkController Register node as live in ZooKeeper:/live_nodes/127.0.0.1:39291_solr
   [junit4]   2> 638225 INFO  (zkCallback-1146-thread-1-processing-n:127.0.0.1:39291_solr) [n:127.0.0.1:39291_solr    ] o.a.s.c.c.ZkStateReader Updated live nodes from ZooKeeper... (1) -> (2)
   [junit4]   2> 638228 INFO  (zkCallback-1147-thread-1-processing-n:127.0.0.1:34935_solr) [n:127.0.0.1:34935_solr    ] o.a.s.c.c.ZkStateReader Updated live nodes from ZooKeeper... (1) -> (2)
   [junit4]   2> 638264 INFO  (jetty-launcher-1130-thread-1) [n:127.0.0.1:34935_solr    ] o.a.s.m.r.SolrJmxReporter JMX monitoring for 'solr_34935.solr.node' (registry 'solr.node') enabled at server: com.sun.jmx.mbeanserver.JmxMBeanServer@52b1eec2
   [junit4]   2> 638269 INFO  (jetty-launcher-1130-thread-2) [n:127.0.0.1:39291_solr    ] o.a.s.m.r.SolrJmxReporter JMX monitoring for 'solr_39291.solr.node' (registry 'solr.node') enabled at server: com.sun.jmx.mbeanserver.JmxMBeanServer@52b1eec2
   [junit4]   2> 638272 INFO  (jetty-launcher-1130-thread-1) [n:127.0.0.1:34935_solr    ] o.a.s.m.r.SolrJmxReporter JMX monitoring for 'solr_34935.solr.jvm' (registry 'solr.jvm') enabled at server: com.sun.jmx.mbeanserver.JmxMBeanServer@52b1eec2
   [junit4]   2> 638272 INFO  (jetty-launcher-1130-thread-1) [n:127.0.0.1:34935_solr    ] o.a.s.m.r.SolrJmxReporter JMX monitoring for 'solr_34935.solr.jetty' (registry 'solr.jetty') enabled at server: com.sun.jmx.mbeanserver.JmxMBeanServer@52b1eec2
   [junit4]   2> 638273 INFO  (jetty-launcher-1130-thread-1) [n:127.0.0.1:34935_solr    ] o.a.s.c.CorePropertiesLocator Found 0 core definitions underneath /home/jenkins/workspace/Lucene-Solr-7.2-Linux/solr/build/solr-core/test/J0/temp/solr.cloud.TestLocalFSCloudBackupRestore_7AF6155C5F2F79BC-001/tempDir-001/node1/.
   [junit4]   2> 638277 INFO  (jetty-launcher-1130-thread-2) [n:127.0.0.1:39291_solr    ] o.a.s.m.r.SolrJmxReporter JMX monitoring for 'solr_39291.solr.jvm' (registry 'solr.jvm') enabled at server: com.sun.jmx.mbeanserver.JmxMBeanServer@52b1eec2
   [junit4]   2> 638277 INFO  (jetty-launcher-1130-thread-2) [n:127.0.0.1:39291_solr    ] o.a.s.m.r.SolrJmxReporter JMX monitoring for 'solr_39291.solr.jetty' (registry 'solr.jetty') enabled at server: com.sun.jmx.mbeanserver.JmxMBeanServer@52b1eec2
   [junit4]   2> 638278 INFO  (jetty-launcher-1130-thread-2) [n:127.0.0.1:39291_solr    ] o.a.s.c.CorePropertiesLocator Found 0 core definitions underneath /home/jenkins/workspace/Lucene-Solr-7.2-Linux/solr/build/solr-core/test/J0/temp/solr.cloud.TestLocalFSCloudBackupRestore_7AF6155C5F2F79BC-001/tempDir-001/node2/.
   [junit4]   2> 638304 INFO  (zkConnectionManagerCallback-1154-thread-1) [    ] o.a.s.c.c.ConnectionManager zkClient has connected
   [junit4]   2> 638306 INFO  (zkConnectionManagerCallback-1158-thread-1) [    ] o.a.s.c.c.ConnectionManager zkClient has connected
   [junit4]   2> 638306 INFO  (SUITE-TestLocalFSCloudBackupRestore-seed#[7AF6155C5F2F79BC]-worker) [    ] o.a.s.c.c.ZkStateReader Updated live nodes from ZooKeeper... (0) -> (2)
   [junit4]   2> 638307 INFO  (SUITE-TestLocalFSCloudBackupRestore-seed#[7AF6155C5F2F79BC]-worker) [    ] o.a.s.c.s.i.ZkClientClusterStateProvider Cluster at 127.0.0.1:40253/solr ready
   [junit4]   2> 638314 INFO  (TEST-TestLocalFSCloudBackupRestore.test-seed#[7AF6155C5F2F79BC]) [    ] o.a.s.SolrTestCaseJ4 ###Starting test
   [junit4]   2> 638330 INFO  (qtp550013639-5092) [n:127.0.0.1:34935_solr    ] o.a.s.h.a.CollectionsHandler Invoked Collection Action :create with params replicationFactor=1&collection.configName=conf1&version=2&pullReplicas=1&property.customKey=customValue&maxShardsPerNode=4&autoAddReplicas=true&name=backuprestore&nrtReplicas=1&action=CREATE&numShards=2&tlogReplicas=0&wt=javabin and sendToOCPQueue=true
   [junit4]   2> 638331 INFO  (OverseerThreadFactory-2649-thread-1-processing-n:127.0.0.1:34935_solr) [n:127.0.0.1:34935_solr    ] o.a.s.c.CreateCollectionCmd Create collection backuprestore
   [junit4]   2> 668348 ERROR (OverseerThreadFactory-2649-thread-1-processing-n:127.0.0.1:34935_solr) [n:127.0.0.1:34935_solr    ] o.a.s.c.OverseerCollectionMessageHandler Collection: backuprestore operation: create failed:org.apache.solr.common.SolrException: Could not fully create collection: backuprestore
   [junit4]   2> 	at org.apache.solr.cloud.CreateCollectionCmd.call(CreateCollectionCmd.java:215)
   [junit4]   2> 	at org.apache.solr.cloud.OverseerCollectionMessageHandler.processMessage(OverseerCollectionMessageHandler.java:233)
   [junit4]   2> 	at org.apache.solr.cloud.OverseerTaskProcessor$Runner.run(OverseerTaskProcessor.java:464)
   [junit4]   2> 	at org.apache.solr.common.util.ExecutorUtil$MDCAwareThreadPoolExecutor.lambda$execute$0(ExecutorUtil.java:188)
   [junit4]   2> 	at java.base/java.util.concurrent.ThreadPoolExecutor.runWorker(ThreadPoolExecutor.java:1167)
   [junit4]   2> 	at java.base/java.util.concurrent.ThreadPoolExecutor$Worker.run(ThreadPoolExecutor.java:641)
   [junit4]   2> 	at java.base/java.lang.Thread.run(Thread.java:844)
   [junit4]   2> 
   [junit4]   2> 668350 INFO  (qtp550013639-5092) [n:127.0.0.1:34935_solr    ] o.a.s.s.HttpSolrCall [admin] webapp=null path=/admin/collections params={replicationFactor=1&collection.configName=conf1&version=2&pullReplicas=1&property.customKey=customValue&maxShardsPerNode=4&autoAddReplicas=true&name=backuprestore&nrtReplicas=1&action=CREATE&numShards=2&tlogReplicas=0&wt=javabin} status=500 QTime=30020
   [junit4]   2> 668350 ERROR (qtp550013639-5092) [n:127.0.0.1:34935_solr    ] o.a.s.s.HttpSolrCall null:org.apache.solr.common.SolrException: Could not fully create collection: backuprestore
   [junit4]   2> 	at org.apache.solr.handler.admin.CollectionsHandler.handleResponse(CollectionsHandler.java:309)
   [junit4]   2> 	at org.apache.solr.handler.admin.CollectionsHandler.invokeAction(CollectionsHandler.java:246)
   [junit4]   2> 	at org.apache.solr.handler.admin.CollectionsHandler.handleRequestBody(CollectionsHandler.java:224)
   [junit4]   2> 	at org.apache.solr.handler.RequestHandlerBase.handleRequest(RequestHandlerBase.java:177)
   [junit4]   2> 	at org.apache.solr.servlet.HttpSolrCall.handleAdmin(HttpSolrCall.java:735)
   [junit4]   2> 	at org.apache.solr.servlet.HttpSolrCall.handleAdminRequest(HttpSolrCall.java:716)
   [junit4]   2> 	at org.apache.solr.servlet.HttpSolrCall.call(HttpSolrCall.java:497)
   [junit4]   2> 	at org.apache.solr.servlet.SolrDispatchFilter.doFilter(SolrDispatchFilter.java:382)
   [junit4]   2> 	at org.apache.solr.servlet.SolrDispatchFilter.doFilter(SolrDispatchFilter.java:326)
   [junit4]   2> 	at org.eclipse.jetty.servlet.ServletHandler$CachedChain.doFilter(ServletHandler.java:1759)
   [junit4]   2> 	at org.apache.solr.client.solrj.embedded.JettySolrRunner$DebugFilter.doFilter(JettySolrRunner.java:139)
   [junit4]   2> 	at org.eclipse.jetty.servlet.ServletHandler$CachedChain.doFilter(ServletHandler.java:1759)
   [junit4]   2> 	at org.eclipse.jetty.servlet.ServletHandler.doHandle(ServletHandler.java:582)
   [junit4]   2> 	at org.eclipse.jetty.server.session.SessionHandler.doHandle(SessionHandler.java:224)
   [junit4]   2> 	at org.eclipse.jetty.server.handler.ContextHandler.doHandle(ContextHandler.java:1180)
   [junit4]   2> 	at org.eclipse.jetty.servlet.ServletHandler.doScope(ServletHandler.java:512)
   [junit4]   2> 	at org.eclipse.jetty.server.session.SessionHandler.doScope(SessionHandler.java:185)
   [junit4]   2> 	at org.eclipse.jetty.server.handler.ContextHandler.doScope(ContextHandler.java:1112)
   [junit4]   2> 	at org.eclipse.jetty.server.handler.ScopedHandler.handle(ScopedHandler.java:141)
   [junit4]   2> 	at org.eclipse.jetty.server.handler.gzip.GzipHandler.handle(GzipHandler.java:493)
   [junit4]   2> 	at org.eclipse.jetty.server.handler.HandlerWrapper.handle(HandlerWrapper.java:134)
   [junit4]   2> 	at org.eclipse.jetty.server.Server.handle(Server.java:534)
   [junit4]   2> 	at org.eclipse.jetty.server.HttpChannel.handle(HttpChannel.java:320)
   [junit4]   2> 	at org.eclipse.jetty.server.HttpConnection.onFillable(HttpConnection.java:251)
   [junit4]   2> 	at org.eclipse.jetty.io.AbstractConnection$ReadCallback.succeeded(AbstractConnection.java:283)
   [junit4]   2> 	at org.eclipse.jetty.io.FillInterest.fillable(FillInterest.java:108)
   [junit4]   2> 	at org.eclipse.jetty.io.ssl.SslConnection.onFillable(SslConnection.java:251)
   [junit4]   2> 	at org.eclipse.jetty.io.AbstractConnection$ReadCallback.succeeded(AbstractConnection.java:283)
   [junit4]   2> 	at org.eclipse.jetty.io.FillInterest.fillable(FillInterest.java:108)
   [junit4]   2> 	at org.eclipse.jetty.io.SelectChannelEndPoint$2.run(SelectChannelEndPoint.java:93)
   [junit4]   2> 	at org.eclipse.jetty.util.thread.strategy.ExecuteProduceConsume.executeProduceConsume(ExecuteProduceConsume.java:303)
   [junit4]   2> 	at org.eclipse.jetty.util.thread.strategy.ExecuteProduceConsume.produceConsume(ExecuteProduceConsume.java:148)
   [junit4]   2> 	at org.eclipse.jetty.util.thread.strategy.ExecuteProduceConsume.run(ExecuteProduceConsume.java:136)
   [junit4]   2> 	at org.eclipse.jetty.util.thread.QueuedThreadPool.runJob(QueuedThreadPool.java:671)
   [junit4]   2> 	at org.eclipse.jetty.util.thread.QueuedThreadPool$2.run(QueuedThreadPool.java:589)
   [junit4]   2> 	at java.base/java.lang.Thread.run(Thread.java:844)
   [junit4]   2> 
   [junit4]   2> 668351 INFO  (TEST-TestLocalFSCloudBackupRestore.test-seed#[7AF6155C5F2F79BC]) [    ] o.a.s.SolrTestCaseJ4 ###Ending test
   [junit4]   2> NOTE: reproduce with: ant test  -Dtestcase=TestLocalFSCloudBackupRestore -Dtests.method=test -Dtests.seed=7AF6155C5F2F79BC -Dtests.multiplier=3 -Dtests.slow=true -Dtests.locale=ka -Dtests.timezone=America/Nipigon -Dtests.asserts=true -Dtests.file.encoding=ISO-8859-1
   [junit4] ERROR   30.0s J0 | TestLocalFSCloudBackupRestore.test <<<
   [junit4]    > Throwable #1: org.apache.solr.client.solrj.impl.HttpSolrClient$RemoteSolrException: Error from server at https://127.0.0.1:34935/solr: Could not fully create collection: backuprestore
   [junit4]    > 	at __randomizedtesting.SeedInfo.seed([7AF6155C5F2F79BC:F2A22A86F1D31444]:0)
   [junit4]    > 	at org.apache.solr.client.solrj.impl.HttpSolrClient.executeMethod(HttpSolrClient.java:643)
   [junit4]    > 	at org.apache.solr.client.solrj.impl.HttpSolrClient.request(HttpSolrClient.java:255)
   [junit4]    > 	at org.apache.solr.client.solrj.impl.HttpSolrClient.request(HttpSolrClient.java:244)
   [junit4]    > 	at org.apache.solr.client.solrj.impl.LBHttpSolrClient.doRequest(LBHttpSolrClient.java:483)
   [junit4]    > 	at org.apache.solr.client.solrj.impl.LBHttpSolrClient.request(LBHttpSolrClient.java:413)
   [junit4]    > 	at org.apache.solr.client.solrj.impl.CloudSolrClient.sendRequest(CloudSolrClient.java:1103)
   [junit4]    > 	at org.apache.solr.client.solrj.impl.CloudSolrClient.requestWithRetryOnStaleState(CloudSolrClient.java:883)
   [junit4]    > 	at org.apache.solr.client.solrj.impl.CloudSolrClient.request(CloudSolrClient.java:816)
   [junit4]    > 	at org.apache.solr.client.solrj.SolrRequest.process(SolrRequest.java:194)
   [junit4]    > 	at org.apache.solr.client.solrj.SolrRequest.process(SolrRequest.java:211)
   [junit4]    > 	at org.apache.solr.cloud.AbstractCloudBackupRestoreTestCase.test(AbstractCloudBackupRestoreTestCase.java:121)
   [junit4]    > 	at java.base/jdk.internal.reflect.NativeMethodAccessorImpl.invoke0(Native Method)
   [junit4]    > 	at java.base/jdk.internal.reflect.NativeMethodAccessorImpl.invoke(NativeMethodAccessorImpl.java:62)
   [junit4]    > 	at java.base/jdk.internal.reflect.DelegatingMethodAccessorImpl.invoke(DelegatingMethodAccessorImpl.java:43)
   [junit4]    > 	at java.base/java.lang.reflect.Method.invoke(Method.java:564)
   [junit4]    > 	at java.base/java.lang.Thread.run(Thread.java:844)
   [junit4]   2> 668353 INFO  (jetty-closer-1131-thread-1) [    ] o.e.j.s.AbstractConnector Stopped ServerConnector@1bf87af{SSL,[ssl, http/1.1]}{127.0.0.1:0}
   [junit4]   2> 668353 INFO  (jetty-closer-1131-thread-1) [    ] o.a.s.c.CoreContainer Shutting down CoreContainer instance=1967387508
   [junit4]   2> 668353 INFO  (jetty-closer-1131-thread-1) [    ] o.a.s.m.SolrMetricManager Closing metric reporters for registry=solr.node, tag=null
   [junit4]   2> 668354 INFO  (jetty-closer-1131-thread-2) [    ] o.e.j.s.AbstractConnector Stopped ServerConnector@2e3496f1{SSL,[ssl, http/1.1]}{127.0.0.1:0}
   [junit4]   2> 668354 INFO  (jetty-closer-1131-thread-1) [    ] o.a.s.m.r.SolrJmxReporter Closing reporter [org.apache.solr.metrics.reporters.SolrJmxReporter@38bf9fe7: rootName = solr_34935, domain = solr.node, service url = null, agent id = null] for registry solr.node / com.codahale.metrics.MetricRegistry@1069b3ab
   [junit4]   2> 668354 INFO  (jetty-closer-1131-thread-2) [    ] o.a.s.c.CoreContainer Shutting down CoreContainer instance=1257148492
   [junit4]   2> 668354 INFO  (jetty-closer-1131-thread-2) [    ] o.a.s.m.SolrMetricManager Closing metric reporters for registry=solr.node, tag=null
   [junit4]   2> 668354 INFO  (jetty-closer-1131-thread-2) [    ] o.a.s.m.r.SolrJmxReporter Closing reporter [org.apache.solr.metrics.reporters.SolrJmxReporter@4c6e1e02: rootName = solr_39291, domain = solr.node, service url = null, agent id = null] for registry solr.node / com.codahale.metrics.MetricRegistry@15158fee
   [junit4]   2> 668357 INFO  (jetty-closer-1131-thread-2) [    ] o.a.s.m.SolrMetricManager Closing metric reporters for registry=solr.jvm, tag=null
   [junit4]   2> 668357 INFO  (jetty-closer-1131-thread-2) [    ] o.a.s.m.r.SolrJmxReporter Closing reporter [org.apache.solr.metrics.reporters.SolrJmxReporter@2da74a5f: rootName = solr_39291, domain = solr.jvm, service url = null, agent id = null] for registry solr.jvm / com.codahale.metrics.MetricRegistry@3d3e60c4
   [junit4]   2> 668359 INFO  (jetty-closer-1131-thread-1) [    ] o.a.s.m.SolrMetricManager Closing metric reporters for registry=solr.jvm, tag=null
   [junit4]   2> 668359 INFO  (jetty-closer-1131-thread-1) [    ] o.a.s.m.r.SolrJmxReporter Closing reporter [org.apache.solr.metrics.reporters.SolrJmxReporter@2e872c50: rootName = solr_34935, domain = solr.jvm, service url = null, agent id = null] for registry solr.jvm / com.codahale.metrics.MetricRegistry@3d3e60c4
   [junit4]   2> 668359 INFO  (jetty-closer-1131-thread-2) [    ] o.a.s.m.SolrMetricManager Closing metric reporters for registry=solr.jetty, tag=null
   [junit4]   2> 668359 INFO  (jetty-closer-1131-thread-2) [    ] o.a.s.m.r.SolrJmxReporter Closing reporter [org.apache.solr.metrics.reporters.SolrJmxReporter@2ae3e253: rootName = solr_39291, domain = solr.jetty, service url = null, agent id = null] for registry solr.jetty / com.codahale.metrics.MetricRegistry@3901f3bb
   [junit4]   2> 668360 INFO  (jetty-closer-1131-thread-2) [    ] o.a.s.c.ZkController Remove node as live in ZooKeeper:/live_nodes/127.0.0.1:39291_solr
   [junit4]   2> 668360 INFO  (jetty-closer-1131-thread-2) [    ] o.a.s.m.SolrMetricManager Closing metric reporters for registry=solr.cluster, tag=null
   [junit4]   2> 668360 INFO  (zkCallback-1147-thread-1-processing-n:127.0.0.1:34935_solr) [n:127.0.0.1:34935_solr    ] o.a.s.c.c.ZkStateReader Updated live nodes from ZooKeeper... (2) -> (1)
   [junit4]   2> 668360 INFO  (zkCallback-1146-thread-1-processing-n:127.0.0.1:39291_solr) [n:127.0.0.1:39291_solr    ] o.a.s.c.c.ZkStateReader Updated live nodes from ZooKeeper... (2) -> (1)
   [junit4]   2> 668361 INFO  (jetty-closer-1131-thread-2) [    ] o.a.s.c.TransientSolrCoreCacheDefault Allocating transient cache for 2147483647 transient cores
   [junit4]   2> 668362 INFO  (jetty-closer-1131-thread-1) [    ] o.a.s.m.SolrMetricManager Closing metric reporters for registry=solr.jetty, tag=null
   [junit4]   2> 668363 INFO  (jetty-closer-1131-thread-1) [    ] o.a.s.m.r.SolrJmxReporter Closing reporter [org.apache.solr.metrics.reporters.SolrJmxReporter@1921d67c: rootName = solr_34935, domain = solr.jetty, service url = null, agent id = null] for registry solr.jetty / com.codahale.metrics.MetricRegistry@3901f3bb
   [junit4]   2> 668363 INFO  (jetty-closer-1131-thread-1) [    ] o.a.s.c.ZkController Remove node as live in ZooKeeper:/live_nodes/127.0.0.1:34935_solr
   [junit4]   2> 668363 INFO  (jetty-closer-1131-thread-1) [    ] o.a.s.m.SolrMetricManager Closing metric reporters for registry=solr.cluster, tag=null
   [junit4]   2> 668363 INFO  (zkCallback-1147-thread-1-processing-n:127.0.0.1:34935_solr) [n:127.0.0.1:34935_solr    ] o.a.s.c.c.ZkStateReader Updated live nodes from ZooKeeper... (1) -> (0)
   [junit4]   2> 668363 INFO  (jetty-closer-1131-thread-1) [    ] o.a.s.c.TransientSolrCoreCacheDefault Allocating transient cache for 2147483647 transient cores
   [junit4]   2> 668363 INFO  (jetty-closer-1131-thread-1) [    ] o.a.s.c.Overseer Overseer (id=99229493884485637-127.0.0.1:34935_solr-n_0000000000) closing
   [junit4]   2> 668364 INFO  (OverseerStateUpdate-99229493884485637-127.0.0.1:34935_solr-n_0000000000) [n:127.0.0.1:34935_solr    ] o.a.s.c.Overseer Overseer Loop exiting : 127.0.0.1:34935_solr
   [junit4]   2> 668366 WARN  (OverseerAutoScalingTriggerThread-99229493884485637-127.0.0.1:34935_solr-n_0000000000) [n:127.0.0.1:34935_solr    ] o.a.s.c.a.OverseerTriggerThread OverseerTriggerThread woken up but we are closed, exiting.
   [junit4]   2> 668366 INFO  (jetty-closer-1131-thread-2) [    ] o.e.j.s.h.ContextHandler Stopped o.e.j.s.ServletContextHandler@3956628b{/solr,null,UNAVAILABLE}
   [junit4]   2> 668367 INFO  (jetty-closer-1131-thread-1) [    ] o.e.j.s.h.ContextHandler Stopped o.e.j.s.ServletContextHandler@20e5ee21{/solr,null,UNAVAILABLE}
   [junit4]   2> 668367 ERROR (SUITE-TestLocalFSCloudBackupRestore-seed#[7AF6155C5F2F79BC]-worker) [    ] o.a.z.s.ZooKeeperServer ZKShutdownHandler is not registered, so ZooKeeper server won't take any action on ERROR or SHUTDOWN server state changes
   [junit4]   2> 668367 INFO  (SUITE-TestLocalFSCloudBackupRestore-seed#[7AF6155C5F2F79BC]-worker) [    ] o.a.s.c.ZkTestServer connecting to 127.0.0.1:40253 40253
   [junit4]   2> 673514 INFO  (Thread-992) [    ] o.a.s.c.ZkTestServer connecting to 127.0.0.1:40253 40253
   [junit4]   2> 673514 WARN  (Thread-992) [    ] o.a.s.c.ZkTestServer Watch limit violations: 
   [junit4]   2> Maximum concurrent create/delete watches above limit:
   [junit4]   2> 
   [junit4]   2> 	3	/solr/aliases.json
   [junit4]   2> 	2	/solr/security.json
   [junit4]   2> 
   [junit4]   2> Maximum concurrent data watches above limit:
   [junit4]   2> 
   [junit4]   2> 	3	/solr/clusterstate.json
   [junit4]   2> 	3	/solr/clusterprops.json
   [junit4]   2> 
   [junit4]   2> Maximum concurrent children watches above limit:
   [junit4]   2> 
   [junit4]   2> 	3	/solr/live_nodes
   [junit4]   2> 	3	/solr/collections
   [junit4]   2> 
   [junit4]   2> NOTE: leaving temporary files on disk at: /home/jenkins/workspace/Lucene-Solr-7.2-Linux/solr/build/solr-core/test/J0/temp/solr.cloud.TestLocalFSCloudBackupRestore_7AF6155C5F2F79BC-001
   [junit4]   2> NOTE: test params are: codec=Lucene70, sim=RandomSimilarity(queryNorm=false): {}, locale=ka, timezone=America/Nipigon
   [junit4]   2> NOTE: Linux 4.10.0-40-generic amd64/Oracle Corporation 9.0.1 (64-bit)/cpus=8,threads=1,free=114596944,total=494927872
   [junit4]   2> NOTE: All tests run in this JVM: [TestZkAclsWithHadoopAuth, CoreMergeIndexesAdminHandlerTest, TestBadConfig, BlockJoinFacetRandomTest, BufferStoreTest, CollectionsAPISolrJTest, TestMacros, TestManagedResource, RAMDirectoryFactoryTest, SearchHandlerTest, TestPKIAuthenticationPlugin, SimpleFacetsTest, OverseerModifyCollectionTest, HdfsNNFailoverTest, SpatialRPTFieldTypeTest, SliceStateTest, TestPostingsSolrHighlighter, TestSimpleTextCodec, TestManagedSynonymFilterFactory, AnalysisErrorHandlingTest, TestSolrIndexConfig, TestDynamicFieldResource, TestSolrCloudWithDelegationTokens, TestFieldTypeCollectionResource, MultiTermTest, TestLeaderElectionWithEmptyReplica, TestLegacyFieldReuse, TestMergePolicyConfig, TestPhraseSuggestions, TestManagedSchema, TestReqParamsAPI, DocValuesTest, QueryResultKeyTest, PeerSyncWithIndexFingerprintCachingTest, TestFastOutputStream, TestNumericTerms64, HdfsChaosMonkeyNothingIsSafeTest, TestDownShardTolerantSearch, VMParamsZkACLAndCredentialsProvidersTest, TestDFRSimilarityFactory, TermsComponentTest, TestRTimerTree, StatelessScriptUpdateProcessorFactoryTest, DeleteReplicaTest, TestFieldCacheSort, TestInitQParser, TestCryptoKeys, ChaosMonkeyNothingIsSafeWithPullReplicasTest, TestMultiValuedNumericRangeQuery, TestPullReplicaErrorHandling, TestImplicitCoreProperties, SolrCoreTest, WrapperMergePolicyFactoryTest, SolrSlf4jReporterTest, ExecutePlanActionTest, TestCloudNestedDocsSort, ExternalFileFieldSortTest, TestQueryWrapperFilter, TestCodecSupport, BigEndianAscendingWordSerializerTest, SimpleMLTQParserTest, SolrPluginUtilsTest, TestFieldCacheWithThreads, SpellCheckComponentTest, TestSearcherReuse, PropertiesRequestHandlerTest, TestCoreBackup, DistributedQueueTest, TestOnReconnectListenerSupport, TestHighFrequencyDictionaryFactory, CachingDirectoryFactoryTest, ResourceLoaderTest, ReplicaListTransformerTest, AssignBackwardCompatibilityTest, HdfsTlogReplayBufferedWhileIndexingTest, TestLocalFSCloudBackupRestore]
   [junit4] Completed [191/751 (1!)] on J0 in 35.50s, 1 test, 1 error <<< FAILURES!

[...truncated 50 lines...]
   [junit4] Suite: org.apache.solr.core.TestLazyCores
   [junit4]   2> Creating dataDir: /home/jenkins/workspace/Lucene-Solr-7.2-Linux/solr/build/solr-core/test/J1/temp/solr.core.TestLazyCores_7AF6155C5F2F79BC-001/init-core-data-001
   [junit4]   2> 705995 WARN  (SUITE-TestLazyCores-seed#[7AF6155C5F2F79BC]-worker) [    ] o.a.s.SolrTestCaseJ4 startTrackingSearchers: numOpens=11 numCloses=11
   [junit4]   2> 705995 INFO  (SUITE-TestLazyCores-seed#[7AF6155C5F2F79BC]-worker) [    ] o.a.s.SolrTestCaseJ4 Using TrieFields (NUMERIC_POINTS_SYSPROP=false) w/NUMERIC_DOCVALUES_SYSPROP=false
   [junit4]   2> 705995 INFO  (SUITE-TestLazyCores-seed#[7AF6155C5F2F79BC]-worker) [    ] o.a.s.SolrTestCaseJ4 Randomized ssl (true) and clientAuth (true) via: @org.apache.solr.util.RandomizeSSL(reason="", ssl=0.0/0.0, value=0.0/0.0, clientAuth=0.0/0.0)
   [junit4]   2> 705996 INFO  (SUITE-TestLazyCores-seed#[7AF6155C5F2F79BC]-worker) [    ] o.a.s.SolrTestCaseJ4 SecureRandom sanity checks: test.solr.allowed.securerandom=null & java.security.egd=file:/dev/./urandom
   [junit4]   2> 705997 INFO  (TEST-TestLazyCores.testLazySearch-seed#[7AF6155C5F2F79BC]) [    ] o.a.s.SolrTestCaseJ4 ###Starting testLazySearch
   [junit4]   2> 706004 INFO  (TEST-TestLazyCores.testLazySearch-seed#[7AF6155C5F2F79BC]) [    ] o.a.s.c.SolrXmlConfig Loading container configuration from /home/jenkins/workspace/Lucene-Solr-7.2-Linux/solr/build/solr-core/test/J1/temp/solr.core.TestLazyCores_7AF6155C5F2F79BC-001/tempDir-001/solr.xml
   [junit4]   2> 706006 INFO  (TEST-TestLazyCores.testLazySearch-seed#[7AF6155C5F2F79BC]) [    ] o.a.s.c.SolrXmlConfig Configuration parameter autoReplicaFailoverWorkLoopDelay is ignored
   [junit4]   2> 706006 INFO  (TEST-TestLazyCores.testLazySearch-seed#[7AF6155C5F2F79BC]) [    ] o.a.s.c.SolrXmlConfig Configuration parameter autoReplicaFailoverBadNodeExpiration is ignored
   [junit4]   2> 706007 INFO  (TEST-TestLazyCores.testLazySearch-seed#[7AF6155C5F2F79BC]) [    ] o.a.s.c.SolrXmlConfig MBean server found: com.sun.jmx.mbeanserver.JmxMBeanServer@374ec7ab, but no JMX reporters were configured - adding default JMX reporter.
   [junit4]   2> 706023 INFO  (TEST-TestLazyCores.testLazySearch-seed#[7AF6155C5F2F79BC]) [    ] o.a.s.m.r.SolrJmxReporter JMX monitoring for 'solr.node' (registry 'solr.node') enabled at server: com.sun.jmx.mbeanserver.JmxMBeanServer@374ec7ab
   [junit4]   2> 706029 INFO  (TEST-TestLazyCores.testLazySearch-seed#[7AF6155C5F2F79BC]) [    ] o.a.s.m.r.SolrJmxReporter JMX monitoring for 'solr.jvm' (registry 'solr.jvm') enabled at server: com.sun.jmx.mbeanserver.JmxMBeanServer@374ec7ab
   [junit4]   2> 706029 INFO  (TEST-TestLazyCores.testLazySearch-seed#[7AF6155C5F2F79BC]) [    ] o.a.s.m.r.SolrJmxReporter JMX monitoring for 'solr.jetty' (registry 'solr.jetty') enabled at server: com.sun.jmx.mbeanserver.JmxMBeanServer@374ec7ab
   [junit4]   2> 706030 INFO  (TEST-TestLazyCores.testLazySearch-seed#[7AF6155C5F2F79BC]) [    ] o.a.s.c.TransientSolrCoreCacheDefault Allocating transient cache for 4 transient cores
   [junit4]   2> 706035 INFO  (coreLoadExecutor-1613-thread-2) [    x:collection2] o.a.s.c.SolrConfig Using Lucene MatchVersion: 7.2.1
   [junit4]   2> 706035 INFO  (coreLoadExecutor-1613-thread-3) [    x:collection5] o.a.s.c.SolrConfig Using Lucene MatchVersion: 7.2.1
   [junit4]   2> 706042 INFO  (coreLoadExecutor-1613-thread-1) [    x:collection1] o.a.s.c.SolrConfig Using Lucene MatchVersion: 7.2.1
   [junit4]   2> 706046 INFO  (coreLoadExecutor-1613-thread-3) [    x:collection5] o.a.s.s.IndexSchema [collection5] Schema name=tiny
   [junit4]   2> 706046 INFO  (coreLoadExecutor-1613-thread-1) [    x:collection1] o.a.s.s.IndexSchema [collection1] Schema name=tiny
   [junit4]   2> 706048 INFO  (coreLoadExecutor-1613-thread-3) [    x:collection5] o.a.s.s.IndexSchema Loaded schema tiny/1.1 with uniqueid field id
   [junit4]   2> 706048 INFO  (coreLoadExecutor-1613-thread-1) [    x:collection1] o.a.s.s.IndexSchema Loaded schema tiny/1.1 with uniqueid field id
   [junit4]   2> 706048 INFO  (coreLoadExecutor-1613-thread-3) [    x:collection5] o.a.s.c.CoreContainer Creating SolrCore 'collection5' using configuration from instancedir /home/jenkins/workspace/Lucene-Solr-7.2-Linux/solr/build/solr-core/test/J1/temp/solr.core.TestLazyCores_7AF6155C5F2F79BC-001/tempDir-001/./collection5, trusted=true
   [junit4]   2> 706048 INFO  (coreLoadExecutor-1613-thread-1) [    x:collection1] o.a.s.c.CoreContainer Creating SolrCore 'collection1' using configuration from instancedir /home/jenkins/workspace/Lucene-Solr-7.2-Linux/solr/build/solr-core/test/J1/temp/solr.core.TestLazyCores_7AF6155C5F2F79BC-001/tempDir-001/./collection1, trusted=true
   [junit4]   2> 706049 INFO  (coreLoadExecutor-1613-thread-3) [    x:collection5] o.a.s.m.r.SolrJmxReporter JMX monitoring for 'solr.core.collection5' (registry 'solr.core.collection5') enabled at server: com.sun.jmx.mbeanserver.JmxMBeanServer@374ec7ab
   [junit4]   2> 706049 INFO  (coreLoadExecutor-1613-thread-1) [    x:collection1] o.a.s.m.r.SolrJmxReporter JMX monitoring for 'solr.core.collection1' (registry 'solr.core.collection1') enabled at server: com.sun.jmx.mbeanserver.JmxMBeanServer@374ec7ab
   [junit4]   2> 706049 INFO  (coreLoadExecutor-1613-thread-3) [    x:collection5] o.a.s.c.SolrCore solr.RecoveryStrategy.Builder
   [junit4]   2> 706049 INFO  (coreLoadExecutor-1613-thread-1) [    x:collection1] o.a.s.c.SolrCore solr.RecoveryStrategy.Builder
   [junit4]   2> 706049 INFO  (coreLoadExecutor-1613-thread-1) [    x:collection1] o.a.s.c.SolrCore [[collection1] ] Opening new SolrCore at [/home/jenkins/workspace/Lucene-Solr-7.2-Linux/solr/build/solr-core/test/J1/temp/solr.core.TestLazyCores_7AF6155C5F2F79BC-001/tempDir-001/collection1], dataDir=[/home/jenkins/workspace/Lucene-Solr-7.2-Linux/solr/build/solr-core/test/J1/temp/solr.core.TestLazyCores_7AF6155C5F2F79BC-001/tempDir-001/./collection1/data/]
   [junit4]   2> 706049 INFO  (coreLoadExecutor-1613-thread-3) [    x:collection5] o.a.s.c.SolrCore [[collection5] ] Opening new SolrCore at [/home/jenkins/workspace/Lucene-Solr-7.2-Linux/solr/build/solr-core/test/J1/temp/solr.core.TestLazyCores_7AF6155C5F2F79BC-001/tempDir-001/collection5], dataDir=[/home/jenkins/workspace/Lucene-Solr-7.2-Linux/solr/build/solr-core/test/J1/temp/solr.core.TestLazyCores_7AF6155C5F2F79BC-001/tempDir-001/./collection5/data/]
   [junit4]   2> 706049 INFO  (coreLoadExecutor-1613-thread-2) [    x:collection2] o.a.s.s.IndexSchema [collection2] Schema name=tiny
   [junit4]   2> 706051 INFO  (coreLoadExecutor-1613-thread-3) [    x:collection5] o.a.s.u.RandomMergePolicy RandomMergePolicy wrapping class org.apache.lucene.index.TieredMergePolicy: [TieredMergePolicy: maxMergeAtOnce=16, maxMergeAtOnceExplicit=29, maxMergedSegmentMB=88.197265625, floorSegmentMB=0.841796875, forceMergeDeletesPctAllowed=25.825290944118464, segmentsPerTier=21.0, maxCFSSegmentSizeMB=8.796093022207999E12, noCFSRatio=0.7492788564887481
   [junit4]   2> 706051 INFO  (coreLoadExecutor-1613-thread-1) [    x:collection1] o.a.s.u.RandomMergePolicy RandomMergePolicy wrapping class org.apache.lucene.index.TieredMergePolicy: [TieredMergePolicy: maxMergeAtOnce=16, maxMergeAtOnceExplicit=29, maxMergedSegmentMB=88.197265625, floorSegmentMB=0.841796875, forceMergeDeletesPctAllowed=25.825290944118464, segmentsPerTier=21.0, maxCFSSegmentSizeMB=8.796093022207999E12, noCFSRatio=0.7492788564887481
   [junit4]   2> 706054 INFO  (coreLoadExecutor-1613-thread-2) [    x:collection2] o.a.s.s.IndexSchema Loaded schema tiny/1.1 with uniqueid field id
   [junit4]   2> 706054 INFO  (coreLoadExecutor-1613-thread-2) [    x:collection2] o.a.s.c.CoreContainer Creating SolrCore 'collection2' using configuration from instancedir /home/jenkins/workspace/Lucene-Solr-7.2-Linux/solr/build/solr-core/test/J1/temp/solr.core.TestLazyCores_7AF6155C5F2F79BC-001/tempDir-001/./collection2, trusted=true
   [junit4]   2> 706054 INFO  (coreLoadExecutor-1613-thread-2) [    x:collection2] o.a.s.m.r.SolrJmxReporter JMX monitoring for 'solr.core.collection2' (registry 'solr.core.collection2') enabled at server: com.sun.jmx.mbeanserver.JmxMBeanServer@374ec7ab
   [junit4]   2> 706054 INFO  (coreLoadExecutor-1613-thread-2) [    x:collection2] o.a.s.c.SolrCore solr.RecoveryStrategy.Builder
   [junit4]   2> 706054 INFO  (coreLoadExecutor-1613-thread-2) [    x:collection2] o.a.s.c.SolrCore [[collection2] ] Opening new SolrCore at [/home/jenkins/workspace/Lucene-Solr-7.2-Linux/solr/build/solr-core/test/J1/temp/solr.core.TestLazyCores_7AF6155C5F2F79BC-001/tempDir-001/collection2], dataDir=[/home/jenkins/workspace/Lucene-Solr-7.2-Linux/solr/build/solr-core/test/J1/temp/solr.core.TestLazyCores_7AF6155C5F2F79BC-001/tempDir-001/./collection2/data/]
   [junit4]   2> 706057 INFO  (coreLoadExecutor-1613-thread-2) [    x:collection2] o.a.s.u.RandomMergePolicy RandomMergePolicy wrapping class org.apache.lucene.index.TieredMergePolicy: [TieredMergePolicy: maxMergeAtOnce=16, maxMergeAtOnceExplicit=29, maxMergedSegmentMB=88.197265625, floorSegmentMB=0.841796875, forceMergeDeletesPctAllowed=25.825290944118464, segmentsPerTier=21.0, maxCFSSegmentSizeMB=8.796093022207999E12, noCFSRatio=0.7492788564887481
   [junit4]   2> 706139 INFO  (coreLoadExecutor-1613-thread-1) [    x:collection1] o.a.s.u.CommitTracker Hard AutoCommit: disabled
   [junit4]   2> 706139 INFO  (coreLoadExecutor-1613-thread-1) [    x:collection1] o.a.s.u.CommitTracker Soft AutoCommit: disabled
   [junit4]   2> 706140 INFO  (coreLoadExecutor-1613-thread-1) [    x:collection1] o.a.s.u.RandomMergePolicy RandomMergePolicy wrapping class org.apache.lucene.index.LogByteSizeMergePolicy: [LogByteSizeMergePolicy: minMergeSize=1677721, mergeFactor=38, maxMergeSize=2147483648, maxMergeSizeForForcedMerge=9223372036854775807, calibrateSizeByDeletes=false, maxMergeDocs=2147483647, maxCFSSegmentSizeMB=8.796093022207999E12, noCFSRatio=0.19879897704174523]
   [junit4]   2> 706141 INFO  (coreLoadExecutor-1613-thread-1) [    x:collection1] o.a.s.s.SolrIndexSearcher Opening [Searcher@29700379[collection1] main]
   [junit4]   2> 706141 INFO  (coreLoadExecutor-1613-thread-1) [    x:collection1] o.a.s.r.ManagedResourceStorage File-based storage initialized to use dir: /home/jenkins/workspace/Lucene-Solr-7.2-Linux/solr/build/solr-core/test/J1/temp/solr.core.TestLazyCores_7AF6155C5F2F79BC-001/tempDir-001/collection1/conf
   [junit4]   2> 706141 INFO  (coreLoadExecutor-1613-thread-1) [    x:collection1] o.a.s.h.ReplicationHandler Commits will be reserved for 10000ms.
   [junit4]   2> 706142 INFO  (searcherExecutor-1615-thread-1-processing-x:collection1) [    x:collection1] o.a.s.c.SolrCore [collection1] Registered new searcher Searcher@29700379[collection1] main{ExitableDirectoryReader(UninvertingDirectoryReader())}
   [junit4]   2> 706168 INFO  (coreLoadExecutor-1613-thread-3) [    x:collection5] o.a.s.u.CommitTracker Hard AutoCommit: disabled
   [junit4]   2> 706168 INFO  (coreLoadExecutor-1613-thread-3) [    x:collection5] o.a.s.u.CommitTracker Soft AutoCommit: disabled
   [junit4]   2> 706169 INFO  (coreLoadExecutor-1613-thread-3) [    x:collection5] o.a.s.u.RandomMergePolicy RandomMergePolicy wrapping class org.apache.lucene.index.LogByteSizeMergePolicy: [LogByteSizeMergePolicy: minMergeSize=1677721, mergeFactor=38, maxMergeSize=2147483648, maxMergeSizeForForcedMerge=9223372036854775807, calibrateSizeByDeletes=false, maxMergeDocs=2147483647, maxCFSSegmentSizeMB=8.796093022207999E12, noCFSRatio=0.19879897704174523]
   [junit4]   2> 706172 INFO  (coreLoadExecutor-1613-thread-3) [    x:collection5] o.a.s.s.SolrIndexSearcher Opening [Searcher@57a5bd4e[collection5] main]
   [junit4]   2> 706172 INFO  (coreLoadExecutor-1613-thread-3) [    x:collection5] o.a.s.r.ManagedResourceStorage File-based storage initialized to use dir: /home/jenkins/workspace/Lucene-Solr-7.2-Linux/solr/build/solr-core/test/J1/temp/solr.core.TestLazyCores_7AF6155C5F2F79BC-001/tempDir-001/collection5/conf
   [junit4]   2> 706173 INFO  (coreLoadExecutor-1613-thread-3) [    x:collection5] o.a.s.h.ReplicationHandler Commits will be reserved for 10000ms.
   [junit4]   2> 706173 INFO  (searcherExecutor-1614-thread-1-processing-x:collection5) [    x:collection5] o.a.s.c.SolrCore [collection5] Registered new searcher Searcher@57a5bd4e[collection5] main{ExitableDirectoryReader(UninvertingDirectoryReader())}
   [junit4]   2> 706192 INFO  (coreLoadExecutor-1613-thread-2) [    x:collection2] o.a.s.u.CommitTracker Hard AutoCommit: disabled
   [junit4]   2> 706192 INFO  (coreLoadExecutor-1613-thread-2) [    x:collection2] o.a.s.u.CommitTracker Soft AutoCommit: disabled
   [junit4]   2> 706193 INFO  (coreLoadExecutor-1613-thread-2) [    x:collection2] o.a.s.u.RandomMergePolicy RandomMergePolicy wrapping class org.apache.lucene.index.LogByteSizeMergePolicy: [LogByteSizeMergePolicy: minMergeSize=1677721, mergeFactor=38, maxMergeSize=2147483648, maxMergeSizeForForcedMerge=9223372036854775807, calibrateSizeByDeletes=false, maxMergeDocs=2147483647, maxCFSSegmentSizeMB=8.796093022207999E12, noCFSRatio=0.19879897704174523]
   [junit4]   2> 706208 INFO  (coreLoadExecutor-1613-thread-2) [    x:collection2] o.a.s.s.SolrIndexSearcher Opening [Searcher@66215339[collection2] main]
   [junit4]   2> 706208 INFO  (coreLoadExecutor-1613-thread-2) [    x:collection2] o.a.s.r.ManagedResourceStorage File-based storage initialized to use dir: /home/jenkins/workspace/Lucene-Solr-7.2-Linux/solr/build/solr-core/test/J1/temp/solr.core.TestLazyCores_7AF6155C5F2F79BC-001/tempDir-001/collection2/conf
   [junit4]   2> 706209 INFO  (coreLoadExecutor-1613-thread-2) [    x:collection2] o.a.s.h.ReplicationHandler Commits will be reserved for 10000ms.
   [junit4]   2> 706210 INFO  (searcherExecutor-1616-thread-1-processing-x:collection2) [    x:collection2] o.a.s.c.SolrCore [collection2] Registered new searcher Searcher@66215339[collection2] main{ExitableDirectoryReader(UninvertingDirectoryReader())}
   [junit4]   2> 706216 INFO  (TEST-TestLazyCores.testLazySearch-seed#[7AF6155C5F2F79BC]) [    x:collection4] o.a.s.c.SolrConfig Using Lucene MatchVersion: 7.2.1
   [junit4]   2> 706220 INFO  (TEST-TestLazyCores.testLazySearch-seed#[7AF6155C5F2F79BC]) [    x:collection4] o.a.s.s.IndexSchema [collection4] Schema name=tiny
   [junit4]   2> 706221 INFO  (TEST-TestLazyCores.testLazySearch-seed#[7AF6155C5F2F79BC]) [    x:collection4] o.a.s.s.IndexSchema Loaded schema tiny/1.1 with uniqueid field id
   [junit4]   2> 706221 INFO  (TEST-TestLazyCores.testLazySearch-seed#[7AF6155C5F2F79BC]) [    x:collection4] o.a.s.c.CoreContainer Creating SolrCore 'collection4' using configuration from instancedir /home/jenkins/workspace/Lucene-Solr-7.2-Linux/solr/build/solr-core/test/J1/temp/solr.core.TestLazyCores_7AF6155C5F2F79BC-001/tempDir-001/./collection4, trusted=true
   [junit4]   2> 706222 INFO  (TEST-TestLazyCores.testLazySearch-seed#[7AF6155C5F2F79BC]) [    x:collection4] o.a.s.m.r.SolrJmxReporter JMX monitoring for 'solr.core.collection4' (registry 'solr.core.collection4') enabled at server: com.sun.jmx.mbeanserver.JmxMBeanServer@374ec7ab
   [junit4]   2> 706222 INFO  (TEST-TestLazyCores.testLazySearch-seed#[7AF6155C5F2F79BC]) [    x:collection4] o.a.s.c.SolrCore solr.RecoveryStrategy.Builder
   [junit4]   2> 706222 INFO  (TEST-TestLazyCores.testLazySearch-seed#[7AF6155C5F2F79BC]) [    x:collection4] o.a.s.c.SolrCore [[collection4] ] Opening new SolrCore at [/home/jenkins/workspace/Lucene-Solr-7.2-Linux/solr/build/solr-core/test/J1/temp/solr.core.TestLazyCores_7AF6155C5F2F79BC-001/tempDir-001/collection4], dataDir=[/home/jenkins/workspace/Lucene-Solr-7.2-Linux/solr/build/solr-core/test/J1/temp/solr.core.TestLazyCores_7AF6155C5F2F79BC-001/tempDir-001/./collection4/data/]
   [junit4]   2> 706224 INFO  (TEST-TestLazyCores.testLazySearch-seed#[7AF6155C5F2F79BC]) [    x:collection4] o.a.s.u.RandomMergePolicy RandomMergePolicy wrapping class org.apache.lucene.index.LogDocMergePolicy: [LogDocMergePolicy: minMergeSize=1000, mergeFactor=40, maxMergeSize=9223372036854775807, maxMergeSizeForForcedMerge=9223372036854775807, calibrateSizeByDeletes=false, maxMergeDocs=2147483647, maxCFSSegmentSizeMB=8.796093022207999E12, noCFSRatio=1.0]
   [junit4]   2> 706286 INFO  (TEST-TestLazyCores.testLazySearch-seed#[7AF6155C5F2F79BC]) [    x:collection4] o.a.s.u.CommitTracker Hard AutoCommit: disabled
   [junit4]   2> 706286 INFO  (TEST-TestLazyCores.testLazySearch-seed#[7AF6155C5F2F79BC]) [    x:collection4] o.a.s.u.CommitTracker Soft AutoCommit: disabled
   [junit4]   2> 706287 INFO  (TEST-TestLazyCores.testLazySearch-seed#[7AF6155C5F2F79BC]) [    x:collection4] o.a.s.u.RandomMergePolicy RandomMergePolicy wrapping class org.apache.lucene.index.AlcoholicMergePolicy: [AlcoholicMergePolicy: minMergeSize=0, mergeFactor=10, maxMergeSize=140540167, maxMergeSizeForForcedMerge=9223372036854775807, calibrateSizeByDeletes=true, maxMergeDocs=2147483647, maxCFSSegmentSizeMB=8.796093022207999E12, noCFSRatio=0.1]
   [junit4]   2> 706288 INFO  (TEST-TestLazyCores.testLazySearch-seed#[7AF6155C5F2F79BC]) [    x:collection4] o.a.s.s.SolrIndexSearcher Opening [Searcher@36a38735[collection4] main]
   [junit4]   2> 706288 INFO  (TEST-TestLazyCores.testLazySearch-seed#[7AF6155C5F2F79BC]) [    x:collection4] o.a.s.r.ManagedResourceStorage File-based storage initialized to use dir: /home/jenkins/workspace/Lucene-Solr-7.2-Linux/solr/build/solr-core/test/J1/temp/solr.core.TestLazyCores_7AF6155C5F2F79BC-001/tempDir-001/collection4/conf
   [junit4]   2> 706289 INFO  (TEST-TestLazyCores.testLazySearch-seed#[7AF6155C5F2F79BC]) [    x:collection4] o.a.s.h.ReplicationHandler Commits will be reserved for 10000ms.
   [junit4]   2> 706290 INFO  (searcherExecutor-1626-thread-1-processing-x:collection4) [    x:collection4] o.a.s.c.SolrCore [collection4] Registered new searcher Searcher@36a38735[collection4] main{ExitableDirectoryReader(UninvertingDirectoryReader())}
   [junit4]   2> 706291 INFO  (TEST-TestLazyCores.testLazySearch-seed#[7AF6155C5F2F79BC]) [    x:collection4] o.a.s.u.DirectUpdateHandler2 start commit{,optimize=false,openSearcher=true,waitSearcher=true,expungeDeletes=false,softCommit=false,prepareCommit=false}
   [junit4]   2> 706291 INFO  (TEST-TestLazyCores.testLazySearch-seed#[7AF6155C5F2F79BC]) [    x:collection4] o.a.s.u.SolrIndexWriter Calling setCommitData with IW:org.apache.solr.update.SolrIndexWriter@73e15bc9 commitCommandVersion:0
   [junit4]   2> 706323 INFO  (TEST-TestLazyCores.testLazySearch-seed#[7AF6155C5F2F79BC]) [    x:collection4] o.a.s.s.SolrIndexSearcher Opening [Searcher@56aaf99b[collection4] main]
   [junit4]   2> 706324 INFO  (TEST-TestLazyCores.testLazySearch-seed#[7AF6155C5F2F79BC]) [    x:collection4] o.a.s.u.DirectUpdateHandler2 end_commit_flush
   [junit4]   2> 706324 INFO  (searcherExecutor-1626-thread-1-processing-x:collection4) [    x:collection4] o.a.s.c.SolrCore [collection4] Registered new searcher Searcher@56aaf99b[collection4] main{ExitableDirectoryReader(UninvertingDirectoryReader(Uninverting(_0(7.2.1):c7)))}
   [junit4]   2> 706326 INFO  (TEST-TestLazyCores.testLazySearch-seed#[7AF6155C5F2F79BC]) [    x:collection4] o.a.s.c.S.Request [collection4]  webapp=null path=null params={q={!prefix+f%3Dv_t}hel&wt=xml} hits=2 status=0 QTime=0
   [junit4]   2> 706327 INFO  (TEST-TestLazyCores.testLazySearch-seed#[7AF6155C5F2F79BC]) [    x:collection4] o.a.s.c.S.Request [collection4]  webapp=null path=null params={q={!raw+f%3Dv_t}hello&wt=xml} hits=2 status=0 QTime=0
   [junit4]   2> 706327 INFO  (TEST-TestLazyCores.testLazySearch-seed#[7AF6155C5F2F79BC]) [    x:collection4] o.a.s.c.S.Request [collection4]  webapp=null path=null params={q={!raw+f%3Dv_t}Hello&wt=xml} hits=0 status=0 QTime=0
   [junit4]   2> 706328 INFO  (TEST-TestLazyCores.testLazySearch-seed#[7AF6155C5F2F79BC]) [    x:collection4] o.a.s.c.S.Request [collection4]  webapp=null path=null params={q={!raw+f%3Dv_f}1.5&wt=xml} hits=0 status=0 QTime=0
   [junit4]   2> 706328 INFO  (TEST-TestLazyCores.testLazySearch-seed#[7AF6155C5F2F79BC]) [    x:collection4] o.a.s.c.S.Request [collection1]  webapp=null path=null params={q={!raw+f%3Dv_t}hello&wt=xml} hits=0 status=0 QTime=0
   [junit4]   2> 706328 INFO  (TEST-TestLazyCores.testLazySearch-seed#[7AF6155C5F2F79BC]) [    x:collection4] o.a.s.c.CoreContainer Shutting down CoreContainer instance=1558223727
   [junit4]   2> 706328 INFO  (TEST-TestLazyCores.testLazySearch-seed#[7AF6155C5F2F79BC]) [    x:collection4] o.a.s.m.SolrMetricManager Closing metric reporters for registry=solr.node, tag=null
   [junit4]   2> 706328 INFO  (TEST-TestLazyCores.testLazySearch-seed#[7AF6155C5F2F79BC]) [    x:collection4] o.a.s.m.r.SolrJmxReporter Closing reporter [org.apache.solr.metrics.reporters.SolrJmxReporter@3daf7a5f: rootName = null, domain = solr.node, service url = null, agent id = null] for registry solr.node / com.codahale.metrics.MetricRegistry@2e6e5c64
   [junit4]   2> 706333 INFO  (TEST-TestLazyCores.testLazySearch-seed#[7AF6155C5F2F79BC]) [    x:collection4] o.a.s.m.SolrMetricManager Closing metric reporters for registry=solr.jvm, tag=null
   [junit4]   2> 706333 INFO  (TEST-TestLazyCores.testLazySearch-seed#[7AF6155C5F2F79BC]) [    x:collection4] o.a.s.m.r.SolrJmxReporter Closing reporter [org.apache.solr.metrics.reporters.SolrJmxReporter@28aaf8f3: rootName = null, domain = solr.jvm, service url = null, agent id = null] for registry solr.jvm / com.codahale.metrics.MetricRegistry@5ccca333
   [junit4]   2> 706337 INFO  (TEST-TestLazyCores.testLazySearch-seed#[7AF6155C5F2F79BC]) [    x:collection4] o.a.s.m.SolrMetricManager Closing metric reporters for registry=solr.jetty, tag=null
   [junit4]   2> 706337 INFO  (TEST-TestLazyCores.testLazySearch-seed#[7AF6155C5F2F79BC]) [    x:collection4] o.a.s.m.r.SolrJmxReporter Closing reporter [org.apache.solr.metrics.reporters.SolrJmxReporter@631cde4d: rootName = null, domain = solr.jetty, service url = null, agent id = null] for registry solr.jetty / com.codahale.metrics.MetricRegistry@131d5f97
   [junit4]   2> 706338 INFO  (coreCloseExecutor-1630-thread-1-processing-x:collection4) [    x:collection1] o.a.s.c.SolrCore [collection1]  CLOSING SolrCore org.apache.solr.core.SolrCore@e381b8a
   [junit4]   2> 706338 INFO  (coreCloseExecutor-1630-thread-1-processing-x:collection4) [    x:collection1] o.a.s.m.SolrMetricManager Closing metric reporters for registry=solr.core.collection1, tag=238558090
   [junit4]   2> 706338 INFO  (coreCloseExecutor-1630-thread-1-processing-x:collection4) [    x:collection1] o.a.s.m.r.SolrJmxReporter Closing reporter [org.apache.solr.metrics.reporters.SolrJmxReporter@4b926bdb: rootName = null, domain = solr.core.collection1, service url = null, agent id = null] for registry solr.core.collection1 / com.codahale.metrics.MetricRegistry@70ad7934
   [junit4]   2> 706352 INFO  (coreCloseExecutor-1630-thread-2-processing-x:collection4) [    x:collection5] o.a.s.c.SolrCore [collection5]  CLOSING SolrCore org.apache.solr.core.SolrCore@3451ec6d
   [junit4]   2> 706352 INFO  (coreCloseExecutor-1630-thread-2-processing-x:collection4) [    x:collection5] o.a.s.m.SolrMetricManager Closing metric reporters for registry=solr.core.collection5, tag=877784173
   [junit4]   2> 706352 INFO  (coreCloseExecutor-1630-thread-2-processing-x:collection4) [    x:collection5] o.a.s.m.r.SolrJmxReporter Closing reporter [org.apache.solr.metrics.reporters.SolrJmxReporter@600ebd42: rootName = null, domain = solr.core.collection5, service url = null, agent id = null] for registry solr.core.collection5 / com.codahale.metrics.MetricRegistry@191e7cf1
   [junit4]   2> 706364 INFO  (coreCloseExecutor-1630-thread-3-processing-x:collection4) [    x:collection4] o.a.s.c.SolrCore [collection4]  CLOSING SolrCore org.apache.solr.core.SolrCore@387de2dd
   [junit4]   2> 706364 INFO  (coreCloseExecutor-1630-thread-3-processing-x:collection4) [    x:collection4] o.a.s.m.SolrMetricManager Closing metric reporters for registry=solr.core.collection4, tag=947774173
   [junit4]   2> 706364 INFO  (coreCloseExecutor-1630-thread-3-processing-x:collection4) [    x:collection4] o.a.s.m.r.SolrJmxReporter Closing reporter [org.apache.solr.metrics.reporters.SolrJmxReporter@66f20950: rootName = null, domain = solr.core.collection4, service url = null, agent id = null] for registry solr.core.collection4 / com.codahale.metrics.MetricRegistry@55dfd196
   [junit4]   2> 706378 INFO  (coreCloseExecutor-1630-thread-4-processing-x:collection4) [    x:collection2] o.a.s.c.SolrCore [collection2]  CLOSING SolrCore org.apache.solr.core.SolrCore@4bf54905
   [junit4]   2> 706378 INFO  (coreCloseExecutor-1630-thread-4-processing-x:collection4) [    x:collection2] o.a.s.m.SolrMetricManager Closing metric reporters for registry=solr.core.collection2, tag=1274366213
   [junit4]   2> 706378 INFO  (coreCloseExecutor-1630-thread-4-processing-x:collection4) [    x:collection2] o.a.s.m.r.SolrJmxReporter Closing reporter [org.apache.solr.metrics.reporters.SolrJmxReporter@39682871: rootName = null, domain = solr.core.collection2, service url = null, agent id = null] for registry solr.core.collection2 / com.codahale.metrics.MetricRegistry@7c1ddc52
   [junit4]   2> 706411 INFO  (TEST-TestLazyCores.testLazySearch-seed#[7AF6155C5F2F79BC]) [    x:collection4] o.a.s.SolrTestCaseJ4 ###Ending testLazySearch
   [junit4]   2> 706412 INFO  (TEST-TestLazyCores.testLazyLoad-seed#[7AF6155C5F2F79BC]) [    x:collection4] o.a.s.SolrTestCaseJ4 ###Starting testLazyLoad
   [junit4]   2> 706419 INFO  (TEST-TestLazyCores.testLazyLoad-seed#[7AF6155C5F2F79BC]) [    x:collection4] o.a.s.c.SolrXmlConfig Loading container configuration from /home/jenkins/workspace/Lucene-Solr-7.2-Linux/solr/build/solr-core/test/J1/temp/solr.core.TestLazyCores_7AF6155C5F2F79BC-001/tempDir-002/solr.xml
   [junit4]   2> 706421 INFO  (TEST-TestLazyCores.testLazyLoad-seed#[7AF6155C5F2F79BC]) [    x:collection4] o.a.s.c.SolrXmlConfig Configuration parameter autoReplicaFailoverWorkLoopDelay is ignored
   [junit4]   2> 706421 INFO  (TEST-TestLazyCores.testLazyLoad-seed#[7AF6155C5F2F79BC]) [    x:collection4] o.a.s.c.SolrXmlConfig Configuration parameter autoReplicaFailoverBadNodeExpiration is ignored
   [junit4]   2> 706421 INFO  (TEST-TestLazyCores.testLazyLoad-seed#[7AF6155C5F2F79BC]) [    x:collection4] o.a.s.c.SolrXmlConfig MBean server found: com.sun.jmx.mbeanserver.JmxMBeanServer@374ec7ab, but no JMX reporters were configured - adding default JMX reporter.
   [junit4]   2> 706451 INFO  (TEST-TestLazyCores.testLazyLoad-seed#[7AF6155C5F2F79BC]) [    x:collection4] o.a.s.m.r.SolrJmxReporter JMX monitoring for 'solr.node' (registry 'solr.node') enabled at server: com.sun.jmx.mbeanserver.JmxMBeanServer@374ec7ab
   [junit4]   2> 706457 INFO  (TEST-TestLazyCores.testLazyLoad-seed#[7AF6155C5F2F79BC]) [    x:collection4] o.a.s.m.r.SolrJmxReporter JMX monitoring for 'solr.jvm' (registry 'solr.jvm') enabled at server: com.sun.jmx.mbeanserver.JmxMBeanServer@374ec7ab
   [junit4]   2> 706458 INFO  (TEST-TestLazyCores.testLazyLoad-seed#[7AF6155C5F2F79BC]) [    x:collection4] o.a.s.m.r.SolrJmxReporter JMX monitoring for 'solr.jetty' (registry 'solr.jetty') enabled at server: com.sun.jmx.mbeanserver.JmxMBeanServer@374ec7ab
   [junit4]   2> 706459 INFO  (TEST-TestLazyCores.testLazyLoad-seed#[7AF6155C5F2F79BC]) [    x:collection4] o.a.s.c.TransientSolrCoreCacheDefault Allocating transient cache for 4 transient cores
   [junit4]   2> 706467 INFO  (coreLoadExecutor-1637-thread-1-processing-x:collection4) [    x:collection1] o.a.s.c.SolrConfig Using Lucene MatchVersion: 7.2.1
   [junit4]   2> 706473 INFO  (coreLoadExecutor-1637-thread-1-processing-x:collection4) [    x:collection1] o.a.s.s.IndexSchema [collection1] Schema name=tiny
   [junit4]   2> 706475 INFO  (coreLoadExecutor-1637-thread-1-processing-x:collection4) [    x:collection1] o.a.s.s.IndexSchema Loaded schema tiny/1.1 with uniqueid field id
   [junit4]   2> 706475 INFO  (coreLoadExecutor-1637-thread-1-processing-x:collection4) [    x:collection1] o.a.s.c.CoreContainer Creating SolrCore 'collection1' using configuration from instancedir /home/jenkins/workspace/Lucene-Solr-7.2-Linux/solr/build/solr-core/test/J1/temp/solr.core.TestLazyCores_7AF6155C5F2F79BC-001/tempDir-002/./collection1, trusted=true
   [junit4]   2> 706475 INFO  (coreLoadExecutor-1637-thread-1-processing-x:collection4) [    x:collection1] o.a.s.m.r.SolrJmxReporter JMX monitoring for 'solr.core.collection1' (registry 'solr.core.collection1') enabled at server: com.sun.jmx.mbeanserver.JmxMBeanServer@374ec7ab
   [junit4]   2> 706475 INFO  (coreLoadExecutor-1637-thread-1-processing-x:collection4) [    x:collection1] o.a.s.c.SolrCore solr.RecoveryStrategy.Builder
   [junit4]   2> 706475 INFO  (coreLoadExecutor-1637-thread-1-processing-x:collection4) [    x:collection1] o.a.s.c.SolrCore [[collection1] ] Opening new SolrCore at [/home/jenkins/workspace/Lucene-Solr-7.2-Linux/solr/build/solr-core/test/J1/temp/solr.core.TestLazyCores_7AF6155C5F2F79BC-001/tempDir-002/collection1], dataDir=[/home/jenkins/workspace/Lucene-Solr-7.2-Linux/solr/build/solr-core/test/J1/temp/solr.core.TestLazyCores_7AF6155C5F2F79BC-001/tempDir-002/./collection1/data/]
   [junit4]   2> 706477 INFO  (coreLoadExecutor-1637-thread-1-processing-x:collection4) [    x:collection1] o.a.s.u.RandomMergePolicy RandomMergePolicy wrapping class org.apache.lucene.index.TieredMergePolicy: [TieredMergePolicy: maxMergeAtOnce=16, maxMergeAtOnceExplicit=29, maxMergedSegmentMB=88.197265625, floorSegmentMB=0.841796875, forceMergeDeletesPctAllowed=25.825290944118464, segmentsPerTier=21.0, maxCFSSegmentSizeMB=8.796093022207999E12, noCFSRatio=0.7492788564887481
   [junit4]   2> 706480 INFO  (coreLoadExecutor-1637-thread-3-processing-x:collection4) [    x:collection5] o.a.s.c.SolrConfig Using Lucene MatchVersion: 7.2.1
   [junit4]   2> 706480 INFO  (coreLoadExecutor-1637-thread-2-processing-x:collection4) [    x:collection2] o.a.s.c.SolrConfig Using Lucene MatchVersion: 7.2.1
   [junit4]   2> 706485 INFO  (coreLoadExecutor-1637-thread-3-processing-x:collection4) [    x:collection5] o.a.s.s.IndexSchema [collection5] Schema name=tiny
   [junit4]   2> 706487 INFO  (coreLoadExecutor-1637-thread-3-processing-x:collection4) [    x:collection5] o.a.s.s.IndexSchema Loaded schema tiny/1.1 with uniqueid field id
   [junit4]   2> 706487 INFO  (coreLoadExecutor-1637-thread-3-processing-x:collection4) [    x:collection5] o.a.s.c.CoreContainer Creating SolrCore 'collection5' using configuration from instancedir /home/jenkins/workspace/Lucene-Solr-7.2-Linux/solr/build/solr-core/test/J1/temp/solr.core.TestLazyCores_7AF6155C5F2F79BC-001/tempDir-002/./collection5, trusted=true
   [junit4]   2> 706487 INFO  (coreLoadExecutor-1637-thread-3-processing-x:collection4) [    x:collection5] o.a.s.m.r.SolrJmxReporter JMX monitoring for 'solr.core.collection5' (registry 'solr.core.collection5') enabled at server: com.sun.jmx.mbeanserver.JmxMBeanServer@374ec7ab
   [junit4]   2> 706487 INFO  (coreLoadExecutor-1637-thread-3-processing-x:collection4) [    x:collection5] o.a.s.c.SolrCore solr.RecoveryStrategy.Builder
   [junit4]   2> 706487 INFO  (coreLoadExecutor-1637-thread-3-processing-x:collection4) [    x:collection5] o.a.s.c.SolrCore [[collection5] ] Opening new SolrCore at [/home/jenkins/workspace/Lucene-Solr-7.2-Linux/solr/build/solr-core/test/J1/temp/solr.core.TestLazyCores_7AF6155C5F2F79BC-001/tempDir-002/collection5], dataDir=[/home/jenkins/workspace/Lucene-Solr-7.2-Linux/solr/build/solr-core/test/J1/temp/solr.core.TestLazyCores_7AF6155C5F2F79BC-001/tempDir-002/./collection5/data/]
   [junit4]   2> 706487 INFO  (coreLoadExecutor-1637-thread-2-processing-x:collection4) [    x:collection2] o.a.s.s.IndexSchema [collection2] Schema name=tiny
   [junit4]   2> 706489 INFO  (coreLoadExecutor-1637-thread-2-processing-x:collection4) [    x:collection2] o.a.s.s.IndexSchema Loaded schema tiny/1.1 with uniqueid field id
   [junit4]   2> 706489 INFO  (coreLoadExecutor-1637-thread-2-processing-x:collection4) [    x:collection2] o.a.s.c.CoreContainer Creating SolrCore 'collection2' using configuration from instancedir /home/jenkins/workspace/Lucene-Solr-7.2-Linux/solr/build/solr-core/test/J1/temp/solr.core.TestLazyCores_7AF6155C5F2F79BC-001/tempDir-002/./collection2, trusted=true
   [junit4]   2> 706489 INFO  (coreLoadExecutor-1637-thread-2-processing-x:collection4) [    x:collection2] o.a.s.m.r.SolrJmxReporter JMX monitoring for 'solr.core.collection2' (registry 'solr.core.collection2') enabled at server: com.sun.jmx.mbeanserver.JmxMBeanServer@374ec7ab
   [junit4]   2> 706489 INFO  (coreLoadExecutor-1637-thread-2-processing-x:collection4) [    x:collection2] o.a.s.c.SolrCore solr.RecoveryStrategy.Builder
   [junit4]   2> 706489 INFO  (coreLoadExecutor-1637-thread-2-processing-x:collection4) [    x:collection2] o.a.s.c.SolrCore [[collection2] ] Opening new SolrCore at [/home/jenkins/workspace/Lucene-Solr-7.2-Linux/solr/build/solr-core/test/J1/temp/solr.core.TestLazyCores_7AF6155C5F2F79BC-001/tempDir-002/collection2], dataDir=[/home/jenkins/workspace/Lucene-Solr-7.2-Linux/solr/build/solr-core/test/J1/temp/solr.core.TestLazyCores_7AF6155C5F2F79BC-001/tempDir-002/./collection2/data/]
   [junit4]   2> 706489 INFO  (coreLoadExecutor-1637-thread-3-processing-x:collection4) [    x:collection5] o.a.s.u.RandomMergePolicy RandomMergePolicy wrapping class org.apache.lucene.index.TieredMergePolicy: [TieredMergePolicy: maxMergeAtOnce=16, maxMergeAtOnceExplicit=29, maxMergedSegmentMB=88.197265625, floorSegmentMB=0.841796875, forceMergeDeletesPctAllowed=25.825290944118464, segmentsPerTier=21.0, maxCFSSegmentSizeMB=8.796093022207999E12, noCFSRatio=0.7492788564887481
   [junit4]   2> 706491 INFO  (coreLoadExecutor-1637-thread-2-processing-x:collection4) [    x:collection2] o.a.s.u.RandomMergePolicy RandomMergePolicy wrapping class org.apache.lucene.index.TieredMergePolicy: [TieredMergePolicy: maxMergeAtOnce=16, maxMergeAtOnceExplicit=29, maxMergedSegmentMB=88.197265625, floorSegmentMB=0.841796875, forceMergeDeletesPctAllowed=25.825290944118464, segmentsPerTier=21.0, maxCFSSegmentSizeMB=8.796093022207999E12, noCFSRatio=0.7492788564887481
   [junit4]   2> 706548 INFO  (coreLoadExecutor-1637-thread-1-processing-x:collection4) [    x:collection1] o.a.s.u.CommitTracker Hard AutoCommit: disabled
   [junit4]   2> 706548 INFO  (coreLoadExecutor-1637-thread-1-processing-x:collection4) [    x:collection1] o.a.s.u.CommitTracker Soft AutoCommit: disabled
   [junit4]   2> 706549 INFO  (coreLoadExecutor-1637-thread-1-processing-x:collection4) [    x:collection1] o.a.s.u.RandomMergePolicy RandomMergePolicy wrapping class org.apache.lucene.index.LogByteSizeMergePolicy: [LogByteSizeMergePolicy: minMergeSize=1677721, mergeFactor=38, maxMergeSize=2147483648, maxMergeSizeForForcedMerge=9223372036854775807, calibrateSizeByDeletes=false, maxMergeDocs=2147483647, maxCFSSegmentSizeMB=8.796093022207999E12, noCFSRatio=0.19879897704174523]
   [junit4]   2> 706549 INFO  (coreLoadExecutor-1637-thread-1-processing-x:collection4) [    x:collection1] o.a.s.s.SolrIndexSearcher Opening [Searcher@28ccfa45[collection1] main]
   [junit4]   2> 706550 INFO  (coreLoadExecutor-1637-thread-1-processing-x:collection4) [    x:collection1] o.a.s.r.ManagedResourceStorage File-based storage initialized to use dir: /home/jenkins/workspace/Lucene-Solr-7.2-Linux/solr/build/solr-core/test/J1/temp/solr.core.TestLazyCores_7AF6155C5F2F79BC-001/tempDir-002/collection1/conf
   [junit4]   2> 706550 INFO  (coreLoadExecutor-1637-thread-1-processing-x:collection4) [    x:collection1] o.a.s.h.ReplicationHandler Commits will be reserved for 10000ms.
   [junit4]   2> 706551 INFO  (searcherExecutor-1638-thread-1-processing-x:collection1) [    x:collection1] o.a.s.c.SolrCore [collection1] Registered new searcher Searcher@28ccfa45[collection1] main{ExitableDirectoryReader(UninvertingDirectoryReader())}
   [junit4]   2> 706555 INFO  (coreLoadExecutor-1637-thread-3-processing-x:collection4) [    x:c

[...truncated too long message...]

test  -Dtestcase=ChaosMonkeyNothingIsSafeTest -Dtests.method=test -Dtests.seed=7AF6155C5F2F79BC -Dtests.multiplier=3 -Dtests.slow=true -Dtests.locale=en-SE -Dtests.timezone=Australia/Victoria -Dtests.asserts=true -Dtests.file.encoding=ISO-8859-1
   [junit4] ERROR    637s J2 | ChaosMonkeyNothingIsSafeTest.test <<<
   [junit4]    > Throwable #1: org.apache.solr.client.solrj.SolrServerException: Timeout occured while waiting response from server at: http://127.0.0.1:43455/ay/f
   [junit4]    > 	at __randomizedtesting.SeedInfo.seed([7AF6155C5F2F79BC:F2A22A86F1D31444]:0)
   [junit4]    > 	at org.apache.solr.client.solrj.impl.HttpSolrClient.executeMethod(HttpSolrClient.java:654)
   [junit4]    > 	at org.apache.solr.client.solrj.impl.HttpSolrClient.request(HttpSolrClient.java:255)
   [junit4]    > 	at org.apache.solr.client.solrj.impl.HttpSolrClient.request(HttpSolrClient.java:244)
   [junit4]    > 	at org.apache.solr.client.solrj.impl.LBHttpSolrClient.doRequest(LBHttpSolrClient.java:483)
   [junit4]    > 	at org.apache.solr.client.solrj.impl.LBHttpSolrClient.request(LBHttpSolrClient.java:413)
   [junit4]    > 	at org.apache.solr.client.solrj.impl.CloudSolrClient.sendRequest(CloudSolrClient.java:1103)
   [junit4]    > 	at org.apache.solr.client.solrj.impl.CloudSolrClient.requestWithRetryOnStaleState(CloudSolrClient.java:883)
   [junit4]    > 	at org.apache.solr.client.solrj.impl.CloudSolrClient.request(CloudSolrClient.java:816)
   [junit4]    > 	at org.apache.solr.client.solrj.SolrRequest.process(SolrRequest.java:194)
   [junit4]    > 	at org.apache.solr.client.solrj.SolrRequest.process(SolrRequest.java:211)
   [junit4]    > 	at org.apache.solr.cloud.AbstractFullDistribZkTestBase.createServers(AbstractFullDistribZkTestBase.java:314)
   [junit4]    > 	at org.apache.solr.BaseDistributedSearchTestCase$ShardsRepeatRule$ShardsFixedStatement.callStatement(BaseDistributedSearchTestCase.java:991)
   [junit4]    > 	at org.apache.solr.BaseDistributedSearchTestCase$ShardsRepeatRule$ShardsStatement.evaluate(BaseDistributedSearchTestCase.java:968)
   [junit4]    > 	at java.base/java.lang.Thread.run(Thread.java:844)
   [junit4]    > Caused by: java.net.SocketTimeoutException: Read timed out
   [junit4]    > 	at java.base/java.net.SocketInputStream.socketRead0(Native Method)
   [junit4]    > 	at java.base/java.net.SocketInputStream.socketRead(SocketInputStream.java:116)
   [junit4]    > 	at java.base/java.net.SocketInputStream.read(SocketInputStream.java:171)
   [junit4]    > 	at java.base/java.net.SocketInputStream.read(SocketInputStream.java:141)
   [junit4]    > 	at org.apache.http.impl.io.SessionInputBufferImpl.streamRead(SessionInputBufferImpl.java:137)
   [junit4]    > 	at org.apache.http.impl.io.SessionInputBufferImpl.fillBuffer(SessionInputBufferImpl.java:153)
   [junit4]    > 	at org.apache.http.impl.io.SessionInputBufferImpl.readLine(SessionInputBufferImpl.java:282)
   [junit4]    > 	at org.apache.http.impl.conn.DefaultHttpResponseParser.parseHead(DefaultHttpResponseParser.java:138)
   [junit4]    > 	at org.apache.http.impl.conn.DefaultHttpResponseParser.parseHead(DefaultHttpResponseParser.java:56)
   [junit4]    > 	at org.apache.http.impl.io.AbstractMessageParser.parse(AbstractMessageParser.java:259)
   [junit4]    > 	at org.apache.http.impl.DefaultBHttpClientConnection.receiveResponseHeader(DefaultBHttpClientConnection.java:163)
   [junit4]    > 	at org.apache.http.impl.conn.CPoolProxy.receiveResponseHeader(CPoolProxy.java:165)
   [junit4]    > 	at org.apache.http.protocol.HttpRequestExecutor.doReceiveResponse(HttpRequestExecutor.java:273)
   [junit4]    > 	at org.apache.http.protocol.HttpRequestExecutor.execute(HttpRequestExecutor.java:125)
   [junit4]    > 	at org.apache.http.impl.execchain.MainClientExec.execute(MainClientExec.java:272)
   [junit4]    > 	at org.apache.http.impl.execchain.ProtocolExec.execute(ProtocolExec.java:185)
   [junit4]    > 	at org.apache.http.impl.execchain.RetryExec.execute(RetryExec.java:89)
   [junit4]    > 	at org.apache.http.impl.execchain.RedirectExec.execute(RedirectExec.java:111)
   [junit4]    > 	at org.apache.http.impl.client.InternalHttpClient.doExecute(InternalHttpClient.java:185)
   [junit4]    > 	at org.apache.http.impl.client.CloseableHttpClient.execute(CloseableHttpClient.java:83)
   [junit4]    > 	at org.apache.http.impl.client.CloseableHttpClient.execute(CloseableHttpClient.java:56)
   [junit4]    > 	at org.apache.solr.client.solrj.impl.HttpSolrClient.executeMethod(HttpSolrClient.java:542)
   [junit4]    > 	... 42 more
   [junit4]   2> NOTE: leaving temporary files on disk at: /home/jenkins/workspace/Lucene-Solr-7.2-Linux/solr/build/solr-core/test/J2/temp/solr.cloud.ChaosMonkeyNothingIsSafeTest_7AF6155C5F2F79BC-001
   [junit4]   2> NOTE: test params are: codec=Asserting(Lucene70): {}, docValues:{}, maxPointsInLeafNode=86, maxMBSortInHeap=6.037727140736874, sim=RandomSimilarity(queryNorm=false): {}, locale=en-SE, timezone=Australia/Victoria
   [junit4]   2> NOTE: Linux 4.10.0-40-generic amd64/Oracle Corporation 9.0.1 (64-bit)/cpus=8,threads=1,free=223982544,total=471334912
   [junit4]   2> NOTE: All tests run in this JVM: [TestCloudDeleteByQuery, TestInitParams, TestChildDocTransformer, RecoveryZkTest, TestPayloadScoreQParserPlugin, ReplicationFactorTest, SimplePostToolTest, TestElisionMultitermQuery, TestDistributedMissingSort, RequiredFieldsTest, AtomicUpdatesTest, TestSolrCloudWithSecureImpersonation, TestCloudSearcherWarming, TestJavabinTupleStreamParser, FileBasedSpellCheckerTest, TestSolrXml, DirectSolrConnectionTest, DataDrivenBlockJoinTest, ClassificationUpdateProcessorTest, TestSystemIdResolver, UniqFieldsUpdateProcessorFactoryTest, DeleteStatusTest, TestSolrConfigHandlerConcurrent, TestSchemaVersionResource, InfixSuggestersTest, TestPartialUpdateDeduplication, TestQueryTypes, TestTrieFacet, TestEmbeddedSolrServerConstructors, EchoParamsTest, TestTolerantUpdateProcessorRandomCloud, LeaderElectionContextKeyTest, FieldAnalysisRequestHandlerTest, RequestLoggingTest, ConnectionReuseTest, DistributedFacetPivotLargeTest, IndexBasedSpellCheckerTest, WordBreakSolrSpellCheckerTest, CoreSorterTest, ZkNodePropsTest, AnalyticsMergeStrategyTest, TestCloudPivotFacet, SegmentsInfoRequestHandlerTest, TestExtendedDismaxParser, TestZkChroot, MigrateRouteKeyTest, TestConfigSets, DeleteNodeTest, TriggerIntegrationTest, TestRawTransformer, SystemInfoHandlerTest, SolrTestCaseJ4Test, TestSearchPerf, TestRequestForwarding, DisMaxRequestHandlerTest, HLLUtilTest, TestLFUCache, LargeFieldTest, ChaosMonkeyNothingIsSafeTest]
   [junit4] Completed [673/751 (3!)] on J2 in 637.26s, 1 test, 1 error <<< FAILURES!

[...truncated 3269 lines...]
   [junit4] Suite: org.apache.solr.analytics.legacy.facet.LegacyQueryFacetCloudTest
   [junit4]   2> Creating dataDir: /home/jenkins/workspace/Lucene-Solr-7.2-Linux/solr/build/contrib/solr-analytics/test/J1/temp/solr.analytics.legacy.facet.LegacyQueryFacetCloudTest_3462FD99EE04FA94-001/init-core-data-001
   [junit4]   2> NOTE: test params are: codec=Asserting(Lucene70): {}, docValues:{}, maxPointsInLeafNode=566, maxMBSortInHeap=6.158662313936685, sim=RandomSimilarity(queryNorm=true): {}, locale=ha-NG, timezone=Pacific/Tahiti
   [junit4]   2> NOTE: Linux 4.10.0-40-generic amd64/Oracle Corporation 9.0.1 (64-bit)/cpus=8,threads=1,free=431156568,total=518520832
   [junit4]   2> NOTE: All tests run in this JVM: [LegacyFieldFacetExtrasCloudTest, CastingBooleanValueTest, LongFieldsTest, AbstractAnalyticsFieldTest, LegacyExpressionTest, CastingLongValueStreamTest, IfFunctionTest, LegacyQueryFacetCloudTest]
   [junit4]   2> NOTE: reproduce with: ant test  -Dtestcase=LegacyQueryFacetCloudTest -Dtests.seed=3462FD99EE04FA94 -Dtests.multiplier=3 -Dtests.slow=true -Dtests.locale=ha-NG -Dtests.timezone=Pacific/Tahiti -Dtests.asserts=true -Dtests.file.encoding=UTF-8
   [junit4] ERROR   0.00s J1 | LegacyQueryFacetCloudTest (suite) <<<
   [junit4]    > Throwable #1: org.apache.solr.client.solrj.impl.HttpSolrClient$RemoteSolrException: Error from server at https://127.0.0.1:33569/solr: Could not fully create collection: collection1
   [junit4]    > 	at __randomizedtesting.SeedInfo.seed([3462FD99EE04FA94]:0)
   [junit4]    > 	at org.apache.solr.client.solrj.impl.HttpSolrClient.executeMethod(HttpSolrClient.java:643)
   [junit4]    > 	at org.apache.solr.client.solrj.impl.HttpSolrClient.request(HttpSolrClient.java:255)
   [junit4]    > 	at org.apache.solr.client.solrj.impl.HttpSolrClient.request(HttpSolrClient.java:244)
   [junit4]    > 	at org.apache.solr.client.solrj.impl.LBHttpSolrClient.doRequest(LBHttpSolrClient.java:483)
   [junit4]    > 	at org.apache.solr.client.solrj.impl.LBHttpSolrClient.request(LBHttpSolrClient.java:413)
   [junit4]    > 	at org.apache.solr.client.solrj.impl.CloudSolrClient.sendRequest(CloudSolrClient.java:1103)
   [junit4]    > 	at org.apache.solr.client.solrj.impl.CloudSolrClient.requestWithRetryOnStaleState(CloudSolrClient.java:883)
   [junit4]    > 	at org.apache.solr.client.solrj.impl.CloudSolrClient.request(CloudSolrClient.java:816)
   [junit4]    > 	at org.apache.solr.client.solrj.SolrRequest.process(SolrRequest.java:194)
   [junit4]    > 	at org.apache.solr.client.solrj.SolrRequest.process(SolrRequest.java:211)
   [junit4]    > 	at org.apache.solr.analytics.legacy.LegacyAbstractAnalyticsCloudTest.setupCollection(LegacyAbstractAnalyticsCloudTest.java:50)
   [junit4]    > 	at java.base/jdk.internal.reflect.NativeMethodAccessorImpl.invoke0(Native Method)
   [junit4]    > 	at java.base/jdk.internal.reflect.NativeMethodAccessorImpl.invoke(NativeMethodAccessorImpl.java:62)
   [junit4]    > 	at java.base/jdk.internal.reflect.DelegatingMethodAccessorImpl.invoke(DelegatingMethodAccessorImpl.java:43)
   [junit4]    > 	at java.base/java.lang.reflect.Method.invoke(Method.java:564)
   [junit4]    > 	at java.base/java.lang.Thread.run(Thread.java:844)
   [junit4] Completed [63/78 (1!)] on J1 in 36.81s, 0 tests, 1 error <<< FAILURES!

[...truncated 37141 lines...]

Mime
View raw message