lucene-dev mailing list archives

Site index · List index
Message view « Date » · « Thread »
Top « Date » · « Thread »
From Policeman Jenkins Server <jenk...@thetaphi.de>
Subject [JENKINS] Lucene-Solr-7.x-Linux (64bit/jdk-9.0.1) - Build # 1034 - Still Unstable!
Date Sat, 23 Dec 2017 14:00:50 GMT
Build: https://jenkins.thetaphi.de/job/Lucene-Solr-7.x-Linux/1034/
Java: 64bit/jdk-9.0.1 -XX:-UseCompressedOops -XX:+UseParallelGC

3 tests failed.
FAILED:  org.apache.solr.cloud.TestCollectionAPI.test

Error Message:
Timeout occured while waiting response from server at: https://127.0.0.1:33613

Stack Trace:
org.apache.solr.client.solrj.SolrServerException: Timeout occured while waiting response from server at: https://127.0.0.1:33613
	at __randomizedtesting.SeedInfo.seed([A89DADC6250C1B18:20C9921C8BF076E0]:0)
	at org.apache.solr.client.solrj.impl.HttpSolrClient.executeMethod(HttpSolrClient.java:654)
	at org.apache.solr.client.solrj.impl.HttpSolrClient.request(HttpSolrClient.java:255)
	at org.apache.solr.client.solrj.impl.HttpSolrClient.request(HttpSolrClient.java:244)
	at org.apache.solr.client.solrj.impl.LBHttpSolrClient.doRequest(LBHttpSolrClient.java:483)
	at org.apache.solr.client.solrj.impl.LBHttpSolrClient.request(LBHttpSolrClient.java:413)
	at org.apache.solr.client.solrj.impl.CloudSolrClient.sendRequest(CloudSolrClient.java:1104)
	at org.apache.solr.client.solrj.impl.CloudSolrClient.requestWithRetryOnStaleState(CloudSolrClient.java:884)
	at org.apache.solr.client.solrj.impl.CloudSolrClient.request(CloudSolrClient.java:817)
	at org.apache.solr.client.solrj.SolrRequest.process(SolrRequest.java:194)
	at org.apache.solr.client.solrj.SolrRequest.process(SolrRequest.java:211)
	at org.apache.solr.cloud.AbstractFullDistribZkTestBase.createServers(AbstractFullDistribZkTestBase.java:315)
	at org.apache.solr.BaseDistributedSearchTestCase$ShardsRepeatRule$ShardsFixedStatement.callStatement(BaseDistributedSearchTestCase.java:991)
	at org.apache.solr.BaseDistributedSearchTestCase$ShardsRepeatRule$ShardsStatement.evaluate(BaseDistributedSearchTestCase.java:968)
	at com.carrotsearch.randomizedtesting.rules.SystemPropertiesRestoreRule$1.evaluate(SystemPropertiesRestoreRule.java:57)
	at org.apache.lucene.util.TestRuleSetupTeardownChained$1.evaluate(TestRuleSetupTeardownChained.java:49)
	at org.apache.lucene.util.AbstractBeforeAfterRule$1.evaluate(AbstractBeforeAfterRule.java:45)
	at org.apache.lucene.util.TestRuleThreadAndTestName$1.evaluate(TestRuleThreadAndTestName.java:48)
	at org.apache.lucene.util.TestRuleIgnoreAfterMaxFailures$1.evaluate(TestRuleIgnoreAfterMaxFailures.java:64)
	at org.apache.lucene.util.TestRuleMarkFailure$1.evaluate(TestRuleMarkFailure.java:47)
	at com.carrotsearch.randomizedtesting.rules.StatementAdapter.evaluate(StatementAdapter.java:36)
	at com.carrotsearch.randomizedtesting.ThreadLeakControl$StatementRunner.run(ThreadLeakControl.java:368)
	at com.carrotsearch.randomizedtesting.ThreadLeakControl.forkTimeoutingTask(ThreadLeakControl.java:817)
	at com.carrotsearch.randomizedtesting.ThreadLeakControl$3.evaluate(ThreadLeakControl.java:468)
	at com.carrotsearch.randomizedtesting.RandomizedRunner.runSingleTest(RandomizedRunner.java:943)
	at com.carrotsearch.randomizedtesting.RandomizedRunner$5.evaluate(RandomizedRunner.java:829)
	at com.carrotsearch.randomizedtesting.RandomizedRunner$6.evaluate(RandomizedRunner.java:879)
	at com.carrotsearch.randomizedtesting.RandomizedRunner$7.evaluate(RandomizedRunner.java:890)
	at com.carrotsearch.randomizedtesting.rules.StatementAdapter.evaluate(StatementAdapter.java:36)
	at com.carrotsearch.randomizedtesting.rules.SystemPropertiesRestoreRule$1.evaluate(SystemPropertiesRestoreRule.java:57)
	at org.apache.lucene.util.AbstractBeforeAfterRule$1.evaluate(AbstractBeforeAfterRule.java:45)
	at com.carrotsearch.randomizedtesting.rules.StatementAdapter.evaluate(StatementAdapter.java:36)
	at org.apache.lucene.util.TestRuleStoreClassName$1.evaluate(TestRuleStoreClassName.java:41)
	at com.carrotsearch.randomizedtesting.rules.NoShadowingOrOverridesOnMethodsRule$1.evaluate(NoShadowingOrOverridesOnMethodsRule.java:40)
	at com.carrotsearch.randomizedtesting.rules.NoShadowingOrOverridesOnMethodsRule$1.evaluate(NoShadowingOrOverridesOnMethodsRule.java:40)
	at com.carrotsearch.randomizedtesting.rules.StatementAdapter.evaluate(StatementAdapter.java:36)
	at com.carrotsearch.randomizedtesting.rules.StatementAdapter.evaluate(StatementAdapter.java:36)
	at org.apache.lucene.util.TestRuleAssertionsRequired$1.evaluate(TestRuleAssertionsRequired.java:53)
	at org.apache.lucene.util.TestRuleMarkFailure$1.evaluate(TestRuleMarkFailure.java:47)
	at org.apache.lucene.util.TestRuleIgnoreAfterMaxFailures$1.evaluate(TestRuleIgnoreAfterMaxFailures.java:64)
	at org.apache.lucene.util.TestRuleIgnoreTestSuites$1.evaluate(TestRuleIgnoreTestSuites.java:54)
	at com.carrotsearch.randomizedtesting.rules.StatementAdapter.evaluate(StatementAdapter.java:36)
	at com.carrotsearch.randomizedtesting.ThreadLeakControl$StatementRunner.run(ThreadLeakControl.java:368)
	at java.base/java.lang.Thread.run(Thread.java:844)
Caused by: java.net.SocketTimeoutException: Read timed out
	at java.base/java.net.SocketInputStream.socketRead0(Native Method)
	at java.base/java.net.SocketInputStream.socketRead(SocketInputStream.java:116)
	at java.base/java.net.SocketInputStream.read(SocketInputStream.java:171)
	at java.base/java.net.SocketInputStream.read(SocketInputStream.java:141)
	at java.base/sun.security.ssl.SSLSocketInputRecord.read(SSLSocketInputRecord.java:425)
	at java.base/sun.security.ssl.SSLSocketInputRecord.bytesInCompletePacket(SSLSocketInputRecord.java:65)
	at java.base/sun.security.ssl.SSLSocketImpl.bytesInCompletePacket(SSLSocketImpl.java:918)
	at java.base/sun.security.ssl.AppInputStream.read(AppInputStream.java:144)
	at org.apache.http.impl.io.SessionInputBufferImpl.streamRead(SessionInputBufferImpl.java:137)
	at org.apache.http.impl.io.SessionInputBufferImpl.fillBuffer(SessionInputBufferImpl.java:153)
	at org.apache.http.impl.io.SessionInputBufferImpl.readLine(SessionInputBufferImpl.java:282)
	at org.apache.http.impl.conn.DefaultHttpResponseParser.parseHead(DefaultHttpResponseParser.java:138)
	at org.apache.http.impl.conn.DefaultHttpResponseParser.parseHead(DefaultHttpResponseParser.java:56)
	at org.apache.http.impl.io.AbstractMessageParser.parse(AbstractMessageParser.java:259)
	at org.apache.http.impl.DefaultBHttpClientConnection.receiveResponseHeader(DefaultBHttpClientConnection.java:163)
	at org.apache.http.impl.conn.CPoolProxy.receiveResponseHeader(CPoolProxy.java:165)
	at org.apache.http.protocol.HttpRequestExecutor.doReceiveResponse(HttpRequestExecutor.java:273)
	at org.apache.http.protocol.HttpRequestExecutor.execute(HttpRequestExecutor.java:125)
	at org.apache.http.impl.execchain.MainClientExec.execute(MainClientExec.java:272)
	at org.apache.http.impl.execchain.ProtocolExec.execute(ProtocolExec.java:185)
	at org.apache.http.impl.execchain.RetryExec.execute(RetryExec.java:89)
	at org.apache.http.impl.execchain.RedirectExec.execute(RedirectExec.java:111)
	at org.apache.http.impl.client.InternalHttpClient.doExecute(InternalHttpClient.java:185)
	at org.apache.http.impl.client.CloseableHttpClient.execute(CloseableHttpClient.java:83)
	at org.apache.http.impl.client.CloseableHttpClient.execute(CloseableHttpClient.java:56)
	at org.apache.solr.client.solrj.impl.HttpSolrClient.executeMethod(HttpSolrClient.java:542)
	... 42 more


FAILED:  org.apache.solr.cloud.TestLocalFSCloudBackupRestore.test

Error Message:
Error from server at https://127.0.0.1:33563/solr: Could not fully create collection: backuprestore

Stack Trace:
org.apache.solr.client.solrj.impl.HttpSolrClient$RemoteSolrException: Error from server at https://127.0.0.1:33563/solr: Could not fully create collection: backuprestore
	at __randomizedtesting.SeedInfo.seed([A89DADC6250C1B18:20C9921C8BF076E0]:0)
	at org.apache.solr.client.solrj.impl.HttpSolrClient.executeMethod(HttpSolrClient.java:643)
	at org.apache.solr.client.solrj.impl.HttpSolrClient.request(HttpSolrClient.java:255)
	at org.apache.solr.client.solrj.impl.HttpSolrClient.request(HttpSolrClient.java:244)
	at org.apache.solr.client.solrj.impl.LBHttpSolrClient.doRequest(LBHttpSolrClient.java:483)
	at org.apache.solr.client.solrj.impl.LBHttpSolrClient.request(LBHttpSolrClient.java:413)
	at org.apache.solr.client.solrj.impl.CloudSolrClient.sendRequest(CloudSolrClient.java:1104)
	at org.apache.solr.client.solrj.impl.CloudSolrClient.requestWithRetryOnStaleState(CloudSolrClient.java:884)
	at org.apache.solr.client.solrj.impl.CloudSolrClient.request(CloudSolrClient.java:817)
	at org.apache.solr.client.solrj.SolrRequest.process(SolrRequest.java:194)
	at org.apache.solr.client.solrj.SolrRequest.process(SolrRequest.java:211)
	at org.apache.solr.cloud.AbstractCloudBackupRestoreTestCase.test(AbstractCloudBackupRestoreTestCase.java:121)
	at java.base/jdk.internal.reflect.NativeMethodAccessorImpl.invoke0(Native Method)
	at java.base/jdk.internal.reflect.NativeMethodAccessorImpl.invoke(NativeMethodAccessorImpl.java:62)
	at java.base/jdk.internal.reflect.DelegatingMethodAccessorImpl.invoke(DelegatingMethodAccessorImpl.java:43)
	at java.base/java.lang.reflect.Method.invoke(Method.java:564)
	at com.carrotsearch.randomizedtesting.RandomizedRunner.invoke(RandomizedRunner.java:1737)
	at com.carrotsearch.randomizedtesting.RandomizedRunner$8.evaluate(RandomizedRunner.java:934)
	at com.carrotsearch.randomizedtesting.RandomizedRunner$9.evaluate(RandomizedRunner.java:970)
	at com.carrotsearch.randomizedtesting.RandomizedRunner$10.evaluate(RandomizedRunner.java:984)
	at com.carrotsearch.randomizedtesting.rules.SystemPropertiesRestoreRule$1.evaluate(SystemPropertiesRestoreRule.java:57)
	at org.apache.lucene.util.TestRuleSetupTeardownChained$1.evaluate(TestRuleSetupTeardownChained.java:49)
	at org.apache.lucene.util.AbstractBeforeAfterRule$1.evaluate(AbstractBeforeAfterRule.java:45)
	at org.apache.lucene.util.TestRuleThreadAndTestName$1.evaluate(TestRuleThreadAndTestName.java:48)
	at org.apache.lucene.util.TestRuleIgnoreAfterMaxFailures$1.evaluate(TestRuleIgnoreAfterMaxFailures.java:64)
	at org.apache.lucene.util.TestRuleMarkFailure$1.evaluate(TestRuleMarkFailure.java:47)
	at com.carrotsearch.randomizedtesting.rules.StatementAdapter.evaluate(StatementAdapter.java:36)
	at com.carrotsearch.randomizedtesting.ThreadLeakControl$StatementRunner.run(ThreadLeakControl.java:368)
	at com.carrotsearch.randomizedtesting.ThreadLeakControl.forkTimeoutingTask(ThreadLeakControl.java:817)
	at com.carrotsearch.randomizedtesting.ThreadLeakControl$3.evaluate(ThreadLeakControl.java:468)
	at com.carrotsearch.randomizedtesting.RandomizedRunner.runSingleTest(RandomizedRunner.java:943)
	at com.carrotsearch.randomizedtesting.RandomizedRunner$5.evaluate(RandomizedRunner.java:829)
	at com.carrotsearch.randomizedtesting.RandomizedRunner$6.evaluate(RandomizedRunner.java:879)
	at com.carrotsearch.randomizedtesting.RandomizedRunner$7.evaluate(RandomizedRunner.java:890)
	at com.carrotsearch.randomizedtesting.rules.StatementAdapter.evaluate(StatementAdapter.java:36)
	at com.carrotsearch.randomizedtesting.rules.SystemPropertiesRestoreRule$1.evaluate(SystemPropertiesRestoreRule.java:57)
	at org.apache.lucene.util.AbstractBeforeAfterRule$1.evaluate(AbstractBeforeAfterRule.java:45)
	at com.carrotsearch.randomizedtesting.rules.StatementAdapter.evaluate(StatementAdapter.java:36)
	at org.apache.lucene.util.TestRuleStoreClassName$1.evaluate(TestRuleStoreClassName.java:41)
	at com.carrotsearch.randomizedtesting.rules.NoShadowingOrOverridesOnMethodsRule$1.evaluate(NoShadowingOrOverridesOnMethodsRule.java:40)
	at com.carrotsearch.randomizedtesting.rules.NoShadowingOrOverridesOnMethodsRule$1.evaluate(NoShadowingOrOverridesOnMethodsRule.java:40)
	at com.carrotsearch.randomizedtesting.rules.StatementAdapter.evaluate(StatementAdapter.java:36)
	at com.carrotsearch.randomizedtesting.rules.StatementAdapter.evaluate(StatementAdapter.java:36)
	at org.apache.lucene.util.TestRuleAssertionsRequired$1.evaluate(TestRuleAssertionsRequired.java:53)
	at org.apache.lucene.util.TestRuleMarkFailure$1.evaluate(TestRuleMarkFailure.java:47)
	at org.apache.lucene.util.TestRuleIgnoreAfterMaxFailures$1.evaluate(TestRuleIgnoreAfterMaxFailures.java:64)
	at org.apache.lucene.util.TestRuleIgnoreTestSuites$1.evaluate(TestRuleIgnoreTestSuites.java:54)
	at com.carrotsearch.randomizedtesting.rules.StatementAdapter.evaluate(StatementAdapter.java:36)
	at com.carrotsearch.randomizedtesting.ThreadLeakControl$StatementRunner.run(ThreadLeakControl.java:368)
	at java.base/java.lang.Thread.run(Thread.java:844)


FAILED:  org.apache.solr.core.TestDynamicLoading.testDynamicLoading

Error Message:
Timeout occured while waiting response from server at: http://127.0.0.1:44563

Stack Trace:
org.apache.solr.client.solrj.SolrServerException: Timeout occured while waiting response from server at: http://127.0.0.1:44563
	at __randomizedtesting.SeedInfo.seed([A89DADC6250C1B18:70D08091D2D1BEB8]:0)
	at org.apache.solr.client.solrj.impl.HttpSolrClient.executeMethod(HttpSolrClient.java:654)
	at org.apache.solr.client.solrj.impl.HttpSolrClient.request(HttpSolrClient.java:255)
	at org.apache.solr.client.solrj.impl.HttpSolrClient.request(HttpSolrClient.java:244)
	at org.apache.solr.client.solrj.impl.LBHttpSolrClient.doRequest(LBHttpSolrClient.java:483)
	at org.apache.solr.client.solrj.impl.LBHttpSolrClient.request(LBHttpSolrClient.java:413)
	at org.apache.solr.client.solrj.impl.CloudSolrClient.sendRequest(CloudSolrClient.java:1104)
	at org.apache.solr.client.solrj.impl.CloudSolrClient.requestWithRetryOnStaleState(CloudSolrClient.java:884)
	at org.apache.solr.client.solrj.impl.CloudSolrClient.request(CloudSolrClient.java:817)
	at org.apache.solr.client.solrj.SolrRequest.process(SolrRequest.java:194)
	at org.apache.solr.client.solrj.SolrRequest.process(SolrRequest.java:211)
	at org.apache.solr.cloud.AbstractFullDistribZkTestBase.createServers(AbstractFullDistribZkTestBase.java:315)
	at org.apache.solr.BaseDistributedSearchTestCase$ShardsRepeatRule$ShardsFixedStatement.callStatement(BaseDistributedSearchTestCase.java:991)
	at org.apache.solr.BaseDistributedSearchTestCase$ShardsRepeatRule$ShardsStatement.evaluate(BaseDistributedSearchTestCase.java:968)
	at com.carrotsearch.randomizedtesting.rules.SystemPropertiesRestoreRule$1.evaluate(SystemPropertiesRestoreRule.java:57)
	at org.apache.lucene.util.TestRuleSetupTeardownChained$1.evaluate(TestRuleSetupTeardownChained.java:49)
	at org.apache.lucene.util.AbstractBeforeAfterRule$1.evaluate(AbstractBeforeAfterRule.java:45)
	at org.apache.lucene.util.TestRuleThreadAndTestName$1.evaluate(TestRuleThreadAndTestName.java:48)
	at org.apache.lucene.util.TestRuleIgnoreAfterMaxFailures$1.evaluate(TestRuleIgnoreAfterMaxFailures.java:64)
	at org.apache.lucene.util.TestRuleMarkFailure$1.evaluate(TestRuleMarkFailure.java:47)
	at com.carrotsearch.randomizedtesting.rules.StatementAdapter.evaluate(StatementAdapter.java:36)
	at com.carrotsearch.randomizedtesting.ThreadLeakControl$StatementRunner.run(ThreadLeakControl.java:368)
	at com.carrotsearch.randomizedtesting.ThreadLeakControl.forkTimeoutingTask(ThreadLeakControl.java:817)
	at com.carrotsearch.randomizedtesting.ThreadLeakControl$3.evaluate(ThreadLeakControl.java:468)
	at com.carrotsearch.randomizedtesting.RandomizedRunner.runSingleTest(RandomizedRunner.java:943)
	at com.carrotsearch.randomizedtesting.RandomizedRunner$5.evaluate(RandomizedRunner.java:829)
	at com.carrotsearch.randomizedtesting.RandomizedRunner$6.evaluate(RandomizedRunner.java:879)
	at com.carrotsearch.randomizedtesting.RandomizedRunner$7.evaluate(RandomizedRunner.java:890)
	at com.carrotsearch.randomizedtesting.rules.StatementAdapter.evaluate(StatementAdapter.java:36)
	at com.carrotsearch.randomizedtesting.rules.SystemPropertiesRestoreRule$1.evaluate(SystemPropertiesRestoreRule.java:57)
	at org.apache.lucene.util.AbstractBeforeAfterRule$1.evaluate(AbstractBeforeAfterRule.java:45)
	at com.carrotsearch.randomizedtesting.rules.StatementAdapter.evaluate(StatementAdapter.java:36)
	at org.apache.lucene.util.TestRuleStoreClassName$1.evaluate(TestRuleStoreClassName.java:41)
	at com.carrotsearch.randomizedtesting.rules.NoShadowingOrOverridesOnMethodsRule$1.evaluate(NoShadowingOrOverridesOnMethodsRule.java:40)
	at com.carrotsearch.randomizedtesting.rules.NoShadowingOrOverridesOnMethodsRule$1.evaluate(NoShadowingOrOverridesOnMethodsRule.java:40)
	at com.carrotsearch.randomizedtesting.rules.StatementAdapter.evaluate(StatementAdapter.java:36)
	at com.carrotsearch.randomizedtesting.rules.StatementAdapter.evaluate(StatementAdapter.java:36)
	at org.apache.lucene.util.TestRuleAssertionsRequired$1.evaluate(TestRuleAssertionsRequired.java:53)
	at org.apache.lucene.util.TestRuleMarkFailure$1.evaluate(TestRuleMarkFailure.java:47)
	at org.apache.lucene.util.TestRuleIgnoreAfterMaxFailures$1.evaluate(TestRuleIgnoreAfterMaxFailures.java:64)
	at org.apache.lucene.util.TestRuleIgnoreTestSuites$1.evaluate(TestRuleIgnoreTestSuites.java:54)
	at com.carrotsearch.randomizedtesting.rules.StatementAdapter.evaluate(StatementAdapter.java:36)
	at com.carrotsearch.randomizedtesting.ThreadLeakControl$StatementRunner.run(ThreadLeakControl.java:368)
	at java.base/java.lang.Thread.run(Thread.java:844)
Caused by: java.net.SocketTimeoutException: Read timed out
	at java.base/java.net.SocketInputStream.socketRead0(Native Method)
	at java.base/java.net.SocketInputStream.socketRead(SocketInputStream.java:116)
	at java.base/java.net.SocketInputStream.read(SocketInputStream.java:171)
	at java.base/java.net.SocketInputStream.read(SocketInputStream.java:141)
	at org.apache.http.impl.io.SessionInputBufferImpl.streamRead(SessionInputBufferImpl.java:137)
	at org.apache.http.impl.io.SessionInputBufferImpl.fillBuffer(SessionInputBufferImpl.java:153)
	at org.apache.http.impl.io.SessionInputBufferImpl.readLine(SessionInputBufferImpl.java:282)
	at org.apache.http.impl.conn.DefaultHttpResponseParser.parseHead(DefaultHttpResponseParser.java:138)
	at org.apache.http.impl.conn.DefaultHttpResponseParser.parseHead(DefaultHttpResponseParser.java:56)
	at org.apache.http.impl.io.AbstractMessageParser.parse(AbstractMessageParser.java:259)
	at org.apache.http.impl.DefaultBHttpClientConnection.receiveResponseHeader(DefaultBHttpClientConnection.java:163)
	at org.apache.http.impl.conn.CPoolProxy.receiveResponseHeader(CPoolProxy.java:165)
	at org.apache.http.protocol.HttpRequestExecutor.doReceiveResponse(HttpRequestExecutor.java:273)
	at org.apache.http.protocol.HttpRequestExecutor.execute(HttpRequestExecutor.java:125)
	at org.apache.http.impl.execchain.MainClientExec.execute(MainClientExec.java:272)
	at org.apache.http.impl.execchain.ProtocolExec.execute(ProtocolExec.java:185)
	at org.apache.http.impl.execchain.RetryExec.execute(RetryExec.java:89)
	at org.apache.http.impl.execchain.RedirectExec.execute(RedirectExec.java:111)
	at org.apache.http.impl.client.InternalHttpClient.doExecute(InternalHttpClient.java:185)
	at org.apache.http.impl.client.CloseableHttpClient.execute(CloseableHttpClient.java:83)
	at org.apache.http.impl.client.CloseableHttpClient.execute(CloseableHttpClient.java:56)
	at org.apache.solr.client.solrj.impl.HttpSolrClient.executeMethod(HttpSolrClient.java:542)
	... 42 more




Build Log:
[...truncated 12106 lines...]
   [junit4] Suite: org.apache.solr.cloud.TestLocalFSCloudBackupRestore
   [junit4]   2> 528261 INFO  (SUITE-TestLocalFSCloudBackupRestore-seed#[A89DADC6250C1B18]-worker) [    ] o.a.s.SolrTestCaseJ4 SecureRandom sanity checks: test.solr.allowed.securerandom=null & java.security.egd=file:/dev/./urandom
   [junit4]   2> Creating dataDir: /home/jenkins/workspace/Lucene-Solr-7.x-Linux/solr/build/solr-core/test/J0/temp/solr.cloud.TestLocalFSCloudBackupRestore_A89DADC6250C1B18-001/init-core-data-001
   [junit4]   2> 528261 WARN  (SUITE-TestLocalFSCloudBackupRestore-seed#[A89DADC6250C1B18]-worker) [    ] o.a.s.SolrTestCaseJ4 startTrackingSearchers: numOpens=1 numCloses=1
   [junit4]   2> 528262 INFO  (SUITE-TestLocalFSCloudBackupRestore-seed#[A89DADC6250C1B18]-worker) [    ] o.a.s.SolrTestCaseJ4 Using TrieFields (NUMERIC_POINTS_SYSPROP=false) w/NUMERIC_DOCVALUES_SYSPROP=true
   [junit4]   2> 528262 INFO  (SUITE-TestLocalFSCloudBackupRestore-seed#[A89DADC6250C1B18]-worker) [    ] o.a.s.SolrTestCaseJ4 Randomized ssl (true) and clientAuth (true) via: @org.apache.solr.util.RandomizeSSL(reason="", ssl=0.0/0.0, value=0.0/0.0, clientAuth=0.0/0.0)
   [junit4]   2> 528263 INFO  (SUITE-TestLocalFSCloudBackupRestore-seed#[A89DADC6250C1B18]-worker) [    ] o.a.s.c.MiniSolrCloudCluster Starting cluster of 2 servers in /home/jenkins/workspace/Lucene-Solr-7.x-Linux/solr/build/solr-core/test/J0/temp/solr.cloud.TestLocalFSCloudBackupRestore_A89DADC6250C1B18-001/tempDir-001
   [junit4]   2> 528263 INFO  (SUITE-TestLocalFSCloudBackupRestore-seed#[A89DADC6250C1B18]-worker) [    ] o.a.s.c.ZkTestServer STARTING ZK TEST SERVER
   [junit4]   2> 528263 INFO  (Thread-1071) [    ] o.a.s.c.ZkTestServer client port:0.0.0.0/0.0.0.0:0
   [junit4]   2> 528263 INFO  (Thread-1071) [    ] o.a.s.c.ZkTestServer Starting server
   [junit4]   2> 528265 ERROR (Thread-1071) [    ] o.a.z.s.ZooKeeperServer ZKShutdownHandler is not registered, so ZooKeeper server won't take any action on ERROR or SHUTDOWN server state changes
   [junit4]   2> 528363 INFO  (SUITE-TestLocalFSCloudBackupRestore-seed#[A89DADC6250C1B18]-worker) [    ] o.a.s.c.ZkTestServer start zk server on port:46667
   [junit4]   2> 528366 INFO  (zkConnectionManagerCallback-642-thread-1) [    ] o.a.s.c.c.ConnectionManager zkClient has connected
   [junit4]   2> 528368 INFO  (jetty-launcher-639-thread-2) [    ] o.e.j.s.Server jetty-9.3.20.v20170531
   [junit4]   2> 528368 INFO  (jetty-launcher-639-thread-1) [    ] o.e.j.s.Server jetty-9.3.20.v20170531
   [junit4]   2> 528369 INFO  (jetty-launcher-639-thread-2) [    ] o.e.j.s.h.ContextHandler Started o.e.j.s.ServletContextHandler@2e701c0f{/solr,null,AVAILABLE}
   [junit4]   2> 528369 INFO  (jetty-launcher-639-thread-1) [    ] o.e.j.s.h.ContextHandler Started o.e.j.s.ServletContextHandler@8e272e3{/solr,null,AVAILABLE}
   [junit4]   2> 528371 INFO  (jetty-launcher-639-thread-1) [    ] o.e.j.s.AbstractConnector Started ServerConnector@5d08e5bb{SSL,[ssl, http/1.1]}{127.0.0.1:43469}
   [junit4]   2> 528371 INFO  (jetty-launcher-639-thread-2) [    ] o.e.j.s.AbstractConnector Started ServerConnector@58b9ab8f{SSL,[ssl, http/1.1]}{127.0.0.1:33563}
   [junit4]   2> 528371 INFO  (jetty-launcher-639-thread-1) [    ] o.e.j.s.Server Started @530040ms
   [junit4]   2> 528371 INFO  (jetty-launcher-639-thread-2) [    ] o.e.j.s.Server Started @530040ms
   [junit4]   2> 528371 INFO  (jetty-launcher-639-thread-1) [    ] o.a.s.c.s.e.JettySolrRunner Jetty properties: {hostContext=/solr, hostPort=43469}
   [junit4]   2> 528371 INFO  (jetty-launcher-639-thread-2) [    ] o.a.s.c.s.e.JettySolrRunner Jetty properties: {hostContext=/solr, hostPort=33563}
   [junit4]   2> 528371 ERROR (jetty-launcher-639-thread-1) [    ] o.a.s.u.StartupLoggingUtils Missing Java Option solr.log.dir. Logging may be missing or incomplete.
   [junit4]   2> 528371 ERROR (jetty-launcher-639-thread-2) [    ] o.a.s.u.StartupLoggingUtils Missing Java Option solr.log.dir. Logging may be missing or incomplete.
   [junit4]   2> 528371 INFO  (jetty-launcher-639-thread-1) [    ] o.a.s.s.SolrDispatchFilter  ___      _       Welcome to Apache Solr™ version 7.3.0
   [junit4]   2> 528371 INFO  (jetty-launcher-639-thread-2) [    ] o.a.s.s.SolrDispatchFilter  ___      _       Welcome to Apache Solr™ version 7.3.0
   [junit4]   2> 528371 INFO  (jetty-launcher-639-thread-1) [    ] o.a.s.s.SolrDispatchFilter / __| ___| |_ _   Starting in cloud mode on port null
   [junit4]   2> 528371 INFO  (jetty-launcher-639-thread-2) [    ] o.a.s.s.SolrDispatchFilter / __| ___| |_ _   Starting in cloud mode on port null
   [junit4]   2> 528371 INFO  (jetty-launcher-639-thread-1) [    ] o.a.s.s.SolrDispatchFilter \__ \/ _ \ | '_|  Install dir: null
   [junit4]   2> 528371 INFO  (jetty-launcher-639-thread-2) [    ] o.a.s.s.SolrDispatchFilter \__ \/ _ \ | '_|  Install dir: null
   [junit4]   2> 528371 INFO  (jetty-launcher-639-thread-1) [    ] o.a.s.s.SolrDispatchFilter |___/\___/_|_|    Start time: 2017-12-23T12:56:25.472765Z
   [junit4]   2> 528371 INFO  (jetty-launcher-639-thread-2) [    ] o.a.s.s.SolrDispatchFilter |___/\___/_|_|    Start time: 2017-12-23T12:56:25.472783Z
   [junit4]   2> 528372 INFO  (zkConnectionManagerCallback-645-thread-1) [    ] o.a.s.c.c.ConnectionManager zkClient has connected
   [junit4]   2> 528372 INFO  (zkConnectionManagerCallback-646-thread-1) [    ] o.a.s.c.c.ConnectionManager zkClient has connected
   [junit4]   2> 528373 INFO  (jetty-launcher-639-thread-2) [    ] o.a.s.s.SolrDispatchFilter solr.xml found in ZooKeeper. Loading...
   [junit4]   2> 528373 INFO  (jetty-launcher-639-thread-1) [    ] o.a.s.s.SolrDispatchFilter solr.xml found in ZooKeeper. Loading...
   [junit4]   2> 528377 INFO  (jetty-launcher-639-thread-2) [    ] o.a.s.c.ZkContainer Zookeeper client=127.0.0.1:46667/solr
   [junit4]   2> 528377 INFO  (jetty-launcher-639-thread-1) [    ] o.a.s.c.ZkContainer Zookeeper client=127.0.0.1:46667/solr
   [junit4]   2> 528378 INFO  (zkConnectionManagerCallback-652-thread-1) [    ] o.a.s.c.c.ConnectionManager zkClient has connected
   [junit4]   2> 528378 INFO  (zkConnectionManagerCallback-654-thread-1) [    ] o.a.s.c.c.ConnectionManager zkClient has connected
   [junit4]   2> 528380 INFO  (zkConnectionManagerCallback-656-thread-1-processing-n:127.0.0.1:33563_solr) [n:127.0.0.1:33563_solr    ] o.a.s.c.c.ConnectionManager zkClient has connected
   [junit4]   2> 528380 INFO  (zkConnectionManagerCallback-658-thread-1-processing-n:127.0.0.1:43469_solr) [n:127.0.0.1:43469_solr    ] o.a.s.c.c.ConnectionManager zkClient has connected
   [junit4]   2> 528421 INFO  (jetty-launcher-639-thread-2) [n:127.0.0.1:33563_solr    ] o.a.s.c.Overseer Overseer (id=null) closing
   [junit4]   2> 528422 INFO  (jetty-launcher-639-thread-2) [n:127.0.0.1:33563_solr    ] o.a.s.c.OverseerElectionContext I am going to be the leader 127.0.0.1:33563_solr
   [junit4]   2> 528422 INFO  (jetty-launcher-639-thread-2) [n:127.0.0.1:33563_solr    ] o.a.s.c.Overseer Overseer (id=99223718157680645-127.0.0.1:33563_solr-n_0000000000) starting
   [junit4]   2> 528422 INFO  (jetty-launcher-639-thread-1) [n:127.0.0.1:43469_solr    ] o.a.s.c.Overseer Overseer (id=null) closing
   [junit4]   2> 528423 INFO  (jetty-launcher-639-thread-1) [n:127.0.0.1:43469_solr    ] o.a.s.c.ZkController Register node as live in ZooKeeper:/live_nodes/127.0.0.1:43469_solr
   [junit4]   2> 528423 INFO  (zkCallback-655-thread-1-processing-n:127.0.0.1:33563_solr) [n:127.0.0.1:33563_solr    ] o.a.s.c.c.ZkStateReader Updated live nodes from ZooKeeper... (0) -> (1)
   [junit4]   2> 528423 INFO  (zkCallback-657-thread-1-processing-n:127.0.0.1:43469_solr) [n:127.0.0.1:43469_solr    ] o.a.s.c.c.ZkStateReader Updated live nodes from ZooKeeper... (0) -> (1)
   [junit4]   2> 528426 INFO  (jetty-launcher-639-thread-2) [n:127.0.0.1:33563_solr    ] o.a.s.c.ZkController Register node as live in ZooKeeper:/live_nodes/127.0.0.1:33563_solr
   [junit4]   2> 528427 INFO  (zkCallback-657-thread-1-processing-n:127.0.0.1:43469_solr) [n:127.0.0.1:43469_solr    ] o.a.s.c.c.ZkStateReader Updated live nodes from ZooKeeper... (1) -> (2)
   [junit4]   2> 528427 INFO  (zkCallback-655-thread-1-processing-n:127.0.0.1:33563_solr) [n:127.0.0.1:33563_solr    ] o.a.s.c.c.ZkStateReader Updated live nodes from ZooKeeper... (1) -> (2)
   [junit4]   2> 528478 INFO  (jetty-launcher-639-thread-1) [n:127.0.0.1:43469_solr    ] o.a.s.m.r.SolrJmxReporter JMX monitoring for 'solr_43469.solr.node' (registry 'solr.node') enabled at server: com.sun.jmx.mbeanserver.JmxMBeanServer@82edecf
   [junit4]   2> 528485 INFO  (jetty-launcher-639-thread-1) [n:127.0.0.1:43469_solr    ] o.a.s.m.r.SolrJmxReporter JMX monitoring for 'solr_43469.solr.jvm' (registry 'solr.jvm') enabled at server: com.sun.jmx.mbeanserver.JmxMBeanServer@82edecf
   [junit4]   2> 528485 INFO  (jetty-launcher-639-thread-1) [n:127.0.0.1:43469_solr    ] o.a.s.m.r.SolrJmxReporter JMX monitoring for 'solr_43469.solr.jetty' (registry 'solr.jetty') enabled at server: com.sun.jmx.mbeanserver.JmxMBeanServer@82edecf
   [junit4]   2> 528486 INFO  (jetty-launcher-639-thread-1) [n:127.0.0.1:43469_solr    ] o.a.s.c.CorePropertiesLocator Found 0 core definitions underneath /home/jenkins/workspace/Lucene-Solr-7.x-Linux/solr/build/solr-core/test/J0/temp/solr.cloud.TestLocalFSCloudBackupRestore_A89DADC6250C1B18-001/tempDir-001/node1/.
   [junit4]   2> 528495 INFO  (jetty-launcher-639-thread-2) [n:127.0.0.1:33563_solr    ] o.a.s.m.r.SolrJmxReporter JMX monitoring for 'solr_33563.solr.node' (registry 'solr.node') enabled at server: com.sun.jmx.mbeanserver.JmxMBeanServer@82edecf
   [junit4]   2> 528502 INFO  (jetty-launcher-639-thread-2) [n:127.0.0.1:33563_solr    ] o.a.s.m.r.SolrJmxReporter JMX monitoring for 'solr_33563.solr.jvm' (registry 'solr.jvm') enabled at server: com.sun.jmx.mbeanserver.JmxMBeanServer@82edecf
   [junit4]   2> 528502 INFO  (jetty-launcher-639-thread-2) [n:127.0.0.1:33563_solr    ] o.a.s.m.r.SolrJmxReporter JMX monitoring for 'solr_33563.solr.jetty' (registry 'solr.jetty') enabled at server: com.sun.jmx.mbeanserver.JmxMBeanServer@82edecf
   [junit4]   2> 528503 INFO  (jetty-launcher-639-thread-2) [n:127.0.0.1:33563_solr    ] o.a.s.c.CorePropertiesLocator Found 0 core definitions underneath /home/jenkins/workspace/Lucene-Solr-7.x-Linux/solr/build/solr-core/test/J0/temp/solr.cloud.TestLocalFSCloudBackupRestore_A89DADC6250C1B18-001/tempDir-001/node2/.
   [junit4]   2> 528521 INFO  (zkConnectionManagerCallback-664-thread-1) [    ] o.a.s.c.c.ConnectionManager zkClient has connected
   [junit4]   2> 528523 INFO  (zkConnectionManagerCallback-668-thread-1) [    ] o.a.s.c.c.ConnectionManager zkClient has connected
   [junit4]   2> 528524 INFO  (SUITE-TestLocalFSCloudBackupRestore-seed#[A89DADC6250C1B18]-worker) [    ] o.a.s.c.c.ZkStateReader Updated live nodes from ZooKeeper... (0) -> (2)
   [junit4]   2> 528524 INFO  (SUITE-TestLocalFSCloudBackupRestore-seed#[A89DADC6250C1B18]-worker) [    ] o.a.s.c.s.i.ZkClientClusterStateProvider Cluster at 127.0.0.1:46667/solr ready
   [junit4]   2> 528530 INFO  (TEST-TestLocalFSCloudBackupRestore.test-seed#[A89DADC6250C1B18]) [    ] o.a.s.SolrTestCaseJ4 ###Starting test
   [junit4]   2> 528546 INFO  (qtp2137389384-4384) [n:127.0.0.1:33563_solr    ] o.a.s.h.a.CollectionsHandler Invoked Collection Action :create with params pullReplicas=0&replicationFactor=2&property.customKey=customValue&collection.configName=conf1&maxShardsPerNode=6&name=backuprestore&nrtReplicas=2&action=CREATE&numShards=2&tlogReplicas=1&wt=javabin&version=2 and sendToOCPQueue=true
   [junit4]   2> 528551 INFO  (OverseerThreadFactory-1906-thread-1-processing-n:127.0.0.1:33563_solr) [n:127.0.0.1:33563_solr    ] o.a.s.c.CreateCollectionCmd Create collection backuprestore
   [junit4]   2> 528551 WARN  (OverseerThreadFactory-1906-thread-1-processing-n:127.0.0.1:33563_solr) [n:127.0.0.1:33563_solr    ] o.a.s.c.CreateCollectionCmd Specified number of replicas of 3 on collection backuprestore is higher than the number of Solr instances currently live or live and part of your createNodeSet(2). It's unusual to run two replica of the same slice on the same Solr-instance.
   [junit4]   2> 558577 ERROR (OverseerThreadFactory-1906-thread-1-processing-n:127.0.0.1:33563_solr) [n:127.0.0.1:33563_solr    ] o.a.s.c.OverseerCollectionMessageHandler Collection: backuprestore operation: create failed:org.apache.solr.common.SolrException: Could not fully create collection: backuprestore
   [junit4]   2> 	at org.apache.solr.cloud.CreateCollectionCmd.call(CreateCollectionCmd.java:151)
   [junit4]   2> 	at org.apache.solr.cloud.OverseerCollectionMessageHandler.processMessage(OverseerCollectionMessageHandler.java:242)
   [junit4]   2> 	at org.apache.solr.cloud.OverseerTaskProcessor$Runner.run(OverseerTaskProcessor.java:464)
   [junit4]   2> 	at org.apache.solr.common.util.ExecutorUtil$MDCAwareThreadPoolExecutor.lambda$execute$0(ExecutorUtil.java:188)
   [junit4]   2> 	at java.base/java.util.concurrent.ThreadPoolExecutor.runWorker(ThreadPoolExecutor.java:1167)
   [junit4]   2> 	at java.base/java.util.concurrent.ThreadPoolExecutor$Worker.run(ThreadPoolExecutor.java:641)
   [junit4]   2> 	at java.base/java.lang.Thread.run(Thread.java:844)
   [junit4]   2> 
   [junit4]   2> 558583 INFO  (qtp2137389384-4384) [n:127.0.0.1:33563_solr    ] o.a.s.s.HttpSolrCall [admin] webapp=null path=/admin/collections params={pullReplicas=0&replicationFactor=2&property.customKey=customValue&collection.configName=conf1&maxShardsPerNode=6&name=backuprestore&nrtReplicas=2&action=CREATE&numShards=2&tlogReplicas=1&wt=javabin&version=2} status=500 QTime=30037
   [junit4]   2> 558583 ERROR (qtp2137389384-4384) [n:127.0.0.1:33563_solr    ] o.a.s.s.HttpSolrCall null:org.apache.solr.common.SolrException: Could not fully create collection: backuprestore
   [junit4]   2> 	at org.apache.solr.handler.admin.CollectionsHandler.handleResponse(CollectionsHandler.java:309)
   [junit4]   2> 	at org.apache.solr.handler.admin.CollectionsHandler.invokeAction(CollectionsHandler.java:246)
   [junit4]   2> 	at org.apache.solr.handler.admin.CollectionsHandler.handleRequestBody(CollectionsHandler.java:224)
   [junit4]   2> 	at org.apache.solr.handler.RequestHandlerBase.handleRequest(RequestHandlerBase.java:177)
   [junit4]   2> 	at org.apache.solr.servlet.HttpSolrCall.handleAdmin(HttpSolrCall.java:736)
   [junit4]   2> 	at org.apache.solr.servlet.HttpSolrCall.handleAdminRequest(HttpSolrCall.java:717)
   [junit4]   2> 	at org.apache.solr.servlet.HttpSolrCall.call(HttpSolrCall.java:498)
   [junit4]   2> 	at org.apache.solr.servlet.SolrDispatchFilter.doFilter(SolrDispatchFilter.java:382)
   [junit4]   2> 	at org.apache.solr.servlet.SolrDispatchFilter.doFilter(SolrDispatchFilter.java:326)
   [junit4]   2> 	at org.eclipse.jetty.servlet.ServletHandler$CachedChain.doFilter(ServletHandler.java:1759)
   [junit4]   2> 	at org.apache.solr.client.solrj.embedded.JettySolrRunner$DebugFilter.doFilter(JettySolrRunner.java:139)
   [junit4]   2> 	at org.eclipse.jetty.servlet.ServletHandler$CachedChain.doFilter(ServletHandler.java:1759)
   [junit4]   2> 	at org.eclipse.jetty.servlet.ServletHandler.doHandle(ServletHandler.java:582)
   [junit4]   2> 	at org.eclipse.jetty.server.session.SessionHandler.doHandle(SessionHandler.java:224)
   [junit4]   2> 	at org.eclipse.jetty.server.handler.ContextHandler.doHandle(ContextHandler.java:1180)
   [junit4]   2> 	at org.eclipse.jetty.servlet.ServletHandler.doScope(ServletHandler.java:512)
   [junit4]   2> 	at org.eclipse.jetty.server.session.SessionHandler.doScope(SessionHandler.java:185)
   [junit4]   2> 	at org.eclipse.jetty.server.handler.ContextHandler.doScope(ContextHandler.java:1112)
   [junit4]   2> 	at org.eclipse.jetty.server.handler.ScopedHandler.handle(ScopedHandler.java:141)
   [junit4]   2> 	at org.eclipse.jetty.server.handler.gzip.GzipHandler.handle(GzipHandler.java:493)
   [junit4]   2> 	at org.eclipse.jetty.server.handler.HandlerWrapper.handle(HandlerWrapper.java:134)
   [junit4]   2> 	at org.eclipse.jetty.server.Server.handle(Server.java:534)
   [junit4]   2> 	at org.eclipse.jetty.server.HttpChannel.handle(HttpChannel.java:320)
   [junit4]   2> 	at org.eclipse.jetty.server.HttpConnection.onFillable(HttpConnection.java:251)
   [junit4]   2> 	at org.eclipse.jetty.io.AbstractConnection$ReadCallback.succeeded(AbstractConnection.java:283)
   [junit4]   2> 	at org.eclipse.jetty.io.FillInterest.fillable(FillInterest.java:108)
   [junit4]   2> 	at org.eclipse.jetty.io.ssl.SslConnection.onFillable(SslConnection.java:251)
   [junit4]   2> 	at org.eclipse.jetty.io.AbstractConnection$ReadCallback.succeeded(AbstractConnection.java:283)
   [junit4]   2> 	at org.eclipse.jetty.io.FillInterest.fillable(FillInterest.java:108)
   [junit4]   2> 	at org.eclipse.jetty.io.SelectChannelEndPoint$2.run(SelectChannelEndPoint.java:93)
   [junit4]   2> 	at org.eclipse.jetty.util.thread.strategy.ExecuteProduceConsume.executeProduceConsume(ExecuteProduceConsume.java:303)
   [junit4]   2> 	at org.eclipse.jetty.util.thread.strategy.ExecuteProduceConsume.produceConsume(ExecuteProduceConsume.java:148)
   [junit4]   2> 	at org.eclipse.jetty.util.thread.strategy.ExecuteProduceConsume.run(ExecuteProduceConsume.java:136)
   [junit4]   2> 	at org.eclipse.jetty.util.thread.QueuedThreadPool.runJob(QueuedThreadPool.java:671)
   [junit4]   2> 	at org.eclipse.jetty.util.thread.QueuedThreadPool$2.run(QueuedThreadPool.java:589)
   [junit4]   2> 	at java.base/java.lang.Thread.run(Thread.java:844)
   [junit4]   2> 
   [junit4]   2> 558584 INFO  (TEST-TestLocalFSCloudBackupRestore.test-seed#[A89DADC6250C1B18]) [    ] o.a.s.SolrTestCaseJ4 ###Ending test
   [junit4]   2> NOTE: reproduce with: ant test  -Dtestcase=TestLocalFSCloudBackupRestore -Dtests.method=test -Dtests.seed=A89DADC6250C1B18 -Dtests.multiplier=3 -Dtests.slow=true -Dtests.locale=rn -Dtests.timezone=NST -Dtests.asserts=true -Dtests.file.encoding=UTF-8
   [junit4] ERROR   30.1s J0 | TestLocalFSCloudBackupRestore.test <<<
   [junit4]    > Throwable #1: org.apache.solr.client.solrj.impl.HttpSolrClient$RemoteSolrException: Error from server at https://127.0.0.1:33563/solr: Could not fully create collection: backuprestore
   [junit4]    > 	at __randomizedtesting.SeedInfo.seed([A89DADC6250C1B18:20C9921C8BF076E0]:0)
   [junit4]    > 	at org.apache.solr.client.solrj.impl.HttpSolrClient.executeMethod(HttpSolrClient.java:643)
   [junit4]    > 	at org.apache.solr.client.solrj.impl.HttpSolrClient.request(HttpSolrClient.java:255)
   [junit4]    > 	at org.apache.solr.client.solrj.impl.HttpSolrClient.request(HttpSolrClient.java:244)
   [junit4]    > 	at org.apache.solr.client.solrj.impl.LBHttpSolrClient.doRequest(LBHttpSolrClient.java:483)
   [junit4]    > 	at org.apache.solr.client.solrj.impl.LBHttpSolrClient.request(LBHttpSolrClient.java:413)
   [junit4]    > 	at org.apache.solr.client.solrj.impl.CloudSolrClient.sendRequest(CloudSolrClient.java:1104)
   [junit4]    > 	at org.apache.solr.client.solrj.impl.CloudSolrClient.requestWithRetryOnStaleState(CloudSolrClient.java:884)
   [junit4]    > 	at org.apache.solr.client.solrj.impl.CloudSolrClient.request(CloudSolrClient.java:817)
   [junit4]    > 	at org.apache.solr.client.solrj.SolrRequest.process(SolrRequest.java:194)
   [junit4]    > 	at org.apache.solr.client.solrj.SolrRequest.process(SolrRequest.java:211)
   [junit4]    > 	at org.apache.solr.cloud.AbstractCloudBackupRestoreTestCase.test(AbstractCloudBackupRestoreTestCase.java:121)
   [junit4]    > 	at java.base/jdk.internal.reflect.NativeMethodAccessorImpl.invoke0(Native Method)
   [junit4]    > 	at java.base/jdk.internal.reflect.NativeMethodAccessorImpl.invoke(NativeMethodAccessorImpl.java:62)
   [junit4]    > 	at java.base/jdk.internal.reflect.DelegatingMethodAccessorImpl.invoke(DelegatingMethodAccessorImpl.java:43)
   [junit4]    > 	at java.base/java.lang.reflect.Method.invoke(Method.java:564)
   [junit4]    > 	at java.base/java.lang.Thread.run(Thread.java:844)
   [junit4]   2> 558587 INFO  (jetty-closer-640-thread-1) [    ] o.e.j.s.AbstractConnector Stopped ServerConnector@5d08e5bb{SSL,[ssl, http/1.1]}{127.0.0.1:0}
   [junit4]   2> 558587 INFO  (jetty-closer-640-thread-2) [    ] o.e.j.s.AbstractConnector Stopped ServerConnector@58b9ab8f{SSL,[ssl, http/1.1]}{127.0.0.1:0}
   [junit4]   2> 558587 INFO  (jetty-closer-640-thread-1) [    ] o.a.s.c.CoreContainer Shutting down CoreContainer instance=852120590
   [junit4]   2> 558587 INFO  (jetty-closer-640-thread-2) [    ] o.a.s.c.CoreContainer Shutting down CoreContainer instance=408904923
   [junit4]   2> 558587 INFO  (jetty-closer-640-thread-1) [    ] o.a.s.m.SolrMetricManager Closing metric reporters for registry=solr.node, tag=null
   [junit4]   2> 558587 INFO  (jetty-closer-640-thread-2) [    ] o.a.s.m.SolrMetricManager Closing metric reporters for registry=solr.node, tag=null
   [junit4]   2> 558587 INFO  (jetty-closer-640-thread-1) [    ] o.a.s.m.r.SolrJmxReporter Closing reporter [org.apache.solr.metrics.reporters.SolrJmxReporter@2f9b91a7: rootName = solr_43469, domain = solr.node, service url = null, agent id = null] for registry solr.node / com.codahale.metrics.MetricRegistry@2eae5e6e
   [junit4]   2> 558587 INFO  (jetty-closer-640-thread-2) [    ] o.a.s.m.r.SolrJmxReporter Closing reporter [org.apache.solr.metrics.reporters.SolrJmxReporter@49964930: rootName = solr_33563, domain = solr.node, service url = null, agent id = null] for registry solr.node / com.codahale.metrics.MetricRegistry@73d28b46
   [junit4]   2> 558590 INFO  (jetty-closer-640-thread-1) [    ] o.a.s.m.SolrMetricManager Closing metric reporters for registry=solr.jvm, tag=null
   [junit4]   2> 558590 INFO  (jetty-closer-640-thread-1) [    ] o.a.s.m.r.SolrJmxReporter Closing reporter [org.apache.solr.metrics.reporters.SolrJmxReporter@2fab1638: rootName = solr_43469, domain = solr.jvm, service url = null, agent id = null] for registry solr.jvm / com.codahale.metrics.MetricRegistry@1c73fe3a
   [junit4]   2> 558590 INFO  (jetty-closer-640-thread-2) [    ] o.a.s.m.SolrMetricManager Closing metric reporters for registry=solr.jvm, tag=null
   [junit4]   2> 558590 INFO  (jetty-closer-640-thread-2) [    ] o.a.s.m.r.SolrJmxReporter Closing reporter [org.apache.solr.metrics.reporters.SolrJmxReporter@76b68e66: rootName = solr_33563, domain = solr.jvm, service url = null, agent id = null] for registry solr.jvm / com.codahale.metrics.MetricRegistry@1c73fe3a
   [junit4]   2> 558592 INFO  (jetty-closer-640-thread-1) [    ] o.a.s.m.SolrMetricManager Closing metric reporters for registry=solr.jetty, tag=null
   [junit4]   2> 558592 INFO  (jetty-closer-640-thread-1) [    ] o.a.s.m.r.SolrJmxReporter Closing reporter [org.apache.solr.metrics.reporters.SolrJmxReporter@1cd59b75: rootName = solr_43469, domain = solr.jetty, service url = null, agent id = null] for registry solr.jetty / com.codahale.metrics.MetricRegistry@64f5b44e
   [junit4]   2> 558592 INFO  (jetty-closer-640-thread-2) [    ] o.a.s.m.SolrMetricManager Closing metric reporters for registry=solr.jetty, tag=null
   [junit4]   2> 558592 INFO  (jetty-closer-640-thread-2) [    ] o.a.s.m.r.SolrJmxReporter Closing reporter [org.apache.solr.metrics.reporters.SolrJmxReporter@69dfbe28: rootName = solr_33563, domain = solr.jetty, service url = null, agent id = null] for registry solr.jetty / com.codahale.metrics.MetricRegistry@64f5b44e
   [junit4]   2> 558593 INFO  (jetty-closer-640-thread-1) [    ] o.a.s.c.ZkController Remove node as live in ZooKeeper:/live_nodes/127.0.0.1:43469_solr
   [junit4]   2> 558593 INFO  (jetty-closer-640-thread-2) [    ] o.a.s.c.ZkController Remove node as live in ZooKeeper:/live_nodes/127.0.0.1:33563_solr
   [junit4]   2> 558593 INFO  (jetty-closer-640-thread-1) [    ] o.a.s.m.SolrMetricManager Closing metric reporters for registry=solr.cluster, tag=null
   [junit4]   2> 558593 INFO  (jetty-closer-640-thread-2) [    ] o.a.s.m.SolrMetricManager Closing metric reporters for registry=solr.cluster, tag=null
   [junit4]   2> 558593 INFO  (jetty-closer-640-thread-1) [    ] o.a.s.c.TransientSolrCoreCacheDefault Allocating transient cache for 2147483647 transient cores
   [junit4]   2> 558593 INFO  (zkCallback-657-thread-1-processing-n:127.0.0.1:43469_solr) [n:127.0.0.1:43469_solr    ] o.a.s.c.c.ZkStateReader Updated live nodes from ZooKeeper... (2) -> (0)
   [junit4]   2> 558593 INFO  (jetty-closer-640-thread-2) [    ] o.a.s.c.TransientSolrCoreCacheDefault Allocating transient cache for 2147483647 transient cores
   [junit4]   2> 558593 INFO  (jetty-closer-640-thread-2) [    ] o.a.s.c.Overseer Overseer (id=99223718157680645-127.0.0.1:33563_solr-n_0000000000) closing
   [junit4]   2> 558593 INFO  (zkCallback-655-thread-1-processing-n:127.0.0.1:33563_solr) [n:127.0.0.1:33563_solr    ] o.a.s.c.c.ZkStateReader Updated live nodes from ZooKeeper... (2) -> (0)
   [junit4]   2> 558593 INFO  (OverseerStateUpdate-99223718157680645-127.0.0.1:33563_solr-n_0000000000) [n:127.0.0.1:33563_solr    ] o.a.s.c.Overseer Overseer Loop exiting : 127.0.0.1:33563_solr
   [junit4]   2> 558593 WARN  (zkCallback-657-thread-1-processing-n:127.0.0.1:43469_solr) [n:127.0.0.1:43469_solr    ] o.a.s.c.ZkController Unable to register nodeLost path for 127.0.0.1:33563_solr
   [junit4]   2> org.apache.zookeeper.KeeperException$SessionExpiredException: KeeperErrorCode = Session expired for /autoscaling/nodeLost/127.0.0.1:33563_solr
   [junit4]   2> 	at org.apache.zookeeper.KeeperException.create(KeeperException.java:127)
   [junit4]   2> 	at org.apache.zookeeper.KeeperException.create(KeeperException.java:51)
   [junit4]   2> 	at org.apache.zookeeper.ZooKeeper.create(ZooKeeper.java:783)
   [junit4]   2> 	at org.apache.solr.common.cloud.SolrZkClient.lambda$create$7(SolrZkClient.java:364)
   [junit4]   2> 	at org.apache.solr.common.cloud.ZkCmdExecutor.retryOperation(ZkCmdExecutor.java:60)
   [junit4]   2> 	at org.apache.solr.common.cloud.SolrZkClient.create(SolrZkClient.java:364)
   [junit4]   2> 	at org.apache.solr.cloud.ZkController.lambda$registerLiveNodesListener$2(ZkController.java:879)
   [junit4]   2> 	at org.apache.solr.common.cloud.ZkStateReader.lambda$refreshLiveNodes$1(ZkStateReader.java:704)
   [junit4]   2> 	at java.base/java.util.concurrent.ConcurrentHashMap$KeySetView.forEach(ConcurrentHashMap.java:4724)
   [junit4]   2> 	at org.apache.solr.common.cloud.ZkStateReader.refreshLiveNodes(ZkStateReader.java:703)
   [junit4]   2> 	at org.apache.solr.common.cloud.ZkStateReader.access$900(ZkStateReader.java:72)
   [junit4]   2> 	at org.apache.solr.common.cloud.ZkStateReader$LiveNodeWatcher.refreshAndWatch(ZkStateReader.java:1090)
   [junit4]   2> 	at org.apache.solr.common.cloud.ZkStateReader$LiveNodeWatcher.process(ZkStateReader.java:1085)
   [junit4]   2> 	at org.apache.solr.common.cloud.SolrZkClient$1.lambda$process$1(SolrZkClient.java:268)
   [junit4]   2> 	at java.base/java.util.concurrent.Executors$RunnableAdapter.call(Executors.java:514)
   [junit4]   2> 	at java.base/java.util.concurrent.FutureTask.run(FutureTask.java:264)
   [junit4]   2> 	at org.apache.solr.common.util.ExecutorUtil$MDCAwareThreadPoolExecutor.lambda$execute$0(ExecutorUtil.java:188)
   [junit4]   2> 	at java.base/java.util.concurrent.ThreadPoolExecutor.runWorker(ThreadPoolExecutor.java:1167)
   [junit4]   2> 	at java.base/java.util.concurrent.ThreadPoolExecutor$Worker.run(ThreadPoolExecutor.java:641)
   [junit4]   2> 	at java.base/java.lang.Thread.run(Thread.java:844)
   [junit4]   2> 558594 WARN  (OverseerAutoScalingTriggerThread-99223718157680645-127.0.0.1:33563_solr-n_0000000000) [n:127.0.0.1:33563_solr    ] o.a.s.c.a.OverseerTriggerThread OverseerTriggerThread woken up but we are closed, exiting.
   [junit4]   2> 558594 WARN  (zkCallback-657-thread-1-processing-n:127.0.0.1:43469_solr) [n:127.0.0.1:43469_solr    ] o.a.s.c.ZkController Unable to register nodeLost path for 127.0.0.1:43469_solr
   [junit4]   2> org.apache.zookeeper.KeeperException$SessionExpiredException: KeeperErrorCode = Session expired for /autoscaling/nodeLost/127.0.0.1:43469_solr
   [junit4]   2> 	at org.apache.zookeeper.KeeperException.create(KeeperException.java:127)
   [junit4]   2> 	at org.apache.zookeeper.KeeperException.create(KeeperException.java:51)
   [junit4]   2> 	at org.apache.zookeeper.ZooKeeper.create(ZooKeeper.java:783)
   [junit4]   2> 	at org.apache.solr.common.cloud.SolrZkClient.lambda$create$7(SolrZkClient.java:364)
   [junit4]   2> 	at org.apache.solr.common.cloud.ZkCmdExecutor.retryOperation(ZkCmdExecutor.java:60)
   [junit4]   2> 	at org.apache.solr.common.cloud.SolrZkClient.create(SolrZkClient.java:364)
   [junit4]   2> 	at org.apache.solr.cloud.ZkController.lambda$registerLiveNodesListener$2(ZkController.java:879)
   [junit4]   2> 	at org.apache.solr.common.cloud.ZkStateReader.lambda$refreshLiveNodes$1(ZkStateReader.java:704)
   [junit4]   2> 	at java.base/java.util.concurrent.ConcurrentHashMap$KeySetView.forEach(ConcurrentHashMap.java:4724)
   [junit4]   2> 	at org.apache.solr.common.cloud.ZkStateReader.refreshLiveNodes(ZkStateReader.java:703)
   [junit4]   2> 	at org.apache.solr.common.cloud.ZkStateReader.access$900(ZkStateReader.java:72)
   [junit4]   2> 	at org.apache.solr.common.cloud.ZkStateReader$LiveNodeWatcher.refreshAndWatch(ZkStateReader.java:1090)
   [junit4]   2> 	at org.apache.solr.common.cloud.ZkStateReader$LiveNodeWatcher.process(ZkStateReader.java:1085)
   [junit4]   2> 	at org.apache.solr.common.cloud.SolrZkClient$1.lambda$process$1(SolrZkClient.java:268)
   [junit4]   2> 	at java.base/java.util.concurrent.Executors$RunnableAdapter.call(Executors.java:514)
   [junit4]   2> 	at java.base/java.util.concurrent.FutureTask.run(FutureTask.java:264)
   [junit4]   2> 	at org.apache.solr.common.util.ExecutorUtil$MDCAwareThreadPoolExecutor.lambda$execute$0(ExecutorUtil.java:188)
   [junit4]   2> 	at java.base/java.util.concurrent.ThreadPoolExecutor.runWorker(ThreadPoolExecutor.java:1167)
   [junit4]   2> 	at java.base/java.util.concurrent.ThreadPoolExecutor$Worker.run(ThreadPoolExecutor.java:641)
   [junit4]   2> 	at java.base/java.lang.Thread.run(Thread.java:844)
   [junit4]   2> 558594 INFO  (jetty-closer-640-thread-2) [    ] o.e.j.s.h.ContextHandler Stopped o.e.j.s.ServletContextHandler@2e701c0f{/solr,null,UNAVAILABLE}
   [junit4]   2> 558594 INFO  (jetty-closer-640-thread-1) [    ] o.e.j.s.h.ContextHandler Stopped o.e.j.s.ServletContextHandler@8e272e3{/solr,null,UNAVAILABLE}
   [junit4]   2> 558595 ERROR (SUITE-TestLocalFSCloudBackupRestore-seed#[A89DADC6250C1B18]-worker) [    ] o.a.z.s.ZooKeeperServer ZKShutdownHandler is not registered, so ZooKeeper server won't take any action on ERROR or SHUTDOWN server state changes
   [junit4]   2> 558595 INFO  (SUITE-TestLocalFSCloudBackupRestore-seed#[A89DADC6250C1B18]-worker) [    ] o.a.s.c.ZkTestServer connecting to 127.0.0.1:46667 46667
   [junit4]   2> 562642 INFO  (Thread-1071) [    ] o.a.s.c.ZkTestServer connecting to 127.0.0.1:46667 46667
   [junit4]   2> 562643 WARN  (Thread-1071) [    ] o.a.s.c.ZkTestServer Watch limit violations: 
   [junit4]   2> Maximum concurrent create/delete watches above limit:
   [junit4]   2> 
   [junit4]   2> 	3	/solr/aliases.json
   [junit4]   2> 	2	/solr/security.json
   [junit4]   2> 
   [junit4]   2> Maximum concurrent data watches above limit:
   [junit4]   2> 
   [junit4]   2> 	3	/solr/clusterstate.json
   [junit4]   2> 	3	/solr/clusterprops.json
   [junit4]   2> 
   [junit4]   2> Maximum concurrent children watches above limit:
   [junit4]   2> 
   [junit4]   2> 	3	/solr/live_nodes
   [junit4]   2> 	3	/solr/collections
   [junit4]   2> 
   [junit4]   2> NOTE: leaving temporary files on disk at: /home/jenkins/workspace/Lucene-Solr-7.x-Linux/solr/build/solr-core/test/J0/temp/solr.cloud.TestLocalFSCloudBackupRestore_A89DADC6250C1B18-001
   [junit4]   2> NOTE: test params are: codec=Lucene70, sim=RandomSimilarity(queryNorm=true): {}, locale=rn, timezone=NST
   [junit4]   2> NOTE: Linux 4.10.0-40-generic amd64/Oracle Corporation 9.0.1 (64-bit)/cpus=8,threads=1,free=149492800,total=525860864
   [junit4]   2> NOTE: All tests run in this JVM: [DistributedQueueTest, SolrPluginUtilsTest, HdfsLockFactoryTest, TestConfigsApi, TestMacros, TestSolrCloudWithHadoopAuthPlugin, AnalysisAfterCoreReloadTest, TestPHPSerializedResponseWriter, ClassificationUpdateProcessorTest, SpatialFilterTest, TestDynamicFieldResource, SolrMetricReporterTest, DateMathParserTest, TestJsonFacetRefinement, TestOverriddenPrefixQueryForCustomFieldType, OverseerModifyCollectionTest, HdfsNNFailoverTest, TestManagedResource, TestRandomFaceting, SimpleFacetsTest, RAMDirectoryFactoryTest, CloudMLTQParserTest, TestJoin, TestRecovery, TestCSVLoader, ExternalFileFieldSortTest, TestSQLHandlerNonCloud, RestartWhileUpdatingTest, TestIntervalFaceting, TestTrackingShardHandlerFactory, TestMultiValuedNumericRangeQuery, ConnectionManagerTest, DocValuesTest, TestMergePolicyConfig, QueryParsingTest, SearchHandlerTest, UpdateRequestProcessorFactoryTest, RemoteQueryErrorTest, TestLargeCluster, TestStressCloudBlindAtomicUpdates, TestMissingGroups, TestUpdate, TestNumericTerms32, AutoAddReplicasPlanActionTest, JsonLoaderTest, TestFieldCacheVsDocValues, TestDFRSimilarityFactory, TestGeoJSONResponseWriter, TestDistributedSearch, ReplicaListTransformerTest, ResponseHeaderTest, QueryResultKeyTest, TestAnalyzeInfixSuggestions, HLLUtilTest, TestPushWriter, HdfsChaosMonkeyNothingIsSafeTest, TestXmlQParser, BasicZkTest, CollectionsAPISolrJTest, TestInitQParser, TestBulkSchemaAPI, DirectoryFactoryTest, SolrSlf4jReporterTest, TestReRankQParserPlugin, TestPhraseSuggestions, StatelessScriptUpdateProcessorFactoryTest, TestSolrIndexConfig, TestFilteredDocIdSet, TestLocalFSCloudBackupRestore]
   [junit4] Completed [134/764 (1!)] on J0 in 34.39s, 1 test, 1 error <<< FAILURES!

[...truncated 380 lines...]
   [junit4] Suite: org.apache.solr.core.TestDynamicLoading
   [junit4]   2> 555537 INFO  (SUITE-TestDynamicLoading-seed#[A89DADC6250C1B18]-worker) [    ] o.a.s.SolrTestCaseJ4 SecureRandom sanity checks: test.solr.allowed.securerandom=null & java.security.egd=file:/dev/./urandom
   [junit4]   2> Creating dataDir: /home/jenkins/workspace/Lucene-Solr-7.x-Linux/solr/build/solr-core/test/J2/temp/solr.core.TestDynamicLoading_A89DADC6250C1B18-001/init-core-data-001
   [junit4]   2> 555537 INFO  (SUITE-TestDynamicLoading-seed#[A89DADC6250C1B18]-worker) [    ] o.a.s.SolrTestCaseJ4 Using PointFields (NUMERIC_POINTS_SYSPROP=true) w/NUMERIC_DOCVALUES_SYSPROP=false
   [junit4]   2> 555537 INFO  (SUITE-TestDynamicLoading-seed#[A89DADC6250C1B18]-worker) [    ] o.a.s.SolrTestCaseJ4 Randomized ssl (false) and clientAuth (false) via: @org.apache.solr.util.RandomizeSSL(reason="", ssl=0.0/0.0, value=0.0/0.0, clientAuth=0.0/0.0)
   [junit4]   2> 555538 INFO  (SUITE-TestDynamicLoading-seed#[A89DADC6250C1B18]-worker) [    ] o.a.s.BaseDistributedSearchTestCase Setting hostContext system property: /
   [junit4]   2> 555539 INFO  (TEST-TestDynamicLoading.testDynamicLoading-seed#[A89DADC6250C1B18]) [    ] o.a.s.c.ZkTestServer STARTING ZK TEST SERVER
   [junit4]   2> 555539 INFO  (Thread-3505) [    ] o.a.s.c.ZkTestServer client port:0.0.0.0/0.0.0.0:0
   [junit4]   2> 555539 INFO  (Thread-3505) [    ] o.a.s.c.ZkTestServer Starting server
   [junit4]   2> 555540 ERROR (Thread-3505) [    ] o.a.z.s.ZooKeeperServer ZKShutdownHandler is not registered, so ZooKeeper server won't take any action on ERROR or SHUTDOWN server state changes
   [junit4]   2> 555639 INFO  (TEST-TestDynamicLoading.testDynamicLoading-seed#[A89DADC6250C1B18]) [    ] o.a.s.c.ZkTestServer start zk server on port:46677
   [junit4]   2> 555640 INFO  (zkConnectionManagerCallback-632-thread-1) [    ] o.a.s.c.c.ConnectionManager zkClient has connected
   [junit4]   2> 555642 INFO  (zkConnectionManagerCallback-634-thread-1) [    ] o.a.s.c.c.ConnectionManager zkClient has connected
   [junit4]   2> 555643 INFO  (TEST-TestDynamicLoading.testDynamicLoading-seed#[A89DADC6250C1B18]) [    ] o.a.s.c.AbstractZkTestCase put /home/jenkins/workspace/Lucene-Solr-7.x-Linux/solr/core/src/test-files/solr/collection1/conf/solrconfig-tlog.xml to /configs/conf1/solrconfig.xml
   [junit4]   2> 555644 INFO  (TEST-TestDynamicLoading.testDynamicLoading-seed#[A89DADC6250C1B18]) [    ] o.a.s.c.AbstractZkTestCase put /home/jenkins/workspace/Lucene-Solr-7.x-Linux/solr/core/src/test-files/solr/collection1/conf/schema.xml to /configs/conf1/schema.xml
   [junit4]   2> 555645 INFO  (TEST-TestDynamicLoading.testDynamicLoading-seed#[A89DADC6250C1B18]) [    ] o.a.s.c.AbstractZkTestCase put /home/jenkins/workspace/Lucene-Solr-7.x-Linux/solr/core/src/test-files/solr/collection1/conf/solrconfig.snippet.randomindexconfig.xml to /configs/conf1/solrconfig.snippet.randomindexconfig.xml
   [junit4]   2> 555645 INFO  (TEST-TestDynamicLoading.testDynamicLoading-seed#[A89DADC6250C1B18]) [    ] o.a.s.c.AbstractZkTestCase put /home/jenkins/workspace/Lucene-Solr-7.x-Linux/solr/core/src/test-files/solr/collection1/conf/stopwords.txt to /configs/conf1/stopwords.txt
   [junit4]   2> 555645 INFO  (TEST-TestDynamicLoading.testDynamicLoading-seed#[A89DADC6250C1B18]) [    ] o.a.s.c.AbstractZkTestCase put /home/jenkins/workspace/Lucene-Solr-7.x-Linux/solr/core/src/test-files/solr/collection1/conf/protwords.txt to /configs/conf1/protwords.txt
   [junit4]   2> 555646 INFO  (TEST-TestDynamicLoading.testDynamicLoading-seed#[A89DADC6250C1B18]) [    ] o.a.s.c.AbstractZkTestCase put /home/jenkins/workspace/Lucene-Solr-7.x-Linux/solr/core/src/test-files/solr/collection1/conf/currency.xml to /configs/conf1/currency.xml
   [junit4]   2> 555646 INFO  (TEST-TestDynamicLoading.testDynamicLoading-seed#[A89DADC6250C1B18]) [    ] o.a.s.c.AbstractZkTestCase put /home/jenkins/workspace/Lucene-Solr-7.x-Linux/solr/core/src/test-files/solr/collection1/conf/enumsConfig.xml to /configs/conf1/enumsConfig.xml
   [junit4]   2> 555646 INFO  (TEST-TestDynamicLoading.testDynamicLoading-seed#[A89DADC6250C1B18]) [    ] o.a.s.c.AbstractZkTestCase put /home/jenkins/workspace/Lucene-Solr-7.x-Linux/solr/core/src/test-files/solr/collection1/conf/open-exchange-rates.json to /configs/conf1/open-exchange-rates.json
   [junit4]   2> 555647 INFO  (TEST-TestDynamicLoading.testDynamicLoading-seed#[A89DADC6250C1B18]) [    ] o.a.s.c.AbstractZkTestCase put /home/jenkins/workspace/Lucene-Solr-7.x-Linux/solr/core/src/test-files/solr/collection1/conf/mapping-ISOLatin1Accent.txt to /configs/conf1/mapping-ISOLatin1Accent.txt
   [junit4]   2> 555647 INFO  (TEST-TestDynamicLoading.testDynamicLoading-seed#[A89DADC6250C1B18]) [    ] o.a.s.c.AbstractZkTestCase put /home/jenkins/workspace/Lucene-Solr-7.x-Linux/solr/core/src/test-files/solr/collection1/conf/old_synonyms.txt to /configs/conf1/old_synonyms.txt
   [junit4]   2> 555647 INFO  (TEST-TestDynamicLoading.testDynamicLoading-seed#[A89DADC6250C1B18]) [    ] o.a.s.c.AbstractZkTestCase put /home/jenkins/workspace/Lucene-Solr-7.x-Linux/solr/core/src/test-files/solr/collection1/conf/synonyms.txt to /configs/conf1/synonyms.txt
   [junit4]   2> 555648 INFO  (TEST-TestDynamicLoading.testDynamicLoading-seed#[A89DADC6250C1B18]) [    ] o.a.s.c.AbstractFullDistribZkTestBase Will use NRT replicas unless explicitly asked otherwise
   [junit4]   2> 555716 INFO  (TEST-TestDynamicLoading.testDynamicLoading-seed#[A89DADC6250C1B18]) [    ] o.e.j.s.Server jetty-9.3.20.v20170531
   [junit4]   2> 555717 INFO  (TEST-TestDynamicLoading.testDynamicLoading-seed#[A89DADC6250C1B18]) [    ] o.e.j.s.h.ContextHandler Started o.e.j.s.ServletContextHandler@917b7a4{/,null,AVAILABLE}
   [junit4]   2> 555718 INFO  (TEST-TestDynamicLoading.testDynamicLoading-seed#[A89DADC6250C1B18]) [    ] o.e.j.s.AbstractConnector Started ServerConnector@5d5efd5e{HTTP/1.1,[http/1.1]}{127.0.0.1:44563}
   [junit4]   2> 555718 INFO  (TEST-TestDynamicLoading.testDynamicLoading-seed#[A89DADC6250C1B18]) [    ] o.e.j.s.Server Started @557319ms
   [junit4]   2> 555718 INFO  (TEST-TestDynamicLoading.testDynamicLoading-seed#[A89DADC6250C1B18]) [    ] o.a.s.c.s.e.JettySolrRunner Jetty properties: {hostContext=/, solr.data.dir=/home/jenkins/workspace/Lucene-Solr-7.x-Linux/solr/build/solr-core/test/J2/temp/solr.core.TestDynamicLoading_A89DADC6250C1B18-001/tempDir-001/control/data, hostPort=44563, coreRootDirectory=/home/jenkins/workspace/Lucene-Solr-7.x-Linux/solr/build/solr-core/test/J2/temp/solr.core.TestDynamicLoading_A89DADC6250C1B18-001/control-001/cores}
   [junit4]   2> 555718 ERROR (TEST-TestDynamicLoading.testDynamicLoading-seed#[A89DADC6250C1B18]) [    ] o.a.s.u.StartupLoggingUtils Missing Java Option solr.log.dir. Logging may be missing or incomplete.
   [junit4]   2> 555718 INFO  (TEST-TestDynamicLoading.testDynamicLoading-seed#[A89DADC6250C1B18]) [    ] o.a.s.s.SolrDispatchFilter  ___      _       Welcome to Apache Solr™ version 7.3.0
   [junit4]   2> 555719 INFO  (TEST-TestDynamicLoading.testDynamicLoading-seed#[A89DADC6250C1B18]) [    ] o.a.s.s.SolrDispatchFilter / __| ___| |_ _   Starting in cloud mode on port null
   [junit4]   2> 555719 INFO  (TEST-TestDynamicLoading.testDynamicLoading-seed#[A89DADC6250C1B18]) [    ] o.a.s.s.SolrDispatchFilter \__ \/ _ \ | '_|  Install dir: null
   [junit4]   2> 555719 INFO  (TEST-TestDynamicLoading.testDynamicLoading-seed#[A89DADC6250C1B18]) [    ] o.a.s.s.SolrDispatchFilter |___/\___/_|_|    Start time: 2017-12-23T12:56:52.759051Z
   [junit4]   2> 555720 INFO  (zkConnectionManagerCallback-636-thread-1) [    ] o.a.s.c.c.ConnectionManager zkClient has connected
   [junit4]   2> 555720 INFO  (TEST-TestDynamicLoading.testDynamicLoading-seed#[A89DADC6250C1B18]) [    ] o.a.s.s.SolrDispatchFilter Loading solr.xml from SolrHome (not found in ZooKeeper)
   [junit4]   2> 555720 INFO  (TEST-TestDynamicLoading.testDynamicLoading-seed#[A89DADC6250C1B18]) [    ] o.a.s.c.SolrXmlConfig Loading container configuration from /home/jenkins/workspace/Lucene-Solr-7.x-Linux/solr/build/solr-core/test/J2/temp/solr.core.TestDynamicLoading_A89DADC6250C1B18-001/control-001/solr.xml
   [junit4]   2> 555722 INFO  (TEST-TestDynamicLoading.testDynamicLoading-seed#[A89DADC6250C1B18]) [    ] o.a.s.c.SolrXmlConfig Configuration parameter autoReplicaFailoverWorkLoopDelay is ignored
   [junit4]   2> 555722 INFO  (TEST-TestDynamicLoading.testDynamicLoading-seed#[A89DADC6250C1B18]) [    ] o.a.s.c.SolrXmlConfig Configuration parameter autoReplicaFailoverBadNodeExpiration is ignored
   [junit4]   2> 555722 INFO  (TEST-TestDynamicLoading.testDynamicLoading-seed#[A89DADC6250C1B18]) [    ] o.a.s.c.SolrXmlConfig MBean server found: com.sun.jmx.mbeanserver.JmxMBeanServer@485c265, but no JMX reporters were configured - adding default JMX reporter.
   [junit4]   2> 555724 INFO  (TEST-TestDynamicLoading.testDynamicLoading-seed#[A89DADC6250C1B18]) [    ] o.a.s.c.ZkContainer Zookeeper client=127.0.0.1:46677/solr
   [junit4]   2> 555724 INFO  (zkConnectionManagerCallback-640-thread-1) [    ] o.a.s.c.c.ConnectionManager zkClient has connected
   [junit4]   2> 555726 INFO  (zkConnectionManagerCallback-642-thread-1-processing-n:127.0.0.1:44563_) [n:127.0.0.1:44563_    ] o.a.s.c.c.ConnectionManager zkClient has connected
   [junit4]   2> 555750 INFO  (TEST-TestDynamicLoading.testDynamicLoading-seed#[A89DADC6250C1B18]) [n:127.0.0.1:44563_    ] o.a.s.c.Overseer Overseer (id=null) closing
   [junit4]   2> 555750 INFO  (TEST-TestDynamicLoading.testDynamicLoading-seed#[A89DADC6250C1B18]) [n:127.0.0.1:44563_    ] o.a.s.c.OverseerElectionContext I am going to be the leader 127.0.0.1:44563_
   [junit4]   2> 555750 INFO  (TEST-TestDynamicLoading.testDynamicLoading-seed#[A89DADC6250C1B18]) [n:127.0.0.1:44563_    ] o.a.s.c.Overseer Overseer (id=99223719941242884-127.0.0.1:44563_-n_0000000000) starting
   [junit4]   2> 555753 INFO  (TEST-TestDynamicLoading.testDynamicLoading-seed#[A89DADC6250C1B18]) [n:127.0.0.1:44563_    ] o.a.s.c.ZkController Register node as live in ZooKeeper:/live_nodes/127.0.0.1:44563_
   [junit4]   2> 555753 INFO  (OverseerStateUpdate-99223719941242884-127.0.0.1:44563_-n_0000000000) [n:127.0.0.1:44563_    ] o.a.s.c.c.ZkStateReader Updated live nodes from ZooKeeper... (0) -> (1)
   [junit4]   2> 555783 INFO  (TEST-TestDynamicLoading.testDynamicLoading-seed#[A89DADC6250C1B18]) [n:127.0.0.1:44563_    ] o.a.s.m.r.SolrJmxReporter JMX monitoring for 'solr.node' (registry 'solr.node') enabled at server: com.sun.jmx.mbeanserver.JmxMBeanServer@485c265
   [junit4]   2> 555788 INFO  (TEST-TestDynamicLoading.testDynamicLoading-seed#[A89DADC6250C1B18]) [n:127.0.0.1:44563_    ] o.a.s.m.r.SolrJmxReporter JMX monitoring for 'solr.jvm' (registry 'solr.jvm') enabled at server: com.sun.jmx.mbeanserver.JmxMBeanServer@485c265
   [junit4]   2> 555789 INFO  (TEST-TestDynamicLoading.testDynamicLoading-seed#[A89DADC6250C1B18]) [n:127.0.0.1:44563_    ] o.a.s.m.r.SolrJmxReporter JMX monitoring for 'solr.jetty' (registry 'solr.jetty') enabled at server: com.sun.jmx.mbeanserver.JmxMBeanServer@485c265
   [junit4]   2> 555789 INFO  (TEST-TestDynamicLoading.testDynamicLoading-seed#[A89DADC6250C1B18]) [n:127.0.0.1:44563_    ] o.a.s.c.CorePropertiesLocator Found 0 core definitions underneath /home/jenkins/workspace/Lucene-Solr-7.x-Linux/solr/build/solr-core/test/J2/temp/solr.core.TestDynamicLoading_A89DADC6250C1B18-001/control-001/cores
   [junit4]   2> 555800 INFO  (zkConnectionManagerCallback-648-thread-1) [    ] o.a.s.c.c.ConnectionManager zkClient has connected
   [junit4]   2> 555801 INFO  (TEST-TestDynamicLoading.testDynamicLoading-seed#[A89DADC6250C1B18]) [    ] o.a.s.c.c.ZkStateReader Updated live nodes from ZooKeeper... (0) -> (1)
   [junit4]   2> 555801 INFO  (TEST-TestDynamicLoading.testDynamicLoading-seed#[A89DADC6250C1B18]) [    ] o.a.s.c.s.i.ZkClientClusterStateProvider Cluster at 127.0.0.1:46677/solr ready
   [junit4]   2> 555804 INFO  (qtp1218325303-6083) [n:127.0.0.1:44563_    ] o.a.s.h.a.CollectionsHandler Invoked Collection Action :create with params replicationFactor=1&collection.configName=conf1&name=control_collection&nrtReplicas=1&action=CREATE&numShards=1&createNodeSet=127.0.0.1:44563_&wt=javabin&version=2 and sendToOCPQueue=true
   [junit4]   2> 555805 INFO  (OverseerThreadFactory-1465-thread-1-processing-n:127.0.0.1:44563_) [n:127.0.0.1:44563_    ] o.a.s.c.CreateCollectionCmd Create collection control_collection
   [junit4]   2> 555908 INFO  (qtp1218325303-6085) [n:127.0.0.1:44563_    ] o.a.s.h.a.CoreAdminOperation core create command qt=/admin/cores&collection.configName=conf1&newCollection=true&name=control_collection_shard1_replica_n1&action=CREATE&numShards=1&collection=control_collection&shard=shard1&wt=javabin&version=2&replicaType=NRT
   [junit4]   2> 555909 INFO  (qtp1218325303-6085) [n:127.0.0.1:44563_    ] o.a.s.c.TransientSolrCoreCacheDefault Allocating transient cache for 4 transient cores
   [junit4]   2> 556012 INFO  (zkCallback-641-thread-1-processing-n:127.0.0.1:44563_) [n:127.0.0.1:44563_    ] o.a.s.c.c.ZkStateReader A cluster state change: [WatchedEvent state:SyncConnected type:NodeDataChanged path:/collections/control_collection/state.json] for collection [control_collection] has occurred - updating... (live nodes size: [1])
   [junit4]   2> 556925 INFO  (qtp1218325303-6085) [n:127.0.0.1:44563_ c:control_collection s:shard1  x:control_collection_shard1_replica_n1] o.a.s.c.SolrConfig Using Lucene MatchVersion: 7.3.0
   [junit4]   2> 556939 INFO  (qtp1218325303-6085) [n:127.0.0.1:44563_ c:control_collection s:shard1  x:control_collection_shard1_replica_n1] o.a.s.s.IndexSchema [control_collection_shard1_replica_n1] Schema name=test
   [junit4]   2> 556991 INFO  (qtp1218325303-6085) [n:127.0.0.1:44563_ c:control_collection s:shard1  x:control_collection_shard1_replica_n1] o.a.s.s.IndexSchema Loaded schema test/1.0 with uniqueid field id
   [junit4]   2> 557000 INFO  (qtp1218325303-6085) [n:127.0.0.1:44563_ c:control_collection s:shard1  x:control_collection_shard1_replica_n1] o.a.s.c.CoreContainer Creating SolrCore 'control_collection_shard1_replica_n1' using configuration from collection control_collection, trusted=true
   [junit4]   2> 557001 INFO  (qtp1218325303-6085) [n:127.0.0.1:44563_ c:control_collection s:shard1  x:control_collection_shard1_replica_n1] o.a.s.m.r.SolrJmxReporter JMX monitoring for 'solr.core.control_collection.shard1.replica_n1' (registry 'solr.core.control_collection.shard1.replica_n1') enabled at server: com.sun.jmx.mbeanserver.JmxMBeanServer@485c265
   [junit4]   2> 557001 INFO  (qtp1218325303-6085) [n:127.0.0.1:44563_ c:control_collection s:shard1  x:control_collection_shard1_replica_n1] o.a.s.c.SolrCore solr.RecoveryStrategy.Builder
   [junit4]   2> 557001 INFO  (qtp1218325303-6085) [n:127.0.0.1:44563_ c:control_collection s:shard1  x:control_collection_shard1_replica_n1] o.a.s.c.SolrCore [[control_collection_shard1_replica_n1] ] Opening new SolrCore at [/home/jenkins/workspace/Lucene-Solr-7.x-Linux/solr/build/solr-core/test/J2/temp/solr.core.TestDynamicLoading_A89DADC6250C1B18-001/control-001/cores/control_collection_shard1_replica_n1], dataDir=[/home/jenkins/workspace/Lucene-Solr-7.x-Linux/solr/build/solr-core/test/J2/temp/solr.core.TestDynamicLoading_A89DADC6250C1B18-001/control-001/cores/control_collection_shard1_replica_n1/data/]
   [junit4]   2> 557003 INFO  (qtp1218325303-6085) [n:127.0.0.1:44563_ c:control_collection s:shard1  x:control_collection_shard1_replica_n1] o.a.s.u.RandomMergePolicy RandomMergePolicy wrapping class org.apache.lucene.index.LogDocMergePolicy: [LogDocMergePolicy: minMergeSize=1000, mergeFactor=7, maxMergeSize=9223372036854775807, maxMergeSizeForForcedMerge=9223372036854775807, calibrateSizeByDeletes=true, maxMergeDocs=2147483647, maxCFSSegmentSizeMB=8.796093022207999E12, noCFSRatio=1.0]
   [junit4]   2> 557005 WARN  (qtp1218325303-6085) [n:127.0.0.1:44563_ c:control_collection s:shard1  x:control_collection_shard1_replica_n1] o.a.s.c.RequestHandlers INVALID paramSet a in requestHandler {type = requestHandler,name = /dump,class = DumpRequestHandler,attributes = {initParams=a, name=/dump, class=DumpRequestHandler},args = {defaults={a=A,b=B}}}
   [junit4]   2> 557027 INFO  (qtp1218325303-6085) [n:127.0.0.1:44563_ c:control_collection s:shard1  x:control_collection_shard1_replica_n1] o.a.s.u.UpdateHandler Using UpdateLog implementation: org.apache.solr.update.UpdateLog
   [junit4]   2> 557027 INFO  (qtp1218325303-6085) [n:127.0.0.1:44563_ c:control_collection s:shard1  x:control_collection_shard1_replica_n1] o.a.s.u.UpdateLog Initializing UpdateLog: dataDir= defaultSyncLevel=FLUSH numRecordsToKeep=100 maxNumLogsToKeep=10 numVersionBuckets=65536
   [junit4]   2> 557028 INFO  (qtp1218325303-6085) [n:127.0.0.1:44563_ c:control_collection s:shard1  x:control_collection_shard1_replica_n1] o.a.s.u.CommitTracker Hard AutoCommit: disabled
   [junit4]   2> 557028 INFO  (qtp1218325303-6085) [n:127.0.0.1:44563_ c:control_collection s:shard1  x:control_collection_shard1_replica_n1] o.a.s.u.CommitTracker Soft AutoCommit: disabled
   [junit4]   2> 557029 INFO  (qtp1218325303-6085) [n:127.0.0.1:44563_ c:control_collection s:shard1  x:control_collection_shard1_replica_n1] o.a.s.u.RandomMergePolicy RandomMergePolicy wrapping class org.apache.lucene.index.LogByteSizeMergePolicy: [LogByteSizeMergePolicy: minMergeSize=1677721, mergeFactor=33, maxMergeSize=2147483648, maxMergeSizeForForcedMerge=9223372036854775807, calibrateSizeByDeletes=true, maxMergeDocs=2147483647, maxCFSSegmentSizeMB=8.796093022207999E12, noCFSRatio=1.0]
   [junit4]   2> 557029 INFO  (qtp1218325303-6085) [n:127.0.0.1:44563_ c:control_collection s:shard1  x:control_collection_shard1_replica_n1] o.a.s.s.SolrIndexSearcher Opening [Searcher@db2fb6b[control_collection_shard1_replica_n1] main]
   [junit4]   2> 557030 INFO  (qtp1218325303-6085) [n:127.0.0.1:44563_ c:control_collection s:shard1  x:control_collection_shard1_replica_n1] o.a.s.r.ManagedResourceStorage Configured ZooKeeperStorageIO with znodeBase: /configs/conf1
   [junit4]   2> 557030 INFO  (qtp1218325303-6085) [n:127.0.0.1:44563_ c:control_collection s:shard1  x:control_collection_shard1_replica_n1] o.a.s.r.ManagedResourceStorage Loaded null at path _rest_managed.json using ZooKeeperStorageIO:path=/configs/conf1
   [junit4]   2> 557031 INFO  (qtp1218325303-6085) [n:127.0.0.1:44563_ c:control_collection s:shard1  x:control_collection_shard1_replica_n1] o.a.s.h.ReplicationHandler Commits will be reserved for 10000ms.
   [junit4]   2> 557031 INFO  (searcherExecutor-1468-thread-1-processing-n:127.0.0.1:44563_ x:control_collection_shard1_replica_n1 s:shard1 c:control_collection) [n:127.0.0.1:44563_ c:control_collection s:shard1  x:control_collection_shard1_replica_n1] o.a.s.c.SolrCore [control_collection_shard1_replica_n1] Registered new searcher Searcher@db2fb6b[control_collection_shard1_replica_n1] main{ExitableDirectoryReader(UninvertingDirectoryReader())}
   [junit4]   2> 557032 INFO  (qtp1218325303-6085) [n:127.0.0.1:44563_ c:control_collection s:shard1  x:control_collection_shard1_replica_n1] o.a.s.u.UpdateLog Could not find max version in index or recent updates, using new clock 1587579520624361472
   [junit4]   2> 557034 INFO  (qtp1218325303-6085) [n:127.0.0.1:44563_ c:control_collection s:shard1  x:control_collection_shard1_replica_n1] o.a.s.c.ShardLeaderElectionContext Enough replicas found to continue.
   [junit4]   2> 557034 INFO  (qtp1218325303-6085) [n:127.0.0.1:44563_ c:control_collection s:shard1  x:control_collection_shard1_replica_n1] o.a.s.c.ShardLeaderElectionContext I may be the new leader - try and sync
   [junit4]   2> 557034 INFO  (qtp1218325303-6085) [n:127.0.0.1:44563_ c:control_collection s:shard1  x:control_collection_shard1_replica_n1] o.a.s.c.SyncStrategy Sync replicas to http://127.0.0.1:44563/control_collection_shard1_replica_n1/
   [junit4]   2> 557034 INFO  (qtp1218325303-6085) [n:127.0.0.1:44563_ c:control_collection s:shard1  x:control_collection_shard1_replica_n1] o.a.s.c.SyncStrategy Sync Success - now sync replicas to me
   [junit4]   2> 557034 INFO  (qtp1218325303-6085) [n:127.0.0.1:44563_ c:control_collection s:shard1  x:control_collection_shard1_replica_n1] o.a.s.c.SyncStrategy http://127.0.0.1:44563/control_collection_shard1_replica_n1/ has no replicas
   [junit4]   2> 557034 INFO  (qtp1218325303-6085) [n:127.0.0.1:44563_ c:control_collection s:shard1  x:control_collection_shard1_replica_n1] o.a.s.c.ShardLeaderElectionContext Found all replicas participating in election, clear LIR
   [junit4]   2> 557036 INFO  (qtp1218325303-6085) [n:127.0.0.1:44563_ c:control_collection s:shard1  x:control_collection_shard1_replica_n1] o.a.s.c.ShardLeaderElectionContext I am the new leader: http://127.0.0.1:44563/control_collection_shard1_replica_n1/ shard1
   [junit4]   2> 615823 INFO  (TEST-TestDynamicLoading.testDynamicLoading-seed#[A89DADC6250C1B18]) [    ] o.a.s.c.ChaosMonkey monkey: stop jetty! 44563
   [junit4]   2> 615823 INFO  (TEST-TestDynamicLoading.testDynamicLoading-seed#[A89DADC6250C1B18]) [    ] o.a.s.c.CoreContainer Shutting down CoreContainer instance=495009492
   [junit4]   2> 615823 INFO  (TEST-TestDynamicLoading.testDynamicLoading-seed#[A89DADC6250C1B18]) [    ] o.a.s.m.SolrMetricManager Closing metric reporters for registry=solr.node, tag=null
   [junit4]   2> 615823 INFO  (TEST-TestDynamicLoading.testDynamicLoading-seed#[A89DADC6250C1B18]) [    ] o.a.s.m.r.SolrJmxReporter Closing reporter [org.apache.solr.metrics.reporters.SolrJmxReporter@4db457e2: rootName = null, domain = solr.node, service url = null, agent id = null] for registry solr.node / com.codahale.metrics.MetricRegistry@2223d0e3
   [junit4]   2> 615826 INFO  (TEST-TestDynamicLoading.testDynamicLoading-seed#[A89DADC6250C1B18]) [    ] o.a.s.m.SolrMetricManager Closing metric reporters for registry=solr.jvm, tag=null
   [junit4]   2> 615826 INFO  (TEST-TestDynamicLoading.testDynamicLoading-seed#[A89DADC6250C1B18]) [    ] o.a.s.m.r.SolrJmxReporter Closing reporter [org.apache.solr.metrics.reporters.SolrJmxReporter@12986914: rootName = null, domain = solr.jvm, service url = null, agent id = null] for registry solr.jvm / com.codahale.metrics.MetricRegistry@43067a64
   [junit4]   2> 615828 INFO  (TEST-TestDynamicLoading.testDynamicLoading-seed#[A89DADC6250C1B18]) [    ] o.a.s.m.SolrMetricManager Closing metric reporters for registry=solr.jetty, tag=null
   [junit4]   2> 615829 INFO  (TEST-TestDynamicLoading.testDynamicLoading-seed#[A89DADC6250C1B18]) [    ] o.a.s.m.r.SolrJmxReporter Closing reporter [org.apache.solr.metrics.reporters.SolrJmxReporter@fb057e7: rootName = null, domain = solr.jetty, service url = null, agent id = null] for registry solr.jetty / com.codahale.metrics.MetricRegistry@29cfac7b
   [junit4]   2> 615829 INFO  (TEST-TestDynamicLoading.testDynamicLoading-seed#[A89DADC6250C1B18]) [    ] o.a.s.c.ZkController Remove node as live in ZooKeeper:/live_nodes/127.0.0.1:44563_
   [junit4]   2> 615830 INFO  (TEST-TestDynamicLoading.testDynamicLoading-seed#[A89DADC6250C1B18]) [    ] o.a.s.m.SolrMetricManager Closing metric reporters for registry=solr.cluster, tag=null
   [junit4]   2> 615830 INFO  (zkCallback-641-thread-2-processing-n:127.0.0.1:44563_) [n:127.0.0.1:44563_    ] o.a.s.c.c.ZkStateReader Updated live nodes from ZooKeeper... (1) -> (0)
   [junit4]   2> 615830 INFO  (coreCloseExecutor-1473-thread-1) [n:127.0.0.1:44563_ c:control_collection s:shard1 r:core_node2 x:control_collection_shard1_replica_n1] o.a.s.c.SolrCore [control_collection_shard1_replica_n1]  CLOSING SolrCore org.apache.solr.core.SolrCore@33f84fa2
   [junit4]   2> 615830 INFO  (coreCloseExecutor-1473-thread-1) [n:127.0.0.1:44563_ c:control_collection s:shard1 r:core_node2 x:control_collection_shard1_replica_n1] o.a.s.m.SolrMetricManager Closing metric reporters for registry=solr.core.control_collection.shard1.replica_n1, tag=871911330
   [junit4]   2> 615830 INFO  (coreCloseExecutor-1473-thread-1) [n:127.0.0.1:44563_ c:control_collection s:shard1 r:core_node2 x:control_collection_shard1_replica_n1] o.a.s.m.r.SolrJmxReporter Closing reporter [org.apache.solr.metrics.reporters.SolrJmxReporter@64fd5f12: rootName = null, domain = solr.core.control_collection.shard1.replica_n1, service url = null, agent id = null] for registry solr.core.control_collection.shard1.replica_n1 / com.codahale.metrics.MetricRegistry@5c7c5ab9
   [junit4]   2> 615841 INFO  (coreCloseExecutor-1473-thread-1) [n:127.0.0.1:44563_ c:control_collection s:shard1 r:core_node2 x:control_collection_shard1_replica_n1] o.a.s.m.SolrMetricManager Closing metric reporters for registry=solr.collection.control_collection.shard1.leader, tag=871911330
   [junit4]   2> 626766 INFO  (ScheduledTrigger-1463-thread-1) [n:127.0.0.1:44563_    ] o.a.s.c.a.SystemLogListener Collection .system does not exist, disabling logging.
   [junit4]   2> 626768 INFO  (AutoscalingActionExecutor-1464-thread-1-processing-n:127.0.0.1:44563_) [n:127.0.0.1:44563_    ] o.a.s.c.s.c.a.PolicyHelper returnSession, curr-time 1735025780 sessionWrapper.createTime 1735025779758812, this.sessionWrapper.createTime 1735025779758812 
   [junit4]   2> 626768 INFO  (AutoscalingActionExecutor-1464-thread-1-processing-n:127.0.0.1:44563_) [n:127.0.0.1:44563_    ] o.a.s.c.a.ExecutePlanAction No operations to execute for event: {
   [junit4]   2>   "id":"629fcd6fd43f0T1ln2012fu8gk96ahnncw1zcro",
   [junit4]   2>   "source":".auto_add_replicas",
   [junit4]   2>   "eventTime":1735015775683568,
   [junit4]   2>   "eventType":"NODELOST",
   [junit4]   2>   "properties":{
   [junit4]   2>     "eventTimes":[1735015775683568],
   [junit4]   2>     "_enqueue_time_":1735025777455995,
   [junit4]   2>     "nodeNames":["127.0.0.1:44563_"]}}
   [junit4]   2> 735806 ERROR (qtp1218325303-6083) [n:127.0.0.1:44563_    ] o.a.s.h.RequestHandlerBase org.apache.solr.common.SolrException: create the collection time out:180s
   [junit4]   2> 	at org.apache.solr.handler.admin.CollectionsHandler.handleResponse(CollectionsHandler.java:314)
   [junit4]   2> 	at org.apache.solr.handler.admin.CollectionsHandler.invokeAction(CollectionsHandler.java:246)
   [junit4]   2> 	at org.apache.solr.handler.admin.CollectionsHandler.handleRequestBody(CollectionsHandler.java:224)
   [junit4]   2> 	at org.apache.solr.handler.RequestHandlerBase.handleRequest(RequestHandlerBase.java:177)
   [junit4]   2> 	at org.apache.solr.servlet.HttpSolrCall.handleAdmin(HttpSolrCall.java:736)
   [junit4]   2> 	at org.apache.solr.servlet.HttpSolrCall.handleAdminRequest(HttpSolrCall.java:717)
   [junit4]   2> 	at org.apache.solr.servlet.HttpSolrCall.call(HttpSolrCall.java:498)
   [junit4]   2> 	at org.apache.solr.servlet.SolrDispatchFilter.doFilter(SolrDispatchFilter.java:382)
   [junit4]   2> 	at org.apache.solr.servlet.SolrDispatchFilter.doFilter(SolrDispatchFilter.java:326)
   [junit4]   2> 	at org.eclipse.jetty.servlet.ServletHandler$CachedChain.doFilter(ServletHandler.java:1759)
   [junit4]   2> 	at org.apache.solr.client.solrj.embedded.JettySolrRunner$DebugFilter.doFilter(JettySolrRunner.java:139)
   [junit4]   2> 	at org.eclipse.jetty.servlet.ServletHandler$CachedChain.doFilter(ServletHandler.java:1759)
   [junit4]   2> 	at org.eclipse.jetty.servlet.ServletHandler.doHandle(ServletHandler.java:582)
   [junit4]   2> 	at org.eclipse.jetty.server.session.SessionHandler.doHandle(SessionHandler.java:224)
   [junit4]   2> 	at org.eclipse.jetty.server.handler.ContextHandler.doHandle(ContextHandler.java:1180)
   [junit4]   2> 	at org.eclipse.jetty.servlet.ServletHandler.doScope(ServletHandler.java:512)
   [junit4]   2> 	at org.eclipse.jetty.server.session.SessionHandler.doScope(SessionHandler.java:185)
   [junit4]   2> 	at org.eclipse.jetty.server.handler.ContextHandler.doScope(ContextHandler.java:1112)
   [junit4]   2> 	at org.eclipse.jetty.server.handler.ScopedHandler.handle(ScopedHandler.java:141)
   [junit4]   2> 	at org.eclipse.jetty.server.handler.gzip.GzipHandler.handle(GzipHandler.java:493)
   [junit4]   2> 	at org.eclipse.jetty.server.handler.HandlerWrapper.handle(HandlerWrapper.java:134)
   [junit4]   2> 	at org.eclipse.jetty.server.Server.handle(Server.java:534)
   [junit4]   2> 	at org.eclipse.jetty.server.HttpChannel.handle(HttpChannel.java:320)
   [junit4]   2> 	at org.eclipse.jetty.server.HttpConnection.onFillable(HttpConnection.java:251)
   [junit4]   2> 	at org.eclipse.jetty.io.AbstractConnection$ReadCallback.succeeded(AbstractConnection.java:283)
   [junit4]   2> 	at org.eclipse.jetty.io.FillInterest.fillable(FillInterest.java:108)
   [junit4]   2> 	at org.eclipse.jetty.io.SelectChannelEndPoint$2.run(SelectChannelEndPoint.java:93)
   [junit4]   2> 	at org.eclipse.jetty.util.thread.strategy.ExecuteProduceConsume.executeProduceConsume(ExecuteProduceConsume.java:303)
   [junit4]   2> 	at org.eclipse.jetty.util.thread.strategy.ExecuteProduceConsume.produceConsume(ExecuteProduceConsume.java:148)
   [junit4]   2> 	at org.eclipse.jetty.util.thread.strategy.ExecuteProduceConsume.run(ExecuteProduceConsume.java:136)
   [junit4]   2> 	at org.eclipse.jetty.util.thread.QueuedThreadPool.runJob(QueuedThreadPool.java:671)
   [junit4]   2> 	at org.eclipse.jetty.util.thread.QueuedThreadPool$2.run(QueuedThreadPool.java:589)
   [junit4]   2> 	at java.base/java.lang.Thread.run(Thread.java:844)
   [junit4]   2> 
   [junit4]   2> 735806 INFO  (qtp1218325303-6083) [n:127.0.0.1:44563_    ] o.a.s.s.HttpSolrCall [admin] webapp=null path=/admin/collections params={replicationFactor=1&collection.configName=conf1&name=control_collection&nrtReplicas=1&action=CREATE&numShards=1&createNodeSet=127.0.0.1:44563_&wt=javabin&version=2} status=500 QTime=180002
   [junit4]   2> 735807 ERROR (qtp1218325303-6083) [n:127.0.0.1:44563_    ] o.a.s.s.HttpSolrCall null:org.apache.solr.common.SolrException: create the collection time out:180s
   [junit4]   2> 	at org.apache.solr.handler.admin.CollectionsHandler.handleResponse(CollectionsHandler.java:314)
   [junit4]   2> 	at org.apache.solr.handler.admin.CollectionsHandler.invokeAction(CollectionsHandler.java:246)
   [junit4]   2> 	at org.apache.solr.handler.admin.CollectionsHandler.handleRequestBody(CollectionsHandler.java:224)
   [junit4]   2> 	at org.apache.solr.handler.RequestHandlerBase.handleRequest(RequestHandlerBase.java:177)
   [junit4]   2> 	at org.apache.solr.servlet.HttpSolrCall.handleAdmin(HttpSolrCall.java:736)
   [junit4]   2> 	at org.apache.solr.servlet.HttpSolrCall.handleAdminRequest(HttpSolrCall.java:717)
   [junit4]   2> 	at org.apache.solr.servlet.HttpSolrCall.call(HttpSolrCall.java:498)
   [junit4]   2> 	at org.apache.solr.servlet.SolrDispatchFilter.doFilter(SolrDispatchFilter.java:382)
   [junit4]   2> 	at org.apache.solr.servlet.SolrDispatchFilter.doFilter(SolrDispatchFilter.java:326)
   [junit4]   2> 	at org.eclipse.jetty.servlet.ServletHandler$CachedChain.doFilter(ServletHandler.java:1759)
   [junit4]   2> 	at org.apache.solr.client.solrj.embedded.JettySolrRunner$DebugFilter.doFilter(JettySolrRunner.java:139)
   [junit4]   2> 	at org.eclipse.jetty.servlet.ServletHandler$CachedChain.doFilter(ServletHandler.java:1759)
   [junit4]   2> 	at org.eclipse.jetty.servlet.ServletHandler.doHandle(ServletHandler.java:582)
   [junit4]   2> 	at org.eclipse.jetty.server.session.SessionHandler.doHandle(SessionHandler.java:224)
   [junit4]   2> 	at org.eclipse.jetty.server.handler.ContextHandler.doHandle(ContextHandler.java:1180)
   [junit4]   2> 	at org.eclipse.jetty.servlet.ServletHandler.doScope(ServletHandler.java:512)
   [junit4]   2> 	at org.eclipse.jetty.server.session.SessionHandler.doScope(SessionHandler.java:185)
   [junit4]   2> 	at org.eclipse.jetty.server.handler.ContextHandler.doScope(ContextHandler.java:1112)
   [junit4]   2> 	at org.eclipse.jetty.server.handler.ScopedHandler.handle(ScopedHandler.java:141)
   [junit4]   2> 	at org.eclipse.jetty.server.handler.gzip.GzipHandler.handle(GzipHandler.java:493)
   [junit4]   2> 	at org.eclipse.jetty.server.handler.HandlerWrapper.handle(HandlerWrapper.java:134)
   [junit4]   2> 	at org.eclipse.jetty.server.Server.handle(Server.java:534)
   [junit4]   2> 	at org.eclipse.jetty.server.HttpChannel.handle(HttpChannel.java:320)
   [junit4]   2> 	at org.eclipse.jetty.server.HttpConnection.onFillable(HttpConnection.java:251)
   [junit4]   2> 	at org.eclipse.jetty.io.AbstractConnection$ReadCallback.succeeded(AbstractConnection.java:283)
   [junit4]   2> 	at org.eclipse.jetty.io.FillInterest.fillable(FillInterest.java:108)
   [junit4]   2> 	at org.eclipse.jetty.io.SelectChannelEndPoint$2.run(SelectChannelEndPoint.java:93)
   [junit4]   2> 	at org.eclipse.jetty.util.thread.strategy.ExecuteProduceConsume.executeProduceConsume(ExecuteProduceConsume.java:303)
   [junit4]   2> 	at org.eclipse.jetty.util.thread.strategy.ExecuteProduceConsume.produceConsume(ExecuteProduceConsume.java:148)
   [junit4]   2> 	at org.eclipse.jetty.util.thread.strategy.ExecuteProduceConsume.run(ExecuteProduceConsume.java:136)
   [junit4]   2> 	at org.eclipse.jetty.util.thread.QueuedThreadPool.runJob(QueuedThreadPool.java:671)
   [junit4]   2> 	at org.eclipse.jetty.util.thread.QueuedThreadPool$2.run(QueuedThreadPool.java:589)
   [junit4]   2> 	at java.base/java.lang.Thread.run(Thread.java:844)
   [junit4]   2> 
   [junit4]   2> 1156008 ERROR (OverseerThreadFactory-1465-thread-1-processing-n:127.0.0.1:44563_) [n:127.0.0.1:44563_    ] o.a.s.c.OverseerCollectionMessageHandler Error from shard: http://127.0.0.1:44563
   [junit4]   2> org.apache.solr.client.solrj.SolrServerException: Timeout occured while waiting response from server at: http://127.0.0.1:44563
   [junit4]   2> 	at org.apache.solr.client.solrj.impl.HttpSolrClient.executeMethod(HttpSolrClient.java:654)
   [junit4]   2> 	at org.apache.solr.client.solrj.impl.HttpSolrClient.request(HttpSolrClient.java:255)
   [junit4]   2> 	at org.apache.solr.client.solrj.impl.HttpSolrClient.request(HttpSolrClient.java:244)
   [junit4]   2> 	at org.apache.solr.client.solrj.SolrClient.request(SolrClient.java:1219)
   [junit4]   2> 	at org.apache.solr.handler.component.HttpShardHandler.lambda$submit$0(HttpShardHandler.java:172)
   [junit4]   2> 	at java.base/java.util.concurrent.FutureTask.run(FutureTask.java:264)
   [junit4]   2> 	at java.base/java.util.concurrent.Executors$RunnableAdapter.call(Executors.java:514)
   [junit4]   2> 	at java.base/java.util.concurrent.FutureTask.run(FutureTask.java:264)
   [junit4]   2> 	at com.codahale.metrics.InstrumentedExecutorService$InstrumentedRunnable.run(InstrumentedExecutorService.java:176)
   [junit4]   2> 	at org.apache.solr.common.util.ExecutorUtil$MDCAwareThreadPoolExecutor.lambda$execute$0(ExecutorUtil.java:188)
   [junit4]   2> 	at java.base/java.util.concurrent.ThreadPoolExecutor.runWorker(ThreadPoolExecutor.java:1167)
   [junit4]   2> 	at java.base/java.util.concurrent.ThreadPoolExecutor$Worker.run(ThreadPoolExecutor.java:641)
   [junit4]   2> 	at java.base/java.lang.Thread.run(Thread.java:844)
   [junit4]   2> Caused by: java.net.SocketTimeoutException: Read timed out
   [junit4]   2> 	at java.base/java.net.SocketInputStream.socketRead0(Native Method)
   [junit4]   2> 	at java.base/java.net.SocketInputStream.socketRead(SocketInputStream.java:116)
   [junit4]   2> 	at java.base/java.net.SocketInputStream.read(SocketInputStream.java:171)
   [junit4]   2> 	at java.base/java.net.SocketInputStream.read(SocketInputStream.java:141)
   [junit4]   2> 	at org.apache.http.impl.io.SessionInputBufferImpl.streamRead(SessionInputBufferImpl.java:137)
   [junit4]   2> 	at org.apache.http.impl.io.SessionInputBufferImpl.fillBuffer(SessionInputBufferImpl.java:153)
   [junit4]   2> 	at org.apache.http.impl.io.SessionInputBufferImpl.readLine(SessionInputBufferImpl.java:282)
   [junit4]   2> 	at org.apache.http.impl.conn.DefaultHttpResponseParser.parseHead(DefaultHttpResponseParser.java:138)
   [junit4]   2> 	at org.apache.http.impl.conn.DefaultHttpResponseParser.parseHead(DefaultHttpResponseParser.java:56)
   [junit4]   2> 	at org.apache.http.impl.io.AbstractMessageParser.parse(AbstractMessageParser.java:259)
   [junit4]   2> 	at org.apache.http.impl.DefaultBHttpClientConnection.receiveResponseHeader(DefaultBHttpClientConnection.java:163)
   [junit4]   2> 	at org.apache.http.impl.conn.CPoolProxy.receiveResponseHeader(CPoolProxy.java:165)
   [junit4]   2> 	at org.apache.http.protocol.HttpRequestExecutor.doReceiveResponse(HttpRequestExecutor.java:273)
   [junit4]   2> 	at org.apache.http.protocol.HttpRequestExecutor.execute(HttpRequestExecutor.java:125)
   [junit4]   2> 	at org.apache.solr.util.stats.InstrumentedHttpRequestExecutor.execute(InstrumentedHttpRequestExecutor.java:118)
   [junit4]   2> 	at org.apache.http.impl.execchain.MainClientExec.execute(MainClientExec.java:272)
   [junit4]   2> 	at org.apache.http.impl.execchain.ProtocolExec.execute(ProtocolExec.java:185)
   [junit4]   2> 	at org.apache.http.impl.execchain.RetryExec.execute(RetryExec.java:89)
   [junit4]   2> 	at org.apache.http.impl.execchain.RedirectExec.execute(RedirectExec.java:111)
   [junit4]  

[...truncated too long message...]

ol_collection_shard1_replica_n1] o.a.s.s.HttpSolrCall [admin] webapp=null path=/admin/cores params={qt=/admin/cores&collection.configName=conf1&newCollection=true&name=control_collection_shard1_replica_n1&action=CREATE&numShards=1&collection=control_collection&shard=shard1&wt=javabin&version=2&replicaType=NRT} status=0 QTime=630155
   [junit4]   2> 2172882 ERROR (TEST-TestCollectionAPI.test-seed#[A89DADC6250C1B18]) [    ] o.a.z.s.ZooKeeperServer ZKShutdownHandler is not registered, so ZooKeeper server won't take any action on ERROR or SHUTDOWN server state changes
   [junit4]   2> 2172883 INFO  (TEST-TestCollectionAPI.test-seed#[A89DADC6250C1B18]) [    ] o.a.s.c.ZkTestServer connecting to 127.0.0.1:35275 35275
   [junit4]   2> 2178736 INFO  (Thread-2482) [    ] o.a.s.c.ZkTestServer connecting to 127.0.0.1:35275 35275
   [junit4]   2> 2178736 WARN  (Thread-2482) [    ] o.a.s.c.ZkTestServer Watch limit violations: 
   [junit4]   2> Maximum concurrent create/delete watches above limit:
   [junit4]   2> 
   [junit4]   2> 	2	/solr/aliases.json
   [junit4]   2> 
   [junit4]   2> Maximum concurrent data watches above limit:
   [junit4]   2> 
   [junit4]   2> 	2	/solr/clusterstate.json
   [junit4]   2> 	2	/solr/clusterprops.json
   [junit4]   2> 
   [junit4]   2> Maximum concurrent children watches above limit:
   [junit4]   2> 
   [junit4]   2> 	2	/solr/live_nodes
   [junit4]   2> 	2	/solr/collections
   [junit4]   2> 
   [junit4]   2> NOTE: reproduce with: ant test  -Dtestcase=TestCollectionAPI -Dtests.method=test -Dtests.seed=A89DADC6250C1B18 -Dtests.multiplier=3 -Dtests.slow=true -Dtests.locale=en-BS -Dtests.timezone=SystemV/CST6CDT -Dtests.asserts=true -Dtests.file.encoding=UTF-8
   [junit4] ERROR    636s J1 | TestCollectionAPI.test <<<
   [junit4]    > Throwable #1: org.apache.solr.client.solrj.SolrServerException: Timeout occured while waiting response from server at: https://127.0.0.1:33613
   [junit4]    > 	at __randomizedtesting.SeedInfo.seed([A89DADC6250C1B18:20C9921C8BF076E0]:0)
   [junit4]    > 	at org.apache.solr.client.solrj.impl.HttpSolrClient.executeMethod(HttpSolrClient.java:654)
   [junit4]    > 	at org.apache.solr.client.solrj.impl.HttpSolrClient.request(HttpSolrClient.java:255)
   [junit4]    > 	at org.apache.solr.client.solrj.impl.HttpSolrClient.request(HttpSolrClient.java:244)
   [junit4]    > 	at org.apache.solr.client.solrj.impl.LBHttpSolrClient.doRequest(LBHttpSolrClient.java:483)
   [junit4]    > 	at org.apache.solr.client.solrj.impl.LBHttpSolrClient.request(LBHttpSolrClient.java:413)
   [junit4]    > 	at org.apache.solr.client.solrj.impl.CloudSolrClient.sendRequest(CloudSolrClient.java:1104)
   [junit4]    > 	at org.apache.solr.client.solrj.impl.CloudSolrClient.requestWithRetryOnStaleState(CloudSolrClient.java:884)
   [junit4]    > 	at org.apache.solr.client.solrj.impl.CloudSolrClient.request(CloudSolrClient.java:817)
   [junit4]    > 	at org.apache.solr.client.solrj.SolrRequest.process(SolrRequest.java:194)
   [junit4]    > 	at org.apache.solr.client.solrj.SolrRequest.process(SolrRequest.java:211)
   [junit4]    > 	at org.apache.solr.cloud.AbstractFullDistribZkTestBase.createServers(AbstractFullDistribZkTestBase.java:315)
   [junit4]    > 	at org.apache.solr.BaseDistributedSearchTestCase$ShardsRepeatRule$ShardsFixedStatement.callStatement(BaseDistributedSearchTestCase.java:991)
   [junit4]    > 	at org.apache.solr.BaseDistributedSearchTestCase$ShardsRepeatRule$ShardsStatement.evaluate(BaseDistributedSearchTestCase.java:968)
   [junit4]    > 	at java.base/java.lang.Thread.run(Thread.java:844)
   [junit4]    > Caused by: java.net.SocketTimeoutException: Read timed out
   [junit4]    > 	at java.base/java.net.SocketInputStream.socketRead0(Native Method)
   [junit4]    > 	at java.base/java.net.SocketInputStream.socketRead(SocketInputStream.java:116)
   [junit4]    > 	at java.base/java.net.SocketInputStream.read(SocketInputStream.java:171)
   [junit4]    > 	at java.base/java.net.SocketInputStream.read(SocketInputStream.java:141)
   [junit4]    > 	at java.base/sun.security.ssl.SSLSocketInputRecord.read(SSLSocketInputRecord.java:425)
   [junit4]    > 	at java.base/sun.security.ssl.SSLSocketInputRecord.bytesInCompletePacket(SSLSocketInputRecord.java:65)
   [junit4]    > 	at java.base/sun.security.ssl.SSLSocketImpl.bytesInCompletePacket(SSLSocketImpl.java:918)
   [junit4]    > 	at java.base/sun.security.ssl.AppInputStream.read(AppInputStream.java:144)
   [junit4]    > 	at org.apache.http.impl.io.SessionInputBufferImpl.streamRead(SessionInputBufferImpl.java:137)
   [junit4]    > 	at org.apache.http.impl.io.SessionInputBufferImpl.fillBuffer(SessionInputBufferImpl.java:153)
   [junit4]    > 	at org.apache.http.impl.io.SessionInputBufferImpl.readLine(SessionInputBufferImpl.java:282)
   [junit4]    > 	at org.apache.http.impl.conn.DefaultHttpResponseParser.parseHead(DefaultHttpResponseParser.java:138)
   [junit4]    > 	at org.apache.http.impl.conn.DefaultHttpResponseParser.parseHead(DefaultHttpResponseParser.java:56)
   [junit4]    > 	at org.apache.http.impl.io.AbstractMessageParser.parse(AbstractMessageParser.java:259)
   [junit4]    > 	at org.apache.http.impl.DefaultBHttpClientConnection.receiveResponseHeader(DefaultBHttpClientConnection.java:163)
   [junit4]    > 	at org.apache.http.impl.conn.CPoolProxy.receiveResponseHeader(CPoolProxy.java:165)
   [junit4]    > 	at org.apache.http.protocol.HttpRequestExecutor.doReceiveResponse(HttpRequestExecutor.java:273)
   [junit4]    > 	at org.apache.http.protocol.HttpRequestExecutor.execute(HttpRequestExecutor.java:125)
   [junit4]    > 	at org.apache.http.impl.execchain.MainClientExec.execute(MainClientExec.java:272)
   [junit4]    > 	at org.apache.http.impl.execchain.ProtocolExec.execute(ProtocolExec.java:185)
   [junit4]    > 	at org.apache.http.impl.execchain.RetryExec.execute(RetryExec.java:89)
   [junit4]    > 	at org.apache.http.impl.execchain.RedirectExec.execute(RedirectExec.java:111)
   [junit4]    > 	at org.apache.http.impl.client.InternalHttpClient.doExecute(InternalHttpClient.java:185)
   [junit4]    > 	at org.apache.http.impl.client.CloseableHttpClient.execute(CloseableHttpClient.java:83)
   [junit4]    > 	at org.apache.http.impl.client.CloseableHttpClient.execute(CloseableHttpClient.java:56)
   [junit4]    > 	at org.apache.solr.client.solrj.impl.HttpSolrClient.executeMethod(HttpSolrClient.java:542)
   [junit4]    > 	... 42 more
   [junit4]   2> NOTE: leaving temporary files on disk at: /home/jenkins/workspace/Lucene-Solr-7.x-Linux/solr/build/solr-core/test/J1/temp/solr.cloud.TestCollectionAPI_A89DADC6250C1B18-001
   [junit4]   2> NOTE: test params are: codec=Lucene70, sim=RandomSimilarity(queryNorm=false): {}, locale=en-BS, timezone=SystemV/CST6CDT
   [junit4]   2> NOTE: Linux 4.10.0-40-generic amd64/Oracle Corporation 9.0.1 (64-bit)/cpus=8,threads=1,free=98411408,total=510656512
   [junit4]   2> NOTE: All tests run in this JVM: [LegacyCloudClusterPropTest, NumberUtilsTest, TestAnalyzedSuggestions, DebugComponentTest, TestCustomDocTransformer, TestExactStatsCache, ConvertedLegacyTest, TestSolrQueryResponse, AddSchemaFieldsUpdateProcessorFactoryTest, QueryEqualityTest, TestSchemaSimilarityResource, SubstringBytesRefFilterTest, TolerantUpdateProcessorTest, TestStressRecovery, TestMultiWordSynonyms, ShardRoutingCustomTest, TestClusterStateMutator, TestFieldCollectionResource, TestJettySolrRunner, TestWriterPerf, TestConfigSetProperties, TestJsonFacets, TestLuceneMatchVersion, TestRandomCollapseQParserPlugin, TestSolrConfigHandlerCloud, OpenExchangeRatesOrgProviderTest, LukeRequestHandlerTest, SolrCLIZkUtilsTest, JSONWriterTest, SolrMetricsIntegrationTest, DistribDocExpirationUpdateProcessorTest, NumericFieldsTest, TestSolrCoreSnapshots, CursorMarkTest, TestHttpShardHandlerFactory, TemplateUpdateProcessorTest, ShardSplitTest, CdcrReplicationHandlerTest, ZkFailoverTest, TestLegacyNumericRangeQueryBuilder, SolrIndexSplitterTest, BufferStoreTest, SystemLogListenerTest, TestHdfsBackupRestoreCore, TestHighFrequencyDictionaryFactory, BlockJoinFacetRandomTest, TestRawResponseWriter, TestSimpleTrackingShardHandler, SuggestComponentTest, TestDelegationWithHadoopAuth, TestBackupRepositoryFactory, ConjunctionSolrSpellCheckerTest, SparseHLLTest, TestSubQueryTransformerCrossCore, HdfsUnloadDistributedZkTest, TestStressLucene, CollectionsAPIDistributedZkTest, DeleteShardTest, TestGraphTermsQParserPlugin, TestFieldTypeResource, SOLR749Test, TestRemoteStreaming, TestRTGBase, SuggesterFSTTest, ParsingFieldUpdateProcessorsTest, PingRequestHandlerTest, TestDocSet, TestSSLRandomization, TestOmitPositions, ShufflingReplicaListTransformerTest, TestFieldCacheWithThreads, BadIndexSchemaTest, TestLazyCores, TestReplicaProperties, DistributedQueryComponentCustomSortTest, TestBM25SimilarityFactory, TestNumericTerms64, TestSolrQueryParser, OverriddenZkACLAndCredentialsProvidersTest, TestPKIAuthenticationPlugin, DeleteLastCustomShardedReplicaTest, AssignTest, DistributedFacetPivotSmallAdvancedTest, RegexBoostProcessorTest, TestInPlaceUpdatesStandalone, DistributedIntervalFacetingTest, TestXmlQParserPlugin, RollingRestartTest, SampleTest, TestBulkSchemaConcurrent, SecurityConfHandlerTest, CreateCollectionCleanupTest, TestStressReorder, TestCopyFieldCollectionResource, HdfsRecoverLeaseTest, SynonymTokenizerTest, ImplicitSnitchTest, MultiThreadedOCPTest, TestStreamBody, DOMUtilTest, TestSolrCoreParser, TestDeleteCollectionOnDownNodes, ExitableDirectoryReaderTest, TestSlowCompositeReaderWrapper, CloneFieldUpdateProcessorFactoryTest, TestCursorMarkWithoutUniqueKey, TestCollapseQParserPlugin, SolrJmxReporterCloudTest, TestNodeAddedTrigger, TestLeaderElectionZkExpiry, DocValuesMissingTest, BlobRepositoryCloudTest, TestRTimerTree, HdfsBasicDistributedZk2Test, DistributedTermsComponentTest, ChaosMonkeySafeLeaderWithPullReplicasTest, SolrCloudReportersTest, TestCollectionAPI]
   [junit4] Completed [376/764 (3!)] on J1 in 636.46s, 1 test, 1 error <<< FAILURES!

[...truncated 42199 lines...]

Mime
View raw message