lucene-dev mailing list archives

Site index · List index
Message view « Date » · « Thread »
Top « Date » · « Thread »
From Policeman Jenkins Server <jenk...@thetaphi.de>
Subject [JENKINS] Lucene-Solr-master-Solaris (64bit/jdk1.8.0) - Build # 1589 - Still Unstable!
Date Thu, 28 Dec 2017 04:31:21 GMT
Build: https://jenkins.thetaphi.de/job/Lucene-Solr-master-Solaris/1589/
Java: 64bit/jdk1.8.0 -XX:+UseCompressedOops -XX:+UseSerialGC

4 tests failed.
FAILED:  org.apache.solr.cloud.TestCollectionsAPIViaSolrCloudCluster.testCollectionCreateSearchDelete

Error Message:
Error from server at https://127.0.0.1:48645/solr/testcollection_shard1_replica_n3: Expected mime type application/octet-stream but got text/html. <html> <head> <meta http-equiv="Content-Type" content="text/html;charset=ISO-8859-1"/> <title>Error 404 </title> </head> <body> <h2>HTTP ERROR: 404</h2> <p>Problem accessing /solr/testcollection_shard1_replica_n3/update. Reason: <pre>    Can not find: /solr/testcollection_shard1_replica_n3/update</pre></p> <hr /><a href="http://eclipse.org/jetty">Powered by Jetty:// 9.3.20.v20170531</a><hr/> </body> </html> 

Stack Trace:
org.apache.solr.client.solrj.impl.CloudSolrClient$RouteException: Error from server at https://127.0.0.1:48645/solr/testcollection_shard1_replica_n3: Expected mime type application/octet-stream but got text/html. <html>
<head>
<meta http-equiv="Content-Type" content="text/html;charset=ISO-8859-1"/>
<title>Error 404 </title>
</head>
<body>
<h2>HTTP ERROR: 404</h2>
<p>Problem accessing /solr/testcollection_shard1_replica_n3/update. Reason:
<pre>    Can not find: /solr/testcollection_shard1_replica_n3/update</pre></p>
<hr /><a href="http://eclipse.org/jetty">Powered by Jetty:// 9.3.20.v20170531</a><hr/>
</body>
</html>

	at __randomizedtesting.SeedInfo.seed([A53DB481A98D1384:6C71A242E65F921]:0)
	at org.apache.solr.client.solrj.impl.CloudSolrClient.directUpdate(CloudSolrClient.java:550)
	at org.apache.solr.client.solrj.impl.CloudSolrClient.sendRequest(CloudSolrClient.java:1013)
	at org.apache.solr.client.solrj.impl.CloudSolrClient.requestWithRetryOnStaleState(CloudSolrClient.java:884)
	at org.apache.solr.client.solrj.impl.CloudSolrClient.requestWithRetryOnStaleState(CloudSolrClient.java:946)
	at org.apache.solr.client.solrj.impl.CloudSolrClient.requestWithRetryOnStaleState(CloudSolrClient.java:946)
	at org.apache.solr.client.solrj.impl.CloudSolrClient.requestWithRetryOnStaleState(CloudSolrClient.java:946)
	at org.apache.solr.client.solrj.impl.CloudSolrClient.requestWithRetryOnStaleState(CloudSolrClient.java:946)
	at org.apache.solr.client.solrj.impl.CloudSolrClient.requestWithRetryOnStaleState(CloudSolrClient.java:946)
	at org.apache.solr.client.solrj.impl.CloudSolrClient.request(CloudSolrClient.java:817)
	at org.apache.solr.client.solrj.SolrRequest.process(SolrRequest.java:194)
	at org.apache.solr.client.solrj.request.UpdateRequest.commit(UpdateRequest.java:233)
	at org.apache.solr.cloud.TestCollectionsAPIViaSolrCloudCluster.testCollectionCreateSearchDelete(TestCollectionsAPIViaSolrCloudCluster.java:167)
	at sun.reflect.NativeMethodAccessorImpl.invoke0(Native Method)
	at sun.reflect.NativeMethodAccessorImpl.invoke(NativeMethodAccessorImpl.java:62)
	at sun.reflect.DelegatingMethodAccessorImpl.invoke(DelegatingMethodAccessorImpl.java:43)
	at java.lang.reflect.Method.invoke(Method.java:498)
	at com.carrotsearch.randomizedtesting.RandomizedRunner.invoke(RandomizedRunner.java:1737)
	at com.carrotsearch.randomizedtesting.RandomizedRunner$8.evaluate(RandomizedRunner.java:934)
	at com.carrotsearch.randomizedtesting.RandomizedRunner$9.evaluate(RandomizedRunner.java:970)
	at com.carrotsearch.randomizedtesting.RandomizedRunner$10.evaluate(RandomizedRunner.java:984)
	at com.carrotsearch.randomizedtesting.rules.SystemPropertiesRestoreRule$1.evaluate(SystemPropertiesRestoreRule.java:57)
	at org.apache.lucene.util.TestRuleSetupTeardownChained$1.evaluate(TestRuleSetupTeardownChained.java:49)
	at org.apache.lucene.util.AbstractBeforeAfterRule$1.evaluate(AbstractBeforeAfterRule.java:45)
	at org.apache.lucene.util.TestRuleThreadAndTestName$1.evaluate(TestRuleThreadAndTestName.java:48)
	at org.apache.lucene.util.TestRuleIgnoreAfterMaxFailures$1.evaluate(TestRuleIgnoreAfterMaxFailures.java:64)
	at org.apache.lucene.util.TestRuleMarkFailure$1.evaluate(TestRuleMarkFailure.java:47)
	at com.carrotsearch.randomizedtesting.rules.StatementAdapter.evaluate(StatementAdapter.java:36)
	at com.carrotsearch.randomizedtesting.ThreadLeakControl$StatementRunner.run(ThreadLeakControl.java:368)
	at com.carrotsearch.randomizedtesting.ThreadLeakControl.forkTimeoutingTask(ThreadLeakControl.java:817)
	at com.carrotsearch.randomizedtesting.ThreadLeakControl$3.evaluate(ThreadLeakControl.java:468)
	at com.carrotsearch.randomizedtesting.RandomizedRunner.runSingleTest(RandomizedRunner.java:943)
	at com.carrotsearch.randomizedtesting.RandomizedRunner$5.evaluate(RandomizedRunner.java:829)
	at com.carrotsearch.randomizedtesting.RandomizedRunner$6.evaluate(RandomizedRunner.java:879)
	at com.carrotsearch.randomizedtesting.RandomizedRunner$7.evaluate(RandomizedRunner.java:890)
	at com.carrotsearch.randomizedtesting.rules.StatementAdapter.evaluate(StatementAdapter.java:36)
	at com.carrotsearch.randomizedtesting.rules.SystemPropertiesRestoreRule$1.evaluate(SystemPropertiesRestoreRule.java:57)
	at org.apache.lucene.util.AbstractBeforeAfterRule$1.evaluate(AbstractBeforeAfterRule.java:45)
	at com.carrotsearch.randomizedtesting.rules.StatementAdapter.evaluate(StatementAdapter.java:36)
	at org.apache.lucene.util.TestRuleStoreClassName$1.evaluate(TestRuleStoreClassName.java:41)
	at com.carrotsearch.randomizedtesting.rules.NoShadowingOrOverridesOnMethodsRule$1.evaluate(NoShadowingOrOverridesOnMethodsRule.java:40)
	at com.carrotsearch.randomizedtesting.rules.NoShadowingOrOverridesOnMethodsRule$1.evaluate(NoShadowingOrOverridesOnMethodsRule.java:40)
	at com.carrotsearch.randomizedtesting.rules.StatementAdapter.evaluate(StatementAdapter.java:36)
	at com.carrotsearch.randomizedtesting.rules.StatementAdapter.evaluate(StatementAdapter.java:36)
	at com.carrotsearch.randomizedtesting.rules.StatementAdapter.evaluate(StatementAdapter.java:36)
	at org.apache.lucene.util.TestRuleAssertionsRequired$1.evaluate(TestRuleAssertionsRequired.java:53)
	at org.apache.lucene.util.TestRuleMarkFailure$1.evaluate(TestRuleMarkFailure.java:47)
	at org.apache.lucene.util.TestRuleIgnoreAfterMaxFailures$1.evaluate(TestRuleIgnoreAfterMaxFailures.java:64)
	at org.apache.lucene.util.TestRuleIgnoreTestSuites$1.evaluate(TestRuleIgnoreTestSuites.java:54)
	at com.carrotsearch.randomizedtesting.rules.StatementAdapter.evaluate(StatementAdapter.java:36)
	at com.carrotsearch.randomizedtesting.ThreadLeakControl$StatementRunner.run(ThreadLeakControl.java:368)
	at java.lang.Thread.run(Thread.java:748)
Caused by: org.apache.solr.client.solrj.impl.HttpSolrClient$RemoteSolrException: Error from server at https://127.0.0.1:48645/solr/testcollection_shard1_replica_n3: Expected mime type application/octet-stream but got text/html. <html>
<head>
<meta http-equiv="Content-Type" content="text/html;charset=ISO-8859-1"/>
<title>Error 404 </title>
</head>
<body>
<h2>HTTP ERROR: 404</h2>
<p>Problem accessing /solr/testcollection_shard1_replica_n3/update. Reason:
<pre>    Can not find: /solr/testcollection_shard1_replica_n3/update</pre></p>
<hr /><a href="http://eclipse.org/jetty">Powered by Jetty:// 9.3.20.v20170531</a><hr/>
</body>
</html>

	at org.apache.solr.client.solrj.impl.HttpSolrClient.executeMethod(HttpSolrClient.java:607)
	at org.apache.solr.client.solrj.impl.HttpSolrClient.request(HttpSolrClient.java:255)
	at org.apache.solr.client.solrj.impl.HttpSolrClient.request(HttpSolrClient.java:244)
	at org.apache.solr.client.solrj.impl.LBHttpSolrClient.doRequest(LBHttpSolrClient.java:483)
	at org.apache.solr.client.solrj.impl.LBHttpSolrClient.request(LBHttpSolrClient.java:413)
	at org.apache.solr.client.solrj.impl.CloudSolrClient.lambda$directUpdate$0(CloudSolrClient.java:527)
	at java.util.concurrent.FutureTask.run(FutureTask.java:266)
	at org.apache.solr.common.util.ExecutorUtil$MDCAwareThreadPoolExecutor.lambda$execute$0(ExecutorUtil.java:188)
	at java.util.concurrent.ThreadPoolExecutor.runWorker(ThreadPoolExecutor.java:1149)
	at java.util.concurrent.ThreadPoolExecutor$Worker.run(ThreadPoolExecutor.java:624)
	... 1 more


FAILED:  org.apache.solr.cloud.autoscaling.sim.TestTriggerIntegration.testTriggerThrottling

Error Message:


Stack Trace:
java.util.ConcurrentModificationException
	at __randomizedtesting.SeedInfo.seed([A53DB481A98D1384:5E1F1CA47B27F016]:0)
	at java.util.ArrayList$Itr.checkForComodification(ArrayList.java:909)
	at java.util.ArrayList$Itr.next(ArrayList.java:859)
	at org.apache.solr.cloud.autoscaling.sim.SimSolrCloudTestCase.tearDown(SimSolrCloudTestCase.java:141)
	at sun.reflect.GeneratedMethodAccessor7.invoke(Unknown Source)
	at sun.reflect.DelegatingMethodAccessorImpl.invoke(DelegatingMethodAccessorImpl.java:43)
	at java.lang.reflect.Method.invoke(Method.java:498)
	at com.carrotsearch.randomizedtesting.RandomizedRunner.invoke(RandomizedRunner.java:1737)
	at com.carrotsearch.randomizedtesting.RandomizedRunner$10.evaluate(RandomizedRunner.java:992)
	at com.carrotsearch.randomizedtesting.rules.SystemPropertiesRestoreRule$1.evaluate(SystemPropertiesRestoreRule.java:57)
	at org.apache.lucene.util.TestRuleSetupTeardownChained$1.evaluate(TestRuleSetupTeardownChained.java:49)
	at org.apache.lucene.util.AbstractBeforeAfterRule$1.evaluate(AbstractBeforeAfterRule.java:45)
	at org.apache.lucene.util.TestRuleThreadAndTestName$1.evaluate(TestRuleThreadAndTestName.java:48)
	at org.apache.lucene.util.TestRuleIgnoreAfterMaxFailures$1.evaluate(TestRuleIgnoreAfterMaxFailures.java:64)
	at org.apache.lucene.util.TestRuleMarkFailure$1.evaluate(TestRuleMarkFailure.java:47)
	at com.carrotsearch.randomizedtesting.rules.StatementAdapter.evaluate(StatementAdapter.java:36)
	at com.carrotsearch.randomizedtesting.ThreadLeakControl$StatementRunner.run(ThreadLeakControl.java:368)
	at com.carrotsearch.randomizedtesting.ThreadLeakControl.forkTimeoutingTask(ThreadLeakControl.java:817)
	at com.carrotsearch.randomizedtesting.ThreadLeakControl$3.evaluate(ThreadLeakControl.java:468)
	at com.carrotsearch.randomizedtesting.RandomizedRunner.runSingleTest(RandomizedRunner.java:943)
	at com.carrotsearch.randomizedtesting.RandomizedRunner$5.evaluate(RandomizedRunner.java:829)
	at com.carrotsearch.randomizedtesting.RandomizedRunner$6.evaluate(RandomizedRunner.java:879)
	at com.carrotsearch.randomizedtesting.RandomizedRunner$7.evaluate(RandomizedRunner.java:890)
	at com.carrotsearch.randomizedtesting.rules.StatementAdapter.evaluate(StatementAdapter.java:36)
	at com.carrotsearch.randomizedtesting.rules.SystemPropertiesRestoreRule$1.evaluate(SystemPropertiesRestoreRule.java:57)
	at org.apache.lucene.util.AbstractBeforeAfterRule$1.evaluate(AbstractBeforeAfterRule.java:45)
	at com.carrotsearch.randomizedtesting.rules.StatementAdapter.evaluate(StatementAdapter.java:36)
	at org.apache.lucene.util.TestRuleStoreClassName$1.evaluate(TestRuleStoreClassName.java:41)
	at com.carrotsearch.randomizedtesting.rules.NoShadowingOrOverridesOnMethodsRule$1.evaluate(NoShadowingOrOverridesOnMethodsRule.java:40)
	at com.carrotsearch.randomizedtesting.rules.NoShadowingOrOverridesOnMethodsRule$1.evaluate(NoShadowingOrOverridesOnMethodsRule.java:40)
	at com.carrotsearch.randomizedtesting.rules.StatementAdapter.evaluate(StatementAdapter.java:36)
	at com.carrotsearch.randomizedtesting.rules.StatementAdapter.evaluate(StatementAdapter.java:36)
	at com.carrotsearch.randomizedtesting.rules.StatementAdapter.evaluate(StatementAdapter.java:36)
	at org.apache.lucene.util.TestRuleAssertionsRequired$1.evaluate(TestRuleAssertionsRequired.java:53)
	at org.apache.lucene.util.TestRuleMarkFailure$1.evaluate(TestRuleMarkFailure.java:47)
	at org.apache.lucene.util.TestRuleIgnoreAfterMaxFailures$1.evaluate(TestRuleIgnoreAfterMaxFailures.java:64)
	at org.apache.lucene.util.TestRuleIgnoreTestSuites$1.evaluate(TestRuleIgnoreTestSuites.java:54)
	at com.carrotsearch.randomizedtesting.rules.StatementAdapter.evaluate(StatementAdapter.java:36)
	at com.carrotsearch.randomizedtesting.ThreadLeakControl$StatementRunner.run(ThreadLeakControl.java:368)
	at java.lang.Thread.run(Thread.java:748)


FAILED:  org.apache.solr.cloud.MoveReplicaHDFSTest.testFailedMove

Error Message:
No live SolrServers available to handle this request:[http://127.0.0.1:35538/solr/MoveReplicaHDFSTest_failed_coll_true, http://127.0.0.1:39409/solr/MoveReplicaHDFSTest_failed_coll_true, http://127.0.0.1:53063/solr/MoveReplicaHDFSTest_failed_coll_true]

Stack Trace:
org.apache.solr.client.solrj.SolrServerException: No live SolrServers available to handle this request:[http://127.0.0.1:35538/solr/MoveReplicaHDFSTest_failed_coll_true, http://127.0.0.1:39409/solr/MoveReplicaHDFSTest_failed_coll_true, http://127.0.0.1:53063/solr/MoveReplicaHDFSTest_failed_coll_true]
	at __randomizedtesting.SeedInfo.seed([A53DB481A98D1384:FF067731E5EC654]:0)
	at org.apache.solr.client.solrj.impl.LBHttpSolrClient.request(LBHttpSolrClient.java:462)
	at org.apache.solr.client.solrj.impl.CloudSolrClient.sendRequest(CloudSolrClient.java:1104)
	at org.apache.solr.client.solrj.impl.CloudSolrClient.requestWithRetryOnStaleState(CloudSolrClient.java:884)
	at org.apache.solr.client.solrj.impl.CloudSolrClient.requestWithRetryOnStaleState(CloudSolrClient.java:991)
	at org.apache.solr.client.solrj.impl.CloudSolrClient.request(CloudSolrClient.java:817)
	at org.apache.solr.client.solrj.SolrRequest.process(SolrRequest.java:194)
	at org.apache.solr.client.solrj.SolrClient.query(SolrClient.java:942)
	at org.apache.solr.cloud.MoveReplicaTest.testFailedMove(MoveReplicaTest.java:309)
	at sun.reflect.NativeMethodAccessorImpl.invoke0(Native Method)
	at sun.reflect.NativeMethodAccessorImpl.invoke(NativeMethodAccessorImpl.java:62)
	at sun.reflect.DelegatingMethodAccessorImpl.invoke(DelegatingMethodAccessorImpl.java:43)
	at java.lang.reflect.Method.invoke(Method.java:498)
	at com.carrotsearch.randomizedtesting.RandomizedRunner.invoke(RandomizedRunner.java:1737)
	at com.carrotsearch.randomizedtesting.RandomizedRunner$8.evaluate(RandomizedRunner.java:934)
	at com.carrotsearch.randomizedtesting.RandomizedRunner$9.evaluate(RandomizedRunner.java:970)
	at com.carrotsearch.randomizedtesting.RandomizedRunner$10.evaluate(RandomizedRunner.java:984)
	at com.carrotsearch.randomizedtesting.rules.SystemPropertiesRestoreRule$1.evaluate(SystemPropertiesRestoreRule.java:57)
	at org.apache.lucene.util.TestRuleSetupTeardownChained$1.evaluate(TestRuleSetupTeardownChained.java:49)
	at org.apache.lucene.util.AbstractBeforeAfterRule$1.evaluate(AbstractBeforeAfterRule.java:45)
	at org.apache.lucene.util.TestRuleThreadAndTestName$1.evaluate(TestRuleThreadAndTestName.java:48)
	at org.apache.lucene.util.TestRuleIgnoreAfterMaxFailures$1.evaluate(TestRuleIgnoreAfterMaxFailures.java:64)
	at org.apache.lucene.util.TestRuleMarkFailure$1.evaluate(TestRuleMarkFailure.java:47)
	at com.carrotsearch.randomizedtesting.rules.StatementAdapter.evaluate(StatementAdapter.java:36)
	at com.carrotsearch.randomizedtesting.ThreadLeakControl$StatementRunner.run(ThreadLeakControl.java:368)
	at com.carrotsearch.randomizedtesting.ThreadLeakControl.forkTimeoutingTask(ThreadLeakControl.java:817)
	at com.carrotsearch.randomizedtesting.ThreadLeakControl$3.evaluate(ThreadLeakControl.java:468)
	at com.carrotsearch.randomizedtesting.RandomizedRunner.runSingleTest(RandomizedRunner.java:943)
	at com.carrotsearch.randomizedtesting.RandomizedRunner$5.evaluate(RandomizedRunner.java:829)
	at com.carrotsearch.randomizedtesting.RandomizedRunner$6.evaluate(RandomizedRunner.java:879)
	at com.carrotsearch.randomizedtesting.RandomizedRunner$7.evaluate(RandomizedRunner.java:890)
	at com.carrotsearch.randomizedtesting.rules.StatementAdapter.evaluate(StatementAdapter.java:36)
	at com.carrotsearch.randomizedtesting.rules.SystemPropertiesRestoreRule$1.evaluate(SystemPropertiesRestoreRule.java:57)
	at org.apache.lucene.util.AbstractBeforeAfterRule$1.evaluate(AbstractBeforeAfterRule.java:45)
	at com.carrotsearch.randomizedtesting.rules.StatementAdapter.evaluate(StatementAdapter.java:36)
	at org.apache.lucene.util.TestRuleStoreClassName$1.evaluate(TestRuleStoreClassName.java:41)
	at com.carrotsearch.randomizedtesting.rules.NoShadowingOrOverridesOnMethodsRule$1.evaluate(NoShadowingOrOverridesOnMethodsRule.java:40)
	at com.carrotsearch.randomizedtesting.rules.NoShadowingOrOverridesOnMethodsRule$1.evaluate(NoShadowingOrOverridesOnMethodsRule.java:40)
	at com.carrotsearch.randomizedtesting.rules.StatementAdapter.evaluate(StatementAdapter.java:36)
	at com.carrotsearch.randomizedtesting.rules.StatementAdapter.evaluate(StatementAdapter.java:36)
	at com.carrotsearch.randomizedtesting.rules.StatementAdapter.evaluate(StatementAdapter.java:36)
	at org.apache.lucene.util.TestRuleAssertionsRequired$1.evaluate(TestRuleAssertionsRequired.java:53)
	at org.apache.lucene.util.TestRuleMarkFailure$1.evaluate(TestRuleMarkFailure.java:47)
	at org.apache.lucene.util.TestRuleIgnoreAfterMaxFailures$1.evaluate(TestRuleIgnoreAfterMaxFailures.java:64)
	at org.apache.lucene.util.TestRuleIgnoreTestSuites$1.evaluate(TestRuleIgnoreTestSuites.java:54)
	at com.carrotsearch.randomizedtesting.rules.StatementAdapter.evaluate(StatementAdapter.java:36)
	at com.carrotsearch.randomizedtesting.ThreadLeakControl$StatementRunner.run(ThreadLeakControl.java:368)
	at java.lang.Thread.run(Thread.java:748)
Caused by: org.apache.solr.client.solrj.impl.HttpSolrClient$RemoteSolrException: Error from server at http://127.0.0.1:39409/solr/MoveReplicaHDFSTest_failed_coll_true: no servers hosting shard: shard1
	at org.apache.solr.client.solrj.impl.HttpSolrClient.executeMethod(HttpSolrClient.java:643)
	at org.apache.solr.client.solrj.impl.HttpSolrClient.request(HttpSolrClient.java:255)
	at org.apache.solr.client.solrj.impl.HttpSolrClient.request(HttpSolrClient.java:244)
	at org.apache.solr.client.solrj.impl.LBHttpSolrClient.doRequest(LBHttpSolrClient.java:483)
	at org.apache.solr.client.solrj.impl.LBHttpSolrClient.request(LBHttpSolrClient.java:436)
	... 46 more


FAILED:  org.apache.solr.cloud.autoscaling.sim.TestExecutePlanAction.testIntegration

Error Message:


Stack Trace:
java.util.ConcurrentModificationException
	at __randomizedtesting.SeedInfo.seed([A53DB481A98D1384:155CBAAD8CB2B2A1]:0)
	at java.util.ArrayList$Itr.checkForComodification(ArrayList.java:909)
	at java.util.ArrayList$Itr.next(ArrayList.java:859)
	at org.apache.solr.cloud.autoscaling.sim.SimSolrCloudTestCase.tearDown(SimSolrCloudTestCase.java:141)
	at sun.reflect.GeneratedMethodAccessor6.invoke(Unknown Source)
	at sun.reflect.DelegatingMethodAccessorImpl.invoke(DelegatingMethodAccessorImpl.java:43)
	at java.lang.reflect.Method.invoke(Method.java:498)
	at com.carrotsearch.randomizedtesting.RandomizedRunner.invoke(RandomizedRunner.java:1737)
	at com.carrotsearch.randomizedtesting.RandomizedRunner$10.evaluate(RandomizedRunner.java:992)
	at com.carrotsearch.randomizedtesting.rules.SystemPropertiesRestoreRule$1.evaluate(SystemPropertiesRestoreRule.java:57)
	at org.apache.lucene.util.TestRuleSetupTeardownChained$1.evaluate(TestRuleSetupTeardownChained.java:49)
	at org.apache.lucene.util.AbstractBeforeAfterRule$1.evaluate(AbstractBeforeAfterRule.java:45)
	at org.apache.lucene.util.TestRuleThreadAndTestName$1.evaluate(TestRuleThreadAndTestName.java:48)
	at org.apache.lucene.util.TestRuleIgnoreAfterMaxFailures$1.evaluate(TestRuleIgnoreAfterMaxFailures.java:64)
	at org.apache.lucene.util.TestRuleMarkFailure$1.evaluate(TestRuleMarkFailure.java:47)
	at com.carrotsearch.randomizedtesting.rules.StatementAdapter.evaluate(StatementAdapter.java:36)
	at com.carrotsearch.randomizedtesting.ThreadLeakControl$StatementRunner.run(ThreadLeakControl.java:368)
	at com.carrotsearch.randomizedtesting.ThreadLeakControl.forkTimeoutingTask(ThreadLeakControl.java:817)
	at com.carrotsearch.randomizedtesting.ThreadLeakControl$3.evaluate(ThreadLeakControl.java:468)
	at com.carrotsearch.randomizedtesting.RandomizedRunner.runSingleTest(RandomizedRunner.java:943)
	at com.carrotsearch.randomizedtesting.RandomizedRunner$5.evaluate(RandomizedRunner.java:829)
	at com.carrotsearch.randomizedtesting.RandomizedRunner$6.evaluate(RandomizedRunner.java:879)
	at com.carrotsearch.randomizedtesting.RandomizedRunner$7.evaluate(RandomizedRunner.java:890)
	at com.carrotsearch.randomizedtesting.rules.StatementAdapter.evaluate(StatementAdapter.java:36)
	at com.carrotsearch.randomizedtesting.rules.SystemPropertiesRestoreRule$1.evaluate(SystemPropertiesRestoreRule.java:57)
	at org.apache.lucene.util.AbstractBeforeAfterRule$1.evaluate(AbstractBeforeAfterRule.java:45)
	at com.carrotsearch.randomizedtesting.rules.StatementAdapter.evaluate(StatementAdapter.java:36)
	at org.apache.lucene.util.TestRuleStoreClassName$1.evaluate(TestRuleStoreClassName.java:41)
	at com.carrotsearch.randomizedtesting.rules.NoShadowingOrOverridesOnMethodsRule$1.evaluate(NoShadowingOrOverridesOnMethodsRule.java:40)
	at com.carrotsearch.randomizedtesting.rules.NoShadowingOrOverridesOnMethodsRule$1.evaluate(NoShadowingOrOverridesOnMethodsRule.java:40)
	at com.carrotsearch.randomizedtesting.rules.StatementAdapter.evaluate(StatementAdapter.java:36)
	at com.carrotsearch.randomizedtesting.rules.StatementAdapter.evaluate(StatementAdapter.java:36)
	at com.carrotsearch.randomizedtesting.rules.StatementAdapter.evaluate(StatementAdapter.java:36)
	at org.apache.lucene.util.TestRuleAssertionsRequired$1.evaluate(TestRuleAssertionsRequired.java:53)
	at org.apache.lucene.util.TestRuleMarkFailure$1.evaluate(TestRuleMarkFailure.java:47)
	at org.apache.lucene.util.TestRuleIgnoreAfterMaxFailures$1.evaluate(TestRuleIgnoreAfterMaxFailures.java:64)
	at org.apache.lucene.util.TestRuleIgnoreTestSuites$1.evaluate(TestRuleIgnoreTestSuites.java:54)
	at com.carrotsearch.randomizedtesting.rules.StatementAdapter.evaluate(StatementAdapter.java:36)
	at com.carrotsearch.randomizedtesting.ThreadLeakControl$StatementRunner.run(ThreadLeakControl.java:368)
	at java.lang.Thread.run(Thread.java:748)




Build Log:
[...truncated 11955 lines...]
   [junit4] Suite: org.apache.solr.cloud.autoscaling.sim.TestExecutePlanAction
   [junit4]   2> Creating dataDir: /export/home/jenkins/workspace/Lucene-Solr-master-Solaris/solr/build/solr-core/test/J0/temp/solr.cloud.autoscaling.sim.TestExecutePlanAction_A53DB481A98D1384-001/init-core-data-001
   [junit4]   2> 612713 WARN  (SUITE-TestExecutePlanAction-seed#[A53DB481A98D1384]-worker) [    ] o.a.s.SolrTestCaseJ4 startTrackingSearchers: numOpens=6 numCloses=6
   [junit4]   2> 612713 INFO  (SUITE-TestExecutePlanAction-seed#[A53DB481A98D1384]-worker) [    ] o.a.s.SolrTestCaseJ4 Using PointFields (NUMERIC_POINTS_SYSPROP=true) w/NUMERIC_DOCVALUES_SYSPROP=false
   [junit4]   2> 612716 INFO  (SUITE-TestExecutePlanAction-seed#[A53DB481A98D1384]-worker) [    ] o.a.s.SolrTestCaseJ4 Randomized ssl (false) and clientAuth (true) via: @org.apache.solr.util.RandomizeSSL(reason=, value=NaN, ssl=NaN, clientAuth=NaN)
   [junit4]   2> 612716 INFO  (SUITE-TestExecutePlanAction-seed#[A53DB481A98D1384]-worker) [    ] o.a.s.SolrTestCaseJ4 SecureRandom sanity checks: test.solr.allowed.securerandom=null & java.security.egd=file:/dev/./urandom
   [junit4]   2> 612733 DEBUG (Simulated OverseerAutoScalingTriggerThread) [    ] o.a.s.c.a.OverseerTriggerThread Adding .autoAddReplicas trigger
   [junit4]   2> 612733 DEBUG (Simulated OverseerAutoScalingTriggerThread) [    ] o.a.s.c.a.OverseerTriggerThread Refreshing /autoscaling.json with znode version 0
   [junit4]   2> 612733 DEBUG (Simulated OverseerAutoScalingTriggerThread) [    ] o.a.s.c.a.NodeLostTrigger Initial livenodes: [127.0.0.1:10000_solr]
   [junit4]   2> 612733 DEBUG (Simulated OverseerAutoScalingTriggerThread) [    ] o.a.s.c.a.OverseerTriggerThread Current znodeVersion 0, lastZnodeVersion -1
   [junit4]   2> 612733 DEBUG (Simulated OverseerAutoScalingTriggerThread) [    ] o.a.s.c.a.OverseerTriggerThread Processed trigger updates upto znodeVersion 0
   [junit4]   2> 612737 INFO  (TEST-TestExecutePlanAction.testExecute-seed#[A53DB481A98D1384]) [    ] o.a.s.SolrTestCaseJ4 ###Starting testExecute
   [junit4]   2> 612738 DEBUG (Simulated OverseerAutoScalingTriggerThread) [    ] o.a.s.c.a.OverseerTriggerThread -- clean old nodeAdded markers
   [junit4]   2> 612738 DEBUG (Simulated OverseerAutoScalingTriggerThread) [    ] o.a.s.c.a.OverseerTriggerThread Current znodeVersion 0, lastZnodeVersion 0
   [junit4]   2> 612738 DEBUG (TEST-TestExecutePlanAction.testExecute-seed#[A53DB481A98D1384]) [    ] o.a.s.c.a.OverseerTriggerThread Refreshing /autoscaling.json with znode version 1
   [junit4]   2> 612738 DEBUG (Simulated OverseerAutoScalingTriggerThread) [    ] o.a.s.c.a.OverseerTriggerThread Processed trigger updates upto znodeVersion 1
   [junit4]   2> 612739 INFO  (TEST-TestExecutePlanAction.testExecute-seed#[A53DB481A98D1384]) [    ] o.a.s.c.a.s.SimCloudManager === Restarting OverseerTriggerThread and clearing object cache...
   [junit4]   2> 612740 DEBUG (Simulated OverseerAutoScalingTriggerThread) [    ] o.a.s.c.a.OverseerTriggerThread -- clean old nodeLost markers
   [junit4]   2> 612740 DEBUG (Simulated OverseerAutoScalingTriggerThread) [    ] o.a.s.c.a.OverseerTriggerThread -- clean old nodeAdded markers
   [junit4]   2> 612740 WARN  (Simulated OverseerAutoScalingTriggerThread) [    ] o.a.s.c.a.OverseerTriggerThread Interrupted
   [junit4]   2> java.lang.InterruptedException
   [junit4]   2> 	at java.util.concurrent.locks.AbstractQueuedSynchronizer.acquireInterruptibly(AbstractQueuedSynchronizer.java:1220)
   [junit4]   2> 	at java.util.concurrent.locks.ReentrantLock.lockInterruptibly(ReentrantLock.java:335)
   [junit4]   2> 	at org.apache.solr.cloud.autoscaling.OverseerTriggerThread.run(OverseerTriggerThread.java:154)
   [junit4]   2> 	at java.lang.Thread.run(Thread.java:748)
   [junit4]   2> 612740 WARN  (ScheduledTrigger-2424-thread-1) [    ] o.a.s.c.a.NodeLostTrigger NodeLostTrigger ran but was already closed
   [junit4]   2> 612741 DEBUG (TEST-TestExecutePlanAction.testExecute-seed#[A53DB481A98D1384]) [    ] o.a.s.c.a.OverseerTriggerThread OverseerTriggerThread has been closed explicitly
   [junit4]   2> 612741 DEBUG (Simulated OverseerAutoScalingTriggerThread) [    ] o.a.s.c.a.OverseerTriggerThread Adding .autoAddReplicas trigger
   [junit4]   2> 612741 DEBUG (Simulated OverseerAutoScalingTriggerThread) [    ] o.a.s.c.a.OverseerTriggerThread Refreshing /autoscaling.json with znode version 2
   [junit4]   2> 612741 DEBUG (Simulated OverseerAutoScalingTriggerThread) [    ] o.a.s.c.a.NodeLostTrigger Initial livenodes: [127.0.0.1:10001_solr, 127.0.0.1:10000_solr]
   [junit4]   2> 612741 DEBUG (Simulated OverseerAutoScalingTriggerThread) [    ] o.a.s.c.a.OverseerTriggerThread Current znodeVersion 2, lastZnodeVersion -1
   [junit4]   2> 612741 DEBUG (Simulated OverseerAutoScalingTriggerThread) [    ] o.a.s.c.a.OverseerTriggerThread Processed trigger updates upto znodeVersion 2
   [junit4]   2> 612741 DEBUG (Simulated OverseerAutoScalingTriggerThread) [    ] o.a.s.c.a.OverseerTriggerThread -- clean old nodeAdded markers
   [junit4]   2> 612741 DEBUG (Simulated OverseerAutoScalingTriggerThread) [    ] o.a.s.c.a.OverseerTriggerThread Current znodeVersion 2, lastZnodeVersion 2
   [junit4]   2> 612742 DEBUG (ScheduledTrigger-2427-thread-1) [    ] o.a.s.c.a.NodeLostTrigger Running NodeLostTrigger: .auto_add_replicas with currently live nodes: 2
   [junit4]   2> 612762 DEBUG (ScheduledTrigger-2427-thread-1) [    ] o.a.s.c.a.NodeLostTrigger Running NodeLostTrigger: .auto_add_replicas with currently live nodes: 2
   [junit4]   2> 612782 DEBUG (ScheduledTrigger-2427-thread-1) [    ] o.a.s.c.a.NodeLostTrigger Running NodeLostTrigger: .auto_add_replicas with currently live nodes: 2
   [junit4]   2> 612803 DEBUG (ScheduledTrigger-2427-thread-2) [    ] o.a.s.c.a.NodeLostTrigger Running NodeLostTrigger: .auto_add_replicas with currently live nodes: 2
   [junit4]   2> 612823 DEBUG (ScheduledTrigger-2427-thread-2) [    ] o.a.s.c.a.NodeLostTrigger Running NodeLostTrigger: .auto_add_replicas with currently live nodes: 2
   [junit4]   2> 612843 DEBUG (ScheduledTrigger-2427-thread-1) [    ] o.a.s.c.a.NodeLostTrigger Running NodeLostTrigger: .auto_add_replicas with currently live nodes: 2
   [junit4]   2> 612844 DEBUG (simCloudManagerPool-2426-thread-1) [    ] o.a.s.c.o.ClusterStateMutator building a new cName: testExecute
   [junit4]   2> 612856 DEBUG (simCloudManagerPool-2426-thread-1) [    ] o.a.s.c.Assign Identify nodes using default
   [junit4]   2> 612863 DEBUG (ScheduledTrigger-2427-thread-1) [    ] o.a.s.c.a.NodeLostTrigger Running NodeLostTrigger: .auto_add_replicas with currently live nodes: 2
   [junit4]   2> 612882 INFO  (TEST-TestExecutePlanAction.testExecute-seed#[A53DB481A98D1384]) [    ] o.a.s.c.a.s.TestExecutePlanAction Collection ready after 1124ms
   [junit4]   2> 612884 DEBUG (ScheduledTrigger-2427-thread-1) [    ] o.a.s.c.a.NodeLostTrigger Running NodeLostTrigger: .auto_add_replicas with currently live nodes: 2
   [junit4]   2> 612885 DEBUG (TEST-TestExecutePlanAction.testExecute-seed#[A53DB481A98D1384]) [    ] o.a.s.c.a.ExecutePlanAction -- processing event: {
   [junit4]   2>   "id":"150456d0df6d5540Tcklght3lihds2y40g5idki4kc",
   [junit4]   2>   "source":"mock_trigger_name",
   [junit4]   2>   "eventTime":1514430829805000000,
   [junit4]   2>   "eventType":"NODELOST",
   [junit4]   2>   "properties":{
   [junit4]   2>     "eventTimes":[1514430829805000000],
   [junit4]   2>     "nodeNames":["127.0.0.1:10001_solr"]}} with context properties: {operations=[org.apache.solr.client.solrj.request.CollectionAdminRequest$MoveReplica@1060eb3d, org.apache.solr.cloud.autoscaling.sim.TestExecutePlanAction$1@25739ae7]}
   [junit4]   2> 612885 DEBUG (TEST-TestExecutePlanAction.testExecute-seed#[A53DB481A98D1384]) [    ] o.a.s.c.a.ExecutePlanAction Executing operation: action=MOVEREPLICA&collection=testExecute&targetNode=127.0.0.1:10000_solr&inPlaceMove=true&replica=core_node1
   [junit4]   2> 612904 DEBUG (ScheduledTrigger-2427-thread-1) [    ] o.a.s.c.a.NodeLostTrigger Running NodeLostTrigger: .auto_add_replicas with currently live nodes: 2
   [junit4]   2> 612924 DEBUG (ScheduledTrigger-2427-thread-1) [    ] o.a.s.c.a.NodeLostTrigger Running NodeLostTrigger: .auto_add_replicas with currently live nodes: 2
   [junit4]   2> 612944 DEBUG (ScheduledTrigger-2427-thread-1) [    ] o.a.s.c.a.NodeLostTrigger Running NodeLostTrigger: .auto_add_replicas with currently live nodes: 2
   [junit4]   2> 612964 DEBUG (ScheduledTrigger-2427-thread-1) [    ] o.a.s.c.a.NodeLostTrigger Running NodeLostTrigger: .auto_add_replicas with currently live nodes: 2
   [junit4]   2> 612985 DEBUG (ScheduledTrigger-2427-thread-1) [    ] o.a.s.c.a.NodeLostTrigger Running NodeLostTrigger: .auto_add_replicas with currently live nodes: 2
   [junit4]   2> 612987 DEBUG (simCloudManagerPool-2426-thread-4) [    ] o.a.s.c.a.s.SimClusterStateProvider -- new replica: {"core_node4":{
   [junit4]   2>     "core":"testExecute_shard1_replica_n3",
   [junit4]   2>     "shard":"shard1",
   [junit4]   2>     "collection":"testExecute",
   [junit4]   2>     "node_name":"127.0.0.1:10000_solr",
   [junit4]   2>     "type":"NRT"}}
   [junit4]   2> 613005 DEBUG (ScheduledTrigger-2427-thread-1) [    ] o.a.s.c.a.NodeLostTrigger Running NodeLostTrigger: .auto_add_replicas with currently live nodes: 2
   [junit4]   2> 613025 DEBUG (ScheduledTrigger-2427-thread-1) [    ] o.a.s.c.a.NodeLostTrigger Running NodeLostTrigger: .auto_add_replicas with currently live nodes: 2
   [junit4]   2> 613045 DEBUG (ScheduledTrigger-2427-thread-1) [    ] o.a.s.c.a.NodeLostTrigger Running NodeLostTrigger: .auto_add_replicas with currently live nodes: 2
   [junit4]   2> 613066 DEBUG (ScheduledTrigger-2427-thread-1) [    ] o.a.s.c.a.NodeLostTrigger Running NodeLostTrigger: .auto_add_replicas with currently live nodes: 2
   [junit4]   2> 613088 DEBUG (ScheduledTrigger-2427-thread-1) [    ] o.a.s.c.a.NodeLostTrigger Running NodeLostTrigger: .auto_add_replicas with currently live nodes: 2
   [junit4]   2> 613105 DEBUG (TEST-TestExecutePlanAction.testExecute-seed#[A53DB481A98D1384]) [    ] o.a.s.c.a.ExecutePlanAction Executing operation: action=OVERSEERSTATUS
   [junit4]   2> 613106 DEBUG (simCloudManagerPool-2426-thread-5) [    ] o.a.s.c.a.s.SimClusterStateProvider -- elected new leader for testExecute / shard1: {"core_node2":{
   [junit4]   2>     "node_name":"127.0.0.1:10000_solr",
   [junit4]   2>     "core":"testExecute_shard1_replica_n2",
   [junit4]   2>     "leader":"true",
   [junit4]   2>     "state":"active",
   [junit4]   2>     "type":"NRT",
   [junit4]   2>     "INDEX.sizeInBytes":123450000,
   [junit4]   2>     "shard":"shard1",
   [junit4]   2>     "collection":"testExecute"}}
   [junit4]   2> 613108 DEBUG (ScheduledTrigger-2427-thread-1) [    ] o.a.s.c.a.NodeLostTrigger Running NodeLostTrigger: .auto_add_replicas with currently live nodes: 2
   [junit4]   2> 613110 INFO  (TEST-TestExecutePlanAction.testExecute-seed#[A53DB481A98D1384]) [    ] o.a.s.c.a.s.TestExecutePlanAction Collection ready after 8ms
   [junit4]   2> 613110 INFO  (TEST-TestExecutePlanAction.testExecute-seed#[A53DB481A98D1384]) [    ] o.a.s.c.a.s.TestExecutePlanAction -------------_ FINAL STATE --------------
   [junit4]   2> 613110 INFO  (TEST-TestExecutePlanAction.testExecute-seed#[A53DB481A98D1384]) [    ] o.a.s.c.a.s.TestExecutePlanAction * Node values: {
   [junit4]   2>   "127.0.0.1:10001_solr":{
   [junit4]   2>     "sysprop.java.vendor":"Oracle Corporation",
   [junit4]   2>     "cores":0,
   [junit4]   2>     "host":"127.0.0.1",
   [junit4]   2>     "freedisk":1000,
   [junit4]   2>     "sysprop.java.version":"1.8.0_152",
   [junit4]   2>     "ip_1":"127",
   [junit4]   2>     "ip_3":"0",
   [junit4]   2>     "ip_2":"0",
   [junit4]   2>     "ip_4":"1",
   [junit4]   2>     "node":"127.0.0.1:10001_solr",
   [junit4]   2>     "metrics:solr.jvm:buffers.direct.Count":0,
   [junit4]   2>     "port":10001,
   [junit4]   2>     "heapUsage":123450000,
   [junit4]   2>     "sysLoadAvg":1.0,
   [junit4]   2>     "metrics:solr.node:ADMIN./admin/authorization.clientErrors:count":0},
   [junit4]   2>   "127.0.0.1:10000_solr":{
   [junit4]   2>     "sysprop.java.vendor":"Oracle Corporation",
   [junit4]   2>     "cores":2,
   [junit4]   2>     "host":"127.0.0.1",
   [junit4]   2>     "freedisk":980,
   [junit4]   2>     "sysprop.java.version":"1.8.0_152",
   [junit4]   2>     "ip_1":"127",
   [junit4]   2>     "ip_3":"0",
   [junit4]   2>     "ip_2":"0",
   [junit4]   2>     "ip_4":"1",
   [junit4]   2>     "node":"127.0.0.1:10000_solr",
   [junit4]   2>     "metrics:solr.jvm:buffers.direct.Count":0,
   [junit4]   2>     "port":10000,
   [junit4]   2>     "heapUsage":123450000,
   [junit4]   2>     "sysLoadAvg":1.0,
   [junit4]   2>     "metrics:solr.node:ADMIN./admin/authorization.clientErrors:count":0}}
   [junit4]   2> 613110 INFO  (TEST-TestExecutePlanAction.testExecute-seed#[A53DB481A98D1384]) [    ] o.a.s.c.a.s.TestExecutePlanAction * Live nodes: [127.0.0.1:10001_solr, 127.0.0.1:10000_solr]
   [junit4]   2> 613112 INFO  (TEST-TestExecutePlanAction.testExecute-seed#[A53DB481A98D1384]) [    ] o.a.s.c.a.s.TestExecutePlanAction * Collection testExecute state: DocCollection(testExecute//clusterstate.json/3)={
   [junit4]   2>   "replicationFactor":"2",
   [junit4]   2>   "pullReplicas":"0",
   [junit4]   2>   "router":{"name":"compositeId"},
   [junit4]   2>   "maxShardsPerNode":"1",
   [junit4]   2>   "autoAddReplicas":"false",
   [junit4]   2>   "nrtReplicas":"2",
   [junit4]   2>   "tlogReplicas":"0",
   [junit4]   2>   "autoCreated":"true",
   [junit4]   2>   "shards":{"shard1":{
   [junit4]   2>       "replicas":{
   [junit4]   2>         "core_node2":{
   [junit4]   2>           "core":"testExecute_shard1_replica_n2",
   [junit4]   2>           "leader":"true",
   [junit4]   2>           "INDEX.sizeInBytes":123450000,
   [junit4]   2>           "node_name":"127.0.0.1:10000_solr",
   [junit4]   2>           "state":"active",
   [junit4]   2>           "type":"NRT"},
   [junit4]   2>         "core_node4":{
   [junit4]   2>           "node_name":"127.0.0.1:10000_solr",
   [junit4]   2>           "core":"testExecute_shard1_replica_n3",
   [junit4]   2>           "state":"active",
   [junit4]   2>           "INDEX.sizeInBytes":123450000,
   [junit4]   2>           "type":"NRT"}},
   [junit4]   2>       "range":"80000000-7fffffff",
   [junit4]   2>       "state":"active"}}}
   [junit4]   2> 613112 INFO  (TEST-TestExecutePlanAction.testExecute-seed#[A53DB481A98D1384]) [    ] o.a.s.SolrTestCaseJ4 ###Ending testExecute
   [junit4]   2> 613112 INFO  (TEST-TestExecutePlanAction.testExecute-seed#[A53DB481A98D1384]) [    ] o.a.s.c.a.s.SimSolrCloudTestCase 
   [junit4]   2> 
   [junit4]   2> 613112 INFO  (TEST-TestExecutePlanAction.testExecute-seed#[A53DB481A98D1384]) [    ] o.a.s.c.a.s.SimSolrCloudTestCase #############################################
   [junit4]   2> 613112 INFO  (TEST-TestExecutePlanAction.testExecute-seed#[A53DB481A98D1384]) [    ] o.a.s.c.a.s.SimSolrCloudTestCase ############ FINAL CLUSTER STATS ############
   [junit4]   2> 613112 INFO  (TEST-TestExecutePlanAction.testExecute-seed#[A53DB481A98D1384]) [    ] o.a.s.c.a.s.SimSolrCloudTestCase #############################################
   [junit4]   2> 
   [junit4]   2> 613112 INFO  (TEST-TestExecutePlanAction.testExecute-seed#[A53DB481A98D1384]) [    ] o.a.s.c.a.s.SimSolrCloudTestCase ## Live nodes:		2
   [junit4]   2> 613114 INFO  (TEST-TestExecutePlanAction.testExecute-seed#[A53DB481A98D1384]) [    ] o.a.s.c.a.s.SimSolrCloudTestCase ## Empty nodes:	1
   [junit4]   2> 613114 INFO  (TEST-TestExecutePlanAction.testExecute-seed#[A53DB481A98D1384]) [    ] o.a.s.c.a.s.SimSolrCloudTestCase ## Dead nodes:		0
   [junit4]   2> 613114 INFO  (TEST-TestExecutePlanAction.testExecute-seed#[A53DB481A98D1384]) [    ] o.a.s.c.a.s.SimSolrCloudTestCase ## Collections:	[testExecute]
   [junit4]   2> 613114 INFO  (TEST-TestExecutePlanAction.testExecute-seed#[A53DB481A98D1384]) [    ] o.a.s.c.a.s.SimSolrCloudTestCase ## Max replicas per node:	2
   [junit4]   2> 613114 INFO  (TEST-TestExecutePlanAction.testExecute-seed#[A53DB481A98D1384]) [    ] o.a.s.c.a.s.SimSolrCloudTestCase ## Min replicas per node:	0
   [junit4]   2> 613114 INFO  (TEST-TestExecutePlanAction.testExecute-seed#[A53DB481A98D1384]) [    ] o.a.s.c.a.s.SimSolrCloudTestCase ## Total replicas:		2
   [junit4]   2> 613115 INFO  (TEST-TestExecutePlanAction.testExecute-seed#[A53DB481A98D1384]) [    ] o.a.s.c.a.s.SimSolrCloudTestCase ## * testExecute		2
   [junit4]   2> 613116 INFO  (TEST-TestExecutePlanAction.testExecute-seed#[A53DB481A98D1384]) [    ] o.a.s.c.a.s.SimSolrCloudTestCase ##		- active           2
   [junit4]   2> 613116 INFO  (TEST-TestExecutePlanAction.testExecute-seed#[A53DB481A98D1384]) [    ] o.a.s.c.a.s.SimSolrCloudTestCase ######### Final Solr op counts ##########
   [junit4]   2> 613117 INFO  (TEST-TestExecutePlanAction.testExecute-seed#[A53DB481A98D1384]) [    ] o.a.s.c.a.s.SimSolrCloudTestCase ##		- CREATE             1
   [junit4]   2> 613117 INFO  (TEST-TestExecutePlanAction.testExecute-seed#[A53DB481A98D1384]) [    ] o.a.s.c.a.s.SimSolrCloudTestCase ##		- DELETESTATUS       2
   [junit4]   2> 613117 INFO  (TEST-TestExecutePlanAction.testExecute-seed#[A53DB481A98D1384]) [    ] o.a.s.c.a.s.SimSolrCloudTestCase ##		- MOVEREPLICA        1
   [junit4]   2> 613117 INFO  (TEST-TestExecutePlanAction.testExecute-seed#[A53DB481A98D1384]) [    ] o.a.s.c.a.s.SimSolrCloudTestCase ##		- OVERSEERSTATUS     1
   [junit4]   2> 613117 INFO  (TEST-TestExecutePlanAction.testExecute-seed#[A53DB481A98D1384]) [    ] o.a.s.c.a.s.SimSolrCloudTestCase ##		- REQUESTSTATUS      2
   [junit4]   2> 613117 INFO  (TEST-TestExecutePlanAction.testExecute-seed#[A53DB481A98D1384]) [    ] o.a.s.c.a.s.SimSolrCloudTestCase ######### Autoscaling event counts ###########
   [junit4]   2> 613130 DEBUG (ScheduledTrigger-2427-thread-1) [    ] o.a.s.c.a.NodeLostTrigger Running NodeLostTrigger: .auto_add_replicas with currently live nodes: 2
   [junit4]   2> 613131 INFO  (TEST-TestExecutePlanAction.testIntegration-seed#[A53DB481A98D1384]) [    ] o.a.s.SolrTestCaseJ4 ###Starting testIntegration
   [junit4]   2> 613131 DEBUG (TEST-TestExecutePlanAction.testIntegration-seed#[A53DB481A98D1384]) [    ] o.a.s.c.a.OverseerTriggerThread Refreshing /autoscaling.json with znode version 3
   [junit4]   2> 613131 INFO  (TEST-TestExecutePlanAction.testIntegration-seed#[A53DB481A98D1384]) [    ] o.a.s.c.a.s.SimCloudManager === Restarting OverseerTriggerThread and clearing object cache...
   [junit4]   2> 613133 WARN  (Simulated OverseerAutoScalingTriggerThread) [    ] o.a.s.c.a.OverseerTriggerThread OverseerTriggerThread woken up but we are closed, exiting.
   [junit4]   2> 613133 DEBUG (TEST-TestExecutePlanAction.testIntegration-seed#[A53DB481A98D1384]) [    ] o.a.s.c.a.OverseerTriggerThread OverseerTriggerThread has been closed explicitly
   [junit4]   2> 613134 DEBUG (Simulated OverseerAutoScalingTriggerThread) [    ] o.a.s.c.a.OverseerTriggerThread Adding .autoAddReplicas trigger
   [junit4]   2> 613134 DEBUG (Simulated OverseerAutoScalingTriggerThread) [    ] o.a.s.c.a.OverseerTriggerThread Refreshing /autoscaling.json with znode version 4
   [junit4]   2> 613134 DEBUG (Simulated OverseerAutoScalingTriggerThread) [    ] o.a.s.c.a.NodeLostTrigger Initial livenodes: [127.0.0.1:10001_solr, 127.0.0.1:10000_solr]
   [junit4]   2> 613134 DEBUG (Simulated OverseerAutoScalingTriggerThread) [    ] o.a.s.c.a.OverseerTriggerThread Current znodeVersion 4, lastZnodeVersion -1
   [junit4]   2> 613134 DEBUG (Simulated OverseerAutoScalingTriggerThread) [    ] o.a.s.c.a.OverseerTriggerThread Processed trigger updates upto znodeVersion 4
   [junit4]   2> 613134 DEBUG (Simulated OverseerAutoScalingTriggerThread) [    ] o.a.s.c.a.OverseerTriggerThread -- clean old nodeAdded markers
   [junit4]   2> 613134 DEBUG (Simulated OverseerAutoScalingTriggerThread) [    ] o.a.s.c.a.OverseerTriggerThread Current znodeVersion 4, lastZnodeVersion 4
   [junit4]   2> 613138 DEBUG (ScheduledTrigger-2430-thread-1) [    ] o.a.s.c.a.NodeLostTrigger Running NodeLostTrigger: .auto_add_replicas with currently live nodes: 2
   [junit4]   2> 613163 DEBUG (ScheduledTrigger-2430-thread-1) [    ] o.a.s.c.a.NodeLostTrigger Running NodeLostTrigger: .auto_add_replicas with currently live nodes: 2
   [junit4]   2> 613183 DEBUG (ScheduledTrigger-2430-thread-1) [    ] o.a.s.c.a.NodeLostTrigger Running NodeLostTrigger: .auto_add_replicas with currently live nodes: 2
   [junit4]   2> 613206 DEBUG (ScheduledTrigger-2430-thread-1) [    ] o.a.s.c.a.NodeLostTrigger Running NodeLostTrigger: .auto_add_replicas with currently live nodes: 2
   [junit4]   2> 613237 DEBUG (ScheduledTrigger-2430-thread-1) [    ] o.a.s.c.a.NodeLostTrigger Running NodeLostTrigger: .auto_add_replicas with currently live nodes: 2
   [junit4]   2> 613241 DEBUG (simCloudManagerPool-2429-thread-1) [    ] o.a.s.c.a.AutoScalingHandler Verified autoscaling configuration
   [junit4]   2> 613241 DEBUG (simCloudManagerPool-2429-thread-1) [    ] o.a.s.c.a.OverseerTriggerThread Refreshing /autoscaling.json with znode version 5
   [junit4]   2> 613242 DEBUG (simCloudManagerPool-2429-thread-1) [    ] o.a.s.c.a.NodeLostTrigger Initial livenodes: [127.0.0.1:10001_solr, 127.0.0.1:10000_solr]
   [junit4]   2> 613242 DEBUG (simCloudManagerPool-2429-thread-1) [    ] o.a.s.c.a.NodeLostTrigger Initial livenodes: [127.0.0.1:10001_solr, 127.0.0.1:10000_solr]
   [junit4]   2> 613242 DEBUG (Simulated OverseerAutoScalingTriggerThread) [    ] o.a.s.c.a.OverseerTriggerThread Processed trigger updates upto znodeVersion 5
   [junit4]   2> 613243 DEBUG (simCloudManagerPool-2429-thread-2) [    ] o.a.s.c.o.ClusterStateMutator building a new cName: testIntegration
   [junit4]   2> 613243 DEBUG (Simulated OverseerAutoScalingTriggerThread) [    ] o.a.s.c.a.OverseerTriggerThread -- clean old nodeAdded markers
   [junit4]   2> 613243 DEBUG (Simulated OverseerAutoScalingTriggerThread) [    ] o.a.s.c.a.OverseerTriggerThread Current znodeVersion 5, lastZnodeVersion 5
   [junit4]   2> 613243 DEBUG (ScheduledTrigger-2430-thread-2) [    ] o.a.s.c.a.NodeLostTrigger Running NodeLostTrigger: node_lost_trigger with currently live nodes: 2
   [junit4]   2> 613253 DEBUG (simCloudManagerPool-2429-thread-2) [    ] o.a.s.c.Assign Identify nodes using default
   [junit4]   2> 613257 DEBUG (ScheduledTrigger-2430-thread-1) [    ] o.a.s.c.a.NodeLostTrigger Running NodeLostTrigger: .auto_add_replicas with currently live nodes: 2
   [junit4]   2> 613263 DEBUG (ScheduledTrigger-2430-thread-2) [    ] o.a.s.c.a.NodeLostTrigger Running NodeLostTrigger: node_lost_trigger with currently live nodes: 2
   [junit4]   2> 613278 DEBUG (ScheduledTrigger-2430-thread-4) [    ] o.a.s.c.a.NodeLostTrigger Running NodeLostTrigger: .auto_add_replicas with currently live nodes: 1
   [junit4]   2> 613279 DEBUG (ScheduledTrigger-2430-thread-4) [    ] o.a.s.c.a.NodeLostTrigger Tracking lost node: 127.0.0.1:10000_solr
   [junit4]   2> 613280 DEBUG (simCloudManagerPool-2429-thread-5) [    ] o.a.s.c.a.s.SimClusterStateProvider -- elected new leader for testIntegration / shard1: {"core_node1":{
   [junit4]   2>     "node_name":"127.0.0.1:10001_solr",
   [junit4]   2>     "core":"testIntegration_shard1_replica_n1",
   [junit4]   2>     "leader":"true",
   [junit4]   2>     "state":"active",
   [junit4]   2>     "type":"NRT",
   [junit4]   2>     "INDEX.sizeInBytes":123450000,
   [junit4]   2>     "shard":"shard1",
   [junit4]   2>     "collection":"testIntegration"}}
   [junit4]   2> 613285 DEBUG (ScheduledTrigger-2430-thread-4) [    ] o.a.s.c.a.NodeLostTrigger Running NodeLostTrigger: node_lost_trigger with currently live nodes: 1
   [junit4]   2> 613285 DEBUG (ScheduledTrigger-2430-thread-4) [    ] o.a.s.c.a.NodeLostTrigger Tracking lost node: 127.0.0.1:10000_solr
   [junit4]   2> 613300 DEBUG (ScheduledTrigger-2430-thread-1) [    ] o.a.s.c.a.NodeLostTrigger Running NodeLostTrigger: .auto_add_replicas with currently live nodes: 1
   [junit4]   2> 613306 DEBUG (ScheduledTrigger-2430-thread-2) [    ] o.a.s.c.a.NodeLostTrigger Running NodeLostTrigger: node_lost_trigger with currently live nodes: 1
   [junit4]   2> 613306 DEBUG (ScheduledTrigger-2430-thread-2) [    ] o.a.s.c.a.NodeLostTrigger NodeLostTrigger firing registered processor for lost nodes: [127.0.0.1:10000_solr]
   [junit4]   2> 613306 DEBUG (ScheduledTrigger-2430-thread-2) [    ] o.a.s.c.a.ScheduledTriggers ++++++++ Cooldown inactive - processing event: {
   [junit4]   2>   "id":"7b98b90b137bfTcklght3lihds2y40g5idki4kd",
   [junit4]   2>   "source":"node_lost_trigger",
   [junit4]   2>   "eventTime":2174333916100543,
   [junit4]   2>   "eventType":"NODELOST",
   [junit4]   2>   "properties":{
   [junit4]   2>     "eventTimes":[2174333916100543],
   [junit4]   2>     "nodeNames":["127.0.0.1:10000_solr"]}}
   [junit4]   2> 613308 DEBUG (AutoscalingActionExecutor-2431-thread-1) [    ] o.a.s.c.a.ScheduledTriggers -- processing actions for {
   [junit4]   2>   "id":"7b98b90b137bfTcklght3lihds2y40g5idki4kd",
   [junit4]   2>   "source":"node_lost_trigger",
   [junit4]   2>   "eventTime":2174333916100543,
   [junit4]   2>   "eventType":"NODELOST",
   [junit4]   2>   "properties":{
   [junit4]   2>     "eventTimes":[2174333916100543],
   [junit4]   2>     "_enqueue_time_":2174334984352893,
   [junit4]   2>     "nodeNames":["127.0.0.1:10000_solr"]}}
   [junit4]   2> 613309 DEBUG (AutoscalingActionExecutor-2431-thread-1) [    ] o.a.s.c.a.ComputePlanAction -- processing event: {
   [junit4]   2>   "id":"7b98b90b137bfTcklght3lihds2y40g5idki4kd",
   [junit4]   2>   "source":"node_lost_trigger",
   [junit4]   2>   "eventTime":2174333916100543,
   [junit4]   2>   "eventType":"NODELOST",
   [junit4]   2>   "properties":{
   [junit4]   2>     "eventTimes":[2174333916100543],
   [junit4]   2>     "_enqueue_time_":2174334984352893,
   [junit4]   2>     "nodeNames":["127.0.0.1:10000_solr"]}} with context properties: {BEFORE_ACTION=[compute_plan]}
   [junit4]   2> 613311 INFO  (AutoscalingActionExecutor-2431-thread-1) [    ] o.a.s.c.a.ComputePlanAction Computed Plan: action=MOVEREPLICA&collection=testIntegration&targetNode=127.0.0.1:10001_solr&inPlaceMove=true&replica=core_node2
   [junit4]   2> 613311 INFO  (AutoscalingActionExecutor-2431-thread-1) [    ] o.a.s.c.s.c.a.PolicyHelper returnSession, curr-time 2174335242 sessionWrapper.createTime 2174335224443943, this.sessionWrapper.createTime 2174335224443943 
   [junit4]   2> 613312 DEBUG (AutoscalingActionExecutor-2431-thread-1) [    ] o.a.s.c.a.ExecutePlanAction -- processing event: {
   [junit4]   2>   "id":"7b98b90b137bfTcklght3lihds2y40g5idki4kd",
   [junit4]   2>   "source":"node_lost_trigger",
   [junit4]   2>   "eventTime":2174333916100543,
   [junit4]   2>   "eventType":"NODELOST",
   [junit4]   2>   "properties":{
   [junit4]   2>     "eventTimes":[2174333916100543],
   [junit4]   2>     "_enqueue_time_":2174334984352893,
   [junit4]   2>     "nodeNames":["127.0.0.1:10000_solr"]}} with context properties: {operations=[org.apache.solr.client.solrj.request.CollectionAdminRequest$MoveReplica@25908fff], AFTER_ACTION=[compute_plan], BEFORE_ACTION=[compute_plan, execute_plan]}
   [junit4]   2> 613312 DEBUG (AutoscalingActionExecutor-2431-thread-1) [    ] o.a.s.c.a.ExecutePlanAction Executing operation: action=MOVEREPLICA&collection=testIntegration&targetNode=127.0.0.1:10001_solr&inPlaceMove=true&replica=core_node2
   [junit4]   2> 613413 DEBUG (simCloudManagerPool-2429-thread-7) [    ] o.a.s.c.a.s.SimClusterStateProvider -- new replica: {"core_node4":{
   [junit4]   2>     "core":"testIntegration_shard1_replica_n3",
   [junit4]   2>     "shard":"shard1",
   [junit4]   2>     "collection":"testIntegration",
   [junit4]   2>     "node_name":"127.0.0.1:10001_solr",
   [junit4]   2>     "type":"NRT"}}
   [junit4]   2> 613524 INFO  (TEST-TestExecutePlanAction.testIntegration-seed#[A53DB481A98D1384]) [    ] o.a.s.c.a.s.TestExecutePlanAction -------------_ FINAL STATE --------------
   [junit4]   2> 613524 INFO  (TEST-TestExecutePlanAction.testIntegration-seed#[A53DB481A98D1384]) [    ] o.a.s.c.a.s.TestExecutePlanAction * Node values: {
   [junit4]   2>   "127.0.0.1:10001_solr":{
   [junit4]   2>     "sysprop.java.vendor":"Oracle Corporation",
   [junit4]   2>     "cores":2,
   [junit4]   2>     "host":"127.0.0.1",
   [junit4]   2>     "freedisk":980,
   [junit4]   2>     "sysprop.java.version":"1.8.0_152",
   [junit4]   2>     "ip_1":"127",
   [junit4]   2>     "ip_3":"0",
   [junit4]   2>     "ip_2":"0",
   [junit4]   2>     "ip_4":"1",
   [junit4]   2>     "node":"127.0.0.1:10001_solr",
   [junit4]   2>     "metrics:solr.jvm:buffers.direct.Count":0,
   [junit4]   2>     "port":10001,
   [junit4]   2>     "heapUsage":123450000,
   [junit4]   2>     "sysLoadAvg":1.0,
   [junit4]   2>     "metrics:solr.node:ADMIN./admin/authorization.clientErrors:count":0},
   [junit4]   2>   "127.0.0.1:10000_solr":{
   [junit4]   2>     "sysprop.java.vendor":"Oracle Corporation",
   [junit4]   2>     "cores":1,
   [junit4]   2>     "host":"127.0.0.1",
   [junit4]   2>     "freedisk":970,
   [junit4]   2>     "sysprop.java.version":"1.8.0_152",
   [junit4]   2>     "ip_1":"127",
   [junit4]   2>     "ip_3":"0",
   [junit4]   2>     "ip_2":"0",
   [junit4]   2>     "ip_4":"1",
   [junit4]   2>     "node":"127.0.0.1:10000_solr",
   [junit4]   2>     "metrics:solr.jvm:buffers.direct.Count":0,
   [junit4]   2>     "port":10000,
   [junit4]   2>     "heapUsage":123450000,
   [junit4]   2>     "sysLoadAvg":1.0,
   [junit4]   2>     "metrics:solr.node:ADMIN./admin/authorization.clientErrors:count":0}}
   [junit4]   2> 613525 INFO  (TEST-TestExecutePlanAction.testIntegration-seed#[A53DB481A98D1384]) [    ] o.a.s.c.a.s.TestExecutePlanAction * Live nodes: [127.0.0.1:10001_solr]
   [junit4]   2> 613525 INFO  (TEST-TestExecutePlanAction.testIntegration-seed#[A53DB481A98D1384]) [    ] o.a.s.c.a.s.TestExecutePlanAction * Collection testIntegration state: DocCollection(testIntegration//clusterstate.json/11)={
   [junit4]   2>   "replicationFactor":"2",
   [junit4]   2>   "pullReplicas":"0",
   [junit4]   2>   "router":{"name":"compositeId"},
   [junit4]   2>   "maxShardsPerNode":"1",
   [junit4]   2>   "autoAddReplicas":"false",
   [junit4]   2>   "nrtReplicas":"2",
   [junit4]   2>   "tlogReplicas":"0",
   [junit4]   2>   "autoCreated":"true",
   [junit4]   2>   "shards":{"shard1":{
   [junit4]   2>       "replicas":{
   [junit4]   2>         "core_node1":{
   [junit4]   2>           "core":"testIntegration_shard1_replica_n1",
   [junit4]   2>           "leader":"true",
   [junit4]   2>           "INDEX.sizeInBytes":123450000,
   [junit4]   2>           "node_name":"127.0.0.1:10001_solr",
   [junit4]   2>           "state":"active",
   [junit4]   2>           "type":"NRT"},
   [junit4]   2>         "core_node4":{
   [junit4]   2>           "node_name":"127.0.0.1:10001_solr",
   [junit4]   2>           "core":"testIntegration_shard1_replica_n3",
   [junit4]   2>           "state":"active",
   [junit4]   2>           "INDEX.sizeInBytes":123450000,
   [junit4]   2>           "type":"NRT"}},
   [junit4]   2>       "range":"80000000-7fffffff",
   [junit4]   2>       "state":"active"}}}
   [junit4]   2> 613525 INFO  (TEST-TestExecutePlanAction.testIntegration-seed#[A53DB481A98D1384]) [    ] o.a.s.SolrTestCaseJ4 ###Ending testIntegration
   [junit4]   2> 613525 INFO  (TEST-TestExecutePlanAction.testIntegration-seed#[A53DB481A98D1384]) [    ] o.a.s.c.a.s.SimSolrCloudTestCase 
   [junit4]   2> 
   [junit4]   2> 613525 INFO  (TEST-TestExecutePlanAction.testIntegration-seed#[A53DB481A98D1384]) [    ] o.a.s.c.a.s.SimSolrCloudTestCase #############################################
   [junit4]   2> 613525 INFO  (TEST-TestExecutePlanAction.testIntegration-seed#[A53DB481A98D1384]) [    ] o.a.s.c.a.s.SimSolrCloudTestCase ############ FINAL CLUSTER STATS ############
   [junit4]   2> 613525 INFO  (TEST-TestExecutePlanAction.testIntegration-seed#[A53DB481A98D1384]) [    ] o.a.s.c.a.s.SimSolrCloudTestCase #############################################
   [junit4]   2> 
   [junit4]   2> 613525 INFO  (TEST-TestExecutePlanAction.testIntegration-seed#[A53DB481A98D1384]) [    ] o.a.s.c.a.s.SimSolrCloudTestCase ## Live nodes:		1
   [junit4]   2> 613525 INFO  (TEST-TestExecutePlanAction.testIntegration-seed#[A53DB481A98D1384]) [    ] o.a.s.c.a.s.SimSolrCloudTestCase ## Empty nodes:	0
   [junit4]   2> 613525 INFO  (TEST-TestExecutePlanAction.testIntegration-seed#[A53DB481A98D1384]) [    ] o.a.s.c.a.s.SimSolrCloudTestCase ## Dead nodes:		1
   [junit4]   2> 613525 INFO  (TEST-TestExecutePlanAction.testIntegration-seed#[A53DB481A98D1384]) [    ] o.a.s.c.a.s.SimSolrCloudTestCase ##		127.0.0.1:10000_solr
   [junit4]   2> 613525 INFO  (TEST-TestExecutePlanAction.testIntegration-seed#[A53DB481A98D1384]) [    ] o.a.s.c.a.s.SimSolrCloudTestCase ## Collections:	[testIntegration]
   [junit4]   2> 613525 INFO  (TEST-TestExecutePlanAction.testIntegration-seed#[A53DB481A98D1384]) [    ] o.a.s.c.a.s.SimSolrCloudTestCase ## Max replicas per node:	2
   [junit4]   2> 613525 INFO  (TEST-TestExecutePlanAction.testIntegration-seed#[A53DB481A98D1384]) [    ] o.a.s.c.a.s.SimSolrCloudTestCase ## Min replicas per node:	2
   [junit4]   2> 613525 INFO  (TEST-TestExecutePlanAction.testIntegration-seed#[A53DB481A98D1384]) [    ] o.a.s.c.a.s.SimSolrCloudTestCase ## Total replicas:		2
   [junit4]   2> 613525 INFO  (TEST-TestExecutePlanAction.testIntegration-seed#[A53DB481A98D1384]) [    ] o.a.s.c.a.s.SimSolrCloudTestCase ## * testIntegration		2
   [junit4]   2> 613525 INFO  (TEST-TestExecutePlanAction.testIntegration-seed#[A53DB481A98D1384]) [    ] o.a.s.c.a.s.SimSolrCloudTestCase ##		- active           2
   [junit4]   2> 613525 INFO  (TEST-TestExecutePlanAction.testIntegration-seed#[A53DB481A98D1384]) [    ] o.a.s.c.a.s.SimSolrCloudTestCase ######### Final Solr op counts ##########
   [junit4]   2> 613525 INFO  (TEST-TestExecutePlanAction.testIntegration-seed#[A53DB481A98D1384]) [    ] o.a.s.c.a.s.SimSolrCloudTestCase ##		- CREATE             1
   [junit4]   2> 613525 INFO  (TEST-TestExecutePlanAction.testIntegration-seed#[A53DB481A98D1384]) [    ] o.a.s.c.a.s.SimSolrCloudTestCase ##		- DELETESTATUS       1
   [junit4]   2> 613525 INFO  (TEST-TestExecutePlanAction.testIntegration-seed#[A53DB481A98D1384]) [    ] o.a.s.c.a.s.SimSolrCloudTestCase ##		- MOVEREPLICA        1
   [junit4]   2> 613525 INFO  (TEST-TestExecutePlanAction.testIntegration-seed#[A53DB481A98D1384]) [    ] o.a.s.c.a.s.SimSolrCloudTestCase ##		- REQUESTSTATUS      1
   [junit4]   2> 613525 INFO  (TEST-TestExecutePlanAction.testIntegration-seed#[A53DB481A98D1384]) [    ] o.a.s.c.a.s.SimSolrCloudTestCase ##		- autoscaling        1
   [junit4]   2> 613525 INFO  (TEST-TestExecutePlanAction.testIntegration-seed#[A53DB481A98D1384]) [    ] o.a.s.c.a.s.SimSolrCloudTestCase ##		- update             1
   [junit4]   2> 613525 INFO  (TEST-TestExecutePlanAction.testIntegration-seed#[A53DB481A98D1384]) [    ] o.a.s.c.a.s.SimSolrCloudTestCase ######### Autoscaling event counts ###########
   [junit4]   2> 613526 DEBUG (AutoscalingActionExecutor-2431-thread-1) [    ] o.a.s.c.a.ScheduledTriggers -- processing took 10884 ms for event id=7b98b90b137bfTcklght3lihds2y40g5idki4kd
   [junit4]   2> 613527 DEBUG (ScheduledTrigger-2430-thread-3) [    ] o.a.s.c.a.NodeLostTrigger Running NodeLostTrigger: .auto_add_replicas with currently live nodes: 1
   [junit4]   2> NOTE: reproduce with: ant test  -Dtestcase=TestExecutePlanAction -Dtests.method=testIntegration -Dtests.seed=A53DB481A98D1384 -Dtests.slow=true -Dtests.locale=es-BO -Dtests.timezone=NST -Dtests.asserts=true -Dtests.file.encoding=UTF-8
   [junit4] ERROR   0.41s J0 | TestExecutePlanAction.testIntegration <<<
   [junit4]    > Throwable #1: java.util.ConcurrentModificationException
   [junit4]    > 	at __randomizedtesting.SeedInfo.seed([A53DB481A98D1384:155CBAAD8CB2B2A1]:0)
   [junit4]    > 	at java.util.ArrayList$Itr.checkForComodification(ArrayList.java:909)
   [junit4]    > 	at java.util.ArrayList$Itr.next(ArrayList.java:859)
   [junit4]    > 	at org.apache.solr.cloud.autoscaling.sim.SimSolrCloudTestCase.tearDown(SimSolrCloudTestCase.java:141)
   [junit4]    > 	at java.lang.Thread.run(Thread.java:748)
   [junit4]   2> 613528 WARN  (Simulated OverseerAutoScalingTriggerThread) [    ] o.a.s.c.a.OverseerTriggerThread OverseerTriggerThread woken up but we are closed, exiting.
   [junit4]   2> 613528 DEBUG (SUITE-TestExecutePlanAction-seed#[A53DB481A98D1384]-worker) [    ] o.a.s.c.a.OverseerTriggerThread OverseerTriggerThread has been closed explicitly
   [junit4]   2> NOTE: leaving temporary files on disk at: /export/home/jenkins/workspace/Lucene-Solr-master-Solaris/solr/build/solr-core/test/J0/temp/solr.cloud.autoscaling.sim.TestExecutePlanAction_A53DB481A98D1384-001
   [junit4]   2> Dec 28, 2017 3:13:50 AM com.carrotsearch.randomizedtesting.ThreadLeakControl checkThreadLeaks
   [junit4]   2> WARNING: Will linger awaiting termination of 1 leaked thread(s).
   [junit4]   2> NOTE: test params are: codec=Asserting(Lucene70): {}, docValues:{}, maxPointsInLeafNode=1338, maxMBSortInHeap=6.3034766291286335, sim=Asserting(org.apache.lucene.search.similarities.AssertingSimilarity@79f77186), locale=es-BO, timezone=NST
   [junit4]   2> NOTE: SunOS 5.11 amd64/Oracle Corporation 1.8.0_152 (64-bit)/cpus=3,threads=1,free=138888432,total=449957888
   [junit4]   2> NOTE: All tests run in this JVM: [TestFieldResource, TestPseudoReturnFields, SpellCheckCollatorWithCollapseTest, AutoAddReplicasPlanActionTest, MultiThreadedOCPTest, CdcrUpdateLogTest, AddBlockUpdateTest, TestRandomCollapseQParserPlugin, ShufflingReplicaListTransformerTest, TestQuerySenderListener, InfoHandlerTest, HLLSerializationTest, BinaryUpdateRequestHandlerTest, TestDynamicLoading, MetricTriggerTest, UniqFieldsUpdateProcessorFactoryTest, MergeStrategyTest, BlobRepositoryCloudTest, TestSolrDeletionPolicy2, UUIDFieldTest, ClassificationUpdateProcessorTest, TestFuzzyAnalyzedSuggestions, ConfigSetsAPITest, SyncSliceTest, HighlighterTest, TestFiltering, ReplaceNodeTest, SuggestComponentContextFilterQueryTest, TestDistributedStatsComponentCardinality, TestHttpShardHandlerFactory, TestManagedSynonymFilterFactory, TestOmitPositions, BigEndianAscendingWordSerializerTest, SuggesterWFSTTest, CleanupOldIndexTest, ClusterStateTest, DirectUpdateHandlerTest, PeerSyncWithIndexFingerprintCachingTest, DisMaxRequestHandlerTest, TestRestoreCore, TestIBSimilarityFactory, IndexBasedSpellCheckerTest, TestFieldCacheSort, UnloadDistributedZkTest, InfixSuggestersTest, TestNamedUpdateProcessors, TestJmxIntegration, ParsingFieldUpdateProcessorsTest, TestConfigSetProperties, HighlighterMaxOffsetTest, TestDocBasedVersionConstraints, TestOrdValues, TestStreamBody, TestIndexingPerformance, AssignBackwardCompatibilityTest, DistanceFunctionTest, DeleteNodeTest, TestCryptoKeys, AddReplicaTest, TriLevelCompositeIdRoutingTest, TestHdfsUpdateLog, TestEmbeddedSolrServerAdminHandler, TestCollapseQParserPlugin, RAMDirectoryFactoryTest, TestLockTree, MissingSegmentRecoveryTest, TestExecutePlanAction]
   [junit4] Completed [113/765 (1!)] on J0 in 1.09s, 2 tests, 1 error <<< FAILURES!

[...truncated 99 lines...]
   [junit4] Suite: org.apache.solr.cloud.MoveReplicaHDFSTest
   [junit4]   2> Creating dataDir: /export/home/jenkins/workspace/Lucene-Solr-master-Solaris/solr/build/solr-core/test/J0/temp/solr.cloud.MoveReplicaHDFSTest_A53DB481A98D1384-001/init-core-data-001
   [junit4]   2> 700921 INFO  (SUITE-MoveReplicaHDFSTest-seed#[A53DB481A98D1384]-worker) [    ] o.a.s.SolrTestCaseJ4 Using PointFields (NUMERIC_POINTS_SYSPROP=true) w/NUMERIC_DOCVALUES_SYSPROP=true
   [junit4]   2> 700922 INFO  (SUITE-MoveReplicaHDFSTest-seed#[A53DB481A98D1384]-worker) [    ] o.a.s.SolrTestCaseJ4 Randomized ssl (false) and clientAuth (false) via: @org.apache.solr.util.RandomizeSSL(reason=, value=NaN, ssl=NaN, clientAuth=NaN)
   [junit4]   2> 700922 INFO  (SUITE-MoveReplicaHDFSTest-seed#[A53DB481A98D1384]-worker) [    ] o.a.s.SolrTestCaseJ4 SecureRandom sanity checks: test.solr.allowed.securerandom=null & java.security.egd=file:/dev/./urandom
   [junit4]   2> 700922 INFO  (SUITE-MoveReplicaHDFSTest-seed#[A53DB481A98D1384]-worker) [    ] o.a.s.c.MiniSolrCloudCluster Starting cluster of 4 servers in /export/home/jenkins/workspace/Lucene-Solr-master-Solaris/solr/build/solr-core/test/J0/temp/solr.cloud.MoveReplicaHDFSTest_A53DB481A98D1384-001/tempDir-001
   [junit4]   2> 700923 INFO  (SUITE-MoveReplicaHDFSTest-seed#[A53DB481A98D1384]-worker) [    ] o.a.s.c.ZkTestServer STARTING ZK TEST SERVER
   [junit4]   2> 700923 INFO  (Thread-1542) [    ] o.a.s.c.ZkTestServer client port:0.0.0.0/0.0.0.0:0
   [junit4]   2> 700923 INFO  (Thread-1542) [    ] o.a.s.c.ZkTestServer Starting server
   [junit4]   2> 700924 ERROR (Thread-1542) [    ] o.a.z.s.ZooKeeperServer ZKShutdownHandler is not registered, so ZooKeeper server won't take any action on ERROR or SHUTDOWN server state changes
   [junit4]   2> 701023 INFO  (SUITE-MoveReplicaHDFSTest-seed#[A53DB481A98D1384]-worker) [    ] o.a.s.c.ZkTestServer start zk server on port:55653
   [junit4]   2> 701027 INFO  (zkConnectionManagerCallback-1446-thread-1) [    ] o.a.s.c.c.ConnectionManager zkClient has connected
   [junit4]   2> 701035 INFO  (jetty-launcher-1443-thread-1) [    ] o.e.j.s.Server jetty-9.3.20.v20170531
   [junit4]   2> 701036 INFO  (jetty-launcher-1443-thread-2) [    ] o.e.j.s.Server jetty-9.3.20.v20170531
   [junit4]   2> 701038 INFO  (jetty-launcher-1443-thread-3) [    ] o.e.j.s.Server jetty-9.3.20.v20170531
   [junit4]   2> 701038 INFO  (jetty-launcher-1443-thread-4) [    ] o.e.j.s.Server jetty-9.3.20.v20170531
   [junit4]   2> 701040 INFO  (jetty-launcher-1443-thread-1) [    ] o.e.j.s.h.ContextHandler Started o.e.j.s.ServletContextHandler@32c03363{/solr,null,AVAILABLE}
   [junit4]   2> 701043 INFO  (jetty-launcher-1443-thread-4) [    ] o.e.j.s.h.ContextHandler Started o.e.j.s.ServletContextHandler@6aefb361{/solr,null,AVAILABLE}
   [junit4]   2> 701045 INFO  (jetty-launcher-1443-thread-3) [    ] o.e.j.s.h.ContextHandler Started o.e.j.s.ServletContextHandler@3c340347{/solr,null,AVAILABLE}
   [junit4]   2> 701047 INFO  (jetty-launcher-1443-thread-2) [    ] o.e.j.s.h.ContextHandler Started o.e.j.s.ServletContextHandler@4ab5b712{/solr,null,AVAILABLE}
   [junit4]   2> 701048 INFO  (jetty-launcher-1443-thread-2) [    ] o.e.j.s.AbstractConnector Started ServerConnector@48f67e32{HTTP/1.1,[http/1.1]}{127.0.0.1:38423}
   [junit4]   2> 701048 INFO  (jetty-launcher-1443-thread-2) [    ] o.e.j.s.Server Started @703489ms
   [junit4]   2> 701048 INFO  (jetty-launcher-1443-thread-2) [    ] o.a.s.c.s.e.JettySolrRunner Jetty properties: {hostContext=/solr, hostPort=38423}
   [junit4]   2> 701048 ERROR (jetty-launcher-1443-thread-2) [    ] o.a.s.u.StartupLoggingUtils Missing Java Option solr.log.dir. Logging may be missing or incomplete.
   [junit4]   2> 701048 INFO  (jetty-launcher-1443-thread-2) [    ] o.a.s.s.SolrDispatchFilter  ___      _       Welcome to Apache Solr™ version 8.0.0
   [junit4]   2> 701049 INFO  (jetty-launcher-1443-thread-2) [    ] o.a.s.s.SolrDispatchFilter / __| ___| |_ _   Starting in cloud mode on port null
   [junit4]   2> 701049 INFO  (jetty-launcher-1443-thread-2) [    ] o.a.s.s.SolrDispatchFilter \__ \/ _ \ | '_|  Install dir: null
   [junit4]   2> 701049 INFO  (jetty-launcher-1443-thread-2) [    ] o.a.s.s.SolrDispatchFilter |___/\___/_|_|    Start time: 2017-12-28T03:15:17.969Z
   [junit4]   2> 701049 INFO  (jetty-launcher-1443-thread-3) [    ] o.e.j.s.AbstractConnector Started ServerConnector@4ce14201{HTTP/1.1,[http/1.1]}{127.0.0.1:41820}
   [junit4]   2> 701050 INFO  (jetty-launcher-1443-thread-3) [    ] o.e.j.s.Server Started @703491ms
   [junit4]   2> 701050 INFO  (jetty-launcher-1443-thread-3) [    ] o.a.s.c.s.e.JettySolrRunner Jetty properties: {hostContext=/solr, hostPort=41820}
   [junit4]   2> 701050 ERROR (jetty-launcher-1443-thread-3) [    ] o.a.s.u.StartupLoggingUtils Missing Java Option solr.log.dir. Logging may be missing or incomplete.
   [junit4]   2> 701050 INFO  (jetty-launcher-1443-thread-3) [    ] o.a.s.s.SolrDispatchFilter  ___      _       Welcome to Apache Solr™ version 8.0.0
   [junit4]   2> 701050 INFO  (jetty-launcher-1443-thread-3) [    ] o.a.s.s.SolrDispatchFilter / __| ___| |_ _   Starting in cloud mode on port null
   [junit4]   2> 701050 INFO  (jetty-launcher-1443-thread-4) [    ] o.e.j.s.AbstractConnector Started ServerConnector@5f631c59{HTTP/1.1,[http/1.1]}{127.0.0.1:47065}
   [junit4]   2> 701050 INFO  (jetty-launcher-1443-thread-4) [    ] o.e.j.s.Server Started @703492ms
   [junit4]   2> 701050 INFO  (jetty-launcher-1443-thread-4) [    ] o.a.s.c.s.e.JettySolrRunner Jetty properties: {hostContext=/solr, hostPort=47065}
   [junit4]   2> 701050 ERROR (jetty-launcher-1443-thread-4) [    ] o.a.s.u.StartupLoggingUtils Missing Java Option solr.log.dir. Logging may be missing or incomplete.
   [junit4]   2> 701050 INFO  (jetty-launcher-1443-thread-4) [    ] o.a.s.s.SolrDispatchFilter  ___      _       Welcome to Apache Solr™ version 8.0.0
   [junit4]   2> 701051 INFO  (jetty-launcher-1443-thread-4) [    ] o.a.s.s.SolrDispatchFilter / __| ___| |_ _   Starting in cloud mode on port null
   [junit4]   2> 701051 INFO  (jetty-launcher-1443-thread-4) [    ] o.a.s.s.SolrDispatchFilter \__ \/ _ \ | '_|  Install dir: null
   [junit4]   2> 701051 INFO  (jetty-launcher-1443-thread-4) [    ] o.a.s.s.SolrDispatchFilter |___/\___/_|_|    Start time: 2017-12-28T03:15:17.971Z
   [junit4]   2> 701050 INFO  (jetty-launcher-1443-thread-3) [    ] o.a.s.s.SolrDispatchFilter \__ \/ _ \ | '_|  Install dir: null
   [junit4]   2> 701053 INFO  (jetty-launcher-1443-thread-3) [    ] o.a.s.s.SolrDispatchFilter |___/\___/_|_|    Start time: 2017-12-28T03:15:17.973Z
   [junit4]   2> 701054 INFO  (jetty-launcher-1443-thread-1) [    ] o.e.j.s.AbstractConnector Started ServerConnector@6c79c8ab{HTTP/1.1,[http/1.1]}{127.0.0.1:35538}
   [junit4]   2> 701054 INFO  (jetty-launcher-1443-thread-1) [    ] o.e.j.s.Server Started @703495ms
   [junit4]   2> 701054 INFO  (jetty-launcher-1443-thread-1) [    ] o.a.s.c.s.e.JettySolrRunner Jetty properties: {hostContext=/solr, hostPort=35538}
   [junit4]   2> 701054 ERROR (jetty-launcher-1443-thread-1) [    ] o.a.s.u.StartupLoggingUtils Missing Java Option solr.log.dir. Logging may be missing or incomplete.
   [junit4]   2> 701054 INFO  (jetty-launcher-1443-thread-1) [    ] o.a.s.s.SolrDispatchFilter  ___      _       Welcome to Apache Solr™ version 8.0.0
   [junit4]   2> 701054 INFO  (jetty-launcher-1443-thread-1) [    ] o.a.s.s.SolrDispatchFilter / __| ___| |_ _   Starting in cloud mode on port null
   [junit4]   2> 701054 INFO  (jetty-launcher-1443-thread-1) [    ] o.a.s.s.SolrDispatchFilter \__ \/ _ \ | '_|  Install dir: null
   [junit4]   2> 701054 INFO  (jetty-launcher-1443-thread-1) [    ] o.a.s.s.SolrDispatchFilter |___/\___/_|_|    Start time: 2017-12-28T03:15:17.974Z
   [junit4]   2> 701061 INFO  (zkConnectionManagerCallback-1450-thread-1) [    ] o.a.s.c.c.ConnectionManager zkClient has connected
   [junit4]   2> 701062 INFO  (zkConnectionManagerCallback-1452-thread-1) [    ] o.a.s.c.c.ConnectionManager zkClient has connected
   [junit4]   2> 701062 INFO  (zkConnectionManagerCallback-1448-thread-1) [    ] o.a.s.c.c.ConnectionManager zkClient has connected
   [junit4]   2> 701062 INFO  (jetty-launcher-1443-thread-3) [    ] o.a.s.s.SolrDispatchFilter solr.xml found in ZooKeeper. Loading...
   [junit4]   2> 701062 INFO  (jetty-launcher-1443-thread-4) [    ] o.a.s.s.SolrDispatchFilter solr.xml found in ZooKeeper. Loading...
   [junit4]   2> 701063 INFO  (zkConnectionManagerCallback-1454-thread-1) [    ] o.a.s.c.c.ConnectionManager zkClient has connected
   [junit4]   2> 701063 INFO  (jetty-launcher-1443-thread-2) [    ] o.a.s.s.SolrDispatchFilter solr.xml found in ZooKeeper. Loading...
   [junit4]   2> 701063 INFO  (jetty-launcher-1443-thread-1) [    ] o.a.s.s.SolrDispatchFilter solr.xml found in ZooKeeper. Loading...
   [junit4]   2> 701068 WARN  (NIOServerCxn.Factory:0.0.0.0/0.0.0.0:0) [    ] o.a.z.s.NIOServerCnxn caught end of stream exception
   [junit4]   2> EndOfStreamException: Unable to read additional data from client sessionid 0x1609b1decd40003, likely client has closed socket
   [junit4]   2> 	at org.apache.zookeeper.server.NIOServerCnxn.doIO(NIOServerCnxn.java:239)
   [junit4]   2> 	at org.apache.zookeeper.server.NIOServerCnxnFactory.run(NIOServerCnxnFactory.java:203)
   [junit4]   2> 	at java.lang.Thread.run(Thread.java:748)
   [junit4]   2> 701068 WARN  (NIOServerCxn.Factory:0.0.0.0/0.0.0.0:0) [    ] o.a.z.s.NIOServerCnxn caught end of stream exception
   [junit4]   2> EndOfStreamException: Unable to read additional data from client sessionid 0x1609b1decd40004, likely client has closed socket
   [junit4]   2> 	at org.apache.zookeeper.server.NIOServerCnxn.doIO(NIOServerCnxn.java:239)
   [junit4]   2> 	at org.apache.zookeeper.server.NIOServerCnxnFactory.run(NIOServerCnxnFactory.java:203)
   [junit4]   2> 	at java.lang.Thread.run(Thread.java:748)
   [junit4]   2> 701070 INFO  (jetty-launcher-1443-thread-1) [    ] o.a.s.c.ZkContainer Zookeeper client=127.0.0.1:55653/solr
   [junit4]   2> 701070 INFO  (jetty-launcher-1443-thread-3) [    ] o.a.s.c.ZkContainer Zookeeper client=127.0.0.1:55653/solr
   [junit4]   2> 701072 INFO  (zkConnectionManagerCallback-1462-thread-1) [    ] o.a.s.c.c.ConnectionManager zkClient has connected
   [junit4]   2> 701074 INFO  (zkConnectionManagerCallback-1460-thread-1) [    ] o.a.s.c.c.ConnectionManager zkClient has connected
   [junit4]   2> 701075 INFO  (jetty-launcher-1443-thread-2) [    ] o.a.s.c.ZkContainer Zookeeper client=127.0.0.1:55653/solr
   [junit4]   2> 701077 DEBUG (jetty-launcher-1443-thread-1) [n:127.0.0.1:35538_solr    ] o.a.s.c.ZkController Added new OnReconnect listener org.apache.solr.cloud.ZkController$$Lambda$226/1786143340@48b1f92f
   [junit4]   2> 701079 DEBUG (jetty-launcher-1443-thread-3) [n:127.0.0.1:41820_solr    ] o.a.s.c.ZkController Added new OnReconnect listener org.apache.solr.cloud.ZkController$$Lambda$226/1786143340@13018b84
   [junit4]   2> 701080 INFO  (zkConnectionManagerCallback-1466-thread-1) [    ] o.a.s.c.c.ConnectionManager zkClient has connected
   [junit4]   2> 701080 INFO  (jetty-launcher-1443-thread-4) [    ] o.a.s.c.ZkContainer Zookeeper client=127.0.0.1:55653/solr
   [junit4]   2> 701081 INFO  (zkConnectionManagerCallback-1472-thread-1-processing-n:127.0.0.1:41820_solr) [n:127.0.0.1:41820_solr    ] o.a.s.c.c.ConnectionManager zkClient has connected
   [junit4]   2> 701083 INFO  (zkConnectionManagerCallback-1468-thread-1-processing-n:127.0.0.1:35538_solr) [n:127.0.0.1:35538_solr    ] o.a.s.c.c.ConnectionManager zkClient has connected
   [junit4]   2> 701086 WARN  (NIOServerCxn.Factory:0.0.0.0/0.0.0.0:0) [    ] o.a.z.s.NIOServerCnxn caught end of stream exception
   [junit4]   2> EndOfStreamException: Unable to read additional data from client sessionid 0x1609b1decd40007, likely client has closed socket
   [junit4]   2> 	at org.apache.zookeeper.server.NIOServerCnxn.doIO(NIOServerCnxn.java:239)
   [junit4]   2> 	at org.apache.zookeeper.server.NIOServerCnxnFactory.run(NIOServerCnxnFactory.java:203)
   [junit4]   2> 	at java.lang.Thread.run(Thread.java:748)
   [junit4]   2> 701087 INFO  (zkConnectionManagerCallback-1474-thread-1) [    ] o.a.s.c.c.ConnectionManager zkClient has connected
   [junit4]   2> 701088 DEBUG (jetty-launcher-1443-thread-2) [n:127.0.0.1:38423_solr    ] o.a.s.c.ZkController Added new OnReconnect listener org.apache.solr.cloud.ZkController$$Lambda$226/1786143340@dc308fc
   [junit4]   2> 701089 DEBUG (jetty-launcher-1443-thread-4) [n:127.0.0.1:47065_solr    ] o.a.s.c.ZkController Added new OnReconnect listener org.apache.solr.cloud.ZkController$$Lambda$226/1786143340@297c9199
   [junit4]   2> 701091 INFO  (zkConnectionManagerCallback-1476-thread-1-processing-n:127.0.0.1:38423_solr) [n:127.0.0.1:38423_solr    ] o.a.s.c.c.ConnectionManager zkClient has connected
   [junit4]   2> 701092 INFO  (zkConnectionManagerCallback-1478-thread-1-processing-n:127.0.0.1:47065_solr) [n:127.0.0.1:47065_solr    ] o.a.s.c.c.ConnectionManager zkClient has connected
   [junit4]   2> 701230 DEBUG (SyncThread:0) [    ] o.a.s.c.ZkTestServer Watch added: create/delete: /solr/clusterprops.json
   [junit4]   2> 701231 DEBUG (SyncThread:0) [    ] o.a.s.c.ZkTestServer Watch added: children: /solr/live_nodes
   [junit4]   2> 701231 DEBUG (SyncThread:0) [    ] o.a.s.c.ZkTestServer Watch added: data: /solr/clusterstate.json
   [junit4]   2> 701232 DEBUG (SyncThread:0) [    ] o.a.s.c.ZkTestServer Watch added: children: /solr/collections
   [junit4]   2> 701232 DEBUG (SyncThread:0) [    ] o.a.s.c.ZkTestServer Watch added: create/delete: /solr/aliases.json
   [junit4]   2> 701233 DEBUG (SyncThread:0) [    ] o.a.s.c.ZkTestServer Watch added: create/delete: /solr/security.json
   [junit4]   2> 701238 INFO  (jetty-launcher-1443-thread-2) [n:127.0.0.1:38423_solr    ] o.a.s.c.Overseer Overseer (id=null) closing
   [junit4]   2> 701238 DEBUG (jetty-launcher-1443-thread-2) [n:127.0.0.1:38423_solr    ] o.a.s.c.LeaderElector Joined leadership election with path: /overseer_elect/election/99249744631824395-127.0.0.1:38423_solr-n_0000000000
   [junit4]   2> 701239 INFO  (jetty-launcher-1443-thread-2) [n:127.0.0.1:38423_solr    ] o.a.s.c.OverseerElectionContext I am going to be the leader 127.0.0.1:38423_solr
   [junit4]   2> 701241 DEBUG (SyncThread:0) [    ] o.a.s.c.ZkTestServer Watch added: create/delete: /solr/clusterprops.json
   [junit4]   2> 701241 INFO  (jetty-launcher-1443-thread-2) [n:127.0.0.1:38423_solr    ] o.a.s.c.Overseer Overseer (id=99249744631824395-127.0.0.1:38423_solr-n_0000000000) starting
   [junit4]   2> 701241 DEBUG (SyncThread:0) [    ] o.a.s.c.ZkTestServer Watch added: children: /solr/live_nodes
   [junit4]   2> 701241 DEBUG (SyncThread:0) [    ] o.a.s.c.ZkTestServer Watch added: data: /solr/clusterstate.json
   [junit4]   2> 701242 DEBUG (SyncThread:0) [    ] o.a.s.c.ZkTestServer Watch added: children: /solr/collections
   [junit4]   2> 701242 DEBUG (SyncThread:0) [    ] o.a.s.c.ZkTestServer Watch added: create/delete: /solr/aliases.json
   [junit4]   2> 701243 DEBUG (SyncThread:0) [    ] o.a.s.c.ZkTestServer Watch added: create/delete: /solr/security.json
   [junit4]   2> 701243 DEBUG (SyncThread:0) [    ] o.a.s.c.ZkTestServer Watch added: create/delete: /solr/clusterprops.json
   [junit4]   2> 701243 DEBUG (SyncThread:0) [    ] o.a.s.c.ZkTestServer Watch added: children: /solr/live_nodes
   [junit4]   2> 701244 DEBUG (SyncThread:0) [    ] o.a.s.c.ZkTestServer Watch added: data: /solr/clusterstate.json
   [junit4]   2> 701244 DEBUG (SyncThread:0) [    ] o.a.s.c.ZkTestServer Watch added: children: /solr/collections
   [junit4]   2> 701245 DEBUG (SyncThread:0) [    ] o.a.s.c.ZkTestServer Watch added: create/delete: /solr/aliases.json
   [junit4]   2> 701245 DEBUG (SyncThread:0) [    ] o.a.s.c.ZkTestServer Watch added: create/delete: /solr/security.json
   [junit4]   2> 701245 INFO  (jetty-launcher-1443-thread-4) [n:127.0.0.1:47065_solr    ] o.a.s.c.Overseer Overseer (id=null) closing
   [junit4]   2> 701246 DEBUG (jetty-launcher-1443-thread-4) [n:127.0.0.1:47065_solr    ] o.a.s.c.LeaderElector Joined leadership election with path: /overseer_elect/election/99249744631824396-127.0.0.1:47065_solr-n_0000000001
   [junit4]   2> 701246 DEBUG (SyncThread:0) [    ] o.a.s.c.ZkTestServer Watch added: data: /solr/overseer_elect/election/99249744631824395-127.0.0.1:38423_solr-n_0000000000
   [junit4]   2> 701247 DEBUG (jetty-launcher-1443-thread-4) [n:127.0.0.1:47065_solr    ] o.a.s.c.LeaderElector Watching path /overseer_elect/election/99249744631824395-127.0.0.1:38423_solr-n_0000000000 to know if I could be the leader
   [junit4]   2> 701247 INFO  (jetty-launcher-1443-thread-4) [n:127.0.0.1:47065_solr    ] o.a.s.c.ZkController Register node as live in ZooKeeper:/live_nodes/127.0.0.1:47065_solr
   [junit4]   2> 701247 INFO  (jetty-launcher-1443-thread-1) [n:127.0.0.1:35538_solr    ] o.a.s.c.Overseer Overseer (id=null) closing
   [junit4]   2> 701248 DEBUG (SyncThread:0) [    ] o.a.s.c.ZkTestServer Watch fired: children: /solr/live_nodes
   [junit4]   2> 701248 DEBUG (SyncThread:0) [    ] o.a.s.c.ZkTestServer Watch fired: children: /solr/live_nodes
   [junit4]   2> 701248 DEBUG (SyncThread:0) [    ] o.a.s.c.ZkTestServer Watch fired: children: /solr/live_nodes
   [junit4]   2> 701248 DEBUG (jetty-launcher-1443-thread-1) [n:127.0.0.1:35538_solr    ] o.a.s.c.LeaderElector Joined leadership election with path: /overseer_elect/election/99249744631824392-127.0.0.1:35538_solr-n_0000000002
   [junit4]   2> 701248 DEBUG (SyncThread:0) [    ] o.a.s.c.ZkTestServer Watch added: children: /solr/live_nodes
   [junit4]   2> 701249 INFO  (zkCallback-1475-thread-1-processing-n:127.0.0.1:38423_solr) [n:127.0.0.1:38423_solr    ] o.a.s.c.c.ZkStateReader Updated live nodes from ZooKeeper... (0) -> (1)
   [junit4]   2> 701249 DEBUG (SyncThread:0) [    ] o.a.s.c.ZkTestServer Watch added: create/delete: /solr/clusterprops.json
   [junit4]   2> 701249 DEBUG (SyncThread:0) [    ] o.a.s.c.ZkTestServer Watch added: children: /solr/live_nodes
   [junit4]   2> 701250 INFO  (zkCallback-1477-thread-1-processing-n:127.0.0.1:47065_solr) [n:127.0.0.1:47065_solr    ] o.a.s.c.c.ZkStateReader Updated live nodes from ZooKeeper... (0) -> (1)
   [junit4]   2> 701250 DEBUG (SyncThread:0) [    ] o.a.s.c.ZkTestServer Watch added: children: /solr/live_nodes
   [junit4]   2> 701250 DEBUG (SyncThread:0) [    ] o.a.s.c.ZkTestServer Watch added: children: /solr/live_nodes
   [junit4]   2> 701250 DEBUG (SyncThread:0) [    ] o.a.s.c.ZkTestServer Watch added: data: /solr/overseer_elect/election/99249744631824396-127.0.0.1:47065_solr-n_0000000001
   [junit4]   2> 701250 INFO  (zkCallback-1467-thread-1-processing-n:127.0.0.1:35538_solr) [n:127.0.0.1:35538_solr    ] o.a.s.c.c.ZkStateReader Updated live nodes from ZooKeeper... (0) -> (1)
   [junit4]   2> 701250 DEBUG (jetty-launcher-1443-thread-1) [n:127.0.0.1:35538_solr    ] o.a.s.c.LeaderElector Watching path /overseer_elect/election/99249744631824396-127.0.0.1:47065_solr-n_0000000001 to know if I could be the leader
   [junit4]   2> 701250 DEBUG (jetty-launcher-1443-thread-1) [n:127.0.0.1:35538_solr    ] o.a.s.c.ZkController Publish node=127.0.0.1:35538_solr as DOWN
   [junit4]   2> 701251 INFO  (jetty-launcher-1443-thread-3) [n:127.0.0.1:41820_solr    ] o.a.s.c.c.ZkStateReader Updated live nodes from ZooKeeper... (0) -> (1)
   [junit4]   2> 701251 DEBUG (SyncThread:0) [    ] o.a.s.c.ZkTestServer Watch added: data: /solr/clusterstate.json
   [junit4]   2> 701251 DEBUG (SyncThread:0) [    ] o.a.s.c.ZkTestServer Watch added: children: /solr/collections
   [junit4]   2> 701252 DEBUG (SyncThread:0) [    ] o.a.s.c.ZkTestServer Watch added: create/delete: /solr/aliases.json
   [junit4]   2> 701252 DEBUG (SyncThread:0) [    ] o.a.s.c.ZkTestServer Watch added: create/delete: /solr/security.json
   [junit4]   2> 701253 DEBUG (OverseerCollectionConfigSetProcessor-99249744631824395-127.0.0.1:38423_solr-n_0000000000) [n:127.0.0.1:38423_solr    ] o.a.s.c.OverseerTaskProcessor Process current queue of overseer operations
   [junit4]   2> 701253 DEBUG (jetty-launcher-1443-thread-2) [n:127.0.0.1:38423_solr    ] o.a.s.c.ZkController Publish node=127.0.0.1:38423_solr as DOWN
   [junit4]   2> 701253 INFO  (jetty-launcher-1443-thread-3) [n:127.0.0.1:41820_solr    ] o.a.s.c.Overseer Overseer (id=null) closing
   [junit4]   2> 701254 INFO  (jetty-launcher-1443-thread-1) [n:127.0.0.1:35538_solr    ] o.a.s.c.ZkController Register node as live in ZooKeeper:/live_nodes/127.0.0.1:35538_solr
   [junit4]   2> 701254 DEBUG (jetty-launcher-1443-thread-3) [n:127.0.0.1:41820_solr    ] o.a.s.c.LeaderElector Joined leadership election with path: /overseer_elect/election/99249744631824393-127.0.0.1:41820_solr-n_0000000003
   [junit4]   2> 701254 DEBUG (OverseerAutoScalingTriggerThread-99249744631824395-127.0.0.1:38423_solr-n_0000000000) [n:127.0.0.1:38423_solr    ] o.a.s.c.a.OverseerTriggerThread Adding .autoAddReplicas trigger
   [junit4]   2> 701254 DEBUG (SyncThread:0) [    ] o.a.s.c.ZkTestServer Watch added: data: /solr/overseer_elect/election/99249744631824392-127.0.0.1:35538_solr-n_0000000002
   [junit4]   2> 701254 DEBUG (SyncThread:0) [    ] o.a.s.c.ZkTestServer Watch fired: children: /solr/live_nodes
   [junit4]   2> 701255 DEBUG (SyncThread:0) [    ] o.a.s.c.ZkTestServer Watch fired: children: /solr/live_nodes
   [junit4]   2> 701255 DEBUG (SyncThread:0) [    ] o.a.s.c.ZkTestServer Watch fired: children: /solr/live_nodes
   [junit4]   2> 701255 DEBUG (SyncThread:0) [    ] o.a.s.c.ZkTestServer Watch fired: children: /solr/live_nodes
   [junit4]   2> 701255 DEBUG (SyncThread:0) [    ] o.a.s.c.ZkTestServer Watch added: data: /solr/autoscaling.json
   [junit4]   2> 701255 DEBUG (jetty-launcher-1443-thread-3) [n:127.0.0.1:41820_solr    ] o.a.s.c.LeaderElector Watching path /overseer_elect/election/99249744631824392-127.0.0.1:35538_solr-n_0000000002 to know if I could be the leader
   [junit4]   2> 701255 DEBUG (jetty-launcher-1443-thread-3) [n:127.0.0.1:41820_solr    ] o.a.s.c.ZkController Publish node=127.0.0.1:41820_solr as DOWN
   [junit4]   2> 701256 DEBUG (OverseerAutoScalingTriggerThread-99249744631824395-127.0.0.1:38423_solr-n_0000000000) [n:127.0.0.1:38423_solr    ] o.a.s.c.a.OverseerTriggerThread Refreshing /autoscaling.json with znode version 1
   [junit4]   2> 701256 DEBUG (OverseerStateUpdate-99249744631824395-127.0.0.1:38423_solr-n_0000000000) [n:127.0.0.1:38423_solr    ] o.a.s.c.Overseer Starting to work on the main queue
   [junit4]   2> 701256 INFO  (jetty-launcher-1443-thread-3) [n:127.0.0.1:41820_solr    ] o.a.s.c.ZkController Register node as live in ZooKeeper:/live_nodes/127.0.0.1:41820_solr
   [junit4]   2> 701256 INFO  (jetty-launcher-1443-thread-2) [n:127.0.0.1:38423_solr    ] o.a.s.c.ZkController Register node as live in ZooKeeper:/live_nodes/127.0.0.1:38423_solr
   [junit4]   2> 701257 DEBUG (OverseerAutoScalingTriggerThread-99249744631824395-127.0.0.1:38423_solr-n_0000000000) [n:127.0.0.1:38423_solr    ] o.a.s.c.a.NodeLostTrigger Initial livenodes: [127.0.0.1:47065_solr]
   [junit4]   2> 701257 DEBUG (OverseerAutoScalingTriggerThread-99249744631824395-127.0.0.1:38423_solr-n_0000000000) [n:127.0.0.1:38423_solr    ] o.a.s.c.a.OverseerTriggerThread Current znodeVersion 1, lastZnodeVersion -1
   [junit4]   2> 701257 DEBUG (OverseerAutoScalingTriggerThread-99249744631824395-127.0.0.1:38423_solr-n_0000000000) [n:127.0.0.1:38423_solr    ] o.a.s.c.a.OverseerTriggerThread Processed trigger updates upto znodeVersion 1
   [junit4]   2> 701258 DEBUG (OverseerCollectionConfigSetProcessor-99249744631824395-127.0.0.1:38423_solr-n_0000000000) [n:127.0.0.1:38423_solr    ] o.a.s.c.OverseerTaskProcessor Cleaning up work-queue. #Running tasks: 0
   [junit4]   2> 701258 DEBUG (OverseerCollectionConfigSetProcessor-99249744631824395-127.0.0.1:38423_solr-n_0000000000) [n:127.0.0.1:38423_solr    ] o.a.s.c.OverseerTaskProcessor RunningTasks: []
   [junit4]   2> 701258 DEBUG (OverseerCollectionConfigSetProcessor-99249744631824395-127.0.0.1:38423_solr-n_0000000000) [n:127.0.0.1:38423_solr    ] o.a.s.c.OverseerTaskProcessor BlockedTasks: []
   [junit4]   2> 701258 DEBUG (OverseerCollectionConfigSetProcessor-99249744631824395-127.0.0.1:38423_solr-n_0000000000) [n:127.0.0.1:38423_solr    ] o.a.s.c.OverseerTaskProcessor CompletedTasks: []
   [junit4]   2> 701258 DEBUG (OverseerCollectionConfigSetProcessor-99249744631824395-127.0.0.1:38423_solr-n_0000000000) [n:127.0.0.1:38423_solr    ] o.a.s.c.OverseerTaskProcessor RunningZKTasks: []
   [junit4]   2> 701258 DEBUG (OverseerCollectionConfigSetProcessor-99249744631824395-127.0.0.1:38423_solr-n_0000000000) [n:127.0.0.1:38423_solr    ] o.a.s.c.OverseerTaskQueue Peeking for top 100 elements. ExcludeSet: []
   [junit4]   2> 701261 DEBUG (SyncThread:0) [    ] o.a.s.c.ZkTestServer Watch added: children: /solr/live_nodes
   [junit4]   2> 701261 DEBUG (SyncThread:0) [    ] o.a.s.c.ZkTestServer Watch added: children: /solr/overseer/collection-queue-work
   [junit4]   2> 701268 DEBUG (SyncThread:0) [    ] o.a.s.c.ZkTestServer Watch added: children: /solr/live_nodes
   [junit4]   2> 701276 INFO  (zkCallback-1477-thread-1-processing-n:127.0.0.1:47065_solr) [n:127.0.0.1:47065_solr    ] o.a.s.c.c.ZkStateReader Updated live nodes from ZooKeeper... (1) -> (4)
   [junit4]   2> 701269 INFO  (OverseerStateUpdate-99249744631824395-127.0.0.1:38423_solr-n_0000000000) [n:127.0.0.1:38423_solr    ] o.a.s.c.c.ZkStateReader Updated live nodes from ZooKeeper... (1) -> (4)
   [junit4]   2> 701276 DEBUG (SyncThread:0) [    ] o.a.s.c.ZkTestServer Watch added: children: /solr/live_nodes
   [junit4]   2> 701276 DEBUG (SyncThread:0) [    ] o.a.s.c.ZkTestServer Watch added: children: /solr/live_nodes
   [junit4]   2> 701268 INFO  (zkCallback-1471-thread-1-processing-n:127.0.0.1:41820_solr) [n:127.0.0.1:41820_solr    ] o.a.s.c.c.ZkStateReader Updated live nodes from ZooKeeper... (1) -> (4)
   [junit4]   2> 701278 INFO  (zkCallback-1467-thread-1-processing-n:127.0.0.1:35538_solr) [n:127.0.0.1:35538_solr    ] o.a.s.c.c.ZkStateReader Updated live nodes from ZooKeeper... (1) -> (4)
   [junit4]   2> 701279 DEBUG (SyncThread:0) [    ] o.a.s.c.ZkTestServer Watch added: children: /solr/overseer/queue-work
   [junit4]   2> 701289 DEBUG (SyncThread:0) [    ] o.a.s.c.ZkTestServer Watch added: children: /solr/overseer/queue
   [junit4]   2> 701300 DEBUG (OverseerAutoScalingTriggerThread-99249744631824395-127.0.0.1:38423_solr-n_0000000000) [n:127.0.0.1:38423_solr    ] o.a.s.c.a.OverseerTriggerThread -- clean old nodeAdded markers
   [junit4]   2> 701309 DEBUG (SyncThread:0) [    ] o.a.s.c.ZkTestServer Watch added: children: /solr/autoscaling/events/.auto_add_replicas
   [junit4]   2> 701316 DEBUG (OverseerStateUpdate-99249744631824395-127.0.0.1:38423_solr-n_0000000000) [n:127.0.0.1:38423_solr    ] o.a.s.c.Overseer processMessage: queueSize: 3, message = {
   [junit4]   2>   "operation":"downnode",
   [junit4]   2>   "node_name":"127.0.0.1:35538_solr"} current state version: 0
   [junit4]   2> 701316 DEBUG (OverseerStateUpdate-99249744631824395-127.0.0.1:38423_solr-n_0000000000) [n:127.0.0.1:38423_solr    ] o.a.s.c.o.NodeMutator DownNode state invoked for node: 127.0.0.1:35538_solr
   [junit4]   2> 701316 DEBUG (OverseerStateUpdate-99249744631824395-127.0.0.1:38423_solr-n_0000000000) [n:127.0.0.1:38423_solr    ] o.a.s.c.Overseer processMessage: queueSize: 3, message = {
   [junit4]   2>   "operation":"downnode",
   [junit4]   2>   "node_name":"127.0.0.1:41820_solr"} current state version: 0
   [junit4]   2> 701316 DEBUG (OverseerStateUpdate-99249744631824395-127.0.0.1:38423_solr-n_0000000000) [n:127.0.0.1:38423_solr    ] o.a.s.c.o.NodeMutator DownNode state invoked for node: 127.0.0.1:41820_solr
   [junit4]   2> 701316 DEBUG (OverseerStateUpdate-99249744631824395-127.0.0.1:38423_solr-n_0000000000) [n:127.0.0.1:38423_solr    ] o.a.s.c.Overseer processMessage: queueSize: 3, message = {
   [junit4]   2>   "operation":"downnode",
   [junit4]   2>   "node_name":"127.0.0.1:38423_solr"} current state version: 0
   [junit4]   2> 701317 DEBUG (OverseerStateUpdate-99249744631824395-127.0.0.1:38423_solr-n_0000000000) [n:127.0.0.1:38423_solr    ] o.a.s.c.o.NodeMutator DownNode state invoked for node: 127.0.0.1:38423_solr
   [junit4]   2> 701334 DEBUG (OverseerAutoScalingTriggerThread-99249744631824395-127.0.0.1:38423_solr-n_0000000000) [n:127.0.0.1:38423_solr    ] o.a.s.c.a.OverseerTriggerThread Current znodeVersion 1, lastZnodeVersion 1
   [junit4]   2> 701349 INFO  (jetty-launcher-1443-thread-3) [n:127.0.0.1:41820_solr    ] o.a.s.m.r.So

[...truncated too long message...]

0.1:44549_solr
   [junit4]   2> 3121971 INFO  (jetty-closer-7400-thread-4) [    ] o.e.j.s.h.ContextHandler Stopped o.e.j.s.ServletContextHandler@5d6c0f78{/solr,null,UNAVAILABLE}
   [junit4]   2> 3121974 INFO  (jetty-closer-7400-thread-2) [    ] o.e.j.s.h.ContextHandler Stopped o.e.j.s.ServletContextHandler@3f96253b{/solr,null,UNAVAILABLE}
   [junit4]   2> 3121976 ERROR (TEST-TestCollectionsAPIViaSolrCloudCluster.testStopAllStartAll-seed#[A53DB481A98D1384]) [    ] o.a.z.s.ZooKeeperServer ZKShutdownHandler is not registered, so ZooKeeper server won't take any action on ERROR or SHUTDOWN server state changes
   [junit4]   2> 3121981 INFO  (TEST-TestCollectionsAPIViaSolrCloudCluster.testStopAllStartAll-seed#[A53DB481A98D1384]) [    ] o.a.s.c.ZkTestServer connecting to 127.0.0.1:54700 54700
   [junit4]   2> 3133077 INFO  (Thread-9293) [    ] o.a.s.c.ZkTestServer connecting to 127.0.0.1:54700 54700
   [junit4]   2> 3133079 WARN  (Thread-9293) [    ] o.a.s.c.ZkTestServer Watch limit violations: 
   [junit4]   2> Maximum concurrent create/delete watches above limit:
   [junit4]   2> 
   [junit4]   2> 	10	/solr/aliases.json
   [junit4]   2> 	9	/solr/security.json
   [junit4]   2> 	8	/solr/configs/solrCloudCollectionConfig
   [junit4]   2> 
   [junit4]   2> Maximum concurrent data watches above limit:
   [junit4]   2> 
   [junit4]   2> 	73	/solr/collections/testStopAllStartAllCollection/state.json
   [junit4]   2> 	10	/solr/clusterprops.json
   [junit4]   2> 	10	/solr/clusterstate.json
   [junit4]   2> 	5	/solr/overseer_elect/election/99249902288109581-127.0.0.1:52979_solr-n_0000000000
   [junit4]   2> 
   [junit4]   2> Maximum concurrent children watches above limit:
   [junit4]   2> 
   [junit4]   2> 	10	/solr/live_nodes
   [junit4]   2> 	10	/solr/collections
   [junit4]   2> 
   [junit4]   2> 3133079 INFO  (TEST-TestCollectionsAPIViaSolrCloudCluster.testStopAllStartAll-seed#[A53DB481A98D1384]) [    ] o.a.s.SolrTestCaseJ4 ###Ending testStopAllStartAll
   [junit4]   2> 3133080 INFO  (SUITE-TestCollectionsAPIViaSolrCloudCluster-seed#[A53DB481A98D1384]-worker) [    ] o.a.s.c.ZkTestServer connecting to 127.0.0.1:54700 54700
   [junit4]   2> NOTE: leaving temporary files on disk at: /export/home/jenkins/workspace/Lucene-Solr-master-Solaris/solr/build/solr-core/test/J0/temp/solr.cloud.TestCollectionsAPIViaSolrCloudCluster_A53DB481A98D1384-001
   [junit4]   2> NOTE: test params are: codec=Asserting(Lucene70): {id=PostingsFormat(name=LuceneVarGapFixedInterval)}, docValues:{}, maxPointsInLeafNode=127, maxMBSortInHeap=5.884564979654049, sim=Asserting(org.apache.lucene.search.similarities.AssertingSimilarity@20e4860c), locale=es-VE, timezone=ROK
   [junit4]   2> NOTE: SunOS 5.11 amd64/Oracle Corporation 1.8.0_152 (64-bit)/cpus=3,threads=1,free=233572400,total=518979584
   [junit4]   2> NOTE: All tests run in this JVM: [TestFieldResource, TestPseudoReturnFields, SpellCheckCollatorWithCollapseTest, AutoAddReplicasPlanActionTest, MultiThreadedOCPTest, CdcrUpdateLogTest, AddBlockUpdateTest, TestRandomCollapseQParserPlugin, ShufflingReplicaListTransformerTest, TestQuerySenderListener, InfoHandlerTest, HLLSerializationTest, BinaryUpdateRequestHandlerTest, TestDynamicLoading, MetricTriggerTest, UniqFieldsUpdateProcessorFactoryTest, MergeStrategyTest, BlobRepositoryCloudTest, TestSolrDeletionPolicy2, UUIDFieldTest, ClassificationUpdateProcessorTest, TestFuzzyAnalyzedSuggestions, ConfigSetsAPITest, SyncSliceTest, HighlighterTest, TestFiltering, ReplaceNodeTest, SuggestComponentContextFilterQueryTest, TestDistributedStatsComponentCardinality, TestHttpShardHandlerFactory, TestManagedSynonymFilterFactory, TestOmitPositions, BigEndianAscendingWordSerializerTest, SuggesterWFSTTest, CleanupOldIndexTest, ClusterStateTest, DirectUpdateHandlerTest, PeerSyncWithIndexFingerprintCachingTest, DisMaxRequestHandlerTest, TestRestoreCore, TestIBSimilarityFactory, IndexBasedSpellCheckerTest, TestFieldCacheSort, UnloadDistributedZkTest, InfixSuggestersTest, TestNamedUpdateProcessors, TestJmxIntegration, ParsingFieldUpdateProcessorsTest, TestConfigSetProperties, HighlighterMaxOffsetTest, TestDocBasedVersionConstraints, TestOrdValues, TestStreamBody, TestIndexingPerformance, AssignBackwardCompatibilityTest, DistanceFunctionTest, DeleteNodeTest, TestCryptoKeys, AddReplicaTest, TriLevelCompositeIdRoutingTest, TestHdfsUpdateLog, TestEmbeddedSolrServerAdminHandler, TestCollapseQParserPlugin, RAMDirectoryFactoryTest, TestLockTree, MissingSegmentRecoveryTest, TestExecutePlanAction, TestSimpleQParserPlugin, TestZkAclsWithHadoopAuth, ZkCLITest, MoveReplicaHDFSTest, CollectionsAPISolrJTest, TestUniqueKeyFieldResource, MinimalSchemaTest, HdfsTlogReplayBufferedWhileIndexingTest, TestShortCircuitedRequests, XmlUpdateRequestHandlerTest, TestJsonFacets, TestTolerantUpdateProcessorCloud, TestPHPSerializedResponseWriter, CoreSorterTest, TestSolrCloudSnapshots, TestSSLRandomization, DistanceUnitsTest, ClassificationUpdateProcessorFactoryTest, TestUseDocValuesAsStored, BadCopyFieldTest, TestQuerySenderNoQuery, TestUtilizeNode, WordBreakSolrSpellCheckerTest, TolerantUpdateProcessorTest, TestMaxTokenLenTokenizer, TestManagedSchema, TestInPlaceUpdatesStandalone, TestRangeQuery, TestExactStatsCache, TestRetrieveFieldsOptimizer, TestEmbeddedSolrServerSchemaAPI, TestClassicSimilarityFactory, TestOnReconnectListenerSupport, SmileWriterTest, SegmentsInfoRequestHandlerTest, ShardRoutingTest, TestPhraseSuggestions, TestLeaderInitiatedRecoveryThread, SortByFunctionTest, RequiredFieldsTest, MetricsConfigTest, OverseerTaskQueueTest, NoCacheHeaderTest, DistributedSuggestComponentTest, RegexBytesRefFilterTest, DistribCursorPagingTest, CloudMLTQParserTest, TestFreeTextSuggestions, HighlighterConfigTest, TestTrackingShardHandlerFactory, RecoveryZkTest, TestSlowCompositeReaderWrapper, ExplicitHLLTest, BadIndexSchemaTest, TestCopyFieldCollectionResource, HdfsSyncSliceTest, TestDFRSimilarityFactory, DirectSolrConnectionTest, LeaderInitiatedRecoveryOnCommitTest, TestStressLiveNodes, ComputePlanActionTest, WrapperMergePolicyFactoryTest, SystemLogListenerTest, TestReplicationHandler, CollectionTooManyReplicasTest, DistributedFacetExistsSmallTest, LegacyCloudClusterPropTest, TestConfigsApi, TestNonDefinedSimilarityFactory, HdfsRecoveryZkTest, TestLFUCache, DirectUpdateHandlerOptimizeTest, TestBlobHandler, OutputWriterTest, TestInfoStreamLogging, AtomicUpdateProcessorFactoryTest, SolrCloudExampleTest, ReturnFieldsTest, TestCloudInspectUtil, SolrCmdDistributorTest, TestLazyCores, SuggesterFSTTest, TestPullReplica, SolrRequestParserTest, XsltUpdateRequestHandlerTest, TestWriterPerf, CoreAdminRequestStatusTest, ConvertedLegacyTest, TestLargeCluster, OverseerCollectionConfigSetProcessorTest, TestRandomFlRTGCloud, TestCloudRecovery, TestSolr4Spatial, TestGraphTermsQParserPlugin, DistributedQueryElevationComponentTest, TestLeaderElectionWithEmptyReplica, EnumFieldTest, TestSolr4Spatial2, TriggerIntegrationTest, TestSchemaVersionResource, ChaosMonkeySafeLeaderWithPullReplicasTest, ResourceLoaderTest, RequestHandlersTest, BasicAuthIntegrationTest, SSLMigrationTest, TestFieldCacheVsDocValues, BufferStoreTest, TestDynamicFieldResource, HdfsAutoAddReplicasIntegrationTest, ExitableDirectoryReaderTest, TestShardHandlerFactory, CursorMarkTest, SolrJmxReporterTest, TestSurroundQueryParser, TestCloudManagedSchema, TestCoreDiscovery, TestNestedDocsSort, BasicDistributedZkTest, ChaosMonkeySafeLeaderTest, OpenCloseCoreStressTest, OverseerTest, BasicZkTest, ClusterStateUpdateTest, TestRandomFaceting, LeaderElectionTest, TestRecovery, TestHashPartitioner, DistributedSpellCheckComponentTest, ZkControllerTest, TestStressReorder, TestReload, DistributedTermsComponentTest, SpellCheckComponentTest, TestGroupingSearch, QueryElevationComponentTest, TestFunctionQuery, TestBadConfig, TestIndexSearcher, ShowFileRequestHandlerTest, AnalysisAfterCoreReloadTest, SignatureUpdateProcessorFactoryTest, TestExtendedDismaxParser, SpellCheckCollatorTest, SuggesterTSTTest, SuggesterTest, TestStressLucene, SpatialFilterTest, PolyFieldTest, TestAtomicUpdateErrorCases, TestSolrDeletionPolicy1, SolrInfoBeanTest, LukeRequestHandlerTest, PrimitiveFieldTypeTest, DocumentBuilderTest, TermVectorComponentTest, FieldAnalysisRequestHandlerTest, LoggingHandlerTest, IndexSchemaTest, TestCSVResponseWriter, TestAnalyzedSuggestions, PingRequestHandlerTest, CopyFieldTest, MultiTermTest, TestDocSet, TestBinaryField, NumericFieldsTest, TestElisionMultitermQuery, TestConfig, TestSolrCoreProperties, TestPostingsSolrHighlighter, NotRequiredUniqueKeyTest, TestLuceneMatchVersion, SpellPossibilityIteratorTest, TestCharFilters, SynonymTokenizerTest, TestXIncludeConfig, EchoParamsTest, TestSweetSpotSimilarityFactory, TestLMDirichletSimilarityFactory, TimeZoneUtilsTest, ScriptEngineTest, URLClassifyProcessorTest, PreAnalyzedFieldTest, PrimUtilsTest, TestSuggestSpellingConverter, DateFieldTest, SpellingQueryConverterTest, TestLRUCache, TestUtils, TestDocumentBuilder, SliceStateTest, SystemInfoHandlerTest, CircularListTest, DistributedMLTComponentTest, TestRTGBase, CursorPagingTest, DistributedIntervalFacetingTest, SolrTestCaseJ4Test, TestCursorMarkWithoutUniqueKey, TestDistributedMissingSort, TestHighlightDedupGrouping, TestSimpleTrackingShardHandler, TestTolerantSearch, TestLuceneIndexBackCompat, ConnectionReuseTest, AssignTest, CollectionsAPIAsyncDistributedZkTest, DeleteLastCustomShardedReplicaTest, DeleteShardTest, DistribJoinFromCollectionTest, DocValuesNotIndexedTest, ForceLeaderTest, LeaderFailureAfterFreshStartTest, LeaderInitiatedRecoveryOnShardRestartTest, MoveReplicaHDFSFailoverTest, OverseerRolesTest, RecoveryAfterSoftCommitTest, SimpleCollectionCreateDeleteTest, SolrCLIZkUtilsTest, TestAuthenticationFramework, TestCloudDeleteByQuery, TestCloudPivotFacet, TestCloudPseudoReturnFields, TestClusterProperties, TestCollectionsAPIViaSolrCloudCluster]
   [junit4] Completed [547/765 (4!)] on J0 in 61.69s, 3 tests, 1 error <<< FAILURES!

[...truncated 48857 lines...]

Mime
View raw message