lucene-dev mailing list archives

Site index · List index
Message view « Date » · « Thread »
Top « Date » · « Thread »
From Policeman Jenkins Server <jenk...@thetaphi.de>
Subject [JENKINS] Lucene-Solr-7.2-Windows (32bit/jdk1.8.0_144) - Build # 26 - Still Unstable!
Date Wed, 20 Dec 2017 22:21:28 GMT
Build: https://jenkins.thetaphi.de/job/Lucene-Solr-7.2-Windows/26/
Java: 32bit/jdk1.8.0_144 -server -XX:+UseSerialGC

2 tests failed.
FAILED:  junit.framework.TestSuite.org.apache.solr.client.solrj.embedded.LargeVolumeBinaryJettyTest

Error Message:
Could not remove the following files (in the order of attempts):    C:\Users\jenkins\workspace\Lucene-Solr-7.2-Windows\solr\build\solr-solrj\test\J1\temp\solr.client.solrj.embedded.LargeVolumeBinaryJettyTest_AFF9D9F935F99FE9-001\tempDir-001\collection1\conf: java.nio.file.DirectoryNotEmptyException: C:\Users\jenkins\workspace\Lucene-Solr-7.2-Windows\solr\build\solr-solrj\test\J1\temp\solr.client.solrj.embedded.LargeVolumeBinaryJettyTest_AFF9D9F935F99FE9-001\tempDir-001\collection1\conf    C:\Users\jenkins\workspace\Lucene-Solr-7.2-Windows\solr\build\solr-solrj\test\J1\temp\solr.client.solrj.embedded.LargeVolumeBinaryJettyTest_AFF9D9F935F99FE9-001\tempDir-001\collection1: java.nio.file.DirectoryNotEmptyException: C:\Users\jenkins\workspace\Lucene-Solr-7.2-Windows\solr\build\solr-solrj\test\J1\temp\solr.client.solrj.embedded.LargeVolumeBinaryJettyTest_AFF9D9F935F99FE9-001\tempDir-001\collection1    C:\Users\jenkins\workspace\Lucene-Solr-7.2-Windows\solr\build\solr-solrj\test\J1\temp\solr.client.solrj.embedded.LargeVolumeBinaryJettyTest_AFF9D9F935F99FE9-001\tempDir-001: java.nio.file.DirectoryNotEmptyException: C:\Users\jenkins\workspace\Lucene-Solr-7.2-Windows\solr\build\solr-solrj\test\J1\temp\solr.client.solrj.embedded.LargeVolumeBinaryJettyTest_AFF9D9F935F99FE9-001\tempDir-001    C:\Users\jenkins\workspace\Lucene-Solr-7.2-Windows\solr\build\solr-solrj\test\J1\temp\solr.client.solrj.embedded.LargeVolumeBinaryJettyTest_AFF9D9F935F99FE9-001\tempDir-001\collection1\conf\velocity: java.nio.file.AccessDeniedException: C:\Users\jenkins\workspace\Lucene-Solr-7.2-Windows\solr\build\solr-solrj\test\J1\temp\solr.client.solrj.embedded.LargeVolumeBinaryJettyTest_AFF9D9F935F99FE9-001\tempDir-001\collection1\conf\velocity    C:\Users\jenkins\workspace\Lucene-Solr-7.2-Windows\solr\build\solr-solrj\test\J1\temp\solr.client.solrj.embedded.LargeVolumeBinaryJettyTest_AFF9D9F935F99FE9-001: java.nio.file.DirectoryNotEmptyException: C:\Users\jenkins\workspace\Lucene-Solr-7.2-Windows\solr\build\solr-solrj\test\J1\temp\solr.client.solrj.embedded.LargeVolumeBinaryJettyTest_AFF9D9F935F99FE9-001 

Stack Trace:
java.io.IOException: Could not remove the following files (in the order of attempts):
   C:\Users\jenkins\workspace\Lucene-Solr-7.2-Windows\solr\build\solr-solrj\test\J1\temp\solr.client.solrj.embedded.LargeVolumeBinaryJettyTest_AFF9D9F935F99FE9-001\tempDir-001\collection1\conf: java.nio.file.DirectoryNotEmptyException: C:\Users\jenkins\workspace\Lucene-Solr-7.2-Windows\solr\build\solr-solrj\test\J1\temp\solr.client.solrj.embedded.LargeVolumeBinaryJettyTest_AFF9D9F935F99FE9-001\tempDir-001\collection1\conf
   C:\Users\jenkins\workspace\Lucene-Solr-7.2-Windows\solr\build\solr-solrj\test\J1\temp\solr.client.solrj.embedded.LargeVolumeBinaryJettyTest_AFF9D9F935F99FE9-001\tempDir-001\collection1: java.nio.file.DirectoryNotEmptyException: C:\Users\jenkins\workspace\Lucene-Solr-7.2-Windows\solr\build\solr-solrj\test\J1\temp\solr.client.solrj.embedded.LargeVolumeBinaryJettyTest_AFF9D9F935F99FE9-001\tempDir-001\collection1
   C:\Users\jenkins\workspace\Lucene-Solr-7.2-Windows\solr\build\solr-solrj\test\J1\temp\solr.client.solrj.embedded.LargeVolumeBinaryJettyTest_AFF9D9F935F99FE9-001\tempDir-001: java.nio.file.DirectoryNotEmptyException: C:\Users\jenkins\workspace\Lucene-Solr-7.2-Windows\solr\build\solr-solrj\test\J1\temp\solr.client.solrj.embedded.LargeVolumeBinaryJettyTest_AFF9D9F935F99FE9-001\tempDir-001
   C:\Users\jenkins\workspace\Lucene-Solr-7.2-Windows\solr\build\solr-solrj\test\J1\temp\solr.client.solrj.embedded.LargeVolumeBinaryJettyTest_AFF9D9F935F99FE9-001\tempDir-001\collection1\conf\velocity: java.nio.file.AccessDeniedException: C:\Users\jenkins\workspace\Lucene-Solr-7.2-Windows\solr\build\solr-solrj\test\J1\temp\solr.client.solrj.embedded.LargeVolumeBinaryJettyTest_AFF9D9F935F99FE9-001\tempDir-001\collection1\conf\velocity
   C:\Users\jenkins\workspace\Lucene-Solr-7.2-Windows\solr\build\solr-solrj\test\J1\temp\solr.client.solrj.embedded.LargeVolumeBinaryJettyTest_AFF9D9F935F99FE9-001: java.nio.file.DirectoryNotEmptyException: C:\Users\jenkins\workspace\Lucene-Solr-7.2-Windows\solr\build\solr-solrj\test\J1\temp\solr.client.solrj.embedded.LargeVolumeBinaryJettyTest_AFF9D9F935F99FE9-001

	at __randomizedtesting.SeedInfo.seed([AFF9D9F935F99FE9]:0)
	at org.apache.lucene.util.IOUtils.rm(IOUtils.java:329)
	at org.apache.lucene.util.TestRuleTemporaryFilesCleanup.afterAlways(TestRuleTemporaryFilesCleanup.java:216)
	at com.carrotsearch.randomizedtesting.rules.TestRuleAdapter$1.afterAlways(TestRuleAdapter.java:31)
	at com.carrotsearch.randomizedtesting.rules.StatementAdapter.evaluate(StatementAdapter.java:43)
	at com.carrotsearch.randomizedtesting.rules.StatementAdapter.evaluate(StatementAdapter.java:36)
	at org.apache.lucene.util.TestRuleAssertionsRequired$1.evaluate(TestRuleAssertionsRequired.java:53)
	at org.apache.lucene.util.TestRuleMarkFailure$1.evaluate(TestRuleMarkFailure.java:47)
	at org.apache.lucene.util.TestRuleIgnoreAfterMaxFailures$1.evaluate(TestRuleIgnoreAfterMaxFailures.java:64)
	at org.apache.lucene.util.TestRuleIgnoreTestSuites$1.evaluate(TestRuleIgnoreTestSuites.java:54)
	at com.carrotsearch.randomizedtesting.rules.StatementAdapter.evaluate(StatementAdapter.java:36)
	at com.carrotsearch.randomizedtesting.ThreadLeakControl$StatementRunner.run(ThreadLeakControl.java:368)
	at java.lang.Thread.run(Thread.java:748)


FAILED:  junit.framework.TestSuite.org.apache.solr.common.cloud.TestZkConfigManager

Error Message:
Could not remove the following files (in the order of attempts):    C:\Users\jenkins\workspace\Lucene-Solr-7.2-Windows\solr\build\solr-solrj\test\J1\temp\solr.common.cloud.TestZkConfigManager_AFF9D9F935F99FE9-001\init-core-data-001: java.nio.file.AccessDeniedException: C:\Users\jenkins\workspace\Lucene-Solr-7.2-Windows\solr\build\solr-solrj\test\J1\temp\solr.common.cloud.TestZkConfigManager_AFF9D9F935F99FE9-001\init-core-data-001    C:\Users\jenkins\workspace\Lucene-Solr-7.2-Windows\solr\build\solr-solrj\test\J1\temp\solr.common.cloud.TestZkConfigManager_AFF9D9F935F99FE9-001: java.nio.file.DirectoryNotEmptyException: C:\Users\jenkins\workspace\Lucene-Solr-7.2-Windows\solr\build\solr-solrj\test\J1\temp\solr.common.cloud.TestZkConfigManager_AFF9D9F935F99FE9-001 

Stack Trace:
java.io.IOException: Could not remove the following files (in the order of attempts):
   C:\Users\jenkins\workspace\Lucene-Solr-7.2-Windows\solr\build\solr-solrj\test\J1\temp\solr.common.cloud.TestZkConfigManager_AFF9D9F935F99FE9-001\init-core-data-001: java.nio.file.AccessDeniedException: C:\Users\jenkins\workspace\Lucene-Solr-7.2-Windows\solr\build\solr-solrj\test\J1\temp\solr.common.cloud.TestZkConfigManager_AFF9D9F935F99FE9-001\init-core-data-001
   C:\Users\jenkins\workspace\Lucene-Solr-7.2-Windows\solr\build\solr-solrj\test\J1\temp\solr.common.cloud.TestZkConfigManager_AFF9D9F935F99FE9-001: java.nio.file.DirectoryNotEmptyException: C:\Users\jenkins\workspace\Lucene-Solr-7.2-Windows\solr\build\solr-solrj\test\J1\temp\solr.common.cloud.TestZkConfigManager_AFF9D9F935F99FE9-001

	at __randomizedtesting.SeedInfo.seed([AFF9D9F935F99FE9]:0)
	at org.apache.lucene.util.IOUtils.rm(IOUtils.java:329)
	at org.apache.lucene.util.TestRuleTemporaryFilesCleanup.afterAlways(TestRuleTemporaryFilesCleanup.java:216)
	at com.carrotsearch.randomizedtesting.rules.TestRuleAdapter$1.afterAlways(TestRuleAdapter.java:31)
	at com.carrotsearch.randomizedtesting.rules.StatementAdapter.evaluate(StatementAdapter.java:43)
	at com.carrotsearch.randomizedtesting.rules.StatementAdapter.evaluate(StatementAdapter.java:36)
	at org.apache.lucene.util.TestRuleAssertionsRequired$1.evaluate(TestRuleAssertionsRequired.java:53)
	at org.apache.lucene.util.TestRuleMarkFailure$1.evaluate(TestRuleMarkFailure.java:47)
	at org.apache.lucene.util.TestRuleIgnoreAfterMaxFailures$1.evaluate(TestRuleIgnoreAfterMaxFailures.java:64)
	at org.apache.lucene.util.TestRuleIgnoreTestSuites$1.evaluate(TestRuleIgnoreTestSuites.java:54)
	at com.carrotsearch.randomizedtesting.rules.StatementAdapter.evaluate(StatementAdapter.java:36)
	at com.carrotsearch.randomizedtesting.ThreadLeakControl$StatementRunner.run(ThreadLeakControl.java:368)
	at java.lang.Thread.run(Thread.java:748)




Build Log:
[...truncated 14598 lines...]
   [junit4] Suite: org.apache.solr.common.cloud.TestZkConfigManager
   [junit4]   2> SLF4J: Class path contains multiple SLF4J bindings.
   [junit4]   2> SLF4J: Found binding in [jar:file:/C:/Users/jenkins/workspace/Lucene-Solr-7.2-Windows/solr/solrj/test-lib/slf4j-log4j12-1.7.7.jar!/org/slf4j/impl/StaticLoggerBinder.class]
   [junit4]   2> SLF4J: Found binding in [jar:file:/C:/Users/jenkins/workspace/Lucene-Solr-7.2-Windows/solr/core/lib/slf4j-log4j12-1.7.7.jar!/org/slf4j/impl/StaticLoggerBinder.class]
   [junit4]   2> SLF4J: See http://www.slf4j.org/codes.html#multiple_bindings for an explanation.
   [junit4]   2> SLF4J: Actual binding is of type [org.slf4j.impl.Log4jLoggerFactory]
   [junit4]   2> Creating dataDir: C:\Users\jenkins\workspace\Lucene-Solr-7.2-Windows\solr\build\solr-solrj\test\J1\temp\solr.common.cloud.TestZkConfigManager_AFF9D9F935F99FE9-001\init-core-data-001
   [junit4]   2> 0    INFO  (SUITE-TestZkConfigManager-seed#[AFF9D9F935F99FE9]-worker) [    ] o.a.s.SolrTestCaseJ4 Using PointFields (NUMERIC_POINTS_SYSPROP=true) w/NUMERIC_DOCVALUES_SYSPROP=false
   [junit4]   2> 123  INFO  (SUITE-TestZkConfigManager-seed#[AFF9D9F935F99FE9]-worker) [    ] o.e.j.u.log Logging initialized @7945ms
   [junit4]   2> 135  INFO  (SUITE-TestZkConfigManager-seed#[AFF9D9F935F99FE9]-worker) [    ] o.a.s.SolrTestCaseJ4 Randomized ssl (false) and clientAuth (false) via: @org.apache.solr.util.RandomizeSSL(reason=, value=NaN, ssl=NaN, clientAuth=NaN)
   [junit4]   2> 155  INFO  (SUITE-TestZkConfigManager-seed#[AFF9D9F935F99FE9]-worker) [    ] o.a.s.SolrTestCaseJ4 SecureRandom sanity checks: test.solr.allowed.securerandom=null & java.security.egd=file:/dev/./urandom
   [junit4]   2> 192  INFO  (SUITE-TestZkConfigManager-seed#[AFF9D9F935F99FE9]-worker) [    ] o.a.s.c.ZkTestServer STARTING ZK TEST SERVER
   [junit4]   2> 196  INFO  (Thread-1) [    ] o.a.s.c.ZkTestServer client port:0.0.0.0/0.0.0.0:0
   [junit4]   2> 196  INFO  (Thread-1) [    ] o.a.s.c.ZkTestServer Starting server
   [junit4]   2> 751  INFO  (SUITE-TestZkConfigManager-seed#[AFF9D9F935F99FE9]-worker) [    ] o.a.s.c.ZkTestServer start zk server on port:60636
   [junit4]   2> 839  ERROR (Thread-1) [    ] o.a.z.s.ZooKeeperServer ZKShutdownHandler is not registered, so ZooKeeper server won't take any action on ERROR or SHUTDOWN server state changes
   [junit4]   2> 844  INFO  (TEST-TestZkConfigManager.testUploadWithACL-seed#[AFF9D9F935F99FE9]) [    ] o.a.s.SolrTestCaseJ4 ###Starting testUploadWithACL
   [junit4]   2> 1131 INFO  (zkConnectionManagerCallback-2-thread-1) [    ] o.a.s.c.c.ConnectionManager zkClient has connected
   [junit4]   2> 1310 WARN  (NIOServerCxn.Factory:0.0.0.0/0.0.0.0:0) [    ] o.a.z.s.NIOServerCnxn caught end of stream exception
   [junit4]   2> EndOfStreamException: Unable to read additional data from client sessionid 0x16075f6bc970000, likely client has closed socket
   [junit4]   2> 	at org.apache.zookeeper.server.NIOServerCnxn.doIO(NIOServerCnxn.java:239)
   [junit4]   2> 	at org.apache.zookeeper.server.NIOServerCnxnFactory.run(NIOServerCnxnFactory.java:203)
   [junit4]   2> 	at java.lang.Thread.run(Thread.java:748)
   [junit4]   2> 1323 INFO  (zkConnectionManagerCallback-4-thread-1) [    ] o.a.s.c.c.ConnectionManager zkClient has connected
   [junit4]   2> 1389 INFO  (zkConnectionManagerCallback-6-thread-1) [    ] o.a.s.c.c.ConnectionManager zkClient has connected
   [junit4]   2> 1403 INFO  (zkConnectionManagerCallback-8-thread-1) [    ] o.a.s.c.c.ConnectionManager zkClient has connected
   [junit4]   2> 1409 INFO  (TEST-TestZkConfigManager.testUploadWithACL-seed#[AFF9D9F935F99FE9]) [    ] o.a.s.SolrTestCaseJ4 ###Ending testUploadWithACL
   [junit4]   2> 1447 INFO  (TEST-TestZkConfigManager.testConstants-seed#[AFF9D9F935F99FE9]) [    ] o.a.s.SolrTestCaseJ4 ###Starting testConstants
   [junit4]   2> 1447 INFO  (TEST-TestZkConfigManager.testConstants-seed#[AFF9D9F935F99FE9]) [    ] o.a.s.SolrTestCaseJ4 ###Ending testConstants
   [junit4]   2> 1450 INFO  (TEST-TestZkConfigManager.testUploadConfig-seed#[AFF9D9F935F99FE9]) [    ] o.a.s.SolrTestCaseJ4 ###Starting testUploadConfig
   [junit4]   2> 1450 INFO  (zkConnectionManagerCallback-10-thread-1) [    ] o.a.s.c.c.ConnectionManager zkClient has connected
   [junit4]   2> 1455 WARN  (NIOServerCxn.Factory:0.0.0.0/0.0.0.0:0) [    ] o.a.z.s.NIOServerCnxn caught end of stream exception
   [junit4]   2> EndOfStreamException: Unable to read additional data from client sessionid 0x16075f6bc970004, likely client has closed socket
   [junit4]   2> 	at org.apache.zookeeper.server.NIOServerCnxn.doIO(NIOServerCnxn.java:239)
   [junit4]   2> 	at org.apache.zookeeper.server.NIOServerCnxnFactory.run(NIOServerCnxnFactory.java:203)
   [junit4]   2> 	at java.lang.Thread.run(Thread.java:748)
   [junit4]   2> 1460 INFO  (zkConnectionManagerCallback-12-thread-1) [    ] o.a.s.c.c.ConnectionManager zkClient has connected
   [junit4]   2> 1468 INFO  (TEST-TestZkConfigManager.testUploadConfig-seed#[AFF9D9F935F99FE9]) [    ] o.a.s.c.c.ZkMaintenanceUtils uploadToZK skipping '.ignored' due to filenameExclusions '^\..*$'
   [junit4]   2> 1509 INFO  (TEST-TestZkConfigManager.testUploadConfig-seed#[AFF9D9F935F99FE9]) [    ] o.a.s.c.c.ZkMaintenanceUtils Writing file C:\Users\jenkins\workspace\Lucene-Solr-7.2-Windows\solr\build\solr-solrj\test\J1\temp\solr.common.cloud.TestZkConfigManager_AFF9D9F935F99FE9-001\download-001\file1
   [junit4]   2> 1522 INFO  (TEST-TestZkConfigManager.testUploadConfig-seed#[AFF9D9F935F99FE9]) [    ] o.a.s.c.c.ZkMaintenanceUtils uploadToZK skipping '.ignored' due to filenameExclusions '^\..*$'
   [junit4]   2> 1560 INFO  (TEST-TestZkConfigManager.testUploadConfig-seed#[AFF9D9F935F99FE9]) [    ] o.a.s.c.c.ZkMaintenanceUtils Writing file C:\Users\jenkins\workspace\Lucene-Solr-7.2-Windows\solr\build\solr-solrj\test\J1\temp\solr.common.cloud.TestZkConfigManager_AFF9D9F935F99FE9-001\download2-001\file1
   [junit4]   2> 1561 INFO  (TEST-TestZkConfigManager.testUploadConfig-seed#[AFF9D9F935F99FE9]) [    ] o.a.s.c.c.ZkMaintenanceUtils uploadToZK skipping '.ignored' due to filenameExclusions '^\..*$'
   [junit4]   2> 1585 WARN  (NIOServerCxn.Factory:0.0.0.0/0.0.0.0:0) [    ] o.a.z.s.NIOServerCnxn caught end of stream exception
   [junit4]   2> EndOfStreamException: Unable to read additional data from client sessionid 0x16075f6bc970005, likely client has closed socket
   [junit4]   2> 	at org.apache.zookeeper.server.NIOServerCnxn.doIO(NIOServerCnxn.java:239)
   [junit4]   2> 	at org.apache.zookeeper.server.NIOServerCnxnFactory.run(NIOServerCnxnFactory.java:203)
   [junit4]   2> 	at java.lang.Thread.run(Thread.java:748)
   [junit4]   2> 1587 INFO  (TEST-TestZkConfigManager.testUploadConfig-seed#[AFF9D9F935F99FE9]) [    ] o.a.s.SolrTestCaseJ4 ###Ending testUploadConfig
   [junit4]   2> 1588 ERROR (SUITE-TestZkConfigManager-seed#[AFF9D9F935F99FE9]-worker) [    ] o.a.z.s.ZooKeeperServer ZKShutdownHandler is not registered, so ZooKeeper server won't take any action on ERROR or SHUTDOWN server state changes
   [junit4]   2> 1593 INFO  (SUITE-TestZkConfigManager-seed#[AFF9D9F935F99FE9]-worker) [    ] o.a.s.c.ZkTestServer connecting to 127.0.0.1:60636 60636
   [junit4]   2> 1597 INFO  (Thread-1) [    ] o.a.s.c.ZkTestServer connecting to 127.0.0.1:60636 60636
   [junit4]   2> 1600 INFO  (SUITE-TestZkConfigManager-seed#[AFF9D9F935F99FE9]-worker) [    ] o.a.s.SolrTestCaseJ4 ------------------------------------------------------- Done waiting for tracked resources to be released
   [junit4]   2> Dec 20, 2017 10:06:33 PM com.carrotsearch.randomizedtesting.ThreadLeakControl checkThreadLeaks
   [junit4]   2> WARNING: Will linger awaiting termination of 2 leaked thread(s).
   [junit4]   2> NOTE: test params are: codec=Asserting(Lucene70): {}, docValues:{}, maxPointsInLeafNode=732, maxMBSortInHeap=6.941855207536153, sim=RandomSimilarity(queryNorm=true): {}, locale=ar-SD, timezone=SystemV/PST8PDT
   [junit4]   2> NOTE: Windows 10 10.0 x86/Oracle Corporation 1.8.0_144 (32-bit)/cpus=3,threads=1,free=46402624,total=64880640
   [junit4]   2> NOTE: All tests run in this JVM: [TestZkConfigManager]
   [junit4]   2> NOTE: reproduce with: ant test  -Dtestcase=TestZkConfigManager -Dtests.seed=AFF9D9F935F99FE9 -Dtests.slow=true -Dtests.locale=ar-SD -Dtests.timezone=SystemV/PST8PDT -Dtests.asserts=true -Dtests.file.encoding=UTF-8
   [junit4] ERROR   0.00s J1 | TestZkConfigManager (suite) <<<
   [junit4]    > Throwable #1: java.io.IOException: Could not remove the following files (in the order of attempts):
   [junit4]    >    C:\Users\jenkins\workspace\Lucene-Solr-7.2-Windows\solr\build\solr-solrj\test\J1\temp\solr.common.cloud.TestZkConfigManager_AFF9D9F935F99FE9-001\init-core-data-001: java.nio.file.AccessDeniedException: C:\Users\jenkins\workspace\Lucene-Solr-7.2-Windows\solr\build\solr-solrj\test\J1\temp\solr.common.cloud.TestZkConfigManager_AFF9D9F935F99FE9-001\init-core-data-001
   [junit4]    >    C:\Users\jenkins\workspace\Lucene-Solr-7.2-Windows\solr\build\solr-solrj\test\J1\temp\solr.common.cloud.TestZkConfigManager_AFF9D9F935F99FE9-001: java.nio.file.DirectoryNotEmptyException: C:\Users\jenkins\workspace\Lucene-Solr-7.2-Windows\solr\build\solr-solrj\test\J1\temp\solr.common.cloud.TestZkConfigManager_AFF9D9F935F99FE9-001
   [junit4]    > 	at __randomizedtesting.SeedInfo.seed([AFF9D9F935F99FE9]:0)
   [junit4]    > 	at org.apache.lucene.util.IOUtils.rm(IOUtils.java:329)
   [junit4]    > 	at java.lang.Thread.run(Thread.java:748)
   [junit4] Completed [5/146 (1!)] on J1 in 8.87s, 3 tests, 1 error <<< FAILURES!

[...truncated 160 lines...]
   [junit4] Suite: org.apache.solr.client.solrj.embedded.LargeVolumeBinaryJettyTest
   [junit4]   2> Creating dataDir: C:\Users\jenkins\workspace\Lucene-Solr-7.2-Windows\solr\build\solr-solrj\test\J1\temp\solr.client.solrj.embedded.LargeVolumeBinaryJettyTest_AFF9D9F935F99FE9-001\init-core-data-001
   [junit4]   2> 62555 INFO  (SUITE-LargeVolumeBinaryJettyTest-seed#[AFF9D9F935F99FE9]-worker) [    ] o.a.s.SolrTestCaseJ4 Using PointFields (NUMERIC_POINTS_SYSPROP=true) w/NUMERIC_DOCVALUES_SYSPROP=true
   [junit4]   2> 62557 INFO  (SUITE-LargeVolumeBinaryJettyTest-seed#[AFF9D9F935F99FE9]-worker) [    ] o.a.s.SolrTestCaseJ4 Randomized ssl (false) and clientAuth (false) via: @org.apache.solr.util.RandomizeSSL(reason=, value=NaN, ssl=NaN, clientAuth=NaN)
   [junit4]   2> 62558 INFO  (SUITE-LargeVolumeBinaryJettyTest-seed#[AFF9D9F935F99FE9]-worker) [    ] o.a.s.SolrTestCaseJ4 SecureRandom sanity checks: test.solr.allowed.securerandom=null & java.security.egd=file:/dev/./urandom
   [junit4]   2> 62658 INFO  (SUITE-LargeVolumeBinaryJettyTest-seed#[AFF9D9F935F99FE9]-worker) [    ] o.a.s.SolrTestCaseJ4 ####initCore
   [junit4]   2> 62658 INFO  (SUITE-LargeVolumeBinaryJettyTest-seed#[AFF9D9F935F99FE9]-worker) [    ] o.a.s.SolrTestCaseJ4 ####initCore end
   [junit4]   2> 62659 INFO  (SUITE-LargeVolumeBinaryJettyTest-seed#[AFF9D9F935F99FE9]-worker) [    ] o.a.s.SolrTestCaseJ4 Writing core.properties file to C:\Users\jenkins\workspace\Lucene-Solr-7.2-Windows\solr\build\solr-solrj\test\J1\temp\solr.client.solrj.embedded.LargeVolumeBinaryJettyTest_AFF9D9F935F99FE9-001\tempDir-002\cores\core
   [junit4]   2> 62661 INFO  (SUITE-LargeVolumeBinaryJettyTest-seed#[AFF9D9F935F99FE9]-worker) [    ] o.e.j.s.Server jetty-9.3.20.v20170531
   [junit4]   2> 62662 INFO  (SUITE-LargeVolumeBinaryJettyTest-seed#[AFF9D9F935F99FE9]-worker) [    ] o.e.j.s.h.ContextHandler Started o.e.j.s.ServletContextHandler@103f916{/solr,null,AVAILABLE}
   [junit4]   2> 62663 INFO  (SUITE-LargeVolumeBinaryJettyTest-seed#[AFF9D9F935F99FE9]-worker) [    ] o.e.j.s.AbstractConnector Started ServerConnector@d00268{HTTP/1.1,[http/1.1]}{127.0.0.1:61333}
   [junit4]   2> 62663 INFO  (SUITE-LargeVolumeBinaryJettyTest-seed#[AFF9D9F935F99FE9]-worker) [    ] o.e.j.s.Server Started @70490ms
   [junit4]   2> 62663 INFO  (SUITE-LargeVolumeBinaryJettyTest-seed#[AFF9D9F935F99FE9]-worker) [    ] o.a.s.c.s.e.JettySolrRunner Jetty properties: {hostContext=/solr, hostPort=61333, configSetBaseDir=C:\Users\jenkins\workspace\Lucene-Solr-7.2-Windows\solr\build\solr-solrj\test\J1\temp\solr.client.solrj.embedded.LargeVolumeBinaryJettyTest_AFF9D9F935F99FE9-001\tempDir-001, coreRootDirectory=C:\Users\jenkins\workspace\Lucene-Solr-7.2-Windows\solr\build\solr-solrj\test\J1\temp\solr.client.solrj.embedded.LargeVolumeBinaryJettyTest_AFF9D9F935F99FE9-001\tempDir-002\cores}
   [junit4]   2> 62663 ERROR (SUITE-LargeVolumeBinaryJettyTest-seed#[AFF9D9F935F99FE9]-worker) [    ] o.a.s.u.StartupLoggingUtils Missing Java Option solr.log.dir. Logging may be missing or incomplete.
   [junit4]   2> 62663 INFO  (SUITE-LargeVolumeBinaryJettyTest-seed#[AFF9D9F935F99FE9]-worker) [    ] o.a.s.s.SolrDispatchFilter  ___      _       Welcome to Apache Solr™ version 7.2.0
   [junit4]   2> 62663 INFO  (SUITE-LargeVolumeBinaryJettyTest-seed#[AFF9D9F935F99FE9]-worker) [    ] o.a.s.s.SolrDispatchFilter / __| ___| |_ _   Starting in standalone mode on port null
   [junit4]   2> 62663 INFO  (SUITE-LargeVolumeBinaryJettyTest-seed#[AFF9D9F935F99FE9]-worker) [    ] o.a.s.s.SolrDispatchFilter \__ \/ _ \ | '_|  Install dir: null
   [junit4]   2> 62663 INFO  (SUITE-LargeVolumeBinaryJettyTest-seed#[AFF9D9F935F99FE9]-worker) [    ] o.a.s.s.SolrDispatchFilter |___/\___/_|_|    Start time: 2017-12-20T22:07:34.598Z
   [junit4]   2> 62663 INFO  (SUITE-LargeVolumeBinaryJettyTest-seed#[AFF9D9F935F99FE9]-worker) [    ] o.a.s.c.SolrXmlConfig Loading container configuration from C:\Users\jenkins\workspace\Lucene-Solr-7.2-Windows\solr\build\solr-solrj\test\J1\temp\solr.client.solrj.embedded.LargeVolumeBinaryJettyTest_AFF9D9F935F99FE9-001\tempDir-001\solr.xml
   [junit4]   2> 62673 INFO  (SUITE-LargeVolumeBinaryJettyTest-seed#[AFF9D9F935F99FE9]-worker) [    ] o.a.s.c.SolrXmlConfig MBean server found: com.sun.jmx.mbeanserver.JmxMBeanServer@cc04ce, but no JMX reporters were configured - adding default JMX reporter.
   [junit4]   2> 62765 INFO  (SUITE-LargeVolumeBinaryJettyTest-seed#[AFF9D9F935F99FE9]-worker) [    ] o.a.s.m.r.SolrJmxReporter JMX monitoring for 'solr.node' (registry 'solr.node') enabled at server: com.sun.jmx.mbeanserver.JmxMBeanServer@cc04ce
   [junit4]   2> 62770 INFO  (SUITE-LargeVolumeBinaryJettyTest-seed#[AFF9D9F935F99FE9]-worker) [    ] o.a.s.m.r.SolrJmxReporter JMX monitoring for 'solr.jvm' (registry 'solr.jvm') enabled at server: com.sun.jmx.mbeanserver.JmxMBeanServer@cc04ce
   [junit4]   2> 62770 INFO  (SUITE-LargeVolumeBinaryJettyTest-seed#[AFF9D9F935F99FE9]-worker) [    ] o.a.s.m.r.SolrJmxReporter JMX monitoring for 'solr.jetty' (registry 'solr.jetty') enabled at server: com.sun.jmx.mbeanserver.JmxMBeanServer@cc04ce
   [junit4]   2> 62783 INFO  (SUITE-LargeVolumeBinaryJettyTest-seed#[AFF9D9F935F99FE9]-worker) [    ] o.a.s.c.CorePropertiesLocator Found 1 core definitions underneath C:\Users\jenkins\workspace\Lucene-Solr-7.2-Windows\solr\build\solr-solrj\test\J1\temp\solr.client.solrj.embedded.LargeVolumeBinaryJettyTest_AFF9D9F935F99FE9-001\tempDir-001
   [junit4]   2> 62784 INFO  (SUITE-LargeVolumeBinaryJettyTest-seed#[AFF9D9F935F99FE9]-worker) [    ] o.a.s.c.CorePropertiesLocator Cores are: [collection1]
   [junit4]   2> 62806 INFO  (coreLoadExecutor-141-thread-1) [    ] o.a.s.c.TransientSolrCoreCacheDefault Allocating transient cache for 2147483647 transient cores
   [junit4]   2> 62826 WARN  (coreLoadExecutor-141-thread-1) [    x:collection1] o.a.s.c.SolrConfig Couldn't add files from C:\Users\jenkins\workspace\Lucene-Solr-7.2-Windows\solr\build\solr-solrj\test\J1\temp\solr.client.solrj.embedded.LargeVolumeBinaryJettyTest_AFF9D9F935F99FE9-001\tempDir-001\collection1\..\..\..\..\contrib\extraction\lib filtered by .*\.jar to classpath: C:\Users\jenkins\workspace\Lucene-Solr-7.2-Windows\solr\build\solr-solrj\test\J1\temp\solr.client.solrj.embedded.LargeVolumeBinaryJettyTest_AFF9D9F935F99FE9-001\tempDir-001\collection1\..\..\..\..\contrib\extraction\lib
   [junit4]   2> 62826 WARN  (coreLoadExecutor-141-thread-1) [    x:collection1] o.a.s.c.SolrConfig Couldn't add files from C:\Users\jenkins\workspace\Lucene-Solr-7.2-Windows\solr\build\solr-solrj\test\J1\temp\solr.client.solrj.embedded.LargeVolumeBinaryJettyTest_AFF9D9F935F99FE9-001\tempDir-001\collection1\..\..\..\..\dist filtered by solr-cell-\d.*\.jar to classpath: C:\Users\jenkins\workspace\Lucene-Solr-7.2-Windows\solr\build\solr-solrj\test\J1\temp\solr.client.solrj.embedded.LargeVolumeBinaryJettyTest_AFF9D9F935F99FE9-001\tempDir-001\collection1\..\..\..\..\dist
   [junit4]   2> 62827 WARN  (coreLoadExecutor-141-thread-1) [    x:collection1] o.a.s.c.SolrConfig Couldn't add files from C:\Users\jenkins\workspace\Lucene-Solr-7.2-Windows\solr\build\solr-solrj\test\J1\temp\solr.client.solrj.embedded.LargeVolumeBinaryJettyTest_AFF9D9F935F99FE9-001\tempDir-001\collection1\..\..\..\..\contrib\clustering\lib filtered by .*\.jar to classpath: C:\Users\jenkins\workspace\Lucene-Solr-7.2-Windows\solr\build\solr-solrj\test\J1\temp\solr.client.solrj.embedded.LargeVolumeBinaryJettyTest_AFF9D9F935F99FE9-001\tempDir-001\collection1\..\..\..\..\contrib\clustering\lib
   [junit4]   2> 62827 WARN  (coreLoadExecutor-141-thread-1) [    x:collection1] o.a.s.c.SolrConfig Couldn't add files from C:\Users\jenkins\workspace\Lucene-Solr-7.2-Windows\solr\build\solr-solrj\test\J1\temp\solr.client.solrj.embedded.LargeVolumeBinaryJettyTest_AFF9D9F935F99FE9-001\tempDir-001\collection1\..\..\..\..\dist filtered by solr-clustering-\d.*\.jar to classpath: C:\Users\jenkins\workspace\Lucene-Solr-7.2-Windows\solr\build\solr-solrj\test\J1\temp\solr.client.solrj.embedded.LargeVolumeBinaryJettyTest_AFF9D9F935F99FE9-001\tempDir-001\collection1\..\..\..\..\dist
   [junit4]   2> 62827 WARN  (coreLoadExecutor-141-thread-1) [    x:collection1] o.a.s.c.SolrConfig Couldn't add files from C:\Users\jenkins\workspace\Lucene-Solr-7.2-Windows\solr\build\solr-solrj\test\J1\temp\solr.client.solrj.embedded.LargeVolumeBinaryJettyTest_AFF9D9F935F99FE9-001\tempDir-001\collection1\..\..\..\..\contrib\langid\lib filtered by .*\.jar to classpath: C:\Users\jenkins\workspace\Lucene-Solr-7.2-Windows\solr\build\solr-solrj\test\J1\temp\solr.client.solrj.embedded.LargeVolumeBinaryJettyTest_AFF9D9F935F99FE9-001\tempDir-001\collection1\..\..\..\..\contrib\langid\lib
   [junit4]   2> 62827 WARN  (coreLoadExecutor-141-thread-1) [    x:collection1] o.a.s.c.SolrConfig Couldn't add files from C:\Users\jenkins\workspace\Lucene-Solr-7.2-Windows\solr\build\solr-solrj\test\J1\temp\solr.client.solrj.embedded.LargeVolumeBinaryJettyTest_AFF9D9F935F99FE9-001\tempDir-001\collection1\..\..\..\..\dist filtered by solr-langid-\d.*\.jar to classpath: C:\Users\jenkins\workspace\Lucene-Solr-7.2-Windows\solr\build\solr-solrj\test\J1\temp\solr.client.solrj.embedded.LargeVolumeBinaryJettyTest_AFF9D9F935F99FE9-001\tempDir-001\collection1\..\..\..\..\dist
   [junit4]   2> 62827 WARN  (coreLoadExecutor-141-thread-1) [    x:collection1] o.a.s.c.SolrConfig Couldn't add files from C:\Users\jenkins\workspace\Lucene-Solr-7.2-Windows\solr\build\solr-solrj\test\J1\temp\solr.client.solrj.embedded.LargeVolumeBinaryJettyTest_AFF9D9F935F99FE9-001\tempDir-001\collection1\..\..\..\..\dist filtered by solr-ltr-\d.*\.jar to classpath: C:\Users\jenkins\workspace\Lucene-Solr-7.2-Windows\solr\build\solr-solrj\test\J1\temp\solr.client.solrj.embedded.LargeVolumeBinaryJettyTest_AFF9D9F935F99FE9-001\tempDir-001\collection1\..\..\..\..\dist
   [junit4]   2> 62828 WARN  (coreLoadExecutor-141-thread-1) [    x:collection1] o.a.s.c.SolrConfig Couldn't add files from C:\Users\jenkins\workspace\Lucene-Solr-7.2-Windows\solr\build\solr-solrj\test\J1\temp\solr.client.solrj.embedded.LargeVolumeBinaryJettyTest_AFF9D9F935F99FE9-001\tempDir-001\collection1\..\..\..\..\contrib\velocity\lib filtered by .*\.jar to classpath: C:\Users\jenkins\workspace\Lucene-Solr-7.2-Windows\solr\build\solr-solrj\test\J1\temp\solr.client.solrj.embedded.LargeVolumeBinaryJettyTest_AFF9D9F935F99FE9-001\tempDir-001\collection1\..\..\..\..\contrib\velocity\lib
   [junit4]   2> 62828 WARN  (coreLoadExecutor-141-thread-1) [    x:collection1] o.a.s.c.SolrConfig Couldn't add files from C:\Users\jenkins\workspace\Lucene-Solr-7.2-Windows\solr\build\solr-solrj\test\J1\temp\solr.client.solrj.embedded.LargeVolumeBinaryJettyTest_AFF9D9F935F99FE9-001\tempDir-001\collection1\..\..\..\..\dist filtered by solr-velocity-\d.*\.jar to classpath: C:\Users\jenkins\workspace\Lucene-Solr-7.2-Windows\solr\build\solr-solrj\test\J1\temp\solr.client.solrj.embedded.LargeVolumeBinaryJettyTest_AFF9D9F935F99FE9-001\tempDir-001\collection1\..\..\..\..\dist
   [junit4]   2> 62833 INFO  (coreLoadExecutor-141-thread-1) [    x:collection1] o.a.s.u.SolrIndexConfig IndexWriter infoStream solr logging is enabled
   [junit4]   2> 62834 INFO  (coreLoadExecutor-141-thread-1) [    x:collection1] o.a.s.c.SolrConfig Using Lucene MatchVersion: 7.2.0
   [junit4]   2> 62864 INFO  (coreLoadExecutor-141-thread-1) [    x:collection1] o.a.s.s.IndexSchema [collection1] Schema name=example
   [junit4]   2> 63011 INFO  (coreLoadExecutor-141-thread-1) [    x:collection1] o.a.s.r.RestManager Registered ManagedResource impl org.apache.solr.rest.schema.analysis.ManagedWordSetResource for path /schema/analysis/stopwords/english
   [junit4]   2> 63011 INFO  (coreLoadExecutor-141-thread-1) [    x:collection1] o.a.s.r.RestManager Registered ManagedResource impl org.apache.solr.rest.schema.analysis.ManagedSynonymGraphFilterFactory$SynonymManager for path /schema/analysis/synonyms/english
   [junit4]   2> 63011 INFO  (coreLoadExecutor-141-thread-1) [    x:collection1] o.a.s.r.RestManager Added observer of type org.apache.solr.rest.schema.analysis.ManagedStopFilterFactory to existing ManagedResource /schema/analysis/stopwords/english
   [junit4]   2> 63011 INFO  (coreLoadExecutor-141-thread-1) [    x:collection1] o.a.s.r.RestManager Added observer of type org.apache.solr.rest.schema.analysis.ManagedSynonymGraphFilterFactory to existing ManagedResource /schema/analysis/synonyms/english
   [junit4]   2> 63012 INFO  (coreLoadExecutor-141-thread-1) [    x:collection1] o.a.s.s.IndexSchema Loaded schema example/1.6 with uniqueid field id
   [junit4]   2> 63012 INFO  (coreLoadExecutor-141-thread-1) [    x:collection1] o.a.s.r.RestManager Added observer of type org.apache.solr.rest.schema.analysis.ManagedStopFilterFactory to existing ManagedResource /schema/analysis/stopwords/english
   [junit4]   2> 63012 INFO  (coreLoadExecutor-141-thread-1) [    x:collection1] o.a.s.r.RestManager Added observer of type org.apache.solr.rest.schema.analysis.ManagedSynonymGraphFilterFactory to existing ManagedResource /schema/analysis/synonyms/english
   [junit4]   2> 63012 INFO  (coreLoadExecutor-141-thread-1) [    x:collection1] o.a.s.r.RestManager Added observer of type org.apache.solr.rest.schema.analysis.ManagedStopFilterFactory to existing ManagedResource /schema/analysis/stopwords/english
   [junit4]   2> 63012 INFO  (coreLoadExecutor-141-thread-1) [    x:collection1] o.a.s.r.RestManager Added observer of type org.apache.solr.rest.schema.analysis.ManagedSynonymGraphFilterFactory to existing ManagedResource /schema/analysis/synonyms/english
   [junit4]   2> 63032 INFO  (coreLoadExecutor-141-thread-1) [    x:collection1] o.a.s.c.CoreContainer Creating SolrCore 'collection1' using configuration from instancedir C:\Users\jenkins\workspace\Lucene-Solr-7.2-Windows\solr\build\solr-solrj\test\J1\temp\solr.client.solrj.embedded.LargeVolumeBinaryJettyTest_AFF9D9F935F99FE9-001\tempDir-001\collection1, trusted=true
   [junit4]   2> 63037 INFO  (coreLoadExecutor-141-thread-1) [    x:collection1] o.a.s.m.r.SolrJmxReporter JMX monitoring for 'solr.core.collection1' (registry 'solr.core.collection1') enabled at server: com.sun.jmx.mbeanserver.JmxMBeanServer@cc04ce
   [junit4]   2> 63037 INFO  (coreLoadExecutor-141-thread-1) [    x:collection1] o.a.s.c.SolrCore solr.RecoveryStrategy.Builder
   [junit4]   2> 63037 INFO  (coreLoadExecutor-141-thread-1) [    x:collection1] o.a.s.c.SolrCore [[collection1] ] Opening new SolrCore at [C:\Users\jenkins\workspace\Lucene-Solr-7.2-Windows\solr\build\solr-solrj\test\J1\temp\solr.client.solrj.embedded.LargeVolumeBinaryJettyTest_AFF9D9F935F99FE9-001\tempDir-001\collection1], dataDir=[C:\Users\jenkins\workspace\Lucene-Solr-7.2-Windows\solr\build\solr-solrj\test\J1\temp\solr.client.solrj.embedded.LargeVolumeBinaryJettyTest_AFF9D9F935F99FE9-001\tempDir-001\collection1\data\]
   [junit4]   2> 63071 INFO  (coreLoadExecutor-141-thread-1) [    x:collection1] o.a.s.u.LoggingInfoStream [IFD][coreLoadExecutor-141-thread-1]: init: current segments file is "segments"; deletionPolicy=org.apache.solr.core.IndexDeletionPolicyWrapper@c5cff1
   [junit4]   2> 63071 INFO  (coreLoadExecutor-141-thread-1) [    x:collection1] o.a.s.u.LoggingInfoStream [IFD][coreLoadExecutor-141-thread-1]: now checkpoint "" [0 segments ; isCommit = false]
   [junit4]   2> 63072 INFO  (coreLoadExecutor-141-thread-1) [    x:collection1] o.a.s.u.LoggingInfoStream [IFD][coreLoadExecutor-141-thread-1]: 0 msec to checkpoint
   [junit4]   2> 63072 INFO  (coreLoadExecutor-141-thread-1) [    x:collection1] o.a.s.u.LoggingInfoStream [IW][coreLoadExecutor-141-thread-1]: init: create=true
   [junit4]   2> 63072 INFO  (coreLoadExecutor-141-thread-1) [    x:collection1] o.a.s.u.LoggingInfoStream [IW][coreLoadExecutor-141-thread-1]: 
   [junit4]   2> dir=MockDirectoryWrapper(RAMDirectory@1b75281 lockFactory=org.apache.lucene.store.SingleInstanceLockFactory@1224e5b)
   [junit4]   2> index=
   [junit4]   2> version=7.2.0
   [junit4]   2> analyzer=org.apache.solr.update.SolrIndexConfig$DelayedSchemaAnalyzer
   [junit4]   2> ramBufferSizeMB=100.0
   [junit4]   2> maxBufferedDocs=-1
   [junit4]   2> mergedSegmentWarmer=null
   [junit4]   2> delPolicy=org.apache.solr.core.IndexDeletionPolicyWrapper
   [junit4]   2> commit=null
   [junit4]   2> openMode=CREATE
   [junit4]   2> similarity=org.apache.solr.search.similarities.SchemaSimilarityFactory$SchemaSimilarity
   [junit4]   2> mergeScheduler=ConcurrentMergeScheduler: maxThreadCount=-1, maxMergeCount=-1, ioThrottle=true
   [junit4]   2> codec=Lucene70
   [junit4]   2> infoStream=org.apache.solr.update.LoggingInfoStream
   [junit4]   2> mergePolicy=[TieredMergePolicy: maxMergeAtOnce=10, maxMergeAtOnceExplicit=30, maxMergedSegmentMB=5120.0, floorSegmentMB=2.0, forceMergeDeletesPctAllowed=10.0, segmentsPerTier=10.0, maxCFSSegmentSizeMB=8.796093022207999E12, noCFSRatio=0.1
   [junit4]   2> indexerThreadPool=org.apache.lucene.index.DocumentsWriterPerThreadPool@1720c96
   [junit4]   2> readerPooling=true
   [junit4]   2> perThreadHardLimitMB=1945
   [junit4]   2> useCompoundFile=false
   [junit4]   2> commitOnClose=true
   [junit4]   2> indexSort=null
   [junit4]   2> writer=org.apache.solr.update.SolrIndexWriter@806c63
   [junit4]   2> 
   [junit4]   2> 63072 INFO  (coreLoadExecutor-141-thread-1) [    x:collection1] o.a.s.u.LoggingInfoStream [IW][coreLoadExecutor-141-thread-1]: MMapDirectory.UNMAP_SUPPORTED=true
   [junit4]   2> 63072 INFO  (coreLoadExecutor-141-thread-1) [    x:collection1] o.a.s.u.LoggingInfoStream [IW][coreLoadExecutor-141-thread-1]: now flush at close
   [junit4]   2> 63072 INFO  (coreLoadExecutor-141-thread-1) [    x:collection1] o.a.s.u.LoggingInfoStream [IW][coreLoadExecutor-141-thread-1]:   start flush: applyAllDeletes=true
   [junit4]   2> 63072 INFO  (coreLoadExecutor-141-thread-1) [    x:collection1] o.a.s.u.LoggingInfoStream [IW][coreLoadExecutor-141-thread-1]:   index before flush 
   [junit4]   2> 63072 INFO  (coreLoadExecutor-141-thread-1) [    x:collection1] o.a.s.u.LoggingInfoStream [DW][coreLoadExecutor-141-thread-1]: startFullFlush
   [junit4]   2> 63072 INFO  (coreLoadExecutor-141-thread-1) [    x:collection1] o.a.s.u.LoggingInfoStream [DW][coreLoadExecutor-141-thread-1]: coreLoadExecutor-141-thread-1 finishFullFlush success=true
   [junit4]   2> 63072 INFO  (coreLoadExecutor-141-thread-1) [    x:collection1] o.a.s.u.LoggingInfoStream [IW][coreLoadExecutor-141-thread-1]: now apply all deletes for all segments buffered updates bytesUsed=0 reader pool bytesUsed=0
   [junit4]   2> 63072 INFO  (coreLoadExecutor-141-thread-1) [    x:collection1] o.a.s.u.LoggingInfoStream [BD][coreLoadExecutor-141-thread-1]: waitApply: no deletes to apply
   [junit4]   2> 63072 INFO  (coreLoadExecutor-141-thread-1) [    x:collection1] o.a.s.u.LoggingInfoStream [MS][coreLoadExecutor-141-thread-1]: initDynamicDefaults spins=false maxThreadCount=2 maxMergeCount=7
   [junit4]   2> 63072 INFO  (coreLoadExecutor-141-thread-1) [    x:collection1] o.a.s.u.LoggingInfoStream [MS][coreLoadExecutor-141-thread-1]: updateMergeThreads ioThrottle=true targetMBPerSec=10240.0 MB/sec
   [junit4]   2> 63072 INFO  (coreLoadExecutor-141-thread-1) [    x:collection1] o.a.s.u.LoggingInfoStream [MS][coreLoadExecutor-141-thread-1]: now merge
   [junit4]   2> 63072 INFO  (coreLoadExecutor-141-thread-1) [    x:collection1] o.a.s.u.LoggingInfoStream [MS][coreLoadExecutor-141-thread-1]:   index: 
   [junit4]   2> 63072 INFO  (coreLoadExecutor-141-thread-1) [    x:collection1] o.a.s.u.LoggingInfoStream [MS][coreLoadExecutor-141-thread-1]:   no more merges pending; now return
   [junit4]   2> 63072 INFO  (coreLoadExecutor-141-thread-1) [    x:collection1] o.a.s.u.LoggingInfoStream [IW][coreLoadExecutor-141-thread-1]: waitForMerges
   [junit4]   2> 63072 INFO  (coreLoadExecutor-141-thread-1) [    x:collection1] o.a.s.u.LoggingInfoStream [IW][coreLoadExecutor-141-thread-1]: waitForMerges done
   [junit4]   2> 63072 INFO  (coreLoadExecutor-141-thread-1) [    x:collection1] o.a.s.u.LoggingInfoStream [IW][coreLoadExecutor-141-thread-1]: commit: start
   [junit4]   2> 63072 INFO  (coreLoadExecutor-141-thread-1) [    x:collection1] o.a.s.u.LoggingInfoStream [IW][coreLoadExecutor-141-thread-1]: commit: enter lock
   [junit4]   2> 63072 INFO  (coreLoadExecutor-141-thread-1) [    x:collection1] o.a.s.u.LoggingInfoStream [IW][coreLoadExecutor-141-thread-1]: commit: now prepare
   [junit4]   2> 63072 INFO  (coreLoadExecutor-141-thread-1) [    x:collection1] o.a.s.u.LoggingInfoStream [IW][coreLoadExecutor-141-thread-1]: prepareCommit: flush
   [junit4]   2> 63072 INFO  (coreLoadExecutor-141-thread-1) [    x:collection1] o.a.s.u.LoggingInfoStream [IW][coreLoadExecutor-141-thread-1]:   index before flush 
   [junit4]   2> 63072 INFO  (coreLoadExecutor-141-thread-1) [    x:collection1] o.a.s.u.LoggingInfoStream [DW][coreLoadExecutor-141-thread-1]: startFullFlush
   [junit4]   2> 63072 INFO  (coreLoadExecutor-141-thread-1) [    x:collection1] o.a.s.u.LoggingInfoStream [IW][coreLoadExecutor-141-thread-1]: now apply all deletes for all segments buffered updates bytesUsed=0 reader pool bytesUsed=0
   [junit4]   2> 63072 INFO  (coreLoadExecutor-141-thread-1) [    x:collection1] o.a.s.u.LoggingInfoStream [BD][coreLoadExecutor-141-thread-1]: waitApply: no deletes to apply
   [junit4]   2> 63072 INFO  (coreLoadExecutor-141-thread-1) [    x:collection1] o.a.s.u.LoggingInfoStream [DW][coreLoadExecutor-141-thread-1]: coreLoadExecutor-141-thread-1 finishFullFlush success=true
   [junit4]   2> 63072 INFO  (coreLoadExecutor-141-thread-1) [    x:collection1] o.a.s.u.LoggingInfoStream [IW][coreLoadExecutor-141-thread-1]: startCommit(): start
   [junit4]   2> 63072 INFO  (coreLoadExecutor-141-thread-1) [    x:collection1] o.a.s.u.LoggingInfoStream [IW][coreLoadExecutor-141-thread-1]: startCommit index= changeCount=2
   [junit4]   2> 63072 INFO  (coreLoadExecutor-141-thread-1) [    x:collection1] o.a.s.u.LoggingInfoStream [IW][coreLoadExecutor-141-thread-1]: startCommit: wrote pending segments file "pending_segments_1"
   [junit4]   2> 63072 INFO  (coreLoadExecutor-141-thread-1) [    x:collection1] o.a.s.u.LoggingInfoStream [IW][coreLoadExecutor-141-thread-1]: done all syncs: []
   [junit4]   2> 63072 INFO  (coreLoadExecutor-141-thread-1) [    x:collection1] o.a.s.u.LoggingInfoStream [IW][coreLoadExecutor-141-thread-1]: commit: pendingCommit != null
   [junit4]   2> 63072 INFO  (coreLoadExecutor-141-thread-1) [    x:collection1] o.a.s.u.LoggingInfoStream [IW][coreLoadExecutor-141-thread-1]: commit: done writing segments file "segments_1"
   [junit4]   2> 63072 INFO  (coreLoadExecutor-141-thread-1) [    x:collection1] o.a.s.u.LoggingInfoStream [IFD][coreLoadExecutor-141-thread-1]: now checkpoint "" [0 segments ; isCommit = true]
   [junit4]   2> 63072 INFO  (coreLoadExecutor-141-thread-1) [    x:collection1] o.a.s.u.LoggingInfoStream [IFD][coreLoadExecutor-141-thread-1]: 0 msec to checkpoint
   [junit4]   2> 63072 INFO  (coreLoadExecutor-141-thread-1) [    x:collection1] o.a.s.u.LoggingInfoStream [IW][coreLoadExecutor-141-thread-1]: commit: took 0.5 msec
   [junit4]   2> 63072 INFO  (coreLoadExecutor-141-thread-1) [    x:collection1] o.a.s.u.LoggingInfoStream [IW][coreLoadExecutor-141-thread-1]: commit: done
   [junit4]   2> 63073 INFO  (coreLoadExecutor-141-thread-1) [    x:collection1] o.a.s.u.LoggingInfoStream [IW][coreLoadExecutor-141-thread-1]: rollback
   [junit4]   2> 63073 INFO  (coreLoadExecutor-141-thread-1) [    x:collection1] o.a.s.u.LoggingInfoStream [IW][coreLoadExecutor-141-thread-1]: all running merges have aborted
   [junit4]   2> 63073 INFO  (coreLoadExecutor-141-thread-1) [    x:collection1] o.a.s.u.LoggingInfoStream [IW][coreLoadExecutor-141-thread-1]: rollback: done finish merges
   [junit4]   2> 63073 INFO  (coreLoadExecutor-141-thread-1) [    x:collection1] o.a.s.u.LoggingInfoStream [DW][coreLoadExecutor-141-thread-1]: abort
   [junit4]   2> 63073 INFO  (coreLoadExecutor-141-thread-1) [    x:collection1] o.a.s.u.LoggingInfoStream [DW][coreLoadExecutor-141-thread-1]: done abort success=true
   [junit4]   2> 63073 INFO  (coreLoadExecutor-141-thread-1) [    x:collection1] o.a.s.u.LoggingInfoStream [IW][coreLoadExecutor-141-thread-1]: rollback: infos=
   [junit4]   2> 63073 INFO  (coreLoadExecutor-141-thread-1) [    x:collection1] o.a.s.u.LoggingInfoStream [IFD][coreLoadExecutor-141-thread-1]: now checkpoint "" [0 segments ; isCommit = false]
   [junit4]   2> 63073 INFO  (coreLoadExecutor-141-thread-1) [    x:collection1] o.a.s.u.LoggingInfoStream [IFD][coreLoadExecutor-141-thread-1]: 0 msec to checkpoint
   [junit4]   2> 63073 INFO  (coreLoadExecutor-141-thread-1) [    x:collection1] o.a.s.r.XSLTResponseWriter xsltCacheLifetimeSeconds=5
   [junit4]   2> 63156 INFO  (coreLoadExecutor-141-thread-1) [    x:collection1] o.a.s.u.UpdateHandler Using UpdateLog implementation: org.apache.solr.update.UpdateLog
   [junit4]   2> 63156 INFO  (coreLoadExecutor-141-thread-1) [    x:collection1] o.a.s.u.UpdateLog Initializing UpdateLog: dataDir= defaultSyncLevel=FLUSH numRecordsToKeep=100 maxNumLogsToKeep=10 numVersionBuckets=65536
   [junit4]   2> 63157 INFO  (coreLoadExecutor-141-thread-1) [    x:collection1] o.a.s.u.CommitTracker Hard AutoCommit: if uncommited for 15000ms; 
   [junit4]   2> 63157 INFO  (coreLoadExecutor-141-thread-1) [    x:collection1] o.a.s.u.CommitTracker Soft AutoCommit: disabled
   [junit4]   2> 63159 INFO  (coreLoadExecutor-141-thread-1) [    x:collection1] o.a.s.u.LoggingInfoStream [IFD][coreLoadExecutor-141-thread-1]: init: current segments file is "segments_1"; deletionPolicy=org.apache.solr.core.IndexDeletionPolicyWrapper@c5cff1
   [junit4]   2> 63159 INFO  (coreLoadExecutor-141-thread-1) [    x:collection1] o.a.s.u.LoggingInfoStream [IFD][coreLoadExecutor-141-thread-1]: init: load commit "segments_1"
   [junit4]   2> 63159 INFO  (coreLoadExecutor-141-thread-1) [    x:collection1] o.a.s.u.LoggingInfoStream [IFD][coreLoadExecutor-141-thread-1]: now checkpoint "" [0 segments ; isCommit = false]
   [junit4]   2> 63159 INFO  (coreLoadExecutor-141-thread-1) [    x:collection1] o.a.s.u.LoggingInfoStream [IFD][coreLoadExecutor-141-thread-1]: 0 msec to checkpoint
   [junit4]   2> 63159 INFO  (coreLoadExecutor-141-thread-1) [    x:collection1] o.a.s.u.LoggingInfoStream [IW][coreLoadExecutor-141-thread-1]: init: create=false
   [junit4]   2> 63159 INFO  (coreLoadExecutor-141-thread-1) [    x:collection1] o.a.s.u.LoggingInfoStream [IW][coreLoadExecutor-141-thread-1]: 
   [junit4]   2> dir=MockDirectoryWrapper(RAMDirectory@1b75281 lockFactory=org.apache.lucene.store.SingleInstanceLockFactory@1224e5b)
   [junit4]   2> index=
   [junit4]   2> version=7.2.0
   [junit4]   2> analyzer=org.apache.solr.update.SolrIndexConfig$DelayedSchemaAnalyzer
   [junit4]   2> ramBufferSizeMB=100.0
   [junit4]   2> maxBufferedDocs=-1
   [junit4]   2> mergedSegmentWarmer=null
   [junit4]   2> delPolicy=org.apache.solr.core.IndexDeletionPolicyWrapper
   [junit4]   2> commit=null
   [junit4]   2> openMode=APPEND
   [junit4]   2> similarity=org.apache.solr.search.similarities.SchemaSimilarityFactory$SchemaSimilarity
   [junit4]   2> mergeScheduler=ConcurrentMergeScheduler: maxThreadCount=-1, maxMergeCount=-1, ioThrottle=true
   [junit4]   2> codec=Lucene70
   [junit4]   2> infoStream=org.apache.solr.update.LoggingInfoStream
   [junit4]   2> mergePolicy=[TieredMergePolicy: maxMergeAtOnce=10, maxMergeAtOnceExplicit=30, maxMergedSegmentMB=5120.0, floorSegmentMB=2.0, forceMergeDeletesPctAllowed=10.0, segmentsPerTier=10.0, maxCFSSegmentSizeMB=8.796093022207999E12, noCFSRatio=0.1
   [junit4]   2> indexerThreadPool=org.apache.lucene.index.DocumentsWriterPerThreadPool@51e3e5
   [junit4]   2> readerPooling=true
   [junit4]   2> perThreadHardLimitMB=1945
   [junit4]   2> useCompoundFile=false
   [junit4]   2> commitOnClose=true
   [junit4]   2> indexSort=null
   [junit4]   2> writer=org.apache.solr.update.SolrIndexWriter@1b44c04
   [junit4]   2> 
   [junit4]   2> 63159 INFO  (coreLoadExecutor-141-thread-1) [    x:collection1] o.a.s.u.LoggingInfoStream [IW][coreLoadExecutor-141-thread-1]: MMapDirectory.UNMAP_SUPPORTED=true
   [junit4]   2> 63159 INFO  (coreLoadExecutor-141-thread-1) [    x:collection1] o.a.s.u.LoggingInfoStream [IW][coreLoadExecutor-141-thread-1]: flush at getReader
   [junit4]   2> 63159 INFO  (coreLoadExecutor-141-thread-1) [    x:collection1] o.a.s.u.LoggingInfoStream [DW][coreLoadExecutor-141-thread-1]: startFullFlush
   [junit4]   2> 63159 INFO  (coreLoadExecutor-141-thread-1) [    x:collection1] o.a.s.u.LoggingInfoStream [IW][coreLoadExecutor-141-thread-1]: now apply all deletes for all segments buffered updates bytesUsed=0 reader pool bytesUsed=0
   [junit4]   2> 63159 INFO  (coreLoadExecutor-141-thread-1) [    x:collection1] o.a.s.u.LoggingInfoStream [BD][coreLoadExecutor-141-thread-1]: waitApply: no deletes to apply
   [junit4]   2> 63159 INFO  (coreLoadExecutor-141-thread-1) [    x:collection1] o.a.s.u.LoggingInfoStream [IW][coreLoadExecutor-141-thread-1]: incRefDeleter for NRT reader version=2 segments=
   [junit4]   2> 63159 INFO  (coreLoadExecutor-141-thread-1) [    x:collection1] o.a.s.u.LoggingInfoStream [IW][coreLoadExecutor-141-thread-1]: return reader version=2 reader=StandardDirectoryReader(segments_1:2:nrt)
   [junit4]   2> 63159 INFO  (coreLoadExecutor-141-thread-1) [    x:collection1] o.a.s.u.LoggingInfoStream [DW][coreLoadExecutor-141-thread-1]: coreLoadExecutor-141-thread-1 finishFullFlush success=true
   [junit4]   2> 63159 INFO  (coreLoadExecutor-141-thread-1) [    x:collection1] o.a.s.u.LoggingInfoStream [IW][coreLoadExecutor-141-thread-1]: getReader took 0 msec
   [junit4]   2> 63159 INFO  (coreLoadExecutor-141-thread-1) [    x:collection1] o.a.s.s.SolrIndexSearcher Opening [Searcher@1407dd0[collection1] main]
   [junit4]   2> 63160 INFO  (coreLoadExecutor-141-thread-1) [    x:collection1] o.a.s.r.ManagedResourceStorage File-based storage initialized to use dir: C:\Users\jenkins\workspace\Lucene-Solr-7.2-Windows\solr\build\solr-solrj\test\J1\temp\solr.client.solrj.embedded.LargeVolumeBinaryJettyTest_AFF9D9F935F99FE9-001\tempDir-001\collection1\conf
   [junit4]   2> 63160 INFO  (coreLoadExecutor-141-thread-1) [    x:collection1] o.a.s.r.ManagedResourceStorage Loaded LinkedHashMap at path _rest_managed.json using file:dir=C:\Users\jenkins\workspace\Lucene-Solr-7.2-Windows\solr\build\solr-solrj\test\J1\temp\solr.client.solrj.embedded.LargeVolumeBinaryJettyTest_AFF9D9F935F99FE9-001\tempDir-001\collection1\conf
   [junit4]   2> 63160 INFO  (coreLoadExecutor-141-thread-1) [    x:collection1] o.a.s.r.ManagedResource Loaded initArgs {} for /rest/managed
   [junit4]   2> 63160 INFO  (coreLoadExecutor-141-thread-1) [    x:collection1] o.a.s.r.ManagedResourceStorage Loaded LinkedHashMap at path _schema_analysis_stopwords_english.json using file:dir=C:\Users\jenkins\workspace\Lucene-Solr-7.2-Windows\solr\build\solr-solrj\test\J1\temp\solr.client.solrj.embedded.LargeVolumeBinaryJettyTest_AFF9D9F935F99FE9-001\tempDir-001\collection1\conf
   [junit4]   2> 63160 INFO  (coreLoadExecutor-141-thread-1) [    x:collection1] o.a.s.r.ManagedResource Loaded initArgs {ignoreCase=true} for /schema/analysis/stopwords/english
   [junit4]   2> 63160 INFO  (coreLoadExecutor-141-thread-1) [    x:collection1] o.a.s.r.s.a.ManagedWordSetResource Loaded 35 words for /schema/analysis/stopwords/english
   [junit4]   2> 63160 INFO  (coreLoadExecutor-141-thread-1) [    x:collection1] o.a.s.r.ManagedResource Notified 4 observers of /schema/analysis/stopwords/english
   [junit4]   2> 63160 INFO  (coreLoadExecutor-141-thread-1) [    x:collection1] o.a.s.r.ManagedResourceStorage Loaded LinkedHashMap at path _schema_analysis_synonyms_english.json using file:dir=C:\Users\jenkins\workspace\Lucene-Solr-7.2-Windows\solr\build\solr-solrj\test\J1\temp\solr.client.solrj.embedded.LargeVolumeBinaryJettyTest_AFF9D9F935F99FE9-001\tempDir-001\collection1\conf
   [junit4]   2> 63160 INFO  (coreLoadExecutor-141-thread-1) [    x:collection1] o.a.s.r.ManagedResource Loaded initArgs {ignoreCase=true,format=solr} for /schema/analysis/synonyms/english
   [junit4]   2> 63160 INFO  (coreLoadExecutor-141-thread-1) [    x:collection1] o.a.s.r.s.a.ManagedSynonymGraphFilterFactory Loaded 3 synonym mappings for /schema/analysis/synonyms/english
   [junit4]   2> 63161 INFO  (coreLoadExecutor-141-thread-1) [    x:collection1] o.a.s.r.ManagedResource Notified 4 observers of /schema/analysis/synonyms/english
   [junit4]   2> 63162 INFO  (coreLoadExecutor-141-thread-1) [    x:collection1] o.a.s.h.c.SpellCheckComponent Initializing spell checkers
   [junit4]   2> 63162 INFO  (coreLoadExecutor-141-thread-1) [    x:collection1] o.a.s.s.DirectSolrSpellChecker init: {name=default,field=text,classname=solr.DirectSolrSpellChecker,distanceMeasure=internal,accuracy=0.5,maxEdits=2,minPrefix=1,maxInspections=5,minQueryLength=4,maxQueryFrequency=0.01}
   [junit4]   2> 63162 INFO  (coreLoadExecutor-141-thread-1) [    x:collection1] o.a.s.h.c.SuggestComponent Initializing SuggestComponent
   [junit4]   2> 63162 INFO  (coreLoadExecutor-141-thread-1) [    x:collection1] o.a.s.s.s.SolrSuggester init: {name=mySuggester,lookupImpl=FuzzyLookupFactory,dictionaryImpl=DocumentDictionaryFactory,field=cat,weightField=price,suggestAnalyzerFieldType=string,buildOnStartup=false}
   [junit4]   2> 63162 INFO  (coreLoadExecutor-141-thread-1) [    x:collection1] o.a.s.s.s.SolrSuggester Dictionary loaded with params: {name=mySuggester,lookupImpl=FuzzyLookupFactory,dictionaryImpl=DocumentDictionaryFactory,field=cat,weightField=price,suggestAnalyzerFieldType=string,buildOnStartup=false}
   [junit4]   2> 63164 INFO  (coreLoadExecutor-141-thread-1) [    x:collection1] o.a.s.h.c.QueryElevationComponent Loading QueryElevation from: C:\Users\jenkins\workspace\Lucene-Solr-7.2-Windows\solr\build\solr-solrj\test\J1\temp\solr.client.solrj.embedded.LargeVolumeBinaryJettyTest_AFF9D9F935F99FE9-001\tempDir-001\collection1\conf\elevate.xml
   [junit4]   2> 63178 INFO  (coreLoadExecutor-141-thread-1) [    x:collection1] o.a.s.h.ReplicationHandler Commits will be reserved for 10000ms.
   [junit4]   2> 63178 INFO  (coreLoadExecutor-141-thread-1) [    x:collection1] o.a.s.u.UpdateLog Could not find max version in index or recent updates, using new clock 1587342375767769088
   [junit4]   2> 63179 INFO  (searcherExecutor-142-thread-1-processing-x:collection1) [    x:collection1] o.a.s.c.QuerySenderListener QuerySenderListener sending requests to Searcher@1407dd0[collection1] main{ExitableDirectoryReader(UninvertingDirectoryReader())}
   [junit4]   2> 63180 INFO  (searcherExecutor-142-thread-1-processing-x:collection1) [    x:collection1] o.a.s.c.S.Request [collection1]  webapp=null path=null params={q=static+firstSearcher+warming+in+solrconfig.xml&distrib=false&event=firstSearcher} hits=0 status=0 QTime=0
   [junit4]   2> 63180 INFO  (searcherExecutor-142-thread-1-processing-x:collection1) [    x:collection1] o.a.s.c.QuerySenderListener QuerySenderListener done.
   [junit4]   2> 63180 INFO  (searcherExecutor-142-thread-1-processing-x:collection1) [    x:collection1] o.a.s.h.c.SpellCheckComponent Loading spell index for spellchecker: default
   [junit4]   2> 63180 INFO  (searcherExecutor-142-thread-1-processing-x:collection1) [    x:collection1] o.a.s.h.c.SpellCheckComponent Loading spell index for spellchecker: wordbreak
   [junit4]   2> 63180 INFO  (SUITE-LargeVolumeBinaryJettyTest-seed#[AFF9D9F935F99FE9]-worker) [    ] o.a.s.SolrJettyTestBase Jetty Assigned Port#61333
   [junit4]   2> 63184 INFO  (searcherExecutor-142-thread-1-processing-x:collection1) [    x:collection1] o.a.s.c.SolrCore [collection1] Registered new searcher Searcher@1407dd0[collection1] main{ExitableDirectoryReader(UninvertingDirectoryReader())}
   [junit4]   2> 63186 INFO  (TEST-LargeVolumeBinaryJettyTest.testMultiThreaded-seed#[AFF9D9F935F99FE9]) [    ] o.a.s.SolrTestCaseJ4 ###Starting testMultiThreaded
   [junit4]   2> 63194 INFO  (qtp18328909-777) [    x:collection1] o.a.s.u.LoggingInfoStream [DW][qtp18328909-777]: anyChanges? numDocsInRam=0 deletes=true hasTickets:false pendingChangesInFullFlush: false
   [junit4]   2> 63194 INFO  (qtp18328909-777) [    x:collection1] o.a.s.u.LoggingInfoStream [DW][qtp18328909-777]: anyChanges? numDocsInRam=0 deletes=true hasTickets:false pendingChangesInFullFlush: false
   [junit4]   2> 63194 INFO  (qtp18328909-777) [    x:collection1] o.a.s.u.LoggingInfoStream [IW][qtp18328909-777]: nrtIsCurrent: infoVersion matches: true; DW changes: true; BD changes: false
   [junit4]   2> 63194 INFO  (qtp18328909-777) [    x:collection1] o.a.s.u.LoggingInfoStream [IW][qtp18328909-777]: flush at getReader
   [junit4]   2> 63194 INFO  (qtp18328909-777) [    x:collection1] o.a.s.u.LoggingInfoStream [DW][qtp18328909-777]: startFullFlush
   [junit4]   2> 63194 INFO  (qtp18328909-777) [    x:collection1] o.a.s.u.LoggingInfoStream [DW][qtp18328909-777]: anyChanges? numDocsInRam=0 deletes=true hasTickets:false pendingChangesInFullFlush: false
   [junit4]   2> 63194 INFO  (qtp18328909-777) [    x:collection1] o.a.s.u.LoggingInfoStream [DW][qtp18328909-777]: qtp18328909-777: flush naked frozen global deletes
   [junit4]   2> 63194 INFO  (qtp18328909-777) [    x:collection1] o.a.s.u.LoggingInfoStream [BD][qtp18328909-777]: compressed 68 to 48 bytes (70.59%) for deletes/updates; private segment null
   [junit4]   2> 63194 INFO  (qtp18328909-777) [    x:collection1] o.a.s.u.LoggingInfoStream [BD][qtp18328909-777]: push new packet (delGen=1 numDeleteQuerys=1 bytesUsed=48), packetCount=1, bytesUsed=0.000 MB
   [junit4]   2> 63194 INFO  (qtp18328909-777) [    x:collection1] o.a.s.u.LoggingInfoStream [DW][qtp18328909-777]: flush: push buffered updates: delGen=1 numDeleteQuerys=1 bytesUsed=48
   [junit4]   2> 63194 INFO  (qtp18328909-777) [    x:collection1] o.a.s.u.LoggingInfoStream [BD][qtp18328909-777]: packet matches no segments
   [junit4]   2> 63194 INFO  (qtp18328909-777) [    x:collection1] o.a.s.u.LoggingInfoStream [BD][qtp18328909-777]: finished packet delGen=1 now completedDelGen=1
   [junit4]   2> 63194 INFO  (qtp18328909-777) [    x:collection1] o.a.s.u.LoggingInfoStream [BD][qtp18328909-777]: done apply del packet (delGen=1 numDeleteQuerys=1 bytesUsed=48) to 0 segments; 0 new deletes/updates; took 0.000 sec; 0 packets remain
   [junit4]   2> 63194 INFO  (qtp18328909-777) [    x:collection1] o.a.s.u.LoggingInfoStream [IW][qtp18328909-777]: now apply all deletes for all segments buffered updates bytesUsed=0 reader pool bytesUsed=0
   [junit4]   2> 63194 INFO  (qtp18328909-777) [    x:collection1] o.a.s.u.LoggingInfoStream [BD][qtp18328909-777]: waitApply: no deletes to apply
   [junit4]   2> 63194 INFO  (qtp18328909-777) [    x:collection1] o.a.s.u.LoggingInfoStream [IW][qtp18328909-777]: incRefDeleter for NRT reader version=2 segments=
   [junit4]   2> 63194 INFO  (qtp18328909-777) [    x:collection1] o.a.s.u.LoggingInfoStream [IW][qtp18328909-777]: return reader version=2 reader=StandardDirectoryReader(segments_1:2:nrt)
   [junit4]   2> 63194 INFO  (qtp18328909-777) [    x:collection1] o.a.s.u.LoggingInfoStream [DW][qtp18328909-777]: qtp18328909-777 finishFullFlush success=true
   [junit4]   2> 63194 INFO  (qtp18328909-777) [    x:collection1] o.a.s.u.LoggingInfoStream [IW][qtp18328909-777]: getReader took 0 msec
   [junit4]   2> 63194 INFO  (qtp18328909-777) [    x:collection1] o.a.s.u.LoggingInfoStream [IW][qtp18328909-777]: decRefDeleter for NRT reader version=2 segments=
   [junit4]   2> 63194 INFO  (qtp18328909-777) [    x:collection1] o.a.s.u.p.LogUpdateProcessorFactory [collection1]  webapp=/solr path=/update params={wt=javabin&version=2}{deleteByQuery=*:* (-1587342375782449152)} 0 3
   [junit4]   2> 63195 INFO  (TEST-LargeVolumeBinaryJettyTest.testMultiThreaded-seed#[AFF9D9F935F99FE9]) [    ] o.a.s.c.s.LargeVolumeTestBase Started thread: 0
   [junit4]   2> 63196 INFO  (TEST-LargeVolumeBinaryJettyTest.testMultiThreaded-seed#[AFF9D9F935F99FE9]) [    ] o.a.s.c.s.LargeVolumeTestBase Started thread: 1
   [junit4]   2> 63197 INFO  (TEST-LargeVolumeBinaryJettyTest.testMultiThreaded-seed#[AFF9D9F935F99FE9]) [    ] o.a.s.c.s.LargeVolumeTestBase Started thread: 2
   [junit4]   2> 63197 INFO  (TEST-LargeVolumeBinaryJettyTest.testMultiThreaded-seed#[AFF9D9F935F99FE9]) [    ] o.a.s.c.s.LargeVolumeTestBase Started thread: 3
   [junit4]   2> 63198 INFO  (TEST-LargeVolumeBinaryJettyTest.testMultiThreaded-seed#[AFF9D9F935F99FE9]) [    ] o.a.s.c.s.LargeVolumeTestBase Started thread: 4
   [junit4]   2> 63418 INFO  (qtp18328909-783) [    x:collection1] o.a.s.u.p.LogUpdateProcessorFactory [collection1]  webapp=/solr path=/update params={wt=javabin&version=2}{add=[T4:0 (1587342375832780800), T4:1 (1587342376004747264), T4:2 (1587342376009990144), T4:3 (1587342376011038720), T4:4 (1587342376011038721), T4:5 (1587342376011038722), T4:6 (1587342376011038723), T4:7 (1587342376011038724), T4:8 (1587342376011038725), T4:9 (1587342376012087296), ... (100 adds)]} 0 178
   [junit4]   2> 63420 INFO  (qtp18328909-783) [    x:collection1] o.a.s.u.DirectUpdateHandler2 start commit{_version_=1587342376021524480,optimize=false,openSearcher=true,waitSearcher=true,expungeDeletes=false,softCommit=false,prepareCommit=false}
   [junit4]   2> 63420 INFO  (qtp18328909-783) [    x:collection1] o.a.s.u.SolrIndexWriter Calling setCommitData with IW:org.apache.solr.update.SolrIndexWriter@1b44c04 commitCommandVersion:1587342376021524480
   [junit4]   2> 63420 INFO  (qtp18328909-783) [    x:collection1] o.a.s.u.LoggingInfoStream [IW][qtp18328909-783]: commit: start
   [junit4]   2> 63420 INFO  (qtp18328909-783) [    x:collection1] o.a.s.u.LoggingInfoStream [IW][qtp18328909-783]: commit: enter lock
   [junit4]   2> 63420 INFO  (qtp18328909-783) [    x:collection1] o.a.s.u.LoggingInfoStream [IW][qtp18328909-783]: commit: now prepare
   [junit4]   2> 63421 INFO  (qtp18328909-783) [    x:collection1] o.a.s.u.LoggingInfoStream [IW][qtp18328909-783]: prepareCommit: flush
   [junit4]   2> 63421 INFO  (qtp18328909-783) [    x:collection1] o.a.s.u.LoggingInfoStream [IW][qtp18328909-783]:   index before flush 
   [junit4]   2> 63421 INFO  (qtp18328909-783) [    x:collection1] o.a.s.u.LoggingInfoStream [DW][qtp18328909-783]: startFullFlush
   [junit4]   2> 63421 INFO  (qtp18328909-783) [    x:collection1] o.a.s.u.LoggingInfoStream [DW][qtp18328909-783]: anyChanges? numDocsInRam=228 deletes=true hasTickets:false pendingChangesInFullFlush: false
   [junit4]   2> 63421 INFO  (qtp18328909-783) [    x:collection1] o.a.s.u.LoggingInfoStream [DWFC][qtp18328909-783]: addFlushableState DocumentsWriterPerThread [pendingDeletes=gen=0 227 deleted terms (unique count=227) bytesUsed=31977, segment=_0, aborted=false, numDocsInRAM=101, deleteQueue=DWDQ: [ generation: 2 ]]
   [junit4]   2> 63447 INFO  (qtp18328909-786) [    x:collection1] o.a.s.u.p.LogUpdateProcessorFactory [collection1]  webapp=/solr path=/update params={wt=javabin&version=2}{add=[T0:0 (1587342375790837760), T0:1 (1587342375909326848), T0:2 (1587342375910375424), T0:3 (1587342375910375425), T0:4 (1587342375910375426), T0:5 (1587342375910375427), T0:6 (1587342375910375428), T0:7 (1587342375910375429), T0:8 (1587342375910375430), T0:9 (1587342375911424000), ... (100 adds)]} 0 246
   [junit4]   2> 63449 INFO  (qtp18328909-781) [    x:collection1] o.a.s.u.LoggingInfoStream [DWFC][qtp18328909-781]: addFlushableState DocumentsWriterPerThread [pendingDeletes=gen=0 227 deleted terms (unique count=227) bytesUsed=31978, segment=_1, aborted=false, numDocsInRAM=128, deleteQueue=DWDQ: [ generation: 2 ]]
   [junit4]   2> 63453 INFO  (qtp18328909-781) [    x:collection1] o.a.s.u.p.LogUpdateProcessorFactory [collection1]  webapp=/solr path=/update params={wt=javabin&version=2}{add=[T2:0 (1587342375989018624), T2:1 (1587342376004747265), T2:2 (1587342376004747266), T2:3 (1587342376004747267), T2:4 (1587342376005795840), T2:5 (1587342376005795841), T2:6 (1587342376005795842), T2:7 (1587342376005795843), T2:8 (1587342376005795844), T2:9 (1587342376005795845), ... (100 adds)]} 0 63
   [junit4]   2> 63460 INFO  (qtp18328909-782) [    x:collection1] o.a.s.u.LoggingInfoStream [BD][qtp18328909-782]: compressed 32258 to 1040 bytes (3.22%) for deletes/updates; private segment null
   [junit4]   2> 63460 INFO  (qtp18328909-782) [    x:collection1] o.a.s.u.LoggingInfoStream [DWPT][qtp18328909-782]: flush postings as segment _0 numDocs=101
   [junit4]   2> 63461 INFO  (qtp18328909-783) [    x:collection1] o.a.s.u.LoggingInfoStream [DWPT][qtp18328909-783]: flush postings as segment _1 numDocs=128
   [junit4]   2> 63462 INFO  (qtp18328909-784) [    x:collection1] o.a.s.u.p.LogUpdateProcessorFactory [collection1]  webapp=/solr path=/update params={wt=javabin&version=2}{add=[T1:0 (1587342375987970048), T1:1 (1587342376064516096), T1:2 (1587342376064516097), T1:3 (1587342376064516098), T1:4 (1587342376064516099), T1:5 (1587342376064516100), T1:6 (1587342376064516101), T1:7 (1587342376064516102), T1:8 (1587342376064516103), T1:9 (1587342376064516104), ... (100 adds)]} 0 74
   [junit4]   2> 63467 INFO  (qtp18328909-782) [    x:collection1] o.a.s.u.LoggingInfoStream [IW][qtp18328909-782]: 7 msec to write norms
   [junit4]   2> 63468 INFO  (qtp18328909-783) [    x:collection1] o.a.s.u.LoggingInfoStream [IW][qtp18328909-783]: 7 msec to write norms
   [junit4]   2> 63468 INFO  (qtp18328909-782) [    x:collection1] o.a.s.u.LoggingInfoStream [IW][qtp18328909-782]: 0 msec to write docValues
   [junit4]   2> 63468 INFO  (qtp18328909-782) [    x:collection1] o.a.s.u.LoggingInfoStream [IW][qtp18328909-782]: 0 msec to write points
   [junit4]   2> 63476 INFO  (qtp18328909-783) [    x:collection1] o.a.s.u.LoggingInfoStream [IW][qtp18328909-783]: 8 msec to write docValues
   [junit4]   2> 63476 INFO  (qtp18328909-783) [    x:collection1] o.a.s.u.LoggingInfoStream [IW][qtp18328909-783]: 0 msec to write points
   [junit4]   2> 63476 INFO  (qtp18328909-783) [    x:collection1] o.a.s.u.LoggingInfoStream [IW][qtp18328909-783]: 0 msec to finish stored fields
   [junit4]   2> 63482 INFO  (qtp18328909-783) [    x:collection1] o.a.s.u.LoggingInfoStream [IW][qtp18328909-783]: 6 msec to write postings and finish vectors
   [junit4]   2> 63482 INFO  (qtp18328909-783) [    x:collection1] o.a.s.u.LoggingInfoStream [IW][qtp18328909-783]: 0 msec to write fieldInfos
   [junit4]   2> 63482 INFO  (qtp18328909-783) [    x:collection1] o.a.s.u.LoggingInfoStream [DWPT][qtp18328909-783]: new segment has 0 deleted docs
   [junit4]   2> 63482 INFO  (qtp18328909-783) [    x:collection1] o.a.s.u.LoggingInfoStream [DWPT][qtp18328909-783]: new segment has no vectors; norms; docValues; prox; freqs
   [junit4]   2> 63482 INFO  (qtp18328909-783) [    x:collection1] o.a.s.u.LoggingInfoStream [DWPT][qtp18328909-783]: flushedFiles=[_1_Lucene50_0.doc, _1_Lucene50_0.tim, _1_Lucene70_0.dvd, _1.nvd, _1_Lucene50_0.pos, _1.fdx, _1.nvm, _1.fnm, _1.fdt, _1_Lucene70_0.dvm, _1_Lucene50_0.tip]
   [junit4]   2> 63483 INFO  (qtp18328909-783) [    x:collection1] o.a.s.u.LoggingInfoStream [DWPT][qtp18328909-783]: flushed codec=Lucene70
   [junit4]   2> 63483 INFO  (qtp18328909-782) [    x:collection1] o.a.s.u.LoggingInfoStream [IW][qtp18328909-782]: 14 msec to finish stored fields
   [junit4]   2> 63488 INFO  (qtp18328909-783) [    x:collection1] o.a.s.u.LoggingInfoStream [DWPT][qtp18328909-783]: flushed: segment=_1 ramUsed=0.13 MB newFlushedSize=0.004 MB docs/MB=31,865.557
   [junit4]   2> 63488 INFO  (qtp18328909-783) [    x:collection1] o.a.s.u.LoggingInfoStream [DWPT][qtp18328909-783]: flush time 27.532239 msec
   [junit4]   2> 63489 INFO  (qtp18328909-782) [    x:collection1] o.a.s.u.LoggingInfoStream [IW][qtp18328909-782]: 5 msec to write postings and finish vectors
   [junit4]   2> 63489 INFO  (qtp18328909-782) [    x:collection1] o.a.s.u.LoggingInfoStream [IW][qtp18328909-782]: 1 msec to write fieldInfos
   [junit4]   2> 63489 INFO  (qtp18328909-782) [    x:collection1] o.a.s.u.LoggingInfoStream [DWPT][qtp18328909-782]: new segment has 0 deleted docs
   [junit4]   2> 63489 INFO  (qtp18328909-782) [    x:collection1] o.a.s.u.LoggingInfoStream [DWPT][qtp18328909-782]: new segment has no vectors; norms; docValues; prox; freqs
   [junit4]   2> 63490 INFO  (qtp18328909-782) [    x:collection1] o.a.s.u.LoggingInfoStream [DWPT][qtp18328909-782]: flushedFiles=[_0_Lucene50_0.doc, _0_Lucene50_0.tim, _0_Lucene70_0.dvd, _0_Lucene50_0.pos, _0.nvd, _0.fdx, _0_Lucene50_0.tip, _0.fdt, _0.nvm, _0_Lucene70_0.dvm, _0.fnm]
   [junit4]   2> 63490 INFO  (qtp18328909-782) [    x:collection1] o.a.s.u.LoggingInfoStream [DWPT][qtp18328909-782]: flushed codec=Lucene70
   [junit4]   2> 63493 INFO  (qtp18328909-782) [    x:collection1] o.a.s.u.LoggingInfoStream [DWPT][qtp18328909-782]: flushed: segment=_0 ramUsed=0.129 MB newFlushedSize=0.004 MB docs/MB=27,190.289
   [junit4]   2> 63494 INFO  (qtp18328909-782) [    x:collection1] o.a.s.u.LoggingInfoStream [DWPT][qtp18328909-782]: flush time 34.369432 msec
   [junit4]   2> 63494 INFO  (qtp18328909-783) [    x:collection1] o.a.s.u.LoggingInfoStream [DW][qtp18328909-783]: publishFlushedSegment seg-private updates=null
   [junit4]   2> 63494 INFO  (qtp18328909-783) [    x:collection1] o.a.s.u.LoggingInfoStream [IW][qtp18328909-783]: publishFlushedSegment _0(7.2.0):C101
   [junit4]   2> 63494 INFO  (qtp18328909-783) [    x:collection1] o.a.s.u.LoggingInfoStream [BD][qtp18328909-783]: push new packet (delGen=2 numDeleteTerms=229 bytesUsed=1040), packetCount=1, bytesUsed=0.001 MB
   [junit4]   2> 63494 INFO  (qtp18328909-783) [    x:collection1] o.a.s.u.LoggingInfoStream [BD][qtp18328909-783]: finished packet delGen=3 now completedDelGen=1
   [junit4]   2> 63494 INFO  (qtp18328909-783) [    x:collection1] o.a.s.u.LoggingInfoStream [IW][qtp18328909-783]: publish sets newSegment delGen=3 seg=_0(7.2.0):C101
   [junit4]   2> 63494 INFO  (qtp18328909-783) [    x:collection1] o.a.s.u.LoggingInfoStream [IFD][qtp18328909-783]: now checkpoint "_0(7.2.0):C101" [1 segments ; isCommit = false]
   [junit4]   2> 63494 INFO  (qtp18328909-783) [    x:collection1] o.a.s.u.LoggingInfoStream [IFD][qtp18328909-783]: 0 msec to checkpoint
   [junit4]   2> 63494 INFO  (qtp18328909-783) [    x:collection1] o.a.s.u.LoggingInfoStream [DW][qtp18328909-783]: publishFlushedSegment seg-private updates=null
   [junit4]   2> 63494 INFO  (qtp18328909-783) [    x:collection1] o.a.s.u.LoggingInfoStream [IW][qtp18328909-783]: publishFlushedSegment _1(7.2.0):C128
   [junit4]   2> 63494 INFO  (qtp18328909-783) [    x:collection1] o.a.s.u.LoggingInfoStream [BD][qtp18328909-783]: finished packet delGen=4 now completedDelGen=1
   [junit4]   2> 63494 INFO  (qtp18328909-783) [    x:collection1] o.a.s.u.LoggingInfoStream [IW][qtp18328909-783]: publish sets newSegment delGen=4 seg=_1(7.2.0):C128
   [junit4]   2> 63494 INFO  (qtp18328909-783) [    x:collection1] o.a.s.u.LoggingInfoStream [IFD][qtp18328909-783]: now checkpoint "_0(7.2.0):C101 _1(7.2.0):C128" [2 segments ; isCommit = false]
   [junit4]   2> 63494 INFO  (qtp18328909-783) [    x:collection1] o.a.s.u.LoggingInfoStream [IFD][qtp18328909-783]: 0 msec to checkpoint
   [junit4]   2> 63494 INFO  (qtp18328909-783) [    x:collection1] o.a.s.u.LoggingInfoStream [BD][qtp18328909-783]: packet matches no segments
   [junit4]   2> 63494 INFO  (qtp18328909-783) [    x:collection1] o.a.s.u.LoggingInfoStream [BD][qtp18328909-783]: finished packet delGen=2 now completedDelGen=4
   [junit4]   2> 63494 INFO  (qtp18328909-783) [    x:collection1] o.a.s.u.LoggingInfoStream [BD][qtp18328909-783]: done apply del packet (delGen=2 numDeleteTerms=229 bytesUsed=1040) to 0 segments; 0 new deletes/updates; took 0.000 sec; 0 packets remain
   [junit4]   2> 63494 INFO  (qtp18328909-783) [    x:collection1] o.a.s.u.LoggingInfoStream [IW][qtp18328909-783]: now apply all deletes for all segments buffered updates bytesUsed=0 reader pool bytesUsed=0
   [junit4]   2> 63495 INFO  (qtp18328909-783) [    x:collection1] o.a.s.u.LoggingInfoStream [BD][qtp18328909-783]: waitApply: no deletes to apply
   [junit4]   2> 63495 INFO  (qtp18328909-783) [    x:collection1] o.a.s.u.LoggingInfoStream [DW][qtp18328909-783]: qtp18328909-783 finishFullFlush success=true
   [junit4]   2> 63495 INFO  (qtp18328909-783) [    x:collection1] o.a.s.u.LoggingInfoStream [IW][qtp18328909-783]: startCommit(): start
   [junit4]   2> 63495 INFO  (qtp18328909-783) [    x:collection1] o.a.s.u.LoggingInfoStream [IW][qtp18328909-783]: startCommit index=_0(7.2.0):C101 _1(7.2.0):C128 changeCount=9
   [junit4]   2> 63495 INFO  (qtp18328909-783) [    x:collection1] o.a.s.u.LoggingInfoStream [IW][qtp18328909-783]: startCommit: wrote pending segments file "pending_segments_2"
   [junit4]   2> 63495 INFO  (qtp18328909-782) [    x:collection1] o.a.s.u.LoggingInfoStream [TMP][qtp18328909-782]: findMerges: 2 segments
   [junit4]   2> 63495 INFO  (qtp18328909-783) [    x:collection1] o.a.s.u.LoggingInfoStream [IW][qtp18328909-783]: done all syncs: [_0.si, _0_Lucene50_0.doc, _0_Lucene50_0.tim, _1.si, _1_Lucene70_0.dvd, _1.nvd, _0_Lucene50_0.pos, _0.nvd, _0.fdx, _0_Lucene50_0.tip, _1.nvm, _1.fnm, _0.fdt, _0_Lucene70_0.dvm, _1_Lucene50_0.doc, _1_Lucene50_0.tim, _0_Lucene70_0.dvd, _1_Lucene50_0.pos, _1.fdx, _0.nvm, _0.fnm, _1.fdt, _1_Lucene70_0.dvm, _1_Lucene50_0.tip]
   [junit4]   2> 63500 INFO  (qtp18328909-782) [    x:collection1] o.a.s.u.LoggingInfoStream [TMP][qtp18328909-782]:   seg=_1(7.2.0):C128 size=0.004 MB [floored]
   [junit4]   2> 63500 INFO  (qtp18328909-782) [    x:collection1] o.a.s.u.LoggingInfoStream [TMP][qtp18328909-782]:   seg=_0(7.2.0):C101 size=0.004 MB [floored]
   [junit4]   2> 63500 INFO  (qtp18328909-782) [    x:collection1] o.a.s.u.LoggingInfoStream [TMP][qtp18328909-782]:   allowedSegmentCount=1 vs count=2 (eligible count=2) tooBigCount=0
   [junit4]   2> 63500 INFO  (qtp18328909-783) [    x:collection1] o.a.s.u.LoggingInfoStream [IW][qtp18328909-783]: commit: pendingCommit != null
   [junit4]   2> 63501 INFO  (qtp18328909-782) [    x:collection1] o.a.s.u.LoggingInfoStream [MS][qtp18328909-782]: initDynamicDefaults spins=false maxThreadCount=2 maxMergeCount=7
   [junit4]   2> 63501 INFO  (qtp18328909-782) [    x:collection1] o.a.s.u.LoggingInfoStream [MS][qtp18328909-782]: now merge
   [junit4]   2> 63501 INFO  (qtp18328909-783) [    x:collection1] o.a.s.u.LoggingInfoStream [IW][qtp18328909-783]: commit: done writing segments file "segments_2"
   [junit4]   2> 63501 INFO  (qtp18328909-783) [    x:collection1] o.a.s.u.LoggingInfoStream [IFD][qtp18328909-783]: now checkpoint "_0(7.2.0):C101 _1(7.2.0):C128" [2 segments ; isCommit = true]
   [junit4]   2> 63502 INFO  (qtp18328909-783) [    x:collection1] o.a.s.u.LoggingInfoStream [IFD][qtp18328909-783]: deleteCommits: now decRef commit "segments_1"
   [junit4]   2> 63502 INFO  (qtp18328909-783) [    x:collection1] o.a.s.u.LoggingInfoStream [IFD][qtp18328909-783]: delete [segments_1]
   [junit4]   2> 63502 INFO  (qtp18328909-783) [    x:collection1] o.a.s.u.LoggingInfoStream [IFD][qtp18328909-783]: 0 msec to checkpoint
   [junit4]   2> 63502 INFO  (qtp18328909-783) [    x:collection1] o.a.s.u.LoggingInfoStream [IW][qtp18328909-783]: commit: took 81.6 msec
   [junit4]   2> 63502 INFO  (qtp18328909-783) [    x:collection1] o.a.s.u.LoggingInfoStream [IW][qtp18328909-783]: commit: done
   [junit4]   2> 63502 INFO  (qtp18328909-783) [    x:collection1] o.a.s.u.LoggingInfoStream [TMP][qtp18328909-783]: findMerges: 2 segments
   [junit4]   2> 63502 INFO  (qtp18328909-783) [    x:collection1] o.a.s.u.LoggingInfoStream [TMP][qtp18328909-783]:   seg=_1(7.2.0):C128 size=0.004 MB [floored]
   [junit4]   2> 63502 INFO  (qtp18328909-783) [    x:collection1] o.a.s.u.LoggingInfoStream [TMP][qtp18328909-783]:   seg=_0(7.2.0):C101 size=0.004 MB [floored]
   [junit4]   2> 63502 INFO  (qtp18328909-783) [    x:collection1] o.a.s.u.LoggingInfoStream [TMP][qtp18328909-783]:   allowedSegmentCount=1 vs count=2 (eligible count=2) tooBigCount=0
   [junit4]   2> 63502 INFO  (qtp18328909-782) [    x:collection1] o.a.s.u.LoggingInfoStream [MS][qtp18328909-782]:   index: _0(7.2.0):C101 _1(7.2.0):C128
   [junit4]   2> 63502 INFO  (qtp18328909-782) [    x:collection1] o.a.s.u.LoggingInfoStream [MS][qtp18328909-782]:   no more merges pending; now return
   [junit4]   2> 63505 INFO  (qtp18328909-783) [    x:collection1] o.a.s.u.LoggingInfoStream [MS][qtp18328909-783]: now merge
   [junit4]   2> 63505 INFO  (qtp18328909-783) [    x:collection1] o.a.s.u.LoggingInfoStream [MS][qtp18328909-783]:   index: _0(7.2.0):C101 _1(7.2.0):C128
   [junit4]   2> 63505 INFO  (qtp18328909-783) [    x:collection1] o.a.s.u.LoggingInfoStream [MS][qtp18328909-783]:   no more merges pending; now return
   [junit4]   2> 63521 INFO  (qtp18328909-782) [    x:collection1] o.a.s.u.p.LogUpdateProcessorFactory [collection1]  webapp=/solr path=/update params={wt=javabin&version=2}{add=[T3:0 (1587342375936589824), T3:1 (1587342376039350272), T3:2 (1587342376108556288), T3:3 (1587342376108556289), T3:4 (1587342376108556290), T3:5 (1587342376108556291), T3:6 (1587342376108556292), T3:7 (1587342376108556293), T3:8 (1587342376108556294), T3:9 (1587342376108556295), ... (100 adds)]} 0 181
   [junit4]   2> 63523 INFO  (qtp18328909-783) [    x:collection1] o.a.s.u.LoggingInfoStream [DW][qtp18328909-783]: anyChanges? numDocsInRam=271 deletes=true hasTickets:false pendingChangesInFullFlush: false
   [junit4]   2> 63523 INFO  (qtp18328909-783) [    x:collection1] o.a.s.u.LoggingInfoStream [IW][qtp18328909-783]: nrtIsCurrent: infoVersion matches: false; DW changes: true; BD changes: false
   [junit4]   2> 63524 INFO  (qtp18328909-783) [    x:collection1] o.a.s.u.LoggingInfoStream [IW][qtp18328909-783]: flush at getReader
   [junit4]   2> 63524 INFO  (qtp18328909-783) [    x:collection1] o.a.s.u.LoggingInfoStream [DW][qtp18328909-783]: startFullFlush
   [junit4]   2> 63524 INFO  (qtp18328909-783) [    x:collection1] o.a.s.u.LoggingInfoStream [DW][qtp18328909-783]: anyChanges? numDocsInRam=271 deletes=true hasTickets:false pendingChangesInFullFlush: false
   [junit4]   2> 63524 INFO  (qtp18328909-783) [    x:collection1] o.a.s.u.LoggingInfoStream [DWFC][qtp18328909-783]: addFlushableState DocumentsWriterPerThread [pendingDeletes=gen=0, segment=_2, aborted=false, numDocsInRAM=1, deleteQueue=DWDQ: [ generation: 3 ]]
   [junit4]   2> 63524 INFO  (qtp18328909-783) [    x:collection1] o.a.s.u.LoggingInfoStream [DWFC][qtp18328909-783]: addFlushableState DocumentsWriterPerThread [pendingDeletes=gen=0 71 deleted terms (unique count=71) bytesUsed=10011, segment=_4, aborted=false, numDocsInRAM=72, deleteQueue=DWDQ: [ generation: 3 ]]
   [junit4]   2> 63524 INFO  (qtp18328909-783) [    x:collection1] o.a.s.u.LoggingInfoStream [DWFC][qtp18328909-783]: addFlushableState DocumentsWriterPerThread [pendingDeletes=gen=0 197 deleted terms (unique count=197) bytesUsed=27760, segment=_3, aborted=false, numDocsInRAM=198, deleteQueue=DWDQ: [ generation: 3 ]]
   [junit4]   2> 63526 INFO  (qtp18328909-783) [    x:collection1] o.a.s.u.LoggingInfoStream [BD][qtp18328909-783]: compressed 38192 to 1040 bytes (2.72%) for deletes/updates; private segment null
   [junit4]   2> 63526 INFO  (qtp18328909-783) [    x:collection1] o.a.s.u.LoggingInfoStream [DWPT][qtp18328909-783]: flush postings as segment _2 numDocs=1
   [junit4]   2> 63530 INFO  (qtp18328909-783) [    x:collection1] o.a.s.u.LoggingInfoStream [IW][qtp18328909-783]: 4 msec to write norms
   [junit4]   2> 63531 INFO  (qtp18328909-783) [    x:collection1] o.a.s.u.LoggingInfoStream [IW][qtp18328909-783]: 0 msec to write docValues
   [junit4]   2> 63531 INFO  (qtp18328909-783) [    x:collection1] o.a.s.u.LoggingInfoStream [IW][qtp18328909-783]: 0 msec to write points
   [junit4]   2> 63531 INFO  (qtp18328909-783) [    x:collection1] o.a.s.u.LoggingInfoStream [IW][qtp18328909-783]: 0 msec to finish stored fields
   [junit4]   2> 63532 INFO  (qtp18328909-783) [    x:collection1] o.a.s.u.LoggingInfoStream [IW][qtp18328909-783]: 0 msec to write postings and finish vectors
   [junit4]   2> 63532 INFO  (qtp18328909-783) [    x:collection1] o.a.s.u.LoggingInfoStream [IW][qtp18328909-783]: 0 msec to write fieldInfos
   [junit4]   2> 63532 INFO  (qtp18328909-783) [    x:collection1] o.a.s.u.LoggingInfoStream [DWPT][qtp18328909-783]: new segment has 0 deleted docs
   [junit4]   2> 63532 INFO  (qtp18328909-783) [    x:collection1] o.a.s.u.LoggingInfoStream [DWPT][qtp18328909-783]: new segment has no vectors; norms; docValues; prox; freqs
   [junit4]   2> 63532 INFO  (qtp18328909-783) [    x:collection1] o.a.s.u.LoggingInfoStream [DWPT][qtp18328909-783]: flushedFiles=[_2.nvd, _2_Lucene70_0.dvd, _2.fdt, _2.nvm, _2_Lucene50_0.pos, _2.fnm, _2.fdx, _2_Lucene50_0.doc, _2_Lucene50_0.tim, _2_Lucene70_0.dvm, _2_Lucene50_0.tip]
   [junit4]   2> 63532 INFO  (qtp18328909-783) [    x:collection1] o.a.s.u.LoggingInfoStream [DWPT][qtp18328909-783]: flushed codec=Lucene70
   [junit4]   2> 63532 INFO  (qtp18328909-783) [    x:collection1] o.a.s.u.LoggingInfoStream [DWPT][qtp18328909-783]: flushed: segment=_2 ramUsed=0.122 MB newFlushedSize=0.001 MB docs/MB=670.445
   [junit4]   2> 63533 INFO  (qtp18328909-783) [    x:collection1] o.a.s.u.LoggingInfoStream [DWPT][qtp18328909-783]: flush time 7.041993 msec
   [junit4]   2> 63533 INFO  (qtp18328909-783) [    x:collection1] o.a.s.u.LoggingInfoStream [DWPT][qtp18328909-783]: flush postings as segment _4 numDocs=72
   [junit4]   2> 63533 INFO  (qtp18328909-783) [    x:collection1] o.a.s.u.LoggingInfoStream [IW][qtp18328909-783]: 0 msec to write norms
   [junit4]   2> 63535 INFO  (qtp18328909-783) [    x:collection1] o.a.s.u.LoggingInfoStream [IW][qtp18328909-783]: 1 msec to write docValues
   [junit4]   2> 63535 INFO  (qtp18328909-783) [    x:collection1] o.a.s.u.LoggingInfoStream [IW][qtp18328909-783]: 0 msec to write points
   [junit4]   2> 63535 INFO  (qtp18328909-783) [    x:collection1] o.a.s.u.LoggingInfoStream [IW][qtp18328909-783]: 0 msec to finish stored fields
   [junit4]   2> 63536 INFO  (qtp18328909-783) [    x:collection1] o.a.s.u.LoggingInfoStream [IW][qtp18328909-783]: 1 msec to write postings and finish vectors
   [junit4]   2> 63536 INFO  (qtp18328909-783) [    x:collection1] o.a.s.u.LoggingInfoStream [IW][qtp18328909-783]: 0 msec to write fieldInfos
   [junit4]   2> 63536 INFO  (qtp18328909-783) [    x:collection1] o.a.s.u.LoggingInfoStream [DWPT][qtp18328909-783]: new segment has 0 deleted docs
   [junit4]   2> 63536 INFO  (qtp18328909-783) [    x:collection1] o.a.s.u.LoggingInfoStream [DWPT][qtp18328909-783]: new segment has no vectors; norms; docValues; prox; freqs
   [junit4]   2> 63536 INFO  (qtp18328909-783) [    x:collection1] o.a.s.u.LoggingInfoStream [DWPT][qtp18328909-783]: flushedFiles=[_4.fdt, _4.nvm, _4_Lucene50_0.pos, _4.fnm, _4_Lucene70_0.dvd, _4_Lucene50_0.tip, _4.nvd, _4_Lucene70_0.dvm, _4.fdx, _4_Lucene50_0.doc, _4_Lucene50_0.tim]
   [junit4]   2> 63536 INFO  (qtp18328909-783) [    x:collection1] o.a.s.u.LoggingInfoStream [DWPT][qtp18328909-783]: flushed codec=Lucene70
   [junit4]   2> 63538 INFO  (qtp18328909-783) [    x:collection1] o.a.s.u.LoggingInfoStream [DWPT][qtp18328909-783]: flushed: segment=_4 ramUsed=0.134 MB newFlushedSize=0.003 MB docs/MB=23,704.073
   [junit4]   2> 63540 INFO  (qtp18328909-783) [    x:collection1] o.a.s.u.LoggingInfoStream [DWPT][qtp18328909-783]: flush time 7.599504 msec
   [junit4]   2> 63540 INFO  (qtp18328909-783) [    x:collection1] o.a.s.u.LoggingInfoStream [DWPT][qtp18328909-783]: flush postings as segment _3 numDocs=198
   [junit4]   2> 63541 INFO  (qtp18328909-783) [    x:collection1] o.a.s.u.LoggingInfoStream [IW][qtp18328909-783]: 0 msec to write norms
   [junit4]   2> 63545 INFO  (qtp18328909-783) [    x:collection1] o.a.s.u.LoggingInfoStream [IW][qtp18328909-783]: 4 msec to write docValues
   [junit4]   2> 63545 INFO  (qtp18328909-783) [    x:collection1] o.a.s.u.LoggingInfoStream [IW][qtp18328909-783]: 0 msec to write points
   [junit4]   2> 63548 INFO  (qtp18328909-783) [    x:collection1] o.a.s.u.LoggingInfoStream [IW][qtp18328909-783]: 1 msec to finish stored fields
   [junit4]   2> 63552 INFO  (qtp18328909-783) [    x:collection1] o.a.s.u.LoggingInfoStream [IW][qtp18328909-783]: 3 msec to write postings and finish vectors
   [junit4]   2> 63552 INFO  (qtp18328909-783) [    x:collection1] o.a.s.u.LoggingInfoStream [IW][qtp18328909-783]: 0 msec to write fieldInfos
   [junit4]   2> 63552 INFO  (qtp18328909-783) [    x:collection1] o.a.s.u.LoggingInfoStream [DWPT][qtp18328909-783]: new segment has 0 deleted docs
   [junit4]   2> 63553 INFO  (qtp18328909-783) [    x:collection1] o.a.s.u.LoggingInfoStream [DWPT][qtp18328909-783]: new segment has no vectors; norms; docValues; prox; freqs
   [junit4]   2> 63553 INFO  (qtp18328909-783) [    x:collection1] o.a.s.u.LoggingInfoStream [DWPT][qtp18328909-783]: flushedFiles=[_3.fdx, _3.nvd, _3_Lucene50_0.pos, _3_Lucene70_0.dvd, _3_Lucene50_0.doc, _3_Lucene50_0.tim, _3_Lucene70_0.dvm, _3.nvm, _3.fnm, _3.fdt, _3_Lucene50_0.tip]
   [junit4]   2> 63553 INFO  (qtp18328909-783) [    x:collection1] o.a.s.u.LoggingInfoStream [DWPT][qtp18328909-783]: flushed codec=Lucene70
   [junit4]   2> 63555 INFO  (qtp18328909-783) [    x:collection1] o.a.s.u.LoggingInfoStream [DWPT][qtp18328909-783]: flushed: segment=_3 ramUsed=0.127 MB newFlushedSize=0.006 MB docs/MB=35,267.207
   [junit4]   2> 63555 INFO  (qtp18328909-783) [    x:collection1] o.a.s.u.LoggingInfoStream [DWPT][qtp18328909-783]: flush time 14.425888 msec
   [junit4]   2> 63555 INFO  (qtp18328909-783) [    x:collection1] o.a.s.u.LoggingInfoStream [DW][qtp18328909-783]: publishFlushedSegment seg-private updates=null
   [junit4]   2> 63555 INFO  (qtp18328909-783) [    x:collection1] o.a.s.u.LoggingInfoStream [IW][qtp18328909-783]: publishFlushedSegment _2(7.2.0):C1
   [junit4]   2> 63555 INFO  (qtp18328909-783) [    x:collection1] o.a.s.u.LoggingInfoStream [BD][qtp18328909-783]: push new packet (delGen=5 numDeleteTerms=271 bytesUsed=1040), packetCount=1, bytesUsed=0.001 MB
   [junit4]   2> 63555 INFO  (qtp18328909-783) [    x:collection1] o.a.s.u.LoggingInfoStream [BD][qtp18328909-783]: finished packet delGen=6 now completedDelGen=4
   [junit4]   2> 63555 INFO  (qtp18328909-783) [    x:collection1] o.a.s.u.LoggingInfoStream [IW][qtp18328909-783]: publish sets newSegment delGen=6 seg=_2(7.2.0):C1
   [junit4]   2> 63556 INFO  (qtp18328909-783) [    x:collection1] o.a.s.u.LoggingInfoStream [IFD][qtp18328909-783]: now checkpoint "_0(7.2.0):C101 _1(7.2.0):C128 _2(7.2.0):C1" [3 segments ; isCommit = false]
   [junit4]   2> 63556 INFO  (qtp18328909-783) [    x:collection1] o.a.s.u.LoggingInfoStream [IFD][qtp18328909-783]: 0 msec to checkpoint
   [junit4]   2> 63556 INFO  (qtp18328909-783) [    x:collection1] o.a.s.u.LoggingInfoStream [DW][qtp18328909-783]: publishFlushedSegment seg-private updates=null
   [junit4]   2> 63556 INFO  (qtp18328909-783) [    x:collection1] o.a.s.u.LoggingInfoStream [IW][qtp18328909-783]: publishFlushedSegment _4(7.2.0):C72
   [junit4]   2> 63556 INFO  (qtp18328909-783) [    x:collection1] o.a.s.u.LoggingInfoStream [BD][qtp18328909-783]: finished packet delGen=7 now completedDelGen=4
   [junit4]   2> 63556 INFO  (qtp18328909-783) [    x:collection1] o.a.s.u.LoggingInfoStream [IW][qtp18328909-783]: publish sets newSegment delGen=7 seg=_4(7.2.0):C72
   [junit4]   2> 63556 INFO  (qtp18328909-783) [    x:collection1] o.a.s.u.LoggingInfoStream [IFD][qtp18328909-783]: now checkpoint "_0(7.2.0):C101 _1(7.2.0):C128 _2(7.2.0):C1 _4(7.2.0):C72" [4 segments ; isCommit = false]
   [junit4]   2> 63556 INFO  (qtp18328909-783) [    x:collection1] o.a.s.u.LoggingInfoStream [IFD][qtp18328909-783]: 0 msec to checkpoint
   [junit4]   2> 63556 INFO  (qtp18328909-783) [    x:collection1] o.a.s.u.LoggingInfoStream [DW][qtp18328909-783]: publishFlushedSegment seg-private updates=null
   [junit4]   2> 63556 INFO  (qtp18328909-783) [    x:collection1] o.a.s.u.LoggingInfoStream [IW][qtp18328909-783]: publishFlushedSegment _3(7.2.0):C198
   [junit4]   2> 63556 INFO  (qtp18328909-783) [    x:collection1] o.a.s.u.LoggingInfoStream [BD][qtp18328909-783]: finished packet delGen=8 now completedDelGen=4
   [junit4]   2> 63556 INFO  (qtp18328909-783) [    x:collection1] o.a.s.u.LoggingInfoStream [IW][qtp18328909-783]: publish sets newSegment delGen=8 seg=_3(7.2.0):C198
   [junit4]   2> 63556 INFO  (qtp18328909-783) [    x:collection1] o.a.s.u.LoggingInfoStream [IFD][qtp18328909-783]: now checkpoint "_0(7.2.0):C101 _1(7.2.0):C128 _2(7.2.0):C1 _4(7.2.0):C72 _3(7.2.0):C198" [5 segments ; isCommit = false]
   [junit4]   2> 63556 INFO  (qtp18328909-783) [    x:collection1] o.a.s.u.LoggingInfoStream [IFD][qtp18328909-783]: 0 msec to checkpoint
   [junit4]   2> 63559 INFO  (qtp18328909-783) [    x:collection1] o.a.s.u.LoggingInfoStream [BD][qtp18328909-783]: now apply del packet (delGen=5 numDeleteTerms=271 bytesUsed=1040) to 2 segments, mergeGen 0
   [junit4]   2> 63559 INFO  (qtp18328909-783) [    x:collection1] o.a.s.u.LoggingInfoStream [BD][qtp18328909-783]: applyTermDeletes took 0.12 msec for 2 segments and 271 del terms; 0 new deletions
   [junit4]   2> 63559 INFO  (qtp18328909-783) [    x:collection1] o.a.s.u.LoggingInfoStream [BD][qtp18328909-783]: closeSegmentStates: 0 new deleted documents; pool 1 packets; bytesUsed=0
   [junit4]   2> 63559 INFO  (qtp18328909-783) [    x:collection1] o.a.s.u.LoggingInfoStream [BD][qtp18328909-783]: done inner apply del packet (delGen=5 numDeleteTerms=271 bytesUsed=1040) to 2 segments; 0 new deletes/updates; took 0.004 sec
   [junit4]   2> 63559 INFO  (qtp18328909-783) [    x:collection1] o.a.s.u.LoggingInfoStream [BD][qtp18328909-783]: finished packet delGen=5 now completedDelGen=8
   [junit4]   2> 63559 INFO  (qtp18328909-783) [    x:collection1] o.a.s.u.LoggingInfoStream [BD][qtp18328909-783]: done apply del packet (delGen=5 numDeleteTerms=271 bytesUsed=1040) to 2 segments; 0 new deletes/updates; took 0.004 sec; 0 packets remain
   [junit4]   2> 63559 INFO  (qtp18328909-783) [    x:collection1] o.a.s.u.LoggingInfoStream [IW][qtp18328909-783]: now apply all deletes for all segments buffered updates bytesUsed=0 reader pool bytesUsed=0
   [junit4]   2> 63559 INFO  (qtp18328909-783) [    x:collection1] o.a.s.u.LoggingInfoStream [BD][qtp18328909-783]: waitApply: no deletes to apply
   [junit4]   2> 63565 INFO  (qtp18328909-783) [    x:collection1] o.a.s.u.LoggingInfoStream [IW][qtp18328909-783]: incRefDeleter for NRT reader version=14 segments=_0(7.2.0):C101 _1(7.2.0):C128 _2(7.2.0):C1 _4(7.2.0):C72 _3(7.2.0):C198
   [junit4]   2> 63566 INFO  (qtp18328909-783) [    x:collection1] o.a.s.u.LoggingInfoStream [IW][qtp18328909-783]: return reader version=14 reader=StandardDirectoryReader(segments_2:14:nrt _0(7.2.0):C101 _1(7.2.0):C128 _2(7.2.0):C1 _4(7.2.0):C72 _3(7.2.0):C198)
   [junit4]   2> 63566 INFO  (qtp18328909-783) [    x:collection1] o.a.s.u.LoggingInfoStream [DW][qtp18328909-783]: qtp18328909-783 finishFullFlush success=true
   [junit4]   2> 63566 INFO  (qtp18328909-783) [    x:collection1] o.a.s.u.LoggingInfoStream [TMP][qtp18328909-783]: findMerges: 5 segments
   [junit4]   2> 63570 INFO  (qtp18328909-783) [    x:collection1] o.a.s.u.LoggingInfoStream [T

[...truncated too long message...]

3665 INFO  (coreCloseExecutor-147-thread-1) [    x:collection1] o.a.s.u.LoggingInfoStream [DW][coreCloseExecutor-147-thread-1]: coreCloseExecutor-147-thread-1 finishFullFlush success=true
   [junit4]   2> 63665 INFO  (coreCloseExecutor-147-thread-1) [    x:collection1] o.a.s.u.LoggingInfoStream [IW][coreCloseExecutor-147-thread-1]: now apply all deletes for all segments buffered updates bytesUsed=0 reader pool bytesUsed=0
   [junit4]   2> 63665 INFO  (coreCloseExecutor-147-thread-1) [    x:collection1] o.a.s.u.LoggingInfoStream [BD][coreCloseExecutor-147-thread-1]: waitApply: no deletes to apply
   [junit4]   2> 63665 INFO  (coreCloseExecutor-147-thread-1) [    x:collection1] o.a.s.u.LoggingInfoStream [MS][coreCloseExecutor-147-thread-1]: updateMergeThreads ioThrottle=true targetMBPerSec=10240.0 MB/sec
   [junit4]   2> 63665 INFO  (coreCloseExecutor-147-thread-1) [    x:collection1] o.a.s.u.LoggingInfoStream [MS][coreCloseExecutor-147-thread-1]: now merge
   [junit4]   2> 63665 INFO  (coreCloseExecutor-147-thread-1) [    x:collection1] o.a.s.u.LoggingInfoStream [MS][coreCloseExecutor-147-thread-1]:   index: _5(7.2.0):C500
   [junit4]   2> 63665 INFO  (coreCloseExecutor-147-thread-1) [    x:collection1] o.a.s.u.LoggingInfoStream [MS][coreCloseExecutor-147-thread-1]:   no more merges pending; now return
   [junit4]   2> 63665 INFO  (coreCloseExecutor-147-thread-1) [    x:collection1] o.a.s.u.LoggingInfoStream [IW][coreCloseExecutor-147-thread-1]: waitForMerges
   [junit4]   2> 63665 INFO  (coreCloseExecutor-147-thread-1) [    x:collection1] o.a.s.u.LoggingInfoStream [IW][coreCloseExecutor-147-thread-1]: waitForMerges done
   [junit4]   2> 63665 INFO  (coreCloseExecutor-147-thread-1) [    x:collection1] o.a.s.u.LoggingInfoStream [IW][coreCloseExecutor-147-thread-1]: commit: start
   [junit4]   2> 63665 INFO  (coreCloseExecutor-147-thread-1) [    x:collection1] o.a.s.u.LoggingInfoStream [IW][coreCloseExecutor-147-thread-1]: commit: enter lock
   [junit4]   2> 63665 INFO  (coreCloseExecutor-147-thread-1) [    x:collection1] o.a.s.u.LoggingInfoStream [IW][coreCloseExecutor-147-thread-1]: commit: now prepare
   [junit4]   2> 63665 INFO  (coreCloseExecutor-147-thread-1) [    x:collection1] o.a.s.u.LoggingInfoStream [IW][coreCloseExecutor-147-thread-1]: prepareCommit: flush
   [junit4]   2> 63665 INFO  (coreCloseExecutor-147-thread-1) [    x:collection1] o.a.s.u.LoggingInfoStream [IW][coreCloseExecutor-147-thread-1]:   index before flush _5(7.2.0):C500
   [junit4]   2> 63665 INFO  (coreCloseExecutor-147-thread-1) [    x:collection1] o.a.s.u.LoggingInfoStream [DW][coreCloseExecutor-147-thread-1]: startFullFlush
   [junit4]   2> 63665 INFO  (coreCloseExecutor-147-thread-1) [    x:collection1] o.a.s.u.LoggingInfoStream [IW][coreCloseExecutor-147-thread-1]: now apply all deletes for all segments buffered updates bytesUsed=0 reader pool bytesUsed=0
   [junit4]   2> 63665 INFO  (coreCloseExecutor-147-thread-1) [    x:collection1] o.a.s.u.LoggingInfoStream [BD][coreCloseExecutor-147-thread-1]: waitApply: no deletes to apply
   [junit4]   2> 63665 INFO  (coreCloseExecutor-147-thread-1) [    x:collection1] o.a.s.u.LoggingInfoStream [DW][coreCloseExecutor-147-thread-1]: coreCloseExecutor-147-thread-1 finishFullFlush success=true
   [junit4]   2> 63665 INFO  (coreCloseExecutor-147-thread-1) [    x:collection1] o.a.s.u.LoggingInfoStream [IW][coreCloseExecutor-147-thread-1]: startCommit(): start
   [junit4]   2> 63665 INFO  (coreCloseExecutor-147-thread-1) [    x:collection1] o.a.s.u.LoggingInfoStream [IW][coreCloseExecutor-147-thread-1]:   skip startCommit(): no changes pending
   [junit4]   2> 63665 INFO  (coreCloseExecutor-147-thread-1) [    x:collection1] o.a.s.u.LoggingInfoStream [IW][coreCloseExecutor-147-thread-1]: commit: pendingCommit == null; skip
   [junit4]   2> 63665 INFO  (coreCloseExecutor-147-thread-1) [    x:collection1] o.a.s.u.LoggingInfoStream [IW][coreCloseExecutor-147-thread-1]: commit: took 0.2 msec
   [junit4]   2> 63665 INFO  (coreCloseExecutor-147-thread-1) [    x:collection1] o.a.s.u.LoggingInfoStream [IW][coreCloseExecutor-147-thread-1]: commit: done
   [junit4]   2> 63666 INFO  (coreCloseExecutor-147-thread-1) [    x:collection1] o.a.s.u.LoggingInfoStream [IW][coreCloseExecutor-147-thread-1]: rollback
   [junit4]   2> 63666 INFO  (coreCloseExecutor-147-thread-1) [    x:collection1] o.a.s.u.LoggingInfoStream [IW][coreCloseExecutor-147-thread-1]: all running merges have aborted
   [junit4]   2> 63666 INFO  (coreCloseExecutor-147-thread-1) [    x:collection1] o.a.s.u.LoggingInfoStream [IW][coreCloseExecutor-147-thread-1]: rollback: done finish merges
   [junit4]   2> 63666 INFO  (coreCloseExecutor-147-thread-1) [    x:collection1] o.a.s.u.LoggingInfoStream [DW][coreCloseExecutor-147-thread-1]: abort
   [junit4]   2> 63666 INFO  (coreCloseExecutor-147-thread-1) [    x:collection1] o.a.s.u.LoggingInfoStream [DW][coreCloseExecutor-147-thread-1]: done abort success=true
   [junit4]   2> 63666 INFO  (coreCloseExecutor-147-thread-1) [    x:collection1] o.a.s.u.LoggingInfoStream [IW][coreCloseExecutor-147-thread-1]: rollback: infos=_5(7.2.0):C500
   [junit4]   2> 63666 INFO  (coreCloseExecutor-147-thread-1) [    x:collection1] o.a.s.u.LoggingInfoStream [IFD][coreCloseExecutor-147-thread-1]: now checkpoint "_5(7.2.0):C500" [1 segments ; isCommit = false]
   [junit4]   2> 63666 INFO  (coreCloseExecutor-147-thread-1) [    x:collection1] o.a.s.u.LoggingInfoStream [IFD][coreCloseExecutor-147-thread-1]: 0 msec to checkpoint
   [junit4]   2> 63671 INFO  (SUITE-LargeVolumeBinaryJettyTest-seed#[AFF9D9F935F99FE9]-worker) [    ] o.e.j.s.h.ContextHandler Stopped o.e.j.s.ServletContextHandler@103f916{/solr,null,UNAVAILABLE}
   [junit4]   2> 63677 INFO  (SUITE-LargeVolumeBinaryJettyTest-seed#[AFF9D9F935F99FE9]-worker) [    ] o.a.s.SolrTestCaseJ4 ------------------------------------------------------- Done waiting for tracked resources to be released
   [junit4]   2> NOTE: test params are: codec=Asserting(Lucene70): {}, docValues:{}, maxPointsInLeafNode=165, maxMBSortInHeap=7.567562255489467, sim=RandomSimilarity(queryNorm=false): {}, locale=und, timezone=Europe/Helsinki
   [junit4]   2> NOTE: Windows 10 10.0 x86/Oracle Corporation 1.8.0_144 (32-bit)/cpus=3,threads=1,free=42456304,total=93450240
   [junit4]   2> NOTE: All tests run in this JVM: [TestZkConfigManager, LargeVolumeJettyTest, GreaterThanEqualToEvaluatorTest, HyperbolicTangentEvaluatorTest, FacetFieldTest, ArcCosineEvaluatorTest, DocumentAnalysisResponseTest, TestPathTrie, DivideEvaluatorTest, SolrParamTest, AbsoluteValueEvaluatorTest, TestConfigSetAdminRequest, ArcTangentEvaluatorTest, SolrExampleBinaryTest, CubedRootEvaluatorTest, FieldValueEvaluatorTest, ConcurrentUpdateSolrClientTest, SolrExampleJettyTest, ContentStreamTest, SolrZkClientTest, BasicHttpSolrClientTest, TestValidatingJsonMap, GraphExpressionTest, HttpSolrClientConPoolTest, SolrQueryTest, AnlysisResponseBaseTest, SolrSchemalessExampleTest, SolrExceptionTest, UniformDistributionEvaluatorTest, JsonValidatorTest, LargeVolumeBinaryJettyTest]
   [junit4]   2> NOTE: reproduce with: ant test  -Dtestcase=LargeVolumeBinaryJettyTest -Dtests.seed=AFF9D9F935F99FE9 -Dtests.slow=true -Dtests.locale=und -Dtests.timezone=Europe/Helsinki -Dtests.asserts=true -Dtests.file.encoding=UTF-8
   [junit4] ERROR   0.00s J1 | LargeVolumeBinaryJettyTest (suite) <<<
   [junit4]    > Throwable #1: java.io.IOException: Could not remove the following files (in the order of attempts):
   [junit4]    >    C:\Users\jenkins\workspace\Lucene-Solr-7.2-Windows\solr\build\solr-solrj\test\J1\temp\solr.client.solrj.embedded.LargeVolumeBinaryJettyTest_AFF9D9F935F99FE9-001\tempDir-001\collection1\conf: java.nio.file.DirectoryNotEmptyException: C:\Users\jenkins\workspace\Lucene-Solr-7.2-Windows\solr\build\solr-solrj\test\J1\temp\solr.client.solrj.embedded.LargeVolumeBinaryJettyTest_AFF9D9F935F99FE9-001\tempDir-001\collection1\conf
   [junit4]    >    C:\Users\jenkins\workspace\Lucene-Solr-7.2-Windows\solr\build\solr-solrj\test\J1\temp\solr.client.solrj.embedded.LargeVolumeBinaryJettyTest_AFF9D9F935F99FE9-001\tempDir-001\collection1: java.nio.file.DirectoryNotEmptyException: C:\Users\jenkins\workspace\Lucene-Solr-7.2-Windows\solr\build\solr-solrj\test\J1\temp\solr.client.solrj.embedded.LargeVolumeBinaryJettyTest_AFF9D9F935F99FE9-001\tempDir-001\collection1
   [junit4]    >    C:\Users\jenkins\workspace\Lucene-Solr-7.2-Windows\solr\build\solr-solrj\test\J1\temp\solr.client.solrj.embedded.LargeVolumeBinaryJettyTest_AFF9D9F935F99FE9-001\tempDir-001: java.nio.file.DirectoryNotEmptyException: C:\Users\jenkins\workspace\Lucene-Solr-7.2-Windows\solr\build\solr-solrj\test\J1\temp\solr.client.solrj.embedded.LargeVolumeBinaryJettyTest_AFF9D9F935F99FE9-001\tempDir-001
   [junit4]    >    C:\Users\jenkins\workspace\Lucene-Solr-7.2-Windows\solr\build\solr-solrj\test\J1\temp\solr.client.solrj.embedded.LargeVolumeBinaryJettyTest_AFF9D9F935F99FE9-001\tempDir-001\collection1\conf\velocity: java.nio.file.AccessDeniedException: C:\Users\jenkins\workspace\Lucene-Solr-7.2-Windows\solr\build\solr-solrj\test\J1\temp\solr.client.solrj.embedded.LargeVolumeBinaryJettyTest_AFF9D9F935F99FE9-001\tempDir-001\collection1\conf\velocity
   [junit4]    >    C:\Users\jenkins\workspace\Lucene-Solr-7.2-Windows\solr\build\solr-solrj\test\J1\temp\solr.client.solrj.embedded.LargeVolumeBinaryJettyTest_AFF9D9F935F99FE9-001: java.nio.file.DirectoryNotEmptyException: C:\Users\jenkins\workspace\Lucene-Solr-7.2-Windows\solr\build\solr-solrj\test\J1\temp\solr.client.solrj.embedded.LargeVolumeBinaryJettyTest_AFF9D9F935F99FE9-001
   [junit4]    > 	at __randomizedtesting.SeedInfo.seed([AFF9D9F935F99FE9]:0)
   [junit4]    > 	at org.apache.lucene.util.IOUtils.rm(IOUtils.java:329)
   [junit4]    > 	at java.lang.Thread.run(Thread.java:748)
   [junit4] Completed [59/146 (2!)] on J1 in 1.22s, 1 test, 1 error <<< FAILURES!

[...truncated 42513 lines...]

Mime
View raw message