lucene-dev mailing list archives

Site index · List index
Message view « Date » · « Thread »
Top « Date » · « Thread »
From Policeman Jenkins Server <jenk...@thetaphi.de>
Subject [JENKINS-EA] Lucene-Solr-7.2-Linux (64bit/jdk-10-ea+32) - Build # 80 - Unstable!
Date Mon, 18 Dec 2017 10:21:49 GMT
Build: https://jenkins.thetaphi.de/job/Lucene-Solr-7.2-Linux/80/
Java: 64bit/jdk-10-ea+32 -XX:-UseCompressedOops -XX:+UseSerialGC

1 tests failed.
FAILED:  org.apache.solr.update.TestInPlaceUpdatesDistrib.test

Error Message:
Timeout occured while waiting response from server at: http://127.0.0.1:36969/mf/fb/collection1

Stack Trace:
org.apache.solr.client.solrj.SolrServerException: Timeout occured while waiting response from server at: http://127.0.0.1:36969/mf/fb/collection1
	at __randomizedtesting.SeedInfo.seed([577EF3B94A888B30:DF2ACC63E474E6C8]:0)
	at org.apache.solr.client.solrj.impl.HttpSolrClient.executeMethod(HttpSolrClient.java:654)
	at org.apache.solr.client.solrj.impl.HttpSolrClient.request(HttpSolrClient.java:255)
	at org.apache.solr.client.solrj.impl.HttpSolrClient.request(HttpSolrClient.java:244)
	at org.apache.solr.client.solrj.impl.LBHttpSolrClient.doRequest(LBHttpSolrClient.java:483)
	at org.apache.solr.client.solrj.impl.LBHttpSolrClient.request(LBHttpSolrClient.java:413)
	at org.apache.solr.client.solrj.impl.CloudSolrClient.sendRequest(CloudSolrClient.java:1103)
	at org.apache.solr.client.solrj.impl.CloudSolrClient.requestWithRetryOnStaleState(CloudSolrClient.java:883)
	at org.apache.solr.client.solrj.impl.CloudSolrClient.request(CloudSolrClient.java:816)
	at org.apache.solr.client.solrj.SolrRequest.process(SolrRequest.java:194)
	at org.apache.solr.client.solrj.SolrClient.commit(SolrClient.java:484)
	at org.apache.solr.client.solrj.SolrClient.commit(SolrClient.java:463)
	at org.apache.solr.cloud.AbstractFullDistribZkTestBase.commit(AbstractFullDistribZkTestBase.java:1582)
	at org.apache.solr.update.TestInPlaceUpdatesDistrib.docValuesUpdateTest(TestInPlaceUpdatesDistrib.java:349)
	at org.apache.solr.update.TestInPlaceUpdatesDistrib.test(TestInPlaceUpdatesDistrib.java:142)
	at java.base/jdk.internal.reflect.NativeMethodAccessorImpl.invoke0(Native Method)
	at java.base/jdk.internal.reflect.NativeMethodAccessorImpl.invoke(NativeMethodAccessorImpl.java:62)
	at java.base/jdk.internal.reflect.DelegatingMethodAccessorImpl.invoke(DelegatingMethodAccessorImpl.java:43)
	at java.base/java.lang.reflect.Method.invoke(Method.java:564)
	at com.carrotsearch.randomizedtesting.RandomizedRunner.invoke(RandomizedRunner.java:1737)
	at com.carrotsearch.randomizedtesting.RandomizedRunner$8.evaluate(RandomizedRunner.java:934)
	at com.carrotsearch.randomizedtesting.RandomizedRunner$9.evaluate(RandomizedRunner.java:970)
	at com.carrotsearch.randomizedtesting.RandomizedRunner$10.evaluate(RandomizedRunner.java:984)
	at org.apache.solr.BaseDistributedSearchTestCase$ShardsRepeatRule$ShardsFixedStatement.callStatement(BaseDistributedSearchTestCase.java:993)
	at org.apache.solr.BaseDistributedSearchTestCase$ShardsRepeatRule$ShardsStatement.evaluate(BaseDistributedSearchTestCase.java:968)
	at com.carrotsearch.randomizedtesting.rules.SystemPropertiesRestoreRule$1.evaluate(SystemPropertiesRestoreRule.java:57)
	at org.apache.lucene.util.TestRuleSetupTeardownChained$1.evaluate(TestRuleSetupTeardownChained.java:49)
	at org.apache.lucene.util.AbstractBeforeAfterRule$1.evaluate(AbstractBeforeAfterRule.java:45)
	at org.apache.lucene.util.TestRuleThreadAndTestName$1.evaluate(TestRuleThreadAndTestName.java:48)
	at org.apache.lucene.util.TestRuleIgnoreAfterMaxFailures$1.evaluate(TestRuleIgnoreAfterMaxFailures.java:64)
	at org.apache.lucene.util.TestRuleMarkFailure$1.evaluate(TestRuleMarkFailure.java:47)
	at com.carrotsearch.randomizedtesting.rules.StatementAdapter.evaluate(StatementAdapter.java:36)
	at com.carrotsearch.randomizedtesting.ThreadLeakControl$StatementRunner.run(ThreadLeakControl.java:368)
	at com.carrotsearch.randomizedtesting.ThreadLeakControl.forkTimeoutingTask(ThreadLeakControl.java:817)
	at com.carrotsearch.randomizedtesting.ThreadLeakControl$3.evaluate(ThreadLeakControl.java:468)
	at com.carrotsearch.randomizedtesting.RandomizedRunner.runSingleTest(RandomizedRunner.java:943)
	at com.carrotsearch.randomizedtesting.RandomizedRunner$5.evaluate(RandomizedRunner.java:829)
	at com.carrotsearch.randomizedtesting.RandomizedRunner$6.evaluate(RandomizedRunner.java:879)
	at com.carrotsearch.randomizedtesting.RandomizedRunner$7.evaluate(RandomizedRunner.java:890)
	at com.carrotsearch.randomizedtesting.rules.StatementAdapter.evaluate(StatementAdapter.java:36)
	at com.carrotsearch.randomizedtesting.rules.SystemPropertiesRestoreRule$1.evaluate(SystemPropertiesRestoreRule.java:57)
	at org.apache.lucene.util.AbstractBeforeAfterRule$1.evaluate(AbstractBeforeAfterRule.java:45)
	at com.carrotsearch.randomizedtesting.rules.StatementAdapter.evaluate(StatementAdapter.java:36)
	at org.apache.lucene.util.TestRuleStoreClassName$1.evaluate(TestRuleStoreClassName.java:41)
	at com.carrotsearch.randomizedtesting.rules.NoShadowingOrOverridesOnMethodsRule$1.evaluate(NoShadowingOrOverridesOnMethodsRule.java:40)
	at com.carrotsearch.randomizedtesting.rules.NoShadowingOrOverridesOnMethodsRule$1.evaluate(NoShadowingOrOverridesOnMethodsRule.java:40)
	at com.carrotsearch.randomizedtesting.rules.StatementAdapter.evaluate(StatementAdapter.java:36)
	at com.carrotsearch.randomizedtesting.rules.StatementAdapter.evaluate(StatementAdapter.java:36)
	at org.apache.lucene.util.TestRuleAssertionsRequired$1.evaluate(TestRuleAssertionsRequired.java:53)
	at org.apache.lucene.util.TestRuleMarkFailure$1.evaluate(TestRuleMarkFailure.java:47)
	at org.apache.lucene.util.TestRuleIgnoreAfterMaxFailures$1.evaluate(TestRuleIgnoreAfterMaxFailures.java:64)
	at org.apache.lucene.util.TestRuleIgnoreTestSuites$1.evaluate(TestRuleIgnoreTestSuites.java:54)
	at com.carrotsearch.randomizedtesting.rules.StatementAdapter.evaluate(StatementAdapter.java:36)
	at com.carrotsearch.randomizedtesting.ThreadLeakControl$StatementRunner.run(ThreadLeakControl.java:368)
	at java.base/java.lang.Thread.run(Thread.java:844)
Caused by: java.net.SocketTimeoutException: Read timed out
	at java.base/java.net.SocketInputStream.socketRead0(Native Method)
	at java.base/java.net.SocketInputStream.socketRead(SocketInputStream.java:116)
	at java.base/java.net.SocketInputStream.read(SocketInputStream.java:171)
	at java.base/java.net.SocketInputStream.read(SocketInputStream.java:141)
	at org.apache.http.impl.io.SessionInputBufferImpl.streamRead(SessionInputBufferImpl.java:137)
	at org.apache.http.impl.io.SessionInputBufferImpl.fillBuffer(SessionInputBufferImpl.java:153)
	at org.apache.http.impl.io.SessionInputBufferImpl.readLine(SessionInputBufferImpl.java:282)
	at org.apache.http.impl.conn.DefaultHttpResponseParser.parseHead(DefaultHttpResponseParser.java:138)
	at org.apache.http.impl.conn.DefaultHttpResponseParser.parseHead(DefaultHttpResponseParser.java:56)
	at org.apache.http.impl.io.AbstractMessageParser.parse(AbstractMessageParser.java:259)
	at org.apache.http.impl.DefaultBHttpClientConnection.receiveResponseHeader(DefaultBHttpClientConnection.java:163)
	at org.apache.http.impl.conn.CPoolProxy.receiveResponseHeader(CPoolProxy.java:165)
	at org.apache.http.protocol.HttpRequestExecutor.doReceiveResponse(HttpRequestExecutor.java:273)
	at org.apache.http.protocol.HttpRequestExecutor.execute(HttpRequestExecutor.java:125)
	at org.apache.http.impl.execchain.MainClientExec.execute(MainClientExec.java:272)
	at org.apache.http.impl.execchain.ProtocolExec.execute(ProtocolExec.java:185)
	at org.apache.http.impl.execchain.RetryExec.execute(RetryExec.java:89)
	at org.apache.http.impl.execchain.RedirectExec.execute(RedirectExec.java:111)
	at org.apache.http.impl.client.InternalHttpClient.doExecute(InternalHttpClient.java:185)
	at org.apache.http.impl.client.CloseableHttpClient.execute(CloseableHttpClient.java:83)
	at org.apache.http.impl.client.CloseableHttpClient.execute(CloseableHttpClient.java:56)
	at org.apache.solr.client.solrj.impl.HttpSolrClient.executeMethod(HttpSolrClient.java:542)
	... 53 more




Build Log:
[...truncated 13063 lines...]
   [junit4] Suite: org.apache.solr.update.TestInPlaceUpdatesDistrib
   [junit4]   2> Creating dataDir: /home/jenkins/workspace/Lucene-Solr-7.2-Linux/solr/build/solr-core/test/J2/temp/solr.update.TestInPlaceUpdatesDistrib_577EF3B94A888B30-001/init-core-data-001
   [junit4]   2> 546015 WARN  (SUITE-TestInPlaceUpdatesDistrib-seed#[577EF3B94A888B30]-worker) [    ] o.a.s.SolrTestCaseJ4 startTrackingSearchers: numOpens=30 numCloses=30
   [junit4]   2> 546015 INFO  (SUITE-TestInPlaceUpdatesDistrib-seed#[577EF3B94A888B30]-worker) [    ] o.a.s.SolrTestCaseJ4 Using PointFields (NUMERIC_POINTS_SYSPROP=true) w/NUMERIC_DOCVALUES_SYSPROP=true
   [junit4]   2> 546016 INFO  (SUITE-TestInPlaceUpdatesDistrib-seed#[577EF3B94A888B30]-worker) [    ] o.a.s.SolrTestCaseJ4 Randomized ssl (false) and clientAuth (true) via: @org.apache.solr.util.RandomizeSSL(reason="", ssl=0.0/0.0, value=0.0/0.0, clientAuth=0.0/0.0)
   [junit4]   2> 546016 INFO  (SUITE-TestInPlaceUpdatesDistrib-seed#[577EF3B94A888B30]-worker) [    ] o.a.s.SolrTestCaseJ4 SecureRandom sanity checks: test.solr.allowed.securerandom=null & java.security.egd=file:/dev/./urandom
   [junit4]   2> 546016 INFO  (SUITE-TestInPlaceUpdatesDistrib-seed#[577EF3B94A888B30]-worker) [    ] o.a.s.BaseDistributedSearchTestCase Setting hostContext system property: /mf/fb
   [junit4]   2> 546016 INFO  (SUITE-TestInPlaceUpdatesDistrib-seed#[577EF3B94A888B30]-worker) [    ] o.a.s.SolrTestCaseJ4 ####initCore
   [junit4]   2> 546016 INFO  (SUITE-TestInPlaceUpdatesDistrib-seed#[577EF3B94A888B30]-worker) [    ] o.a.s.c.SolrResourceLoader [null] Added 2 libs to classloader, from paths: [/home/jenkins/workspace/Lucene-Solr-7.2-Linux/solr/core/src/test-files/solr/collection1/lib, /home/jenkins/workspace/Lucene-Solr-7.2-Linux/solr/core/src/test-files/solr/collection1/lib/classes]
   [junit4]   2> 546026 INFO  (SUITE-TestInPlaceUpdatesDistrib-seed#[577EF3B94A888B30]-worker) [    ] o.a.s.c.SolrConfig Using Lucene MatchVersion: 7.2.0
   [junit4]   2> 546031 INFO  (SUITE-TestInPlaceUpdatesDistrib-seed#[577EF3B94A888B30]-worker) [    ] o.a.s.s.IndexSchema [null] Schema name=inplace-updates
   [junit4]   2> 546032 INFO  (SUITE-TestInPlaceUpdatesDistrib-seed#[577EF3B94A888B30]-worker) [    ] o.a.s.s.IndexSchema Loaded schema inplace-updates/1.6 with uniqueid field id
   [junit4]   2> 546047 INFO  (SUITE-TestInPlaceUpdatesDistrib-seed#[577EF3B94A888B30]-worker) [    ] o.a.s.m.r.SolrJmxReporter JMX monitoring for 'solr.node' (registry 'solr.node') enabled at server: com.sun.jmx.mbeanserver.JmxMBeanServer@6e18ab8f
   [junit4]   2> 546051 INFO  (SUITE-TestInPlaceUpdatesDistrib-seed#[577EF3B94A888B30]-worker) [    ] o.a.s.m.r.SolrJmxReporter JMX monitoring for 'solr.jvm' (registry 'solr.jvm') enabled at server: com.sun.jmx.mbeanserver.JmxMBeanServer@6e18ab8f
   [junit4]   2> 546051 INFO  (SUITE-TestInPlaceUpdatesDistrib-seed#[577EF3B94A888B30]-worker) [    ] o.a.s.m.r.SolrJmxReporter JMX monitoring for 'solr.jetty' (registry 'solr.jetty') enabled at server: com.sun.jmx.mbeanserver.JmxMBeanServer@6e18ab8f
   [junit4]   2> 546052 INFO  (coreLoadExecutor-2142-thread-1) [    ] o.a.s.c.TransientSolrCoreCacheDefault Allocating transient cache for 2147483647 transient cores
   [junit4]   2> 546052 INFO  (coreLoadExecutor-2142-thread-1) [    ] o.a.s.c.SolrResourceLoader [null] Added 2 libs to classloader, from paths: [/home/jenkins/workspace/Lucene-Solr-7.2-Linux/solr/core/src/test-files/solr/collection1/lib, /home/jenkins/workspace/Lucene-Solr-7.2-Linux/solr/core/src/test-files/solr/collection1/lib/classes]
   [junit4]   2> 546062 INFO  (coreLoadExecutor-2142-thread-1) [    ] o.a.s.c.SolrConfig Using Lucene MatchVersion: 7.2.0
   [junit4]   2> 546072 INFO  (coreLoadExecutor-2142-thread-1) [    ] o.a.s.s.IndexSchema [collection1] Schema name=inplace-updates
   [junit4]   2> 546074 INFO  (coreLoadExecutor-2142-thread-1) [    ] o.a.s.s.IndexSchema Loaded schema inplace-updates/1.6 with uniqueid field id
   [junit4]   2> 546074 INFO  (coreLoadExecutor-2142-thread-1) [    ] o.a.s.c.CoreContainer Creating SolrCore 'collection1' using configuration from instancedir /home/jenkins/workspace/Lucene-Solr-7.2-Linux/solr/core/src/test-files/solr/collection1, trusted=true
   [junit4]   2> 546074 INFO  (coreLoadExecutor-2142-thread-1) [    ] o.a.s.m.r.SolrJmxReporter JMX monitoring for 'solr.core.collection1' (registry 'solr.core.collection1') enabled at server: com.sun.jmx.mbeanserver.JmxMBeanServer@6e18ab8f
   [junit4]   2> 546074 INFO  (coreLoadExecutor-2142-thread-1) [    ] o.a.s.c.SolrCore solr.RecoveryStrategy.Builder
   [junit4]   2> 546074 INFO  (coreLoadExecutor-2142-thread-1) [    ] o.a.s.c.SolrCore [[collection1] ] Opening new SolrCore at [/home/jenkins/workspace/Lucene-Solr-7.2-Linux/solr/core/src/test-files/solr/collection1], dataDir=[/home/jenkins/workspace/Lucene-Solr-7.2-Linux/solr/build/solr-core/test/J2/temp/solr.update.TestInPlaceUpdatesDistrib_577EF3B94A888B30-001/init-core-data-001/]
   [junit4]   2> 546077 WARN  (coreLoadExecutor-2142-thread-1) [    ] o.a.s.c.RequestHandlers INVALID paramSet a in requestHandler {type = requestHandler,name = /dump,class = DumpRequestHandler,attributes = {initParams=a, name=/dump, class=DumpRequestHandler},args = {defaults={a=A,b=B}}}
   [junit4]   2> 546098 INFO  (coreLoadExecutor-2142-thread-1) [    ] o.a.s.u.UpdateHandler Using UpdateLog implementation: org.apache.solr.update.UpdateLog
   [junit4]   2> 546098 INFO  (coreLoadExecutor-2142-thread-1) [    ] o.a.s.u.UpdateLog Initializing UpdateLog: dataDir= defaultSyncLevel=FLUSH numRecordsToKeep=100 maxNumLogsToKeep=10 numVersionBuckets=65536
   [junit4]   2> 546098 INFO  (coreLoadExecutor-2142-thread-1) [    ] o.a.s.u.CommitTracker Hard AutoCommit: disabled
   [junit4]   2> 546098 INFO  (coreLoadExecutor-2142-thread-1) [    ] o.a.s.u.CommitTracker Soft AutoCommit: disabled
   [junit4]   2> 546099 INFO  (coreLoadExecutor-2142-thread-1) [    ] o.a.s.s.SolrIndexSearcher Opening [Searcher@e9f3653[collection1] main]
   [junit4]   2> 546099 WARN  (coreLoadExecutor-2142-thread-1) [    ] o.a.s.r.ManagedResourceStorage Cannot write to config directory /home/jenkins/workspace/Lucene-Solr-7.2-Linux/solr/core/src/test-files/solr/collection1/conf; switching to use InMemory storage instead.
   [junit4]   2> 546099 INFO  (coreLoadExecutor-2142-thread-1) [    ] o.a.s.h.ReplicationHandler Commits will be reserved for 10000ms.
   [junit4]   2> 546100 INFO  (searcherExecutor-2143-thread-1) [    ] o.a.s.c.SolrCore [collection1] Registered new searcher Searcher@e9f3653[collection1] main{ExitableDirectoryReader(UninvertingDirectoryReader())}
   [junit4]   2> 546100 INFO  (coreLoadExecutor-2142-thread-1) [    ] o.a.s.u.UpdateLog Could not find max version in index or recent updates, using new clock 1587113896498429952
   [junit4]   2> 546102 INFO  (SUITE-TestInPlaceUpdatesDistrib-seed#[577EF3B94A888B30]-worker) [    ] o.a.s.SolrTestCaseJ4 ####initCore end
   [junit4]   2> 546103 INFO  (TEST-TestInPlaceUpdatesDistrib.test-seed#[577EF3B94A888B30]) [    ] o.a.s.c.ZkTestServer STARTING ZK TEST SERVER
   [junit4]   2> 546103 INFO  (Thread-983) [    ] o.a.s.c.ZkTestServer client port:0.0.0.0/0.0.0.0:0
   [junit4]   2> 546103 INFO  (Thread-983) [    ] o.a.s.c.ZkTestServer Starting server
   [junit4]   2> 546104 ERROR (Thread-983) [    ] o.a.z.s.ZooKeeperServer ZKShutdownHandler is not registered, so ZooKeeper server won't take any action on ERROR or SHUTDOWN server state changes
   [junit4]   2> 546203 INFO  (TEST-TestInPlaceUpdatesDistrib.test-seed#[577EF3B94A888B30]) [    ] o.a.s.c.ZkTestServer start zk server on port:33425
   [junit4]   2> 546205 INFO  (zkConnectionManagerCallback-986-thread-1) [    ] o.a.s.c.c.ConnectionManager zkClient has connected
   [junit4]   2> 546208 INFO  (zkConnectionManagerCallback-988-thread-1) [    ] o.a.s.c.c.ConnectionManager zkClient has connected
   [junit4]   2> 546210 INFO  (TEST-TestInPlaceUpdatesDistrib.test-seed#[577EF3B94A888B30]) [    ] o.a.s.c.AbstractZkTestCase put /home/jenkins/workspace/Lucene-Solr-7.2-Linux/solr/core/src/test-files/solr/collection1/conf/solrconfig-tlog.xml to /configs/conf1/solrconfig.xml
   [junit4]   2> 546211 INFO  (TEST-TestInPlaceUpdatesDistrib.test-seed#[577EF3B94A888B30]) [    ] o.a.s.c.AbstractZkTestCase put /home/jenkins/workspace/Lucene-Solr-7.2-Linux/solr/core/src/test-files/solr/collection1/conf/schema-inplace-updates.xml to /configs/conf1/schema.xml
   [junit4]   2> 546211 INFO  (TEST-TestInPlaceUpdatesDistrib.test-seed#[577EF3B94A888B30]) [    ] o.a.s.c.AbstractZkTestCase put /home/jenkins/workspace/Lucene-Solr-7.2-Linux/solr/core/src/test-files/solr/collection1/conf/solrconfig.snippet.randomindexconfig.xml to /configs/conf1/solrconfig.snippet.randomindexconfig.xml
   [junit4]   2> 546211 INFO  (TEST-TestInPlaceUpdatesDistrib.test-seed#[577EF3B94A888B30]) [    ] o.a.s.c.AbstractZkTestCase put /home/jenkins/workspace/Lucene-Solr-7.2-Linux/solr/core/src/test-files/solr/collection1/conf/stopwords.txt to /configs/conf1/stopwords.txt
   [junit4]   2> 546211 INFO  (TEST-TestInPlaceUpdatesDistrib.test-seed#[577EF3B94A888B30]) [    ] o.a.s.c.AbstractZkTestCase put /home/jenkins/workspace/Lucene-Solr-7.2-Linux/solr/core/src/test-files/solr/collection1/conf/protwords.txt to /configs/conf1/protwords.txt
   [junit4]   2> 546212 INFO  (TEST-TestInPlaceUpdatesDistrib.test-seed#[577EF3B94A888B30]) [    ] o.a.s.c.AbstractZkTestCase put /home/jenkins/workspace/Lucene-Solr-7.2-Linux/solr/core/src/test-files/solr/collection1/conf/currency.xml to /configs/conf1/currency.xml
   [junit4]   2> 546212 INFO  (TEST-TestInPlaceUpdatesDistrib.test-seed#[577EF3B94A888B30]) [    ] o.a.s.c.AbstractZkTestCase put /home/jenkins/workspace/Lucene-Solr-7.2-Linux/solr/core/src/test-files/solr/collection1/conf/enumsConfig.xml to /configs/conf1/enumsConfig.xml
   [junit4]   2> 546212 INFO  (TEST-TestInPlaceUpdatesDistrib.test-seed#[577EF3B94A888B30]) [    ] o.a.s.c.AbstractZkTestCase put /home/jenkins/workspace/Lucene-Solr-7.2-Linux/solr/core/src/test-files/solr/collection1/conf/open-exchange-rates.json to /configs/conf1/open-exchange-rates.json
   [junit4]   2> 546213 INFO  (TEST-TestInPlaceUpdatesDistrib.test-seed#[577EF3B94A888B30]) [    ] o.a.s.c.AbstractZkTestCase put /home/jenkins/workspace/Lucene-Solr-7.2-Linux/solr/core/src/test-files/solr/collection1/conf/mapping-ISOLatin1Accent.txt to /configs/conf1/mapping-ISOLatin1Accent.txt
   [junit4]   2> 546213 INFO  (TEST-TestInPlaceUpdatesDistrib.test-seed#[577EF3B94A888B30]) [    ] o.a.s.c.AbstractZkTestCase put /home/jenkins/workspace/Lucene-Solr-7.2-Linux/solr/core/src/test-files/solr/collection1/conf/old_synonyms.txt to /configs/conf1/old_synonyms.txt
   [junit4]   2> 546213 INFO  (TEST-TestInPlaceUpdatesDistrib.test-seed#[577EF3B94A888B30]) [    ] o.a.s.c.AbstractZkTestCase put /home/jenkins/workspace/Lucene-Solr-7.2-Linux/solr/core/src/test-files/solr/collection1/conf/synonyms.txt to /configs/conf1/synonyms.txt
   [junit4]   2> 546214 INFO  (TEST-TestInPlaceUpdatesDistrib.test-seed#[577EF3B94A888B30]) [    ] o.a.s.c.AbstractFullDistribZkTestBase Will use NRT replicas unless explicitly asked otherwise
   [junit4]   2> 546266 INFO  (TEST-TestInPlaceUpdatesDistrib.test-seed#[577EF3B94A888B30]) [    ] o.e.j.s.Server jetty-9.3.20.v20170531
   [junit4]   2> 546273 INFO  (TEST-TestInPlaceUpdatesDistrib.test-seed#[577EF3B94A888B30]) [    ] o.e.j.s.h.ContextHandler Started o.e.j.s.ServletContextHandler@76e68c0d{/mf/fb,null,AVAILABLE}
   [junit4]   2> 546274 INFO  (TEST-TestInPlaceUpdatesDistrib.test-seed#[577EF3B94A888B30]) [    ] o.e.j.s.AbstractConnector Started ServerConnector@3c38eefe{HTTP/1.1,[http/1.1]}{127.0.0.1:36435}
   [junit4]   2> 546274 INFO  (TEST-TestInPlaceUpdatesDistrib.test-seed#[577EF3B94A888B30]) [    ] o.e.j.s.Server Started @547816ms
   [junit4]   2> 546274 INFO  (TEST-TestInPlaceUpdatesDistrib.test-seed#[577EF3B94A888B30]) [    ] o.a.s.c.s.e.JettySolrRunner Jetty properties: {hostContext=/mf/fb, solr.data.dir=/home/jenkins/workspace/Lucene-Solr-7.2-Linux/solr/build/solr-core/test/J2/temp/solr.update.TestInPlaceUpdatesDistrib_577EF3B94A888B30-001/tempDir-001/control/data, hostPort=36435, coreRootDirectory=/home/jenkins/workspace/Lucene-Solr-7.2-Linux/solr/build/solr-core/test/J2/../../../../../../../../../home/jenkins/workspace/Lucene-Solr-7.2-Linux/solr/build/solr-core/test/J2/temp/solr.update.TestInPlaceUpdatesDistrib_577EF3B94A888B30-001/control-001/cores, replicaType=NRT}
   [junit4]   2> 546274 ERROR (TEST-TestInPlaceUpdatesDistrib.test-seed#[577EF3B94A888B30]) [    ] o.a.s.u.StartupLoggingUtils Missing Java Option solr.log.dir. Logging may be missing or incomplete.
   [junit4]   2> 546275 INFO  (TEST-TestInPlaceUpdatesDistrib.test-seed#[577EF3B94A888B30]) [    ] o.a.s.s.SolrDispatchFilter  ___      _       Welcome to Apache Solr? version 7.2.0
   [junit4]   2> 546275 INFO  (TEST-TestInPlaceUpdatesDistrib.test-seed#[577EF3B94A888B30]) [    ] o.a.s.s.SolrDispatchFilter / __| ___| |_ _   Starting in cloud mode on port null
   [junit4]   2> 546275 INFO  (TEST-TestInPlaceUpdatesDistrib.test-seed#[577EF3B94A888B30]) [    ] o.a.s.s.SolrDispatchFilter \__ \/ _ \ | '_|  Install dir: null
   [junit4]   2> 546275 INFO  (TEST-TestInPlaceUpdatesDistrib.test-seed#[577EF3B94A888B30]) [    ] o.a.s.s.SolrDispatchFilter |___/\___/_|_|    Start time: 2017-12-18T09:36:00.477257Z
   [junit4]   2> 546278 INFO  (zkConnectionManagerCallback-990-thread-1) [    ] o.a.s.c.c.ConnectionManager zkClient has connected
   [junit4]   2> 546278 INFO  (TEST-TestInPlaceUpdatesDistrib.test-seed#[577EF3B94A888B30]) [    ] o.a.s.s.SolrDispatchFilter Loading solr.xml from SolrHome (not found in ZooKeeper)
   [junit4]   2> 546278 INFO  (TEST-TestInPlaceUpdatesDistrib.test-seed#[577EF3B94A888B30]) [    ] o.a.s.c.SolrXmlConfig Loading container configuration from /home/jenkins/workspace/Lucene-Solr-7.2-Linux/solr/build/solr-core/test/J2/temp/solr.update.TestInPlaceUpdatesDistrib_577EF3B94A888B30-001/control-001/solr.xml
   [junit4]   2> 546280 INFO  (TEST-TestInPlaceUpdatesDistrib.test-seed#[577EF3B94A888B30]) [    ] o.a.s.c.SolrXmlConfig Configuration parameter autoReplicaFailoverWorkLoopDelay is ignored
   [junit4]   2> 546280 INFO  (TEST-TestInPlaceUpdatesDistrib.test-seed#[577EF3B94A888B30]) [    ] o.a.s.c.SolrXmlConfig Configuration parameter autoReplicaFailoverBadNodeExpiration is ignored
   [junit4]   2> 546281 INFO  (TEST-TestInPlaceUpdatesDistrib.test-seed#[577EF3B94A888B30]) [    ] o.a.s.c.SolrXmlConfig MBean server found: com.sun.jmx.mbeanserver.JmxMBeanServer@6e18ab8f, but no JMX reporters were configured - adding default JMX reporter.
   [junit4]   2> 546287 INFO  (TEST-TestInPlaceUpdatesDistrib.test-seed#[577EF3B94A888B30]) [    ] o.a.s.c.ZkContainer Zookeeper client=127.0.0.1:33425/solr
   [junit4]   2> 546289 INFO  (zkConnectionManagerCallback-994-thread-1) [    ] o.a.s.c.c.ConnectionManager zkClient has connected
   [junit4]   2> 546290 WARN  (NIOServerCxn.Factory:0.0.0.0/0.0.0.0:0) [    ] o.a.z.s.NIOServerCnxn caught end of stream exception
   [junit4]   2> EndOfStreamException: Unable to read additional data from client sessionid 0x16068fae1320003, likely client has closed socket
   [junit4]   2> 	at org.apache.zookeeper.server.NIOServerCnxn.doIO(NIOServerCnxn.java:239)
   [junit4]   2> 	at org.apache.zookeeper.server.NIOServerCnxnFactory.run(NIOServerCnxnFactory.java:203)
   [junit4]   2> 	at java.base/java.lang.Thread.run(Thread.java:844)
   [junit4]   2> 546290 INFO  (zkConnectionManagerCallback-996-thread-1) [    ] o.a.s.c.c.ConnectionManager zkClient has connected
   [junit4]   2> 546316 INFO  (TEST-TestInPlaceUpdatesDistrib.test-seed#[577EF3B94A888B30]) [    ] o.a.s.c.Overseer Overseer (id=null) closing
   [junit4]   2> 546316 INFO  (TEST-TestInPlaceUpdatesDistrib.test-seed#[577EF3B94A888B30]) [    ] o.a.s.c.OverseerElectionContext I am going to be the leader 127.0.0.1:36435_mf%2Ffb
   [junit4]   2> 546316 INFO  (TEST-TestInPlaceUpdatesDistrib.test-seed#[577EF3B94A888B30]) [    ] o.a.s.c.Overseer Overseer (id=99194618531414020-127.0.0.1:36435_mf%2Ffb-n_0000000000) starting
   [junit4]   2> 546323 INFO  (TEST-TestInPlaceUpdatesDistrib.test-seed#[577EF3B94A888B30]) [    ] o.a.s.c.ZkController Register node as live in ZooKeeper:/live_nodes/127.0.0.1:36435_mf%2Ffb
   [junit4]   2> 546324 INFO  (zkCallback-995-thread-1) [    ] o.a.s.c.c.ZkStateReader Updated live nodes from ZooKeeper... (0) -> (1)
   [junit4]   2> 546365 INFO  (TEST-TestInPlaceUpdatesDistrib.test-seed#[577EF3B94A888B30]) [    ] o.a.s.m.r.SolrJmxReporter JMX monitoring for 'solr.node' (registry 'solr.node') enabled at server: com.sun.jmx.mbeanserver.JmxMBeanServer@6e18ab8f
   [junit4]   2> 546371 INFO  (TEST-TestInPlaceUpdatesDistrib.test-seed#[577EF3B94A888B30]) [    ] o.a.s.m.r.SolrJmxReporter JMX monitoring for 'solr.jvm' (registry 'solr.jvm') enabled at server: com.sun.jmx.mbeanserver.JmxMBeanServer@6e18ab8f
   [junit4]   2> 546371 INFO  (TEST-TestInPlaceUpdatesDistrib.test-seed#[577EF3B94A888B30]) [    ] o.a.s.m.r.SolrJmxReporter JMX monitoring for 'solr.jetty' (registry 'solr.jetty') enabled at server: com.sun.jmx.mbeanserver.JmxMBeanServer@6e18ab8f
   [junit4]   2> 546372 INFO  (TEST-TestInPlaceUpdatesDistrib.test-seed#[577EF3B94A888B30]) [    ] o.a.s.c.CorePropertiesLocator Found 0 core definitions underneath /home/jenkins/workspace/Lucene-Solr-7.2-Linux/solr/build/solr-core/test/J2/../../../../../../../../../home/jenkins/workspace/Lucene-Solr-7.2-Linux/solr/build/solr-core/test/J2/temp/solr.update.TestInPlaceUpdatesDistrib_577EF3B94A888B30-001/control-001/cores
   [junit4]   2> 546388 INFO  (zkConnectionManagerCallback-1002-thread-1) [    ] o.a.s.c.c.ConnectionManager zkClient has connected
   [junit4]   2> 546389 INFO  (TEST-TestInPlaceUpdatesDistrib.test-seed#[577EF3B94A888B30]) [    ] o.a.s.c.c.ZkStateReader Updated live nodes from ZooKeeper... (0) -> (1)
   [junit4]   2> 546389 INFO  (TEST-TestInPlaceUpdatesDistrib.test-seed#[577EF3B94A888B30]) [    ] o.a.s.c.s.i.ZkClientClusterStateProvider Cluster at 127.0.0.1:33425/solr ready
   [junit4]   2> 546391 INFO  (qtp10032280-4713) [    ] o.a.s.h.a.CollectionsHandler Invoked Collection Action :create with params replicationFactor=1&collection.configName=conf1&name=control_collection&nrtReplicas=1&action=CREATE&numShards=1&createNodeSet=127.0.0.1:36435_mf%252Ffb&wt=javabin&version=2 and sendToOCPQueue=true
   [junit4]   2> 546392 INFO  (OverseerThreadFactory-2155-thread-1) [    ] o.a.s.c.CreateCollectionCmd Create collection control_collection
   [junit4]   2> 546496 INFO  (qtp10032280-4715) [    ] o.a.s.h.a.CoreAdminOperation core create command qt=/admin/cores&collection.configName=conf1&newCollection=true&name=control_collection_shard1_replica_n1&action=CREATE&numShards=1&collection=control_collection&shard=shard1&wt=javabin&version=2&replicaType=NRT
   [junit4]   2> 546496 INFO  (qtp10032280-4715) [    ] o.a.s.c.TransientSolrCoreCacheDefault Allocating transient cache for 4 transient cores
   [junit4]   2> 546600 INFO  (zkCallback-995-thread-1) [    ] o.a.s.c.c.ZkStateReader A cluster state change: [WatchedEvent state:SyncConnected type:NodeDataChanged path:/collections/control_collection/state.json] for collection [control_collection] has occurred - updating... (live nodes size: [1])
   [junit4]   2> 547507 INFO  (qtp10032280-4715) [    ] o.a.s.c.SolrConfig Using Lucene MatchVersion: 7.2.0
   [junit4]   2> 547515 INFO  (qtp10032280-4715) [    ] o.a.s.s.IndexSchema [control_collection_shard1_replica_n1] Schema name=inplace-updates
   [junit4]   2> 547533 INFO  (qtp10032280-4715) [    ] o.a.s.s.IndexSchema Loaded schema inplace-updates/1.6 with uniqueid field id
   [junit4]   2> 547533 INFO  (qtp10032280-4715) [    ] o.a.s.c.CoreContainer Creating SolrCore 'control_collection_shard1_replica_n1' using configuration from collection control_collection, trusted=true
   [junit4]   2> 547533 INFO  (qtp10032280-4715) [    ] o.a.s.m.r.SolrJmxReporter JMX monitoring for 'solr.core.control_collection.shard1.replica_n1' (registry 'solr.core.control_collection.shard1.replica_n1') enabled at server: com.sun.jmx.mbeanserver.JmxMBeanServer@6e18ab8f
   [junit4]   2> 547533 INFO  (qtp10032280-4715) [    ] o.a.s.c.SolrCore solr.RecoveryStrategy.Builder
   [junit4]   2> 547534 INFO  (qtp10032280-4715) [    ] o.a.s.c.SolrCore [[control_collection_shard1_replica_n1] ] Opening new SolrCore at [/home/jenkins/workspace/Lucene-Solr-7.2-Linux/solr/build/solr-core/test/J2/temp/solr.update.TestInPlaceUpdatesDistrib_577EF3B94A888B30-001/control-001/cores/control_collection_shard1_replica_n1], dataDir=[/home/jenkins/workspace/Lucene-Solr-7.2-Linux/solr/build/solr-core/test/J2/../../../../../../../../../home/jenkins/workspace/Lucene-Solr-7.2-Linux/solr/build/solr-core/test/J2/temp/solr.update.TestInPlaceUpdatesDistrib_577EF3B94A888B30-001/control-001/cores/control_collection_shard1_replica_n1/data/]
   [junit4]   2> 547537 WARN  (qtp10032280-4715) [    ] o.a.s.c.RequestHandlers INVALID paramSet a in requestHandler {type = requestHandler,name = /dump,class = DumpRequestHandler,attributes = {initParams=a, name=/dump, class=DumpRequestHandler},args = {defaults={a=A,b=B}}}
   [junit4]   2> 547574 INFO  (qtp10032280-4715) [    ] o.a.s.u.UpdateHandler Using UpdateLog implementation: org.apache.solr.update.UpdateLog
   [junit4]   2> 547574 INFO  (qtp10032280-4715) [    ] o.a.s.u.UpdateLog Initializing UpdateLog: dataDir= defaultSyncLevel=FLUSH numRecordsToKeep=100 maxNumLogsToKeep=10 numVersionBuckets=65536
   [junit4]   2> 547575 INFO  (qtp10032280-4715) [    ] o.a.s.u.CommitTracker Hard AutoCommit: disabled
   [junit4]   2> 547575 INFO  (qtp10032280-4715) [    ] o.a.s.u.CommitTracker Soft AutoCommit: disabled
   [junit4]   2> 547576 INFO  (qtp10032280-4715) [    ] o.a.s.s.SolrIndexSearcher Opening [Searcher@43b1fb3a[control_collection_shard1_replica_n1] main]
   [junit4]   2> 547577 INFO  (qtp10032280-4715) [    ] o.a.s.r.ManagedResourceStorage Configured ZooKeeperStorageIO with znodeBase: /configs/conf1
   [junit4]   2> 547577 INFO  (qtp10032280-4715) [    ] o.a.s.r.ManagedResourceStorage Loaded null at path _rest_managed.json using ZooKeeperStorageIO:path=/configs/conf1
   [junit4]   2> 547578 INFO  (qtp10032280-4715) [    ] o.a.s.h.ReplicationHandler Commits will be reserved for 10000ms.
   [junit4]   2> 547578 INFO  (searcherExecutor-2158-thread-1) [    ] o.a.s.c.SolrCore [control_collection_shard1_replica_n1] Registered new searcher Searcher@43b1fb3a[control_collection_shard1_replica_n1] main{ExitableDirectoryReader(UninvertingDirectoryReader())}
   [junit4]   2> 547579 INFO  (qtp10032280-4715) [    ] o.a.s.u.UpdateLog Could not find max version in index or recent updates, using new clock 1587113898049273856
   [junit4]   2> 547582 INFO  (qtp10032280-4715) [    ] o.a.s.c.ShardLeaderElectionContext Enough replicas found to continue.
   [junit4]   2> 547582 INFO  (qtp10032280-4715) [    ] o.a.s.c.ShardLeaderElectionContext I may be the new leader - try and sync
   [junit4]   2> 547582 INFO  (qtp10032280-4715) [    ] o.a.s.c.SyncStrategy Sync replicas to http://127.0.0.1:36435/mf/fb/control_collection_shard1_replica_n1/
   [junit4]   2> 547582 INFO  (qtp10032280-4715) [    ] o.a.s.c.SyncStrategy Sync Success - now sync replicas to me
   [junit4]   2> 547582 INFO  (qtp10032280-4715) [    ] o.a.s.c.SyncStrategy http://127.0.0.1:36435/mf/fb/control_collection_shard1_replica_n1/ has no replicas
   [junit4]   2> 547582 INFO  (qtp10032280-4715) [    ] o.a.s.c.ShardLeaderElectionContext Found all replicas participating in election, clear LIR
   [junit4]   2> 547590 INFO  (qtp10032280-4715) [    ] o.a.s.c.ShardLeaderElectionContext I am the new leader: http://127.0.0.1:36435/mf/fb/control_collection_shard1_replica_n1/ shard1
   [junit4]   2> 547695 INFO  (zkCallback-995-thread-2) [    ] o.a.s.c.c.ZkStateReader A cluster state change: [WatchedEvent state:SyncConnected type:NodeDataChanged path:/collections/control_collection/state.json] for collection [control_collection] has occurred - updating... (live nodes size: [1])
   [junit4]   2> 547741 INFO  (qtp10032280-4715) [    ] o.a.s.c.ZkController I am the leader, no recovery necessary
   [junit4]   2> 547750 INFO  (qtp10032280-4715) [    ] o.a.s.s.HttpSolrCall [admin] webapp=null path=/admin/cores params={qt=/admin/cores&collection.configName=conf1&newCollection=true&name=control_collection_shard1_replica_n1&action=CREATE&numShards=1&collection=control_collection&shard=shard1&wt=javabin&version=2&replicaType=NRT} status=0 QTime=1254
   [junit4]   2> 547755 INFO  (qtp10032280-4713) [    ] o.a.s.h.a.CollectionsHandler Wait for new collection to be active for at most 30 seconds. Check all shard replicas
   [junit4]   2> 547850 INFO  (zkCallback-995-thread-2) [    ] o.a.s.c.c.ZkStateReader A cluster state change: [WatchedEvent state:SyncConnected type:NodeDataChanged path:/collections/control_collection/state.json] for collection [control_collection] has occurred - updating... (live nodes size: [1])
   [junit4]   2> 548393 INFO  (OverseerCollectionConfigSetProcessor-99194618531414020-127.0.0.1:36435_mf%2Ffb-n_0000000000) [    ] o.a.s.c.OverseerTaskQueue Response ZK path: /overseer/collection-queue-work/qnr-0000000000 doesn't exist.  Requestor may have disconnected from ZooKeeper
   [junit4]   2> 548756 INFO  (qtp10032280-4713) [    ] o.a.s.s.HttpSolrCall [admin] webapp=null path=/admin/collections params={replicationFactor=1&collection.configName=conf1&name=control_collection&nrtReplicas=1&action=CREATE&numShards=1&createNodeSet=127.0.0.1:36435_mf%252Ffb&wt=javabin&version=2} status=0 QTime=2365
   [junit4]   2> 548766 INFO  (zkConnectionManagerCallback-1006-thread-1) [    ] o.a.s.c.c.ConnectionManager zkClient has connected
   [junit4]   2> 548767 INFO  (TEST-TestInPlaceUpdatesDistrib.test-seed#[577EF3B94A888B30]) [    ] o.a.s.c.c.ZkStateReader Updated live nodes from ZooKeeper... (0) -> (1)
   [junit4]   2> 548767 INFO  (TEST-TestInPlaceUpdatesDistrib.test-seed#[577EF3B94A888B30]) [    ] o.a.s.c.s.i.ZkClientClusterStateProvider Cluster at 127.0.0.1:33425/solr ready
   [junit4]   2> 548767 INFO  (TEST-TestInPlaceUpdatesDistrib.test-seed#[577EF3B94A888B30]) [    ] o.a.s.c.ChaosMonkey monkey: init - expire sessions:false cause connection loss:false
   [junit4]   2> 548768 INFO  (qtp10032280-4713) [    ] o.a.s.h.a.CollectionsHandler Invoked Collection Action :create with params replicationFactor=1&collection.configName=conf1&name=collection1&nrtReplicas=1&action=CREATE&numShards=1&createNodeSet=&stateFormat=1&wt=javabin&version=2 and sendToOCPQueue=true
   [junit4]   2> 548770 INFO  (OverseerThreadFactory-2155-thread-2) [    ] o.a.s.c.CreateCollectionCmd Create collection collection1
   [junit4]   2> 548770 WARN  (OverseerThreadFactory-2155-thread-2) [    ] o.a.s.c.CreateCollectionCmd It is unusual to create a collection (collection1) without cores.
   [junit4]   2> 548981 INFO  (qtp10032280-4713) [    ] o.a.s.h.a.CollectionsHandler Wait for new collection to be active for at most 30 seconds. Check all shard replicas
   [junit4]   2> 548981 INFO  (qtp10032280-4713) [    ] o.a.s.s.HttpSolrCall [admin] webapp=null path=/admin/collections params={replicationFactor=1&collection.configName=conf1&name=collection1&nrtReplicas=1&action=CREATE&numShards=1&createNodeSet=&stateFormat=1&wt=javabin&version=2} status=0 QTime=212
   [junit4]   2> 549077 INFO  (TEST-TestInPlaceUpdatesDistrib.test-seed#[577EF3B94A888B30]) [    ] o.a.s.c.AbstractFullDistribZkTestBase create jetty 1 in directory /home/jenkins/workspace/Lucene-Solr-7.2-Linux/solr/build/solr-core/test/J2/temp/solr.update.TestInPlaceUpdatesDistrib_577EF3B94A888B30-001/shard-1-001 of type NRT
   [junit4]   2> 549078 INFO  (TEST-TestInPlaceUpdatesDistrib.test-seed#[577EF3B94A888B30]) [    ] o.e.j.s.Server jetty-9.3.20.v20170531
   [junit4]   2> 549080 INFO  (TEST-TestInPlaceUpdatesDistrib.test-seed#[577EF3B94A888B30]) [    ] o.e.j.s.h.ContextHandler Started o.e.j.s.ServletContextHandler@1bebdb82{/mf/fb,null,AVAILABLE}
   [junit4]   2> 549080 INFO  (TEST-TestInPlaceUpdatesDistrib.test-seed#[577EF3B94A888B30]) [    ] o.e.j.s.AbstractConnector Started ServerConnector@687b8ff5{HTTP/1.1,[http/1.1]}{127.0.0.1:36969}
   [junit4]   2> 549081 INFO  (TEST-TestInPlaceUpdatesDistrib.test-seed#[577EF3B94A888B30]) [    ] o.e.j.s.Server Started @550622ms
   [junit4]   2> 549081 INFO  (TEST-TestInPlaceUpdatesDistrib.test-seed#[577EF3B94A888B30]) [    ] o.a.s.c.s.e.JettySolrRunner Jetty properties: {hostContext=/mf/fb, solrconfig=solrconfig.xml, solr.data.dir=/home/jenkins/workspace/Lucene-Solr-7.2-Linux/solr/build/solr-core/test/J2/temp/solr.update.TestInPlaceUpdatesDistrib_577EF3B94A888B30-001/tempDir-001/jetty1, hostPort=36969, coreRootDirectory=/home/jenkins/workspace/Lucene-Solr-7.2-Linux/solr/build/solr-core/test/J2/temp/solr.update.TestInPlaceUpdatesDistrib_577EF3B94A888B30-001/shard-1-001/cores, replicaType=NRT}
   [junit4]   2> 549081 ERROR (TEST-TestInPlaceUpdatesDistrib.test-seed#[577EF3B94A888B30]) [    ] o.a.s.u.StartupLoggingUtils Missing Java Option solr.log.dir. Logging may be missing or incomplete.
   [junit4]   2> 549082 INFO  (TEST-TestInPlaceUpdatesDistrib.test-seed#[577EF3B94A888B30]) [    ] o.a.s.s.SolrDispatchFilter  ___      _       Welcome to Apache Solr? version 7.2.0
   [junit4]   2> 549082 INFO  (TEST-TestInPlaceUpdatesDistrib.test-seed#[577EF3B94A888B30]) [    ] o.a.s.s.SolrDispatchFilter / __| ___| |_ _   Starting in cloud mode on port null
   [junit4]   2> 549082 INFO  (TEST-TestInPlaceUpdatesDistrib.test-seed#[577EF3B94A888B30]) [    ] o.a.s.s.SolrDispatchFilter \__ \/ _ \ | '_|  Install dir: null
   [junit4]   2> 549082 INFO  (TEST-TestInPlaceUpdatesDistrib.test-seed#[577EF3B94A888B30]) [    ] o.a.s.s.SolrDispatchFilter |___/\___/_|_|    Start time: 2017-12-18T09:36:03.284272Z
   [junit4]   2> 549085 INFO  (zkConnectionManagerCallback-1008-thread-1) [    ] o.a.s.c.c.ConnectionManager zkClient has connected
   [junit4]   2> 549086 INFO  (TEST-TestInPlaceUpdatesDistrib.test-seed#[577EF3B94A888B30]) [    ] o.a.s.s.SolrDispatchFilter Loading solr.xml from SolrHome (not found in ZooKeeper)
   [junit4]   2> 549086 INFO  (TEST-TestInPlaceUpdatesDistrib.test-seed#[577EF3B94A888B30]) [    ] o.a.s.c.SolrXmlConfig Loading container configuration from /home/jenkins/workspace/Lucene-Solr-7.2-Linux/solr/build/solr-core/test/J2/temp/solr.update.TestInPlaceUpdatesDistrib_577EF3B94A888B30-001/shard-1-001/solr.xml
   [junit4]   2> 549088 INFO  (TEST-TestInPlaceUpdatesDistrib.test-seed#[577EF3B94A888B30]) [    ] o.a.s.c.SolrXmlConfig Configuration parameter autoReplicaFailoverWorkLoopDelay is ignored
   [junit4]   2> 549088 INFO  (TEST-TestInPlaceUpdatesDistrib.test-seed#[577EF3B94A888B30]) [    ] o.a.s.c.SolrXmlConfig Configuration parameter autoReplicaFailoverBadNodeExpiration is ignored
   [junit4]   2> 549089 INFO  (TEST-TestInPlaceUpdatesDistrib.test-seed#[577EF3B94A888B30]) [    ] o.a.s.c.SolrXmlConfig MBean server found: com.sun.jmx.mbeanserver.JmxMBeanServer@6e18ab8f, but no JMX reporters were configured - adding default JMX reporter.
   [junit4]   2> 549093 INFO  (TEST-TestInPlaceUpdatesDistrib.test-seed#[577EF3B94A888B30]) [    ] o.a.s.c.ZkContainer Zookeeper client=127.0.0.1:33425/solr
   [junit4]   2> 549104 INFO  (zkConnectionManagerCallback-1012-thread-1) [    ] o.a.s.c.c.ConnectionManager zkClient has connected
   [junit4]   2> 549106 INFO  (zkConnectionManagerCallback-1014-thread-1) [    ] o.a.s.c.c.ConnectionManager zkClient has connected
   [junit4]   2> 549108 INFO  (TEST-TestInPlaceUpdatesDistrib.test-seed#[577EF3B94A888B30]) [    ] o.a.s.c.c.ZkStateReader Updated live nodes from ZooKeeper... (0) -> (1)
   [junit4]   2> 549109 INFO  (TEST-TestInPlaceUpdatesDistrib.test-seed#[577EF3B94A888B30]) [    ] o.a.s.c.Overseer Overseer (id=null) closing
   [junit4]   2> 549110 INFO  (TEST-TestInPlaceUpdatesDistrib.test-seed#[577EF3B94A888B30]) [    ] o.a.s.c.ZkController Register node as live in ZooKeeper:/live_nodes/127.0.0.1:36969_mf%2Ffb
   [junit4]   2> 549111 INFO  (zkCallback-995-thread-2) [    ] o.a.s.c.c.ZkStateReader Updated live nodes from ZooKeeper... (1) -> (2)
   [junit4]   2> 549111 INFO  (zkCallback-1005-thread-1) [    ] o.a.s.c.c.ZkStateReader Updated live nodes from ZooKeeper... (1) -> (2)
   [junit4]   2> 549124 INFO  (zkCallback-1013-thread-1) [    ] o.a.s.c.c.ZkStateReader Updated live nodes from ZooKeeper... (1) -> (2)
   [junit4]   2> 549192 INFO  (TEST-TestInPlaceUpdatesDistrib.test-seed#[577EF3B94A888B30]) [    ] o.a.s.m.r.SolrJmxReporter JMX monitoring for 'solr.node' (registry 'solr.node') enabled at server: com.sun.jmx.mbeanserver.JmxMBeanServer@6e18ab8f
   [junit4]   2> 549205 INFO  (TEST-TestInPlaceUpdatesDistrib.test-seed#[577EF3B94A888B30]) [    ] o.a.s.m.r.SolrJmxReporter JMX monitoring for 'solr.jvm' (registry 'solr.jvm') enabled at server: com.sun.jmx.mbeanserver.JmxMBeanServer@6e18ab8f
   [junit4]   2> 549205 INFO  (TEST-TestInPlaceUpdatesDistrib.test-seed#[577EF3B94A888B30]) [    ] o.a.s.m.r.SolrJmxReporter JMX monitoring for 'solr.jetty' (registry 'solr.jetty') enabled at server: com.sun.jmx.mbeanserver.JmxMBeanServer@6e18ab8f
   [junit4]   2> 549207 INFO  (TEST-TestInPlaceUpdatesDistrib.test-seed#[577EF3B94A888B30]) [    ] o.a.s.c.CorePropertiesLocator Found 0 core definitions underneath /home/jenkins/workspace/Lucene-Solr-7.2-Linux/solr/build/solr-core/test/J2/temp/solr.update.TestInPlaceUpdatesDistrib_577EF3B94A888B30-001/shard-1-001/cores
   [junit4]   2> 549242 INFO  (qtp10032280-4714) [    ] o.a.s.h.a.CollectionsHandler Invoked Collection Action :addreplica with params node=127.0.0.1:36969_mf%252Ffb&action=ADDREPLICA&collection=collection1&shard=shard1&type=NRT&wt=javabin&version=2 and sendToOCPQueue=true
   [junit4]   2> 549250 INFO  (OverseerCollectionConfigSetProcessor-99194618531414020-127.0.0.1:36435_mf%2Ffb-n_0000000000) [    ] o.a.s.c.OverseerTaskQueue Response ZK path: /overseer/collection-queue-work/qnr-0000000002 doesn't exist.  Requestor may have disconnected from ZooKeeper
   [junit4]   2> 549252 INFO  (OverseerThreadFactory-2155-thread-3) [    ] o.a.s.c.AddReplicaCmd Node Identified 127.0.0.1:36969_mf%2Ffb for creating new replica
   [junit4]   2> 549254 INFO  (qtp768950761-4763) [    ] o.a.s.h.a.CoreAdminOperation core create command qt=/admin/cores&collection.configName=conf1&name=collection1_shard1_replica_n21&action=CREATE&collection=collection1&shard=shard1&wt=javabin&version=2&replicaType=NRT
   [junit4]   2> 549254 INFO  (qtp768950761-4763) [    ] o.a.s.c.TransientSolrCoreCacheDefault Allocating transient cache for 4 transient cores
   [junit4]   2> 550275 INFO  (qtp768950761-4763) [    ] o.a.s.c.SolrConfig Using Lucene MatchVersion: 7.2.0
   [junit4]   2> 550287 INFO  (qtp768950761-4763) [    ] o.a.s.s.IndexSchema [collection1_shard1_replica_n21] Schema name=inplace-updates
   [junit4]   2> 550289 INFO  (qtp768950761-4763) [    ] o.a.s.s.IndexSchema Loaded schema inplace-updates/1.6 with uniqueid field id
   [junit4]   2> 550289 INFO  (qtp768950761-4763) [    ] o.a.s.c.CoreContainer Creating SolrCore 'collection1_shard1_replica_n21' using configuration from collection collection1, trusted=true
   [junit4]   2> 550290 INFO  (qtp768950761-4763) [    ] o.a.s.m.r.SolrJmxReporter JMX monitoring for 'solr.core.collection1.shard1.replica_n21' (registry 'solr.core.collection1.shard1.replica_n21') enabled at server: com.sun.jmx.mbeanserver.JmxMBeanServer@6e18ab8f
   [junit4]   2> 550290 INFO  (qtp768950761-4763) [    ] o.a.s.c.SolrCore solr.RecoveryStrategy.Builder
   [junit4]   2> 550290 INFO  (qtp768950761-4763) [    ] o.a.s.c.SolrCore [[collection1_shard1_replica_n21] ] Opening new SolrCore at [/home/jenkins/workspace/Lucene-Solr-7.2-Linux/solr/build/solr-core/test/J2/temp/solr.update.TestInPlaceUpdatesDistrib_577EF3B94A888B30-001/shard-1-001/cores/collection1_shard1_replica_n21], dataDir=[/home/jenkins/workspace/Lucene-Solr-7.2-Linux/solr/build/solr-core/test/J2/temp/solr.update.TestInPlaceUpdatesDistrib_577EF3B94A888B30-001/shard-1-001/cores/collection1_shard1_replica_n21/data/]
   [junit4]   2> 550305 WARN  (qtp768950761-4763) [    ] o.a.s.c.RequestHandlers INVALID paramSet a in requestHandler {type = requestHandler,name = /dump,class = DumpRequestHandler,attributes = {initParams=a, name=/dump, class=DumpRequestHandler},args = {defaults={a=A,b=B}}}
   [junit4]   2> 550361 INFO  (qtp768950761-4763) [    ] o.a.s.u.UpdateHandler Using UpdateLog implementation: org.apache.solr.update.UpdateLog
   [junit4]   2> 550361 INFO  (qtp768950761-4763) [    ] o.a.s.u.UpdateLog Initializing UpdateLog: dataDir= defaultSyncLevel=FLUSH numRecordsToKeep=100 maxNumLogsToKeep=10 numVersionBuckets=65536
   [junit4]   2> 550362 INFO  (qtp768950761-4763) [    ] o.a.s.u.CommitTracker Hard AutoCommit: disabled
   [junit4]   2> 550362 INFO  (qtp768950761-4763) [    ] o.a.s.u.CommitTracker Soft AutoCommit: disabled
   [junit4]   2> 550363 INFO  (qtp768950761-4763) [    ] o.a.s.s.SolrIndexSearcher Opening [Searcher@332bdb47[collection1_shard1_replica_n21] main]
   [junit4]   2> 550364 INFO  (qtp768950761-4763) [    ] o.a.s.r.ManagedResourceStorage Configured ZooKeeperStorageIO with znodeBase: /configs/conf1
   [junit4]   2> 550364 INFO  (qtp768950761-4763) [    ] o.a.s.r.ManagedResourceStorage Loaded null at path _rest_managed.json using ZooKeeperStorageIO:path=/configs/conf1
   [junit4]   2> 550365 INFO  (qtp768950761-4763) [    ] o.a.s.h.ReplicationHandler Commits will be reserved for 10000ms.
   [junit4]   2> 550366 INFO  (searcherExecutor-2169-thread-1) [    ] o.a.s.c.SolrCore [collection1_shard1_replica_n21] Registered new searcher Searcher@332bdb47[collection1_shard1_replica_n21] main{ExitableDirectoryReader(UninvertingDirectoryReader())}
   [junit4]   2> 550373 INFO  (qtp768950761-4763) [    ] o.a.s.u.UpdateLog Could not find max version in index or recent updates, using new clock 1587113900978995200
   [junit4]   2> 550377 INFO  (qtp768950761-4763) [    ] o.a.s.c.ShardLeaderElectionContext Enough replicas found to continue.
   [junit4]   2> 550377 INFO  (qtp768950761-4763) [    ] o.a.s.c.ShardLeaderElectionContext I may be the new leader - try and sync
   [junit4]   2> 550377 INFO  (qtp768950761-4763) [    ] o.a.s.c.SyncStrategy Sync replicas to http://127.0.0.1:36969/mf/fb/collection1_shard1_replica_n21/
   [junit4]   2> 550377 INFO  (qtp768950761-4763) [    ] o.a.s.c.SyncStrategy Sync Success - now sync replicas to me
   [junit4]   2> 550377 INFO  (qtp768950761-4763) [    ] o.a.s.c.SyncStrategy http://127.0.0.1:36969/mf/fb/collection1_shard1_replica_n21/ has no replicas
   [junit4]   2> 550377 INFO  (qtp768950761-4763) [    ] o.a.s.c.ShardLeaderElectionContext Found all replicas participating in election, clear LIR
   [junit4]   2> 550378 INFO  (qtp768950761-4763) [    ] o.a.s.c.ShardLeaderElectionContext I am the new leader: http://127.0.0.1:36969/mf/fb/collection1_shard1_replica_n21/ shard1
   [junit4]   2> 550529 INFO  (qtp768950761-4763) [    ] o.a.s.c.ZkController I am the leader, no recovery necessary
   [junit4]   2> 550538 INFO  (qtp768950761-4763) [    ] o.a.s.s.HttpSolrCall [admin] webapp=null path=/admin/cores params={qt=/admin/cores&collection.configName=conf1&name=collection1_shard1_replica_n21&action=CREATE&collection=collection1&shard=shard1&wt=javabin&version=2&replicaType=NRT} status=0 QTime=1284
   [junit4]   2> 550540 INFO  (qtp10032280-4714) [    ] o.a.s.s.HttpSolrCall [admin] webapp=null path=/admin/collections params={node=127.0.0.1:36969_mf%252Ffb&action=ADDREPLICA&collection=collection1&shard=shard1&type=NRT&wt=javabin&version=2} status=0 QTime=1298
   [junit4]   2> 550719 INFO  (TEST-TestInPlaceUpdatesDistrib.test-seed#[577EF3B94A888B30]) [    ] o.a.s.c.AbstractFullDistribZkTestBase create jetty 2 in directory /home/jenkins/workspace/Lucene-Solr-7.2-Linux/solr/build/solr-core/test/J2/temp/solr.update.TestInPlaceUpdatesDistrib_577EF3B94A888B30-001/shard-2-001 of type NRT
   [junit4]   2> 550720 INFO  (TEST-TestInPlaceUpdatesDistrib.test-seed#[577EF3B94A888B30]) [    ] o.e.j.s.Server jetty-9.3.20.v20170531
   [junit4]   2> 550726 INFO  (TEST-TestInPlaceUpdatesDistrib.test-seed#[577EF3B94A888B30]) [    ] o.e.j.s.h.ContextHandler Started o.e.j.s.ServletContextHandler@57221c09{/mf/fb,null,AVAILABLE}
   [junit4]   2> 550726 INFO  (TEST-TestInPlaceUpdatesDistrib.test-seed#[577EF3B94A888B30]) [    ] o.e.j.s.AbstractConnector Started ServerConnector@4ec072b6{HTTP/1.1,[http/1.1]}{127.0.0.1:36081}
   [junit4]   2> 550726 INFO  (TEST-TestInPlaceUpdatesDistrib.test-seed#[577EF3B94A888B30]) [    ] o.e.j.s.Server Started @552268ms
   [junit4]   2> 550727 INFO  (TEST-TestInPlaceUpdatesDistrib.test-seed#[577EF3B94A888B30]) [    ] o.a.s.c.s.e.JettySolrRunner Jetty properties: {hostContext=/mf/fb, solrconfig=solrconfig.xml, solr.data.dir=/home/jenkins/workspace/Lucene-Solr-7.2-Linux/solr/build/solr-core/test/J2/temp/solr.update.TestInPlaceUpdatesDistrib_577EF3B94A888B30-001/tempDir-001/jetty2, hostPort=36081, coreRootDirectory=/home/jenkins/workspace/Lucene-Solr-7.2-Linux/solr/build/solr-core/test/J2/../../../../../../../../../home/jenkins/workspace/Lucene-Solr-7.2-Linux/solr/build/solr-core/test/J2/temp/solr.update.TestInPlaceUpdatesDistrib_577EF3B94A888B30-001/shard-2-001/cores, replicaType=NRT}
   [junit4]   2> 550727 ERROR (TEST-TestInPlaceUpdatesDistrib.test-seed#[577EF3B94A888B30]) [    ] o.a.s.u.StartupLoggingUtils Missing Java Option solr.log.dir. Logging may be missing or incomplete.
   [junit4]   2> 550728 INFO  (TEST-TestInPlaceUpdatesDistrib.test-seed#[577EF3B94A888B30]) [    ] o.a.s.s.SolrDispatchFilter  ___      _       Welcome to Apache Solr? version 7.2.0
   [junit4]   2> 550728 INFO  (TEST-TestInPlaceUpdatesDistrib.test-seed#[577EF3B94A888B30]) [    ] o.a.s.s.SolrDispatchFilter / __| ___| |_ _   Starting in cloud mode on port null
   [junit4]   2> 550728 INFO  (TEST-TestInPlaceUpdatesDistrib.test-seed#[577EF3B94A888B30]) [    ] o.a.s.s.SolrDispatchFilter \__ \/ _ \ | '_|  Install dir: null
   [junit4]   2> 550728 INFO  (TEST-TestInPlaceUpdatesDistrib.test-seed#[577EF3B94A888B30]) [    ] o.a.s.s.SolrDispatchFilter |___/\___/_|_|    Start time: 2017-12-18T09:36:04.930189Z
   [junit4]   2> 550729 INFO  (zkConnectionManagerCallback-1017-thread-1) [    ] o.a.s.c.c.ConnectionManager zkClient has connected
   [junit4]   2> 550730 INFO  (TEST-TestInPlaceUpdatesDistrib.test-seed#[577EF3B94A888B30]) [    ] o.a.s.s.SolrDispatchFilter Loading solr.xml from SolrHome (not found in ZooKeeper)
   [junit4]   2> 550730 INFO  (TEST-TestInPlaceUpdatesDistrib.test-seed#[577EF3B94A888B30]) [    ] o.a.s.c.SolrXmlConfig Loading container configuration from /home/jenkins/workspace/Lucene-Solr-7.2-Linux/solr/build/solr-core/test/J2/temp/solr.update.TestInPlaceUpdatesDistrib_577EF3B94A888B30-001/shard-2-001/solr.xml
   [junit4]   2> 550732 INFO  (TEST-TestInPlaceUpdatesDistrib.test-seed#[577EF3B94A888B30]) [    ] o.a.s.c.SolrXmlConfig Configuration parameter autoReplicaFailoverWorkLoopDelay is ignored
   [junit4]   2> 550732 INFO  (TEST-TestInPlaceUpdatesDistrib.test-seed#[577EF3B94A888B30]) [    ] o.a.s.c.SolrXmlConfig Configuration parameter autoReplicaFailoverBadNodeExpiration is ignored
   [junit4]   2> 550734 INFO  (TEST-TestInPlaceUpdatesDistrib.test-seed#[577EF3B94A888B30]) [    ] o.a.s.c.SolrXmlConfig MBean server found: com.sun.jmx.mbeanserver.JmxMBeanServer@6e18ab8f, but no JMX reporters were configured - adding default JMX reporter.
   [junit4]   2> 550751 INFO  (TEST-TestInPlaceUpdatesDistrib.test-seed#[577EF3B94A888B30]) [    ] o.a.s.c.ZkContainer Zookeeper client=127.0.0.1:33425/solr
   [junit4]   2> 550789 INFO  (zkConnectionManagerCallback-1021-thread-1) [    ] o.a.s.c.c.ConnectionManager zkClient has connected
   [junit4]   2> 550816 INFO  (zkConnectionManagerCallback-1023-thread-1) [    ] o.a.s.c.c.ConnectionManager zkClient has connected
   [junit4]   2> 550820 INFO  (TEST-TestInPlaceUpdatesDistrib.test-seed#[577EF3B94A888B30]) [    ] o.a.s.c.c.ZkStateReader Updated live nodes from ZooKeeper... (0) -> (2)
   [junit4]   2> 550829 INFO  (TEST-TestInPlaceUpdatesDistrib.test-seed#[577EF3B94A888B30]) [    ] o.a.s.c.Overseer Overseer (id=null) closing
   [junit4]   2> 550835 INFO  (TEST-TestInPlaceUpdatesDistrib.test-seed#[577EF3B94A888B30]) [    ] o.a.s.c.ZkController Register node as live in ZooKeeper:/live_nodes/127.0.0.1:36081_mf%2Ffb
   [junit4]   2> 550838 INFO  (zkCallback-1005-thread-1) [    ] o.a.s.c.c.ZkStateReader Updated live nodes from ZooKeeper... (2) -> (3)
   [junit4]   2> 550838 INFO  (zkCallback-995-thread-2) [    ] o.a.s.c.c.ZkStateReader Updated live nodes from ZooKeeper... (2) -> (3)
   [junit4]   2> 550838 INFO  (zkCallback-1013-thread-1) [    ] o.a.s.c.c.ZkStateReader Updated live nodes from ZooKeeper... (2) -> (3)
   [junit4]   2> 550842 INFO  (zkCallback-1022-thread-1) [    ] o.a.s.c.c.ZkStateReader Updated live nodes from ZooKeeper... (2) -> (3)
   [junit4]   2> 550878 INFO  (TEST-TestInPlaceUpdatesDistrib.test-seed#[577EF3B94A888B30]) [    ] o.a.s.m.r.SolrJmxReporter JMX monitoring for 'solr.node' (registry 'solr.node') enabled at server: com.sun.jmx.mbeanserver.JmxMBeanServer@6e18ab8f
   [junit4]   2> 550887 INFO  (TEST-TestInPlaceUpdatesDistrib.test-seed#[577EF3B94A888B30]) [    ] o.a.s.m.r.SolrJmxReporter JMX monitoring for 'solr.jvm' (registry 'solr.jvm') enabled at server: com.sun.jmx.mbeanserver.JmxMBeanServer@6e18ab8f
   [junit4]   2> 550887 INFO  (TEST-TestInPlaceUpdatesDistrib.test-seed#[577EF3B94A888B30]) [    ] o.a.s.m.r.SolrJmxReporter JMX monitoring for 'solr.jetty' (registry 'solr.jetty') enabled at server: com.sun.jmx.mbeanserver.JmxMBeanServer@6e18ab8f
   [junit4]   2> 550889 INFO  (TEST-TestInPlaceUpdatesDistrib.test-seed#[577EF3B94A888B30]) [    ] o.a.s.c.CorePropertiesLocator Found 0 core definitions underneath /home/jenkins/workspace/Lucene-Solr-7.2-Linux/solr/build/solr-core/test/J2/../../../../../../../../../home/jenkins/workspace/Lucene-Solr-7.2-Linux/solr/build/solr-core/test/J2/temp/solr.update.TestInPlaceUpdatesDistrib_577EF3B94A888B30-001/shard-2-001/cores
   [junit4]   2> 550951 INFO  (qtp409518010-4792) [    ] o.a.s.h.a.CollectionsHandler Invoked Collection Action :addreplica with params node=127.0.0.1:36081_mf%252Ffb&action=ADDREPLICA&collection=collection1&shard=shard1&type=NRT&wt=javabin&version=2 and sendToOCPQueue=true
   [junit4]   2> 550954 INFO  (OverseerCollectionConfigSetProcessor-99194618531414020-127.0.0.1:36435_mf%2Ffb-n_0000000000) [    ] o.a.s.c.OverseerTaskQueue Response ZK path: /overseer/collection-queue-work/qnr-0000000004 doesn't exist.  Requestor may have disconnected from ZooKeeper
   [junit4]   2> 550954 INFO  (OverseerThreadFactory-2155-thread-4) [    ] o.a.s.c.AddReplicaCmd Node Identified 127.0.0.1:36081_mf%2Ffb for creating new replica
   [junit4]   2> 550956 INFO  (qtp409518010-4794) [    ] o.a.s.h.a.CoreAdminOperation core create command qt=/admin/cores&collection.configName=conf1&name=collection1_shard1_replica_n23&action=CREATE&collection=collection1&shard=shard1&wt=javabin&version=2&replicaType=NRT
   [junit4]   2> 550956 INFO  (qtp409518010-4794) [    ] o.a.s.c.TransientSolrCoreCacheDefault Allocating transient cache for 4 transient cores
   [junit4]   2> 551996 INFO  (qtp409518010-4794) [    ] o.a.s.c.SolrConfig Using Lucene MatchVersion: 7.2.0
   [junit4]   2> 552003 INFO  (qtp409518010-4794) [    ] o.a.s.s.IndexSchema [collection1_shard1_replica_n23] Schema name=inplace-updates
   [junit4]   2> 552005 INFO  (qtp409518010-4794) [    ] o.a.s.s.IndexSchema Loaded schema inplace-updates/1.6 with uniqueid field id
   [junit4]   2> 552006 INFO  (qtp409518010-4794) [    ] o.a.s.c.CoreContainer Creating SolrCore 'collection1_shard1_replica_n23' using configuration from collection collection1, trusted=true
   [junit4]   2> 552006 INFO  (qtp409518010-4794) [    ] o.a.s.m.r.SolrJmxReporter JMX monitoring for 'solr.core.collection1.shard1.replica_n23' (registry 'solr.core.collection1.shard1.replica_n23') enabled at server: com.sun.jmx.mbeanserver.JmxMBeanServer@6e18ab8f
   [junit4]   2> 552006 INFO  (qtp409518010-4794) [    ] o.a.s.c.SolrCore solr.RecoveryStrategy.Builder
   [junit4]   2> 552006 INFO  (qtp409518010-4794) [    ] o.a.s.c.SolrCore [[collection1_shard1_replica_n23] ] Opening new SolrCore at [/home/jenkins/workspace/Lucene-Solr-7.2-Linux/solr/build/solr-core/test/J2/temp/solr.update.TestInPlaceUpdatesDistrib_577EF3B94A888B30-001/shard-2-001/cores/collection1_shard1_replica_n23], dataDir=[/home/jenkins/workspace/Lucene-Solr-7.2-Linux/solr/build/solr-core/test/J2/../../../../../../../../../home/jenkins/workspace/Lucene-Solr-7.2-Linux/solr/build/solr-core/test/J2/temp/solr.update.TestInPlaceUpdatesDistrib_577EF3B94A888B30-001/shard-2-001/cores/collection1_shard1_replica_n23/data/]
   [junit4]   2> 552014 WARN  (qtp409518010-4794) [    ] o.a.s.c.RequestHandlers INVALID paramSet a in requestHandler {type = requestHandler,name = /dump,class = DumpRequestHandler,attributes = {initParams=a, name=/dump, class=DumpRequestHandler},args = {defaults={a=A,b=B}}}
   [junit4]   2> 552057 INFO  (qtp409518010-4794) [    ] o.a.s.u.UpdateHandler Using UpdateLog implementation: org.apache.solr.update.UpdateLog
   [junit4]   2> 552057 INFO  (qtp409518010-4794) [    ] o.a.s.u.UpdateLog Initializing UpdateLog: dataDir= defaultSyncLevel=FLUSH numRecordsToKeep=100 maxNumLogsToKeep=10 numVersionBuckets=65536
   [junit4]   2> 552058 INFO  (qtp409518010-4794) [    ] o.a.s.u.CommitTracker Hard AutoCommit: disabled
   [junit4]   2> 552058 INFO  (qtp409518010-4794) [    ] o.a.s.u.CommitTracker Soft AutoCommit: disabled
   [junit4]   2> 552060 INFO  (qtp409518010-4794) [    ] o.a.s.s.SolrIndexSearcher Opening [Searcher@20cb3a8e[collection1_shard1_replica_n23] main]
   [junit4]   2> 552060 INFO  (qtp409518010-4794) [    ] o.a.s.r.ManagedResourceStorage Configured ZooKeeperStorageIO with znodeBase: /configs/conf1
   [junit4]   2> 552061 INFO  (qtp409518010-4794) [    ] o.a.s.r.ManagedResourceStorage Loaded null at path _rest_managed.json using ZooKeeperStorageIO:path=/configs/conf1
   [junit4]   2> 552061 INFO  (qtp409518010-4794) [    ] o.a.s.h.ReplicationHandler Commits will be reserved for 10000ms.
   [junit4]   2> 552061 INFO  (qtp409518010-4794) [    ] o.a.s.u.UpdateLog Could not find max version in index or recent updates, using new clock 1587113902748991488
   [junit4]   2> 552062 INFO  (searcherExecutor-2180-thread-1) [    ] o.a.s.c.SolrCore [collection1_shard1_replica_n23] Registered new searcher Searcher@20cb3a8e[collection1_shard1_replica_n23] main{ExitableDirectoryReader(UninvertingDirectoryReader())}
   [junit4]   2> 552064 INFO  (qtp409518010-4794) [    ] o.a.s.c.ZkController Core needs to recover:collection1_shard1_replica_n23
   [junit4]   2> 552064 INFO  (updateExecutor-1018-thread-1) [    ] o.a.s.u.DefaultSolrCoreState Running recovery
   [junit4]   2> 552064 INFO  (recoveryExecutor-1019-thread-1) [    ] o.a.s.c.RecoveryStrategy Starting recovery process. recoveringAfterStartup=true
   [junit4]   2> 552065 INFO  (recoveryExecutor-1019-thread-1) [    ] o.a.s.c.RecoveryStrategy ###### startupVersions=[[]]
   [junit4]   2> 552065 INFO  (recoveryExecutor-1019-thread-1) [    ] o.a.s.c.RecoveryStrategy Begin buffering updates. core=[collection1_shard1_replica_n23]
   [junit4]   2> 552065 INFO  (recoveryExecutor-1019-thread-1) [    ] o.a.s.u.UpdateLog Starting to buffer updates. FSUpdateLog{state=ACTIVE, tlog=null}
   [junit4]   2> 552065 INFO  (recoveryExecutor-1019-thread-1) [    ] o.a.s.c.RecoveryStrategy Publishing state of core [collection1_shard1_replica_n23] as recovering, leader is [http://127.0.0.1:36969/mf/fb/collection1_shard1_replica_n21/] and I am [http://127.0.0.1:36081/mf/fb/collection1_shard1_replica_n23/]
   [junit4]   2> 552065 INFO  (qtp409518010-4794) [    ] o.a.s.s.HttpSolrCall [admin] webapp=null path=/admin/cores params={qt=/admin/cores&collection.configName=conf1&name=collection1_shard1_replica_n23&action=CREATE&collection=collection1&shard=shard1&wt=javabin&version=2&replicaType=NRT} status=0 QTime=1109
   [junit4]   2> 552066 INFO  (qtp409518010-4792) [    ] o.a.s.s.HttpSolrCall [admin] webapp=null path=/admin/collections params={node=127.0.0.1:36081_mf%252Ffb&action=ADDREPLICA&collection=collection1&shard=shard1&type=NRT&wt=javabin&version=2} status=0 QTime=1114
   [junit4]   2> 552066 INFO  (recoveryExecutor-1019-thread-1) [    ] o.a.s.c.RecoveryStrategy Sending prep recovery command to [http://127.0.0.1:36969/mf/fb]; [WaitForState: action=PREPRECOVERY&core=collection1_shard1_replica_n21&nodeName=127.0.0.1:36081_mf%252Ffb&coreNodeName=core_node24&state=recovering&checkLive=true&onlyIfLeader=true&onlyIfLeaderActive=true]
   [junit4]   2> 552067 INFO  (qtp768950761-4760) [    ] o.a.s.h.a.PrepRecoveryOp Going to wait for coreNodeName: core_node24, state: recovering, checkLive: true, onlyIfLeader: true, onlyIfLeaderActive: true, maxTime: 183 s
   [junit4]   2> 552067 INFO  (qtp768950761-4760) [    ] o.a.s.h.a.PrepRecoveryOp In WaitForState(recovering): collection=collection1, shard=shard1, thisCore=collection1_shard1_replica_n21, leaderDoesNotNeedRecovery=false, isLeader? true, live=true, checkLive=true, currentState=down, localState=active, nodeName=127.0.0.1:36081_mf%2Ffb, coreNodeName=core_node24, onlyIfActiveCheckResult=false, nodeProps: core_node24:{"core":"collection1_shard1_replica_n23","base_url":"http://127.0.0.1:36081/mf/fb","node_name":"127.0.0.1:36081_mf%2Ffb","state":"down","type":"NRT"}
   [junit4]   2> 552180 INFO  (TEST-TestInPlaceUpdatesDistrib.test-seed#[577EF3B94A888B30]) [    ] o.a.s.c.AbstractFullDistribZkTestBase create jetty 3 in directory /home/jenkins/workspace/Lucene-Solr-7.2-Linux/solr/build/solr-core/test/J2/temp/solr.update.TestInPlaceUpdatesDistrib_577EF3B94A888B30-001/shard-3-001 of type NRT
   [junit4]   2> 552181 INFO  (TEST-TestInPlaceUpdatesDistrib.test-seed#[577EF3B94A888B30]) [    ] o.e.j.s.Server jetty-9.3.20.v20170531
   [junit4]   2> 552181 INFO  (TEST-TestInPlaceUpdatesDistrib.test-seed#[577EF3B94A888B30]) [    ] o.e.j.s.h.ContextHandler Started o.e.j.s.ServletContextHandler@e59037d{/mf/fb,null,AVAILABLE}
   [junit4]   2> 552182 INFO  (TEST-TestInPlaceUpdatesDistrib.test-seed#[577EF3B94A888B30]) [    ] o.e.j.s.AbstractConnector Started ServerConnector@1401b16f{HTTP/1.1,[http/1.1]}{127.0.0.1:35267}
   [junit4]   2> 552182 INFO  (TEST-TestInPlaceUpdatesDistrib.test-seed#[577EF3B94A888B30]) [    ] o.e.j.s.Server Started @553723ms
   [junit4]   2> 552182 INFO  (TEST-TestInPlaceUpdatesDistrib.test-seed#[577EF3B94A888B30]) [    ] o.a.s.c.s.e.JettySolrRunner Jetty properties: {hostContext=/mf/fb, solrconfig=solrconfig.xml, solr.data.dir=/home/jenkins/workspace/Lucene-Solr-7.2-Linux/solr/build/solr-core/test/J2/temp/solr.update.TestInPlaceUpdatesDistrib_577EF3B94A888B30-001/tempDir-001/jetty3, hostPort=35267, coreRootDirectory=/home/jenkins/workspace/Lucene-Solr-7.2-Linux/solr/build/solr-core/test/J2/../../../../../../../../../home/jenkins/workspace/Lucene-Solr-7.2-Linux/solr/build/solr-core/test/J2/temp/solr.update.TestInPlaceUpdatesDistrib_577EF3B94A888B30-001/shard-3-001/cores}
   [junit4]   2> 552182 ERROR (TEST-TestInPlaceUpdatesDistrib.test-seed#[577EF3B94A888B30]) [    ] o.a.s.u.StartupLoggingUtils Missing Java Option solr.log.dir. Logging may be missing or incomplete.
   [junit4]   2> 552182 INFO  (TEST-TestInPlaceUpdatesDistrib.test-seed#[577EF3B94A888B30]) [    ] o.a.s.s.SolrDispatchFilter  ___      _       Welcome to Apache Solr? version 7.2.0
   [junit4]   2> 552182 INFO  (TEST-TestInPlaceUpdatesDistrib.test-seed#[577EF3B94A888B30]) [    ] o.a.s.s.SolrDispatchFilter / __| ___| |_ _   Starting in cloud mode on port null
   [junit4]   2> 552182 INFO  (TEST-TestInPlaceUpdatesDistrib.test-seed#[577EF3B94A888B30]) [    ] o.a.s.s.SolrDispatchFilter \__ \/ _ \ | '_|  Install dir: null
   [junit4]   2> 552182 INFO  (TEST-TestInPlaceUpdatesDistrib.test-seed#[577EF3B94A888B30]) [    ] o.a.s.s.SolrDispatchFilter |___/\___/_|_|    Start time: 2017-12-18T09:36:06.384896Z
   [junit4]   2> 552184 INFO  (zkConnectionManagerCallback-1027-thread-1) [    ] o.a.s.c.c.ConnectionManager zkClient has connected
   [junit4]   2> 552184 WARN  (NIOServerCxn.Factory:0.0.0.0/0.0.0.0:0) [    ] o.a.z.s.NIOServerCnxn caught end of stream exception
   [junit4]   2> EndOfStreamException: Unable to read additional data from client sessionid 0x16068fae132000d, likely client has closed socket
   [junit4]   2> 	at org.apache.zookeeper.server.NIOServerCnxn.doIO(NIOServerCnxn.java:239)
   [junit4]   2> 	at org.apache.zookeeper.server.NIOServerCnxnFactory.run(NIOServerCnxnFactory.java:203)
   [junit4]   2> 	at java.base/java.lang.Thread.run(Thread.java:844)
   [junit4]   2> 552184 INFO  (TEST-TestInPlaceUpdatesDistrib.test-seed#[577EF3B94A888B30]) [    ] o.a.s.s.SolrDispatchFilter Loading solr.xml from SolrHome (not found in ZooKeeper)
   [junit4]   2> 552184 INFO  (TEST-TestInPlaceUpdatesDistrib.test-seed#[577EF3B94A888B30]) [    ] o.a.s.c.SolrXmlConfig Loading container configuration from /home/jenkins/workspace/Lucene-Solr-7.2-Linux/solr/build/solr-core/test/J2/temp/solr.update.TestInPlaceUpdatesDistrib_577EF3B94A888B30-001/shard-3-001/solr.xml
   [junit4]   2> 552187 INFO  (TEST-TestInPlaceUpdatesDistrib.test-seed#[577EF3B94A888B30]) [    ] o.a.s.c.SolrXmlConfig Configuration parameter autoReplicaFailoverWorkLoopDelay is ignored
   [junit4]   2> 552187 INFO  (TEST-TestInPlaceUpdatesDistrib.test-seed#[577EF3B94A888B30]) [    ] o.a.s.c.SolrXmlConfig Configuration parameter autoReplicaFailoverBadNodeExpiration is ignored
   [junit4]   2> 552188 INFO  (TEST-TestInPlaceUpdatesDistrib.test-seed#[577EF3B94A888B30]) [    ] o.a.s.c.SolrXmlConfig MBean server found: com.sun.jmx.mbeanserver.JmxMBeanServer@6e18ab8f, but no JMX reporters were configured - adding default JMX reporter.
   [junit4]   2> 552189 INFO  (TEST-TestInPlaceUpdatesDistrib.test-seed#[577EF3B94A888B30]) [    ] o.a.s.c.ZkContainer Zookeeper client=127.0.0.1:33425/solr
   [junit4]   2> 552190 INFO  (zkConnectionManagerCallback-1031-thread-1) [    ] o.a.s.c.c.ConnectionManager zkClient has connected
   [junit4]   2> 552198 INFO  (zkConnectionManagerCallback-1033-thread-1) [    ] o.a.s.c.c.ConnectionManager zkClient has connected
   [junit4]   2> 552203 INFO  (TEST-TestInPlaceUpdatesDistrib.test-seed#[577EF3B94A888B30]) [    ] o.a.s.c.c.ZkStateReader Updated live nodes from ZooKeeper... (0) -> (3)
   [junit4]   2> 552203 INFO  (TEST-TestInPlaceUpdatesDistrib.test-seed#[577EF3B94A888B30]) [    ] o.a.s.c.Overseer Overseer (id=null) closing
   [junit4]   2> 552204 INFO  (TEST-TestInPlaceUpdatesDistrib.test-seed#[577EF3B94A888B30]) [    ] o.a.s.c.ZkController Register node as live in ZooKeeper:/live_nodes/127.0.0.1:35267_mf%2Ffb
   [junit4]   2> 552205 INFO  (zkCallback-1005-thread-1) [    ] o.a.s.c.c.ZkStateReader Updated live nodes from ZooKeeper... (3) -> (4)
   [junit4]   2> 552205 INFO  (zkCallback-1022-thread-1) [    ] o.a.s.c.c.ZkStateReader Updated live nodes from ZooKeeper... (3) -> (4)
   [junit4]   2> 552205 INFO  (zkCallback-1032-thread-1) [    ] o.a.s.c.c.ZkStateReader Updated live nodes from ZooKeeper... (3) -> (4)
   [junit4]   2> 552205 INFO  (zkCallback-1013-thread-1) [    ] o.a.s.c.c.ZkStateReader Updated live nodes from ZooKeeper... (3) -> (4)
   [junit4]   2> 552205 INFO  (zkCallback-995-thread-2) [    ] o.a.s.c.c.ZkStateReader Updated live nodes from ZooKeeper... (3) -> (4)
   [junit4]   2> 552256 INFO  (TEST-TestInPlaceUpdatesDistrib.test-seed#[577EF3B94A888B30]) [    ] o.a.s.m.r.SolrJmxReporter JMX monitoring for 'solr.node' (registry 'solr.node') enabled at server: com.sun.jmx.mbeanserver.JmxMBeanServer@6e18ab8f
   [junit4]   2> 552262 INFO  (TEST-TestInPlaceUpdatesDistrib.test-seed#[577EF3B94A888B30]) [    ] o.a.s.m.r.SolrJmxReporter JMX monitoring for 'solr.jvm' (registry 'solr.jvm') enabled at server: com.sun.jmx.mbeanserver.JmxMBeanServer@6e18ab8f
   [junit4]   2> 552263 INFO  (TEST-TestInPlaceUpdatesDistrib.test-seed#[577EF3B94A888B30]) [    ] o.a.s.m.r.SolrJmxReporter JMX monitoring for 'solr.jetty' (registry 'solr.jetty') enabled at server: com.sun.jmx.mbeanserver.JmxMBeanServer@6e18ab8f
   [junit4]   2> 552264 INFO  (TEST-TestInPlaceUpdatesDistrib.test-seed#[577EF3B94A888B30]) [    ] o.a.s.c.CorePropertiesLocator Found 0 core definitions underneath /home/jenkins/workspace/Lucene-Solr-7.2-Linux/solr/build/solr-core/test/J2/../../../../../../../../../home/jenkins/workspace/Lucene-Solr-7.2-Linux/solr/build/solr-core/test/J2/temp/solr.update.TestInPlaceUpdatesDistrib_577EF3B94A888B30-001/shard-3-001/cores
   [junit4]   2> 552329 INFO  (qtp66792484-4826) [    ] o.a.s.h.a.CollectionsHandler Invoked Collection Action :addreplica with params node=127.0.0.1:35267_mf%252Ffb&action=ADDREPLICA&collection=collection1&shard=shard1&type=NRT&wt=javabin&version=2 and sendToOCPQueue=true
   [junit4]   2> 552331 INFO  (OverseerCollectionConfigSetProcessor-99194618531414020-127.0.0.1:36435_mf%2Ffb-n_0000000000) [    ] o.a.s.c.OverseerTaskQueue Response ZK path: /overseer/collection-queue-work/qnr-0000000006 doesn't exist.  Requestor may have disconnected from ZooKeeper
   [junit4]   2> 552331 INFO  (OverseerThreadFactory-2155-thread-5) [    ] o.a.s.c.AddReplicaCmd Node Identified 127.0.0.1:35267_mf%2Ffb for creating new replica
   [junit4]   2> 552332 INFO  (qtp66792484-4828) [    ] o.a.s.h.a.CoreAdminOperation core create command qt=/admin/cores&collection.configName=conf1&name=collection1_shard1_replica_n25&action=CREATE&collection=collection1&shard=shard1&wt=javabin&version=2&replicaType=NRT
   [junit4]   2> 552332 INFO  (qtp66792484-4828) [    ] o.a.s.c.TransientSolrCoreCacheDefault Allocating transient cache for 4 transient cores
   [junit4]   2> 553067 INFO  (qtp768950761-4760) [    ] o.a.s.h.a.PrepRecoveryOp In WaitForState(recovering): collection=collection1, shard=shard1, thisCore=collection1_shard1_replica_n21, leaderDoesNotNeedRecovery=false, isLeader? true, live=true, checkLive=true, currentState=recovering, localState=active, nodeName=127.0.0.1:36081_mf%2Ffb, coreNodeName=core_node24, onlyIfActiveCheckResult=false, nodeProps: core_node24:{"core":"collection1_shard1_replica_n23","base_url":"http://127.0.0.1:36081/mf/fb","node_name":"127.0.0.1:36081_mf%2Ffb","state":"recovering","type":"NRT"}
   [junit4]   2> 553067 INFO  (qtp768950761-4760) [    ] o.a.s.h.a.PrepRecoveryOp Waited coreNodeName: core_node24, state: recovering, checkLive: true, onlyIfLeader: true for: 1 seconds.
   [junit4]   2> 553067 INFO  (qtp768950761-4760) [    ] o.a.s.s.HttpSolrCall [admin] webapp=null path=/admin/cores params={nodeName=127.0.0.1:36081_mf%252Ffb&onlyIfLeaderActive=true&core=collection1_shard1_replica_n21&coreNodeName=core_node24&action=PREPRECOVERY&checkLive=true&state=recovering&onlyIfLeader=true&wt=javabin&version=2} status=0 QTime=1000
   [junit4]   2> 553351 INFO  (qtp66792484-4828) [    ] o.a.s.c.SolrConfig Using Lucene MatchVersion: 7.2.0
   [junit4]   2> 553365 INFO  (qtp66792484-4828) [    ] o.a.s.s.IndexSchema [collection1_shard1_replica_n25] Schema name=inplace-updates
   [junit4]   2> 553394 INFO  (qtp66792484-4828) [    ] o.a.s.s.IndexSchema Loaded schema inplace-updates/1.6 with uniqueid field id
   [junit4]   2> 553394 INFO  (qtp66792484-4828) [    ] o.a.s.c.CoreContainer Creating SolrCore 'collection1_shard1_replica_n25' using configuration from collection collection1, trusted=true
   [junit4]   2> 553395 INFO  (qtp66792484-4828) [    ] o.a.s.m.r.SolrJmxReporter JMX monitoring for 'solr.core.collection1.shard1.replica_n25' (registry 'solr.core.collection1.shard1.replica_n25') enabled at server: com.sun.jmx.mbeanserver.JmxMBeanServer@6e18ab8f
   [junit4]   2> 553395 INFO  (qtp66792484-4828) [    ] o.a.s.c.SolrCore solr.RecoveryStrategy.Builder
   [junit4]   2> 553395 INFO  (qtp66792484-4828) [    ] o.a.s.c.SolrCore [[collection1_shard1_replica_n25] ] Opening new SolrCore at [/home/jenkins/workspace/Lucene-Solr-7.2-Linux/solr/build/solr-core/test/J2/temp/solr.update.TestInPlaceUpdatesDistrib_577EF3B94A888B30-001/shard-3-001/cores/collection1_shard1_replica_n25], dataDir=[/home/jenkins/workspace/Lucene-Solr-7.2-Linux/solr/build/solr-core/test/J2/../../../../../../../../../home/jenkins/workspace/Lucene-Solr-7.2-Linux/solr/build/solr-core/test/J2/temp/solr.update.TestInPlaceUpdatesDistrib_577EF3B94A888B30-001/shard-3-001/cores/collection1_shard1_replica_n25/data/]
   [junit4]   2> 553398 WARN  (qtp66792484-4828) [    ] o.a.s.c.RequestHandlers INVALID paramSet a in requestHandler {type = requestHandler,name = /dump,class = DumpRequestHandler,attributes = {initParams=a, name=/dump, class=DumpRequestHandler},args = {defaults={a=A,b=B}}}
   [junit4]   2> 553437 INFO  (qtp66792484-4828) [    ] o.a.s.u.UpdateHandler Using UpdateLog implementation: org.apache.solr.update.UpdateLog
   [junit4]   2> 553437 INFO  (qtp66792484-4828) [    ] o.a.s.u.UpdateLog Initializing UpdateLog: dataDir= defaultSyncLevel=FLUSH numRecordsToKeep=100 maxNumLogsToKeep=10 numVersionBuckets=65536
   [junit4]   2> 553439 INFO  (qtp66792484-4828) [    ] o.a.s.u.CommitTracker Hard AutoCommit: disabled
   [junit4]   2> 553439 INFO  (qtp66792484-4828) [    ] o.a.s.u.CommitTracker Soft AutoCommit: disabled
   [junit4]   2> 553441 INFO  (qtp66792484-4828) [    ] o.a.s.s.SolrIndexSearcher Opening [Searcher@5b4a9602[collection1_shard1_replica_n25] main]
   [junit4]   2> 553442 INFO  (qtp66792484-4828) [    ] o.a.s.r.ManagedResourceStorage Configured ZooKeeperStorageIO with znodeBase: /configs/conf1
   [junit4]   2> 553443 INFO  (qtp66792484-4828) [    ] o.a.s.r.ManagedResourceStorage Loaded null at path _rest_managed.json using ZooKeeperStorageIO:path=/configs/conf1
   [junit4]   2> 553444 INFO  (qtp66792484-4828) [    ] o.a.s.h.ReplicationHandler Commits will be reserved for 10000ms.
   [junit4]   2> 553444 INFO  (qtp66792484-4828) [    ] o.a.s.u.UpdateLog Could not find max version in index or recent updates, using new clock 1587113904199172096
   [junit4]   2> 553447 INFO  (searcherExecutor-2191-thread-1) [    ] o.a.s.c.SolrCore [collection1_shard1_replica_n25] Registered new searcher Searcher@5b4a9602[collection1_shard1_replica_n25] main{ExitableDirectoryReader(UninvertingDirectoryReader())}
   [junit4]   2> 553448 INFO  (qtp66792484-4828) [    ] o.a.s.c.ZkController Core needs to recover:collection1_shard1_replica_n25
   [junit4]   2> 553449 INFO  (updateExecutor-1028-thread-1) [    ] o.a.s.u.DefaultSolrCoreState Running recovery
   [junit4]   2> 553450 INFO  (recoveryExecutor-1029-thread-1) [    ] o.a.s.c.RecoveryStrategy Starting recovery process. recoveringAfterStartup=true
   [junit4]   2> 553450 INFO  (recoveryExecutor-1029-thread-1) [    ] o.a.s.c.RecoveryStrategy ###### startupVersions=[[]]
   [junit4]   2> 553450 INFO  (recoveryExecutor-1029-thread-1) [    ] o.a.s.c.RecoveryStrategy Begin buffering updates. core=[collection1_shard1_replica_n25]
   [junit4]   2> 553450 INFO  (recoveryExecutor-1029-thread-1) [    ] o.a.s.u.UpdateLog Starting to buffer updates. FSUpdateLog{state=ACTIVE, tlog=null}
   [junit4]   2> 553450 INFO  (recoveryExecutor-1029-thread-1) [    ] o.a.s.c.RecoveryStrategy Publishing state of core [collection1_shard1_replica_n25] as recovering, leader is [http://127.0.0.1:36969/mf/fb/collection1_shard1_replica_n21/] and I am [http://127.0.0.1:35267/mf/fb/collection1_shard1_replica_n25/]
   [junit4]   2> 553450 INFO  (qtp66792484-4828) [    ] o.a.s.s.HttpSolrCall [admin] webapp=null path=/admin/cores params={qt=/admin/cores&collection.configName=conf1&name=collection1_shard1_replica_n25&action=CREATE&collection=collection1&shard=shard1&wt=javabin&version=2&replicaType=NRT} status=0 QTime=1118
   [junit4]   2> 553451 INFO  (recoveryExecutor-1029-thread-1) [    ] o.a.s.c.RecoveryStrategy Sending prep recovery command to [http://127.0.0.1:36969/mf/fb]; [WaitForState: action=PREPRECOVERY&core=collection1_shard1_replica_n21&nodeName=127.0.0.1:35267_mf%252Ffb&coreNodeName=core_node26&state=recovering&checkLive=true&onlyIfLeader=true&onlyIfLeaderActive=true]
   [junit4]   2> 553451 INFO  (qtp66792484-4826) [    ] o.a.s.s.HttpSolrCall [admin] webapp=null path=/admin/collections params={node=127.0.0.1:35267_mf%252Ffb&action=ADDREPLICA&collection=collection1&shard=shard1&type=NRT&wt=javabin&version=2} status=0 QTime=1122
   [junit4]   2> 553452 INFO  (qtp768950761-4757) [    ] o.a.s.h.a.PrepRecoveryOp Going to wait for coreNodeName: core_node26, state: recovering, checkLive: true, onlyIfLeader: true, onlyIfLeaderActive: true, maxTime: 183 s
   [junit4]   2> 553452 INFO  (qtp768950761-4757) [    ] o.a.s.h.a.PrepRecoveryOp In WaitForState(recovering): collection=collection1, shard=shard1, thisCore=collection1_shard1_replica_n21, leaderDoesNotNeedRecovery=false, isLeader? true, live=true, checkLive=true, currentState=down, localState=active, nodeName=127.0.0.1:35267_mf%2Ffb, coreNodeName=core_node26, onlyIfActiveCheckResult=false, nodeProps: core_node26:{"core":"collection1_shard1_replica_n25","base_url":"http://127.0.0.1:35267/mf/fb","node_name":"127.0.0.1:35267_mf%2Ffb","state":"down","type":"NRT"}
   [junit4]   2> 553453 INFO  (TEST-TestInPlaceUpdatesDistrib.test-seed#[577EF3B94A888B30]) [    ] o.a.s.SolrTestCaseJ4 ###Starting test
   [junit4]   2> 553453 INFO  (TEST-TestInPlaceUpdatesDistrib.test-seed#[577EF3B94A888B30]) [    ] o.a.s.c.AbstractDistribZkTestBase Wait for recoveries to finish - collection: collection1 failOnTimeout:true timeout (sec):330
   [junit4]   1> -
   [junit4]   1> replica:core_node22 rstate:active live:true
   [junit4]   1> replica:core_node24 rstate:recovering live:true
   [junit4]   1> replica:core_node26 rstate:down live:true
   [junit4]   2> 553568 INFO  (recoveryExecutor-1019-thread-1) [    ] o.a.s.c.RecoveryStrategy Attempting to PeerSync from [http://127.0.0.1:36969/mf/fb/collection1_shard1_replica_n21/] - recoveringAfterStartup=[true]
   [junit4]   2> 553569 INFO  (recoveryExecutor-1019-thread-1) [    ] o.a.s.u.PeerSync PeerSync: core=collection1_shard1_replica_n23 url=http://127.0.0.1:36081/mf/fb START replicas=[http://127.0.0.1:36969/mf/fb/collection1_shard1_replica_n21/] nUpdates=100
   [junit4]   2> 553575 INFO  (qtp768950761-4763) [    ] o.a.s.u.IndexFingerprint IndexFingerprint millis:0.0 result:{maxVersionSpecified=9223372036854775807, maxVersionEncountered=0, maxInHash=0, versionsHash=0, numVersions=0, numDocs=0, maxDoc=0}
   [junit4]   2> 553575 INFO  (qtp768950761-4763) [    ] o.a.s.c.S.Request [collection1_shard1_replica_n21]  webapp=/mf/fb path=/get params={distrib=false&qt=/get&getFingerprint=9223372036854775807&wt=javabin&version=2} status=0 QTime=0
   [junit4]   2> 553575 INFO  (recoveryExecutor-1019-thread-1) [    ] o.a.s.u.IndexFingerprint IndexFingerprint millis:0.0 result:{maxVersionSpecified=9223372036854775807, maxVersionEncountered=0, maxInHash=0, versionsHash=0, numVersions=0, numDocs=0, maxDoc=0}
   [junit4]   2> 553575 INFO  (recoveryExecutor-1019-thread-1) [    ] o.a.s.u.PeerSync We are already in sync. No need to do a PeerSync 
   [junit4]   2> 553575 INFO  (recoveryExecutor-1019-thread-1) [    ] o.a.s.u.DirectUpdateHandler2 start commit{,optimize=false,openSearcher=true,waitSearcher=true,expungeDeletes=false,softCommit=false,prepareCommit=false}
   [junit4]   2> 553575 INFO  (recoveryExecutor-1019-thread-1) [    ] o.a.s.u.DirectUpdateHandler2 No uncommitted changes. Skipping IW.commit.
   [junit4]   2> 553575 INFO  (recoveryExecutor-1019-thread-1) [    ] o.a.s.u.DirectUpdateHandler2 end_commit_flush
   [junit4]   2> 553575 INFO  (recoveryExecutor-1019-thread-1) [    ] o.a.s.c.RecoveryStrategy PeerSync stage of recovery was successful.
   [junit4]   2> 553575 INFO  (recoveryExecutor-1019-thread-1) [    ] o.a.s.c.RecoveryStrategy Replaying updates buffered during PeerSync.
   [junit4]   2> 553575 INFO  (recoveryExecutor-1019-thread-1) [    ] o.a.s.c.RecoveryStrategy No replay needed.
   [junit4]   2> 553575 INFO  (recoveryExecutor-1019-thread-1) [    ] o.a.s.c.RecoveryStrategy Registering as Active after recovery.
   [junit4]   2> 554332 INFO  (OverseerCollectionConfigSetProcessor-99194618531414020-127.0.0.1:36435_mf%2Ffb-n_0000000000) [    ] o.a.s.c.OverseerTaskQueue Response ZK path: /overseer/collection-queue-work/qnr-0000000008 doesn't exist.  Requestor may have disconnected from ZooKeeper
   [junit4]   2> 554452 INFO  (qtp768950761-4757) [    ] o.a.s.h.a.PrepRecoveryOp In WaitForState(recovering): collection=collection1, shard=shard1, thisCore=collection1_shard1_replica_n21, leaderDoesNotNeedRecovery=false, isLeader? true, live=true, checkLive=true, currentState=recovering, localState=active, nodeName=127.0.0.1:35267_mf%2Ffb, coreNodeName=core_node26, onlyIfActiveCheckResult=false, nodeProps: core_node26:{"core":"collection1_shard1_replica_n25","base_url":"http://127.0.0.1:35267/mf/fb","node_name":"127.0.0.1:35267_mf%2Ffb","state":"recovering","type":"NRT"}
   [junit4]   2> 554452 INFO  (qtp768950761-4757) [    ] o.a.s.h.a.PrepRecoveryOp Waited coreNodeName: core_node26, state: recovering, checkLive: true, onlyIfLeader: true for: 1 seconds.
   [junit4]   2> 554452 INFO  (qtp768950761-4757) [    ] o.a.s.s.HttpSolrCall [admin] webapp=null path=/admin/cores params={nodeName=127.0.0.1:35267_mf%252Ffb&onlyIfLeaderActive=true&core=collection1_shard1_replica_n21&coreNodeName=core_node26&action=PREPRECOVERY&checkLive=true&state=recovering&onlyIfLeader=true&wt=javabin&version=2} status=0 QTime=1000
   [junit4]   1> -
   [junit4]   1> replica:core_node22 rstate:active live:true
   [junit4]   1> replica:core_node24 rstate:active live:true
   [junit4]   1> replica:core_node26 rstate:recovering live:true
   [junit4]   2> 554953 INFO  (recoveryExecutor-1029-thread-1) [    ] o.a.s.c.RecoveryStrategy Attempting to PeerSync from [http://127.0.0.1:36969/mf/fb/collection1_shard1_replica_n21/] - recoveringAfterStartup=[true]
   [junit4]   2> 554953 INFO  (recoveryExecutor-1029-thread-1) [    ] o.a.s.u.PeerSync PeerSync: core=collection1_shard1_replica_n25 url=http://127.0.0.1:35267/mf/fb START replicas=[http://127.0.0.1:36969/mf/fb/collection1_shard1_replica_n21/] nUpdates=100
   [junit4]   2> 554965 INFO  (qtp768950761-4762) [    ] o.a.s.u.IndexFingerprint IndexFingerprint millis:0.0 result:{maxVersionSpecified=9223372036854775807, maxVersionEncountered=0, maxInHash=0, versionsHash=0, numVersions=0, numDocs=0, maxDoc=0}
   [junit4]   2> 554965 INFO  (qtp768950761-4762) [    ] o.a.s.c.S.Request [collection1_shard1_replica_n21]  webapp=/mf/fb path=/get params={distrib=false&qt=/get&getFingerprint=9223372036854775807&wt=javabin&version=2} status=0 QTime=0
   [junit4]   2> 554965 INFO  (recoveryExecutor-1029-thread-1) [    ] o.a.s.u.IndexFingerprint IndexFingerprint millis:0.0 result:{maxVersionSpecified=9223372036854775807, maxVersionEncountered=0, maxInHash=0, versionsHash=0, numVersions=0, numDocs=0, maxDoc=0}
   [junit4]   2> 554965 INFO  (recoveryExecutor-1029-thread-1) [    ] o.a.s.u.PeerSync We are already in sync. No need to do a PeerSync 
   [junit4]   2> 554966 INFO  (recoveryExecutor-1029-thread-1) [    ] o.a.s.u.DirectUpdateHandler2 start commit{,optimize=false,openSearcher=true,waitSearcher=true,expungeDeletes=false,softCommit=false,prepareCommit=false}
   [junit4]   2> 554966 INFO  (recoveryExecutor-1029-thread-1) [    ] o.a.s.u.DirectUpdateHandler2 No uncommitted changes. Skipping IW.commit.
   [junit4]   2> 554966 INFO  (recoveryExecutor-1029-thread-1) [    ] o.a.s.u.DirectUpdateHandler2 end_commit_flush
   [junit4]   2> 554966 INFO  (recoveryExecutor-1029-thread-1) [    ] o.a.s.c.RecoveryStrategy PeerSync stage of recovery was successful.
   [junit4]   2> 554966 INFO  (recoveryExecutor-1029-thread-1) [    ] o.a.s.c.RecoveryStrategy Replaying updates buffered during PeerSync.
   [junit4]   2> 554966 INFO  (recoveryExecutor-1029-thread-1) [    ] o.a.s.c.RecoveryStrategy No replay needed.
   [junit4]   2> 554966 INFO  (recoveryExecutor-1029-thread-1) [    ] o.a.s.c.RecoveryStrategy Registering as Active after recovery.
   [junit4]   1> -
   [junit4]   1> replica:core_node22 rstate:active live:true
   [junit4]   1> replica:core_node24 rstate:active live:true
   [junit4]   1> replica:core_node26 rstate:active live:true
   [junit4]   1> no one is recoverying
   [junit4]   2> 555453 INFO  (TEST-TestInPlaceUpdatesDistrib.test-seed#[577EF3B94A888B30]) [    ] o.a.s.c.AbstractDistribZkTestBase Recoveries finished - collection: collection1
   [junit4]   2> 555461 INFO  (qtp409518010-4793) [    ] o.a.s.c.S.Request [collection1_shard1_replica_n23]  webapp=/mf/fb path=/schema/fields/inplace_updatable_int params={wt=javabin&version=2} status=0 QTime=2
   [junit4]   2> 555464 INFO  (qtp768950761-4760) [    ] o.a.s.c.S.Request [collection1_shard1_replica_n21]  webapp=/mf/fb path=/schema/fields/inplace_updatable_float params={wt=javabin&version=2} status=0 QTime=0
   [junit4]   2> 555464 INFO  (qtp66792484-4827) [    ] o.a.s.c.S.Request [collection1_shard1_replica_n25]  webapp=/mf/fb path=/schema/fields/_version_ params={wt=javabin&version=2} status=0 QTime=0
   [junit4]   2> 555464 INFO  (TEST-TestInPlaceUpdatesDistrib.test-seed#[577EF3B94A888B30]) [    ] o.a.s.u.TestInPlaceUpdatesDistrib Trying num docs = 341
   [junit4]   2> 555468 INFO  (qtp409518010-4794) [    ] o.a.s.u.p.LogUpdateProcessorFactory [collection1_shard1_replica_n23]  webapp=/mf/fb path=/update params={update.distrib=FROMLEADER&distrib.from=http://127.0.0.1:36969/mf/fb/collection1_shard1_replica_n21/&wt=javabin&version=2}{add=[-1 (1587113906318344192)]} 0 0
   [junit4]   2> 555468 INFO  (qtp66792484-4828) [    ] o.a.s.u.p.LogUpdateProcessorFactory [collection1_shard1_replica_n25]  webapp=/mf/fb path=/update params={update.distrib=FROMLEADER&distrib.from=http://127.0.0.1:36969/mf/fb/collection1_shard1_replica_n21/&wt=javabin&version=2}{add=[-1 (1587113906318344192)]} 0 1
   [junit4]   2> 555468 INFO  (qtp768950761-4762) [    ] o.a.s.u.p.LogUpdateProcessorFactory [collection1_shard1_replica_n21]  webapp=/mf/fb path=/update params={versions=true&wt=javabin&version=2}{add=[-1 (1587113906318344192)]} 0 3
   [junit4]   2> 555470 INFO  (qtp409518010-4794) [    ] o.a.s.u.p.LogUpdateProcessorFactory [collection1_shard1_replica_n23]  webapp=/mf/fb path=/update params={update.distrib=FROMLEADER&distrib.from=http://127.0.0.1:36969/mf/fb/collection1_shard1_replica_n21/&wt=javabin&version=2}{add=[-2 (1587113906322538496)]} 0 0
   [junit4]   2> 555470 INFO  (qtp66792484-4826) [    ] o.a.s.u.p.LogUpdateProcessorFactory [collection1_shard1_replica_n25]  webapp=/mf/fb path=/update params={update.distrib=FROMLEADER&distrib.from=http://127.0.0.1:36969/mf/fb/collection1_shard1_replica_n21/&wt=javabin&version=2}{add=[-2 (1587113906322538496)]} 0 0
   [junit4]   2> 555470 INFO  (qtp768950761-4757) [    ] o.a.s.u.p.LogUpdateProcessorFactory [collection1_shard1_replica_n21]  webapp=/mf/fb path=/update params={versions=true&wt=javabin&version=2}{add=[-2 (1587113906322538496)]} 0 1
   [junit4]   2> 555472 INFO  (qtp409518010-4793) [    ] o.a.s.u.p.LogUpdateProcessorFactory [collection1_shard1_replica_n23]  webapp=/mf/fb path=/update params={update.distrib=FROMLEADER&distrib.from=http://127.0.0.1:36969/mf/fb/collection1_shard1_replica_n21/&wt=javabin&version=2}{add=[-3 (1587113906324635648)]} 0 0
   [junit4]   2> 555472 INFO  (qtp66792484-4827) [    ] o.a.s.u.p.LogUpdateProcessorFactory [collection1_shard1_replica_n25]  webapp=/mf/fb path=/update params={update.distrib=FROMLEADER&distrib.from=http://127.0.0.1:36969/mf/fb/collection1_shard1_replica_n21/&wt=javabin&version=2}{add=[-3 (1587113906324635648)]} 0 0
   [junit4]   2> 555472 INFO  (qtp768950761-4760) [    ] o.a.s.u.p.LogUpdateProcessorFactory [collection1_shard1_replica_n21]  webapp=/mf/fb path=/update params={versions=true&wt=javabin&version=2}{add=[-3 (1587113906324635648)]} 0 1
   [junit4]   2> 555494 INFO  (qtp409518010-4789) [    ] o.a.s.u.p.LogUpdateProcessorFactory [collection1_shard1_replica_n23]  webapp=/mf/fb path=/update params={update.distrib=FROMLEADER&distrib.from=http://127.0.0.1:36969/mf/fb/collection1_shard1_replica_n21/&wt=javabin&version=2}{add=[-4 (1587113906326732800)]} 0 12
   [junit4]   2> 555498 INFO  (qtp66792484-4823) [    ] o.a.s.u.p.LogUpdateProcessorFactory [collection1_shard1_replica_n25]  webapp=/mf/fb path=/update params={update.distrib=FROMLEADER&distrib.from=http://127.0.0.1:36969/mf/fb/collection1_shard1_replica_n21/&wt=javabin&version=2}{add=[-4 (1587113906326732800)]} 0 23
   [junit4]   2> 555499 INFO  (qtp768950761-4759) [    ] o.a.s.u.p.LogUpdateProcessorFactory [collection1_shard1_replica_n21]  webapp=/mf/fb path=/update params={versions=true&wt=javabin&version=2}{add=[-4 (1587113906326732800)]} 0 26
   [junit4]   2> 555501 INFO  (qtp409518010-4792) [    ] o.a.s.u.p.LogUpdateProcessorFactory [collection1_shard1_replica_n23]  webapp=/mf/fb path=/update params={update.distrib=FROMLEADER&distrib.from=http://127.0.0.1:36969/mf/fb/collection1_shard1_replica_n21/&wt=javabin&version=2}{add=[-5 (1587113906355044352)]} 0 0
   [junit4]   2> 555502 INFO  (qtp66792484-4828) [    ] o.a.s.u.p.LogUpdateProcessorFactory [collection1_shard1_replica_n25]  webapp=/mf/fb path=/update params={update.distrib=FROMLEADER&distrib.from=http://127.0.0.1:36969/mf/fb/collection1_shard1_replica_n21/&wt=javabin&version=2}{add=[-5 (1587113906355044352)]} 0 1
   [junit4]   2> 555502 INFO  (qtp768950761-4762) [    ] o.a.s.u.p.LogUpdateProcessorFactory [collection1_shard1_replica_n21]  webapp=/mf/fb path=/update params={versions=true&wt=javabin&version=2}{add=[-5 (1587113906355044352)]} 0 3
   [junit4]   2> 555503 INFO  (qtp409518010-4794) [    ] o.a.s.u.p.LogUpdateProcessorFactory [collection1_shard1_replica_n23]  webapp=/mf/fb path=/update params={update.distrib=FROMLEADER&distrib.from=http://127.0.0.1:36969/mf/fb/collection1_shard1_replica_n21/&wt=javabin&version=2}{add=[-6 (1587113906358190080)]} 0 0
   [junit4]   2> 555503 INFO  (qtp66792484-4

[...truncated too long message...]

tp://127.0.0.1:36969/mf/fb/collection1
   [junit4]    > 	at __randomizedtesting.SeedInfo.seed([577EF3B94A888B30:DF2ACC63E474E6C8]:0)
   [junit4]    > 	at org.apache.solr.client.solrj.impl.HttpSolrClient.executeMethod(HttpSolrClient.java:654)
   [junit4]    > 	at org.apache.solr.client.solrj.impl.HttpSolrClient.request(HttpSolrClient.java:255)
   [junit4]    > 	at org.apache.solr.client.solrj.impl.HttpSolrClient.request(HttpSolrClient.java:244)
   [junit4]    > 	at org.apache.solr.client.solrj.impl.LBHttpSolrClient.doRequest(LBHttpSolrClient.java:483)
   [junit4]    > 	at org.apache.solr.client.solrj.impl.LBHttpSolrClient.request(LBHttpSolrClient.java:413)
   [junit4]    > 	at org.apache.solr.client.solrj.impl.CloudSolrClient.sendRequest(CloudSolrClient.java:1103)
   [junit4]    > 	at org.apache.solr.client.solrj.impl.CloudSolrClient.requestWithRetryOnStaleState(CloudSolrClient.java:883)
   [junit4]    > 	at org.apache.solr.client.solrj.impl.CloudSolrClient.request(CloudSolrClient.java:816)
   [junit4]    > 	at org.apache.solr.client.solrj.SolrRequest.process(SolrRequest.java:194)
   [junit4]    > 	at org.apache.solr.client.solrj.SolrClient.commit(SolrClient.java:484)
   [junit4]    > 	at org.apache.solr.client.solrj.SolrClient.commit(SolrClient.java:463)
   [junit4]    > 	at org.apache.solr.cloud.AbstractFullDistribZkTestBase.commit(AbstractFullDistribZkTestBase.java:1582)
   [junit4]    > 	at org.apache.solr.update.TestInPlaceUpdatesDistrib.docValuesUpdateTest(TestInPlaceUpdatesDistrib.java:349)
   [junit4]    > 	at org.apache.solr.update.TestInPlaceUpdatesDistrib.test(TestInPlaceUpdatesDistrib.java:142)
   [junit4]    > 	at java.base/jdk.internal.reflect.NativeMethodAccessorImpl.invoke0(Native Method)
   [junit4]    > 	at java.base/jdk.internal.reflect.NativeMethodAccessorImpl.invoke(NativeMethodAccessorImpl.java:62)
   [junit4]    > 	at java.base/jdk.internal.reflect.DelegatingMethodAccessorImpl.invoke(DelegatingMethodAccessorImpl.java:43)
   [junit4]    > 	at java.base/java.lang.reflect.Method.invoke(Method.java:564)
   [junit4]    > 	at org.apache.solr.BaseDistributedSearchTestCase$ShardsRepeatRule$ShardsFixedStatement.callStatement(BaseDistributedSearchTestCase.java:993)
   [junit4]    > 	at org.apache.solr.BaseDistributedSearchTestCase$ShardsRepeatRule$ShardsStatement.evaluate(BaseDistributedSearchTestCase.java:968)
   [junit4]    > 	at java.base/java.lang.Thread.run(Thread.java:844)
   [junit4]    > Caused by: java.net.SocketTimeoutException: Read timed out
   [junit4]    > 	at java.base/java.net.SocketInputStream.socketRead0(Native Method)
   [junit4]    > 	at java.base/java.net.SocketInputStream.socketRead(SocketInputStream.java:116)
   [junit4]    > 	at java.base/java.net.SocketInputStream.read(SocketInputStream.java:171)
   [junit4]    > 	at java.base/java.net.SocketInputStream.read(SocketInputStream.java:141)
   [junit4]    > 	at org.apache.http.impl.io.SessionInputBufferImpl.streamRead(SessionInputBufferImpl.java:137)
   [junit4]    > 	at org.apache.http.impl.io.SessionInputBufferImpl.fillBuffer(SessionInputBufferImpl.java:153)
   [junit4]    > 	at org.apache.http.impl.io.SessionInputBufferImpl.readLine(SessionInputBufferImpl.java:282)
   [junit4]    > 	at org.apache.http.impl.conn.DefaultHttpResponseParser.parseHead(DefaultHttpResponseParser.java:138)
   [junit4]    > 	at org.apache.http.impl.conn.DefaultHttpResponseParser.parseHead(DefaultHttpResponseParser.java:56)
   [junit4]    > 	at org.apache.http.impl.io.AbstractMessageParser.parse(AbstractMessageParser.java:259)
   [junit4]    > 	at org.apache.http.impl.DefaultBHttpClientConnection.receiveResponseHeader(DefaultBHttpClientConnection.java:163)
   [junit4]    > 	at org.apache.http.impl.conn.CPoolProxy.receiveResponseHeader(CPoolProxy.java:165)
   [junit4]    > 	at org.apache.http.protocol.HttpRequestExecutor.doReceiveResponse(HttpRequestExecutor.java:273)
   [junit4]    > 	at org.apache.http.protocol.HttpRequestExecutor.execute(HttpRequestExecutor.java:125)
   [junit4]    > 	at org.apache.http.impl.execchain.MainClientExec.execute(MainClientExec.java:272)
   [junit4]    > 	at org.apache.http.impl.execchain.ProtocolExec.execute(ProtocolExec.java:185)
   [junit4]    > 	at org.apache.http.impl.execchain.RetryExec.execute(RetryExec.java:89)
   [junit4]    > 	at org.apache.http.impl.execchain.RedirectExec.execute(RedirectExec.java:111)
   [junit4]    > 	at org.apache.http.impl.client.InternalHttpClient.doExecute(InternalHttpClient.java:185)
   [junit4]    > 	at org.apache.http.impl.client.CloseableHttpClient.execute(CloseableHttpClient.java:83)
   [junit4]    > 	at org.apache.http.impl.client.CloseableHttpClient.execute(CloseableHttpClient.java:56)
   [junit4]    > 	at org.apache.solr.client.solrj.impl.HttpSolrClient.executeMethod(HttpSolrClient.java:542)
   [junit4]    > 	... 53 more
   [junit4]   2> 1729381 INFO  (SUITE-TestInPlaceUpdatesDistrib-seed#[577EF3B94A888B30]-worker) [    ] o.a.s.SolrTestCaseJ4 ###deleteCore
   [junit4]   2> 1729381 INFO  (SUITE-TestInPlaceUpdatesDistrib-seed#[577EF3B94A888B30]-worker) [    ] o.a.s.c.CoreContainer Shutting down CoreContainer instance=470338556
   [junit4]   2> 1729381 INFO  (SUITE-TestInPlaceUpdatesDistrib-seed#[577EF3B94A888B30]-worker) [    ] o.a.s.m.SolrMetricManager Closing metric reporters for registry=solr.node, tag=null
   [junit4]   2> 1729381 INFO  (SUITE-TestInPlaceUpdatesDistrib-seed#[577EF3B94A888B30]-worker) [    ] o.a.s.m.r.SolrJmxReporter Closing reporter [org.apache.solr.metrics.reporters.SolrJmxReporter@69a0f00e: rootName = null, domain = solr.node, service url = null, agent id = null] for registry solr.node / com.codahale.metrics.MetricRegistry@279a585f
   [junit4]   2> 1729382 INFO  (SUITE-TestInPlaceUpdatesDistrib-seed#[577EF3B94A888B30]-worker) [    ] o.a.s.m.SolrMetricManager Closing metric reporters for registry=solr.jvm, tag=null
   [junit4]   2> 1729383 INFO  (SUITE-TestInPlaceUpdatesDistrib-seed#[577EF3B94A888B30]-worker) [    ] o.a.s.m.r.SolrJmxReporter Closing reporter [org.apache.solr.metrics.reporters.SolrJmxReporter@55525672: rootName = null, domain = solr.jvm, service url = null, agent id = null] for registry solr.jvm / com.codahale.metrics.MetricRegistry@7b217d6
   [junit4]   2> 1729779 INFO  (SUITE-TestInPlaceUpdatesDistrib-seed#[577EF3B94A888B30]-worker) [    ] o.a.s.m.SolrMetricManager Closing metric reporters for registry=solr.jetty, tag=null
   [junit4]   2> 1729780 INFO  (SUITE-TestInPlaceUpdatesDistrib-seed#[577EF3B94A888B30]-worker) [    ] o.a.s.m.r.SolrJmxReporter Closing reporter [org.apache.solr.metrics.reporters.SolrJmxReporter@2b209ed2: rootName = null, domain = solr.jetty, service url = null, agent id = null] for registry solr.jetty / com.codahale.metrics.MetricRegistry@33aabf0f
   [junit4]   2> 1729780 INFO  (coreCloseExecutor-2216-thread-1) [    ] o.a.s.c.SolrCore [collection1]  CLOSING SolrCore org.apache.solr.core.SolrCore@29c50622
   [junit4]   2> 1729780 INFO  (coreCloseExecutor-2216-thread-1) [    ] o.a.s.m.SolrMetricManager Closing metric reporters for registry=solr.core.collection1, tag=700778018
   [junit4]   2> 1729780 INFO  (coreCloseExecutor-2216-thread-1) [    ] o.a.s.m.r.SolrJmxReporter Closing reporter [org.apache.solr.metrics.reporters.SolrJmxReporter@3d3a8c5e: rootName = null, domain = solr.core.collection1, service url = null, agent id = null] for registry solr.core.collection1 / com.codahale.metrics.MetricRegistry@382056d8
   [junit4]   2> NOTE: leaving temporary files on disk at: /home/jenkins/workspace/Lucene-Solr-7.2-Linux/solr/build/solr-core/test/J2/temp/solr.update.TestInPlaceUpdatesDistrib_577EF3B94A888B30-001
   [junit4]   2> NOTE: test params are: codec=Asserting(Lucene70): {title_s=Lucene50(blocksize=128), id=PostingsFormat(name=LuceneFixedGap), id_field_copy_that_does_not_support_in_place_update_s=PostingsFormat(name=Memory)}, docValues:{inplace_updatable_float=DocValuesFormat(name=Memory), id_i=DocValuesFormat(name=Direct), _version_=DocValuesFormat(name=Lucene70), id=DocValuesFormat(name=Asserting), inplace_updatable_int_with_default=DocValuesFormat(name=Memory), inplace_updatable_float_with_default=DocValuesFormat(name=Direct)}, maxPointsInLeafNode=1599, maxMBSortInHeap=7.637186118406428, sim=RandomSimilarity(queryNorm=false): {}, locale=ms-SG, timezone=Arctic/Longyearbyen
   [junit4]   2> NOTE: Linux 4.10.0-40-generic amd64/Oracle Corporation 10-ea (64-bit)/cpus=8,threads=1,free=271684280,total=518979584
   [junit4]   2> NOTE: All tests run in this JVM: [TestShardHandlerFactory, CopyFieldTest, ReplicationFactorTest, TestSkipOverseerOperations, TestNoOpRegenerator, CloudMLTQParserTest, TestTrie, TestDynamicLoading, TestTrieFacet, TestSchemalessBufferedUpdates, TestAuthorizationFramework, TestReloadDeadlock, TestSolrFieldCacheBean, AsyncCallRequestStatusResponseTest, TestCloudPivotFacet, LeaderInitiatedRecoveryOnCommitTest, ResponseHeaderTest, TestQuerySenderListener, CSVRequestHandlerTest, MigrateRouteKeyTest, TestConfigOverlay, SolrMetricManagerTest, TestHashPartitioner, TestFieldSortValues, SmileWriterTest, TestValueSourceCache, TestSystemIdResolver, TestScoreJoinQPNoScore, TestCharFilters, TestFuzzyAnalyzedSuggestions, TestDistributedMissingSort, DistribJoinFromCollectionTest, TestHashQParserPlugin, TestExtendedDismaxParser, TestCloudSearcherWarming, CoreAdminHandlerTest, SystemInfoHandlerTest, HdfsCollectionsAPIDistributedZkTest, NodeMutatorTest, TestDistributedStatsComponentCardinality, TestCollectionAPIs, TestFiltering, LeaderElectionTest, TestTolerantSearch, SortSpecParsingTest, InfixSuggestersTest, TestInitParams, TimeZoneUtilsTest, TestLFUCache, TestPartialUpdateDeduplication, HdfsThreadLeakTest, SharedFSAutoReplicaFailoverTest, TestPullReplica, TestJsonFacetRefinement, AddBlockUpdateTest, DistributedDebugComponentTest, DistributedFacetPivotSmallTest, TestCoreDiscovery, TestInPlaceUpdatesDistrib]
   [junit4] Completed [452/751 (1!)] on J2 in 1183.79s, 1 test, 1 error <<< FAILURES!

[...truncated 41225 lines...]

Mime
View raw message