lucene-dev mailing list archives

Site index · List index
Message view « Date » · « Thread »
Top « Date » · « Thread »
From Policeman Jenkins Server <jenk...@thetaphi.de>
Subject [JENKINS] Lucene-Solr-master-MacOSX (64bit/jdk-9) - Build # 4346 - Still Unstable!
Date Wed, 27 Dec 2017 03:59:16 GMT
Build: https://jenkins.thetaphi.de/job/Lucene-Solr-master-MacOSX/4346/
Java: 64bit/jdk-9 -XX:+UseCompressedOops -XX:+UseConcMarkSweepGC

2 tests failed.
FAILED:  org.apache.solr.cloud.autoscaling.sim.TestComputePlanAction.testNodeWithMultipleReplicasLost

Error Message:


Stack Trace:
java.util.ConcurrentModificationException
	at __randomizedtesting.SeedInfo.seed([3AA8AC705E40E918:A684DF2D6320844]:0)
	at java.base/java.util.ArrayList$Itr.checkForComodification(ArrayList.java:937)
	at java.base/java.util.ArrayList$Itr.next(ArrayList.java:891)
	at org.apache.solr.cloud.autoscaling.sim.SimSolrCloudTestCase.tearDown(SimSolrCloudTestCase.java:141)
	at jdk.internal.reflect.GeneratedMethodAccessor6.invoke(Unknown Source)
	at java.base/jdk.internal.reflect.DelegatingMethodAccessorImpl.invoke(DelegatingMethodAccessorImpl.java:43)
	at java.base/java.lang.reflect.Method.invoke(Method.java:564)
	at com.carrotsearch.randomizedtesting.RandomizedRunner.invoke(RandomizedRunner.java:1737)
	at com.carrotsearch.randomizedtesting.RandomizedRunner$10.evaluate(RandomizedRunner.java:992)
	at com.carrotsearch.randomizedtesting.rules.SystemPropertiesRestoreRule$1.evaluate(SystemPropertiesRestoreRule.java:57)
	at org.apache.lucene.util.TestRuleSetupTeardownChained$1.evaluate(TestRuleSetupTeardownChained.java:49)
	at org.apache.lucene.util.AbstractBeforeAfterRule$1.evaluate(AbstractBeforeAfterRule.java:45)
	at org.apache.lucene.util.TestRuleThreadAndTestName$1.evaluate(TestRuleThreadAndTestName.java:48)
	at org.apache.lucene.util.TestRuleIgnoreAfterMaxFailures$1.evaluate(TestRuleIgnoreAfterMaxFailures.java:64)
	at org.apache.lucene.util.TestRuleMarkFailure$1.evaluate(TestRuleMarkFailure.java:47)
	at com.carrotsearch.randomizedtesting.rules.StatementAdapter.evaluate(StatementAdapter.java:36)
	at com.carrotsearch.randomizedtesting.ThreadLeakControl$StatementRunner.run(ThreadLeakControl.java:368)
	at com.carrotsearch.randomizedtesting.ThreadLeakControl.forkTimeoutingTask(ThreadLeakControl.java:817)
	at com.carrotsearch.randomizedtesting.ThreadLeakControl$3.evaluate(ThreadLeakControl.java:468)
	at com.carrotsearch.randomizedtesting.RandomizedRunner.runSingleTest(RandomizedRunner.java:943)
	at com.carrotsearch.randomizedtesting.RandomizedRunner$5.evaluate(RandomizedRunner.java:829)
	at com.carrotsearch.randomizedtesting.RandomizedRunner$6.evaluate(RandomizedRunner.java:879)
	at com.carrotsearch.randomizedtesting.RandomizedRunner$7.evaluate(RandomizedRunner.java:890)
	at com.carrotsearch.randomizedtesting.rules.StatementAdapter.evaluate(StatementAdapter.java:36)
	at com.carrotsearch.randomizedtesting.rules.SystemPropertiesRestoreRule$1.evaluate(SystemPropertiesRestoreRule.java:57)
	at org.apache.lucene.util.AbstractBeforeAfterRule$1.evaluate(AbstractBeforeAfterRule.java:45)
	at com.carrotsearch.randomizedtesting.rules.StatementAdapter.evaluate(StatementAdapter.java:36)
	at org.apache.lucene.util.TestRuleStoreClassName$1.evaluate(TestRuleStoreClassName.java:41)
	at com.carrotsearch.randomizedtesting.rules.NoShadowingOrOverridesOnMethodsRule$1.evaluate(NoShadowingOrOverridesOnMethodsRule.java:40)
	at com.carrotsearch.randomizedtesting.rules.NoShadowingOrOverridesOnMethodsRule$1.evaluate(NoShadowingOrOverridesOnMethodsRule.java:40)
	at com.carrotsearch.randomizedtesting.rules.StatementAdapter.evaluate(StatementAdapter.java:36)
	at com.carrotsearch.randomizedtesting.rules.StatementAdapter.evaluate(StatementAdapter.java:36)
	at org.apache.lucene.util.TestRuleAssertionsRequired$1.evaluate(TestRuleAssertionsRequired.java:53)
	at org.apache.lucene.util.TestRuleMarkFailure$1.evaluate(TestRuleMarkFailure.java:47)
	at org.apache.lucene.util.TestRuleIgnoreAfterMaxFailures$1.evaluate(TestRuleIgnoreAfterMaxFailures.java:64)
	at org.apache.lucene.util.TestRuleIgnoreTestSuites$1.evaluate(TestRuleIgnoreTestSuites.java:54)
	at com.carrotsearch.randomizedtesting.rules.StatementAdapter.evaluate(StatementAdapter.java:36)
	at com.carrotsearch.randomizedtesting.ThreadLeakControl$StatementRunner.run(ThreadLeakControl.java:368)
	at java.base/java.lang.Thread.run(Thread.java:844)


FAILED:  org.apache.solr.cloud.autoscaling.sim.TestLargeCluster.testAddNode

Error Message:
did not finish processing changes

Stack Trace:
java.lang.AssertionError: did not finish processing changes
	at __randomizedtesting.SeedInfo.seed([3AA8AC705E40E918:9D47B1D3910D6600]:0)
	at org.junit.Assert.fail(Assert.java:93)
	at org.junit.Assert.assertTrue(Assert.java:43)
	at org.apache.solr.cloud.autoscaling.sim.TestLargeCluster.testAddNode(TestLargeCluster.java:297)
	at java.base/jdk.internal.reflect.NativeMethodAccessorImpl.invoke0(Native Method)
	at java.base/jdk.internal.reflect.NativeMethodAccessorImpl.invoke(NativeMethodAccessorImpl.java:62)
	at java.base/jdk.internal.reflect.DelegatingMethodAccessorImpl.invoke(DelegatingMethodAccessorImpl.java:43)
	at java.base/java.lang.reflect.Method.invoke(Method.java:564)
	at com.carrotsearch.randomizedtesting.RandomizedRunner.invoke(RandomizedRunner.java:1737)
	at com.carrotsearch.randomizedtesting.RandomizedRunner$8.evaluate(RandomizedRunner.java:934)
	at com.carrotsearch.randomizedtesting.RandomizedRunner$9.evaluate(RandomizedRunner.java:970)
	at com.carrotsearch.randomizedtesting.RandomizedRunner$10.evaluate(RandomizedRunner.java:984)
	at com.carrotsearch.randomizedtesting.rules.SystemPropertiesRestoreRule$1.evaluate(SystemPropertiesRestoreRule.java:57)
	at org.apache.lucene.util.TestRuleSetupTeardownChained$1.evaluate(TestRuleSetupTeardownChained.java:49)
	at org.apache.lucene.util.AbstractBeforeAfterRule$1.evaluate(AbstractBeforeAfterRule.java:45)
	at org.apache.lucene.util.TestRuleThreadAndTestName$1.evaluate(TestRuleThreadAndTestName.java:48)
	at org.apache.lucene.util.TestRuleIgnoreAfterMaxFailures$1.evaluate(TestRuleIgnoreAfterMaxFailures.java:64)
	at org.apache.lucene.util.TestRuleMarkFailure$1.evaluate(TestRuleMarkFailure.java:47)
	at com.carrotsearch.randomizedtesting.rules.StatementAdapter.evaluate(StatementAdapter.java:36)
	at com.carrotsearch.randomizedtesting.ThreadLeakControl$StatementRunner.run(ThreadLeakControl.java:368)
	at com.carrotsearch.randomizedtesting.ThreadLeakControl.forkTimeoutingTask(ThreadLeakControl.java:817)
	at com.carrotsearch.randomizedtesting.ThreadLeakControl$3.evaluate(ThreadLeakControl.java:468)
	at com.carrotsearch.randomizedtesting.RandomizedRunner.runSingleTest(RandomizedRunner.java:943)
	at com.carrotsearch.randomizedtesting.RandomizedRunner$5.evaluate(RandomizedRunner.java:829)
	at com.carrotsearch.randomizedtesting.RandomizedRunner$6.evaluate(RandomizedRunner.java:879)
	at com.carrotsearch.randomizedtesting.RandomizedRunner$7.evaluate(RandomizedRunner.java:890)
	at com.carrotsearch.randomizedtesting.rules.StatementAdapter.evaluate(StatementAdapter.java:36)
	at com.carrotsearch.randomizedtesting.rules.SystemPropertiesRestoreRule$1.evaluate(SystemPropertiesRestoreRule.java:57)
	at org.apache.lucene.util.AbstractBeforeAfterRule$1.evaluate(AbstractBeforeAfterRule.java:45)
	at com.carrotsearch.randomizedtesting.rules.StatementAdapter.evaluate(StatementAdapter.java:36)
	at org.apache.lucene.util.TestRuleStoreClassName$1.evaluate(TestRuleStoreClassName.java:41)
	at com.carrotsearch.randomizedtesting.rules.NoShadowingOrOverridesOnMethodsRule$1.evaluate(NoShadowingOrOverridesOnMethodsRule.java:40)
	at com.carrotsearch.randomizedtesting.rules.NoShadowingOrOverridesOnMethodsRule$1.evaluate(NoShadowingOrOverridesOnMethodsRule.java:40)
	at com.carrotsearch.randomizedtesting.rules.StatementAdapter.evaluate(StatementAdapter.java:36)
	at com.carrotsearch.randomizedtesting.rules.StatementAdapter.evaluate(StatementAdapter.java:36)
	at org.apache.lucene.util.TestRuleAssertionsRequired$1.evaluate(TestRuleAssertionsRequired.java:53)
	at org.apache.lucene.util.TestRuleMarkFailure$1.evaluate(TestRuleMarkFailure.java:47)
	at org.apache.lucene.util.TestRuleIgnoreAfterMaxFailures$1.evaluate(TestRuleIgnoreAfterMaxFailures.java:64)
	at org.apache.lucene.util.TestRuleIgnoreTestSuites$1.evaluate(TestRuleIgnoreTestSuites.java:54)
	at com.carrotsearch.randomizedtesting.rules.StatementAdapter.evaluate(StatementAdapter.java:36)
	at com.carrotsearch.randomizedtesting.ThreadLeakControl$StatementRunner.run(ThreadLeakControl.java:368)
	at java.base/java.lang.Thread.run(Thread.java:844)




Build Log:
[...truncated 1797 lines...]
   [junit4] JVM J0: stderr was not empty, see: /Users/jenkins/workspace/Lucene-Solr-master-MacOSX/lucene/build/core/test/temp/junit4-J0-20171227_022817_0108517838374713095379.syserr
   [junit4] >>> JVM J0 emitted unexpected output (verbatim) ----
   [junit4] Java HotSpot(TM) 64-Bit Server VM warning: Option UseConcMarkSweepGC was deprecated in version 9.0 and will likely be removed in a future release.
   [junit4] <<< JVM J0: EOF ----

[...truncated 3 lines...]
   [junit4] JVM J1: stderr was not empty, see: /Users/jenkins/workspace/Lucene-Solr-master-MacOSX/lucene/build/core/test/temp/junit4-J1-20171227_022817_01014420756444457404916.syserr
   [junit4] >>> JVM J1 emitted unexpected output (verbatim) ----
   [junit4] Java HotSpot(TM) 64-Bit Server VM warning: Option UseConcMarkSweepGC was deprecated in version 9.0 and will likely be removed in a future release.
   [junit4] <<< JVM J1: EOF ----

[...truncated 288 lines...]
   [junit4] JVM J0: stderr was not empty, see: /Users/jenkins/workspace/Lucene-Solr-master-MacOSX/lucene/build/test-framework/test/temp/junit4-J0-20171227_023611_94011376994359658493746.syserr
   [junit4] >>> JVM J0 emitted unexpected output (verbatim) ----
   [junit4] Java HotSpot(TM) 64-Bit Server VM warning: Option UseConcMarkSweepGC was deprecated in version 9.0 and will likely be removed in a future release.
   [junit4] <<< JVM J0: EOF ----

[...truncated 3 lines...]
   [junit4] JVM J1: stderr was not empty, see: /Users/jenkins/workspace/Lucene-Solr-master-MacOSX/lucene/build/test-framework/test/temp/junit4-J1-20171227_023611_94014593593080414411409.syserr
   [junit4] >>> JVM J1 emitted unexpected output (verbatim) ----
   [junit4] Java HotSpot(TM) 64-Bit Server VM warning: Option UseConcMarkSweepGC was deprecated in version 9.0 and will likely be removed in a future release.
   [junit4] <<< JVM J1: EOF ----

[...truncated 1058 lines...]
   [junit4] JVM J0: stderr was not empty, see: /Users/jenkins/workspace/Lucene-Solr-master-MacOSX/lucene/build/analysis/common/test/temp/junit4-J0-20171227_023734_6001931892100350417705.syserr
   [junit4] >>> JVM J0 emitted unexpected output (verbatim) ----
   [junit4] Java HotSpot(TM) 64-Bit Server VM warning: Option UseConcMarkSweepGC was deprecated in version 9.0 and will likely be removed in a future release.
   [junit4] <<< JVM J0: EOF ----

[...truncated 3 lines...]
   [junit4] JVM J1: stderr was not empty, see: /Users/jenkins/workspace/Lucene-Solr-master-MacOSX/lucene/build/analysis/common/test/temp/junit4-J1-20171227_023734_6004703697122910411474.syserr
   [junit4] >>> JVM J1 emitted unexpected output (verbatim) ----
   [junit4] Java HotSpot(TM) 64-Bit Server VM warning: Option UseConcMarkSweepGC was deprecated in version 9.0 and will likely be removed in a future release.
   [junit4] <<< JVM J1: EOF ----

[...truncated 224 lines...]
   [junit4] JVM J1: stderr was not empty, see: /Users/jenkins/workspace/Lucene-Solr-master-MacOSX/lucene/build/analysis/icu/test/temp/junit4-J1-20171227_024042_8441797865389935659011.syserr
   [junit4] >>> JVM J1 emitted unexpected output (verbatim) ----
   [junit4] Java HotSpot(TM) 64-Bit Server VM warning: Option UseConcMarkSweepGC was deprecated in version 9.0 and will likely be removed in a future release.
   [junit4] <<< JVM J1: EOF ----

[...truncated 5 lines...]
   [junit4] JVM J0: stderr was not empty, see: /Users/jenkins/workspace/Lucene-Solr-master-MacOSX/lucene/build/analysis/icu/test/temp/junit4-J0-20171227_024042_84412868102637418112798.syserr
   [junit4] >>> JVM J0 emitted unexpected output (verbatim) ----
   [junit4] Java HotSpot(TM) 64-Bit Server VM warning: Option UseConcMarkSweepGC was deprecated in version 9.0 and will likely be removed in a future release.
   [junit4] <<< JVM J0: EOF ----

[...truncated 246 lines...]
   [junit4] JVM J0: stderr was not empty, see: /Users/jenkins/workspace/Lucene-Solr-master-MacOSX/lucene/build/analysis/kuromoji/test/temp/junit4-J0-20171227_024101_1616086982827155634372.syserr
   [junit4] >>> JVM J0 emitted unexpected output (verbatim) ----
   [junit4] Java HotSpot(TM) 64-Bit Server VM warning: Option UseConcMarkSweepGC was deprecated in version 9.0 and will likely be removed in a future release.
   [junit4] <<< JVM J0: EOF ----

[...truncated 6 lines...]
   [junit4] JVM J1: stderr was not empty, see: /Users/jenkins/workspace/Lucene-Solr-master-MacOSX/lucene/build/analysis/kuromoji/test/temp/junit4-J1-20171227_024101_1806407628820751803851.syserr
   [junit4] >>> JVM J1 emitted unexpected output (verbatim) ----
   [junit4] Java HotSpot(TM) 64-Bit Server VM warning: Option UseConcMarkSweepGC was deprecated in version 9.0 and will likely be removed in a future release.
   [junit4] <<< JVM J1: EOF ----

[...truncated 154 lines...]
   [junit4] JVM J1: stderr was not empty, see: /Users/jenkins/workspace/Lucene-Solr-master-MacOSX/lucene/build/analysis/morfologik/test/temp/junit4-J1-20171227_024136_40612248856193946343740.syserr
   [junit4] >>> JVM J1 emitted unexpected output (verbatim) ----
   [junit4] Java HotSpot(TM) 64-Bit Server VM warning: Option UseConcMarkSweepGC was deprecated in version 9.0 and will likely be removed in a future release.
   [junit4] <<< JVM J1: EOF ----

[...truncated 3 lines...]
   [junit4] JVM J0: stderr was not empty, see: /Users/jenkins/workspace/Lucene-Solr-master-MacOSX/lucene/build/analysis/morfologik/test/temp/junit4-J0-20171227_024136_40518079541832961554124.syserr
   [junit4] >>> JVM J0 emitted unexpected output (verbatim) ----
   [junit4] Java HotSpot(TM) 64-Bit Server VM warning: Option UseConcMarkSweepGC was deprecated in version 9.0 and will likely be removed in a future release.
   [junit4] <<< JVM J0: EOF ----

[...truncated 161 lines...]
   [junit4] JVM J1: stderr was not empty, see: /Users/jenkins/workspace/Lucene-Solr-master-MacOSX/lucene/build/analysis/opennlp/test/temp/junit4-J1-20171227_024143_9054632585196656171235.syserr
   [junit4] >>> JVM J1 emitted unexpected output (verbatim) ----
   [junit4] Java HotSpot(TM) 64-Bit Server VM warning: Option UseConcMarkSweepGC was deprecated in version 9.0 and will likely be removed in a future release.
   [junit4] <<< JVM J1: EOF ----

   [junit4] JVM J0: stderr was not empty, see: /Users/jenkins/workspace/Lucene-Solr-master-MacOSX/lucene/build/analysis/opennlp/test/temp/junit4-J0-20171227_024143_9037446449557254729238.syserr
   [junit4] >>> JVM J0 emitted unexpected output (verbatim) ----
   [junit4] Java HotSpot(TM) 64-Bit Server VM warning: Option UseConcMarkSweepGC was deprecated in version 9.0 and will likely be removed in a future release.
   [junit4] <<< JVM J0: EOF ----

[...truncated 168 lines...]
   [junit4] JVM J1: stderr was not empty, see: /Users/jenkins/workspace/Lucene-Solr-master-MacOSX/lucene/build/analysis/phonetic/test/temp/junit4-J1-20171227_024150_6445950193785844939450.syserr
   [junit4] >>> JVM J1 emitted unexpected output (verbatim) ----
   [junit4] Java HotSpot(TM) 64-Bit Server VM warning: Option UseConcMarkSweepGC was deprecated in version 9.0 and will likely be removed in a future release.
   [junit4] <<< JVM J1: EOF ----

[...truncated 3 lines...]
   [junit4] JVM J0: stderr was not empty, see: /Users/jenkins/workspace/Lucene-Solr-master-MacOSX/lucene/build/analysis/phonetic/test/temp/junit4-J0-20171227_024150_6448576703469273436719.syserr
   [junit4] >>> JVM J0 emitted unexpected output (verbatim) ----
   [junit4] Java HotSpot(TM) 64-Bit Server VM warning: Option UseConcMarkSweepGC was deprecated in version 9.0 and will likely be removed in a future release.
   [junit4] <<< JVM J0: EOF ----

[...truncated 151 lines...]
   [junit4] JVM J0: stderr was not empty, see: /Users/jenkins/workspace/Lucene-Solr-master-MacOSX/lucene/build/analysis/smartcn/test/temp/junit4-J0-20171227_024203_945456967544690409403.syserr
   [junit4] >>> JVM J0 emitted unexpected output (verbatim) ----
   [junit4] Java HotSpot(TM) 64-Bit Server VM warning: Option UseConcMarkSweepGC was deprecated in version 9.0 and will likely be removed in a future release.
   [junit4] <<< JVM J0: EOF ----

[...truncated 3 lines...]
   [junit4] JVM J1: stderr was not empty, see: /Users/jenkins/workspace/Lucene-Solr-master-MacOSX/lucene/build/analysis/smartcn/test/temp/junit4-J1-20171227_024203_94511446239292145010209.syserr
   [junit4] >>> JVM J1 emitted unexpected output (verbatim) ----
   [junit4] Java HotSpot(TM) 64-Bit Server VM warning: Option UseConcMarkSweepGC was deprecated in version 9.0 and will likely be removed in a future release.
   [junit4] <<< JVM J1: EOF ----

[...truncated 156 lines...]
   [junit4] JVM J1: stderr was not empty, see: /Users/jenkins/workspace/Lucene-Solr-master-MacOSX/lucene/build/analysis/stempel/test/temp/junit4-J1-20171227_024217_61816718576076532853508.syserr
   [junit4] >>> JVM J1 emitted unexpected output (verbatim) ----
   [junit4] Java HotSpot(TM) 64-Bit Server VM warning: Option UseConcMarkSweepGC was deprecated in version 9.0 and will likely be removed in a future release.
   [junit4] <<< JVM J1: EOF ----

[...truncated 3 lines...]
   [junit4] JVM J0: stderr was not empty, see: /Users/jenkins/workspace/Lucene-Solr-master-MacOSX/lucene/build/analysis/stempel/test/temp/junit4-J0-20171227_024217_6184180725138427151569.syserr
   [junit4] >>> JVM J0 emitted unexpected output (verbatim) ----
   [junit4] Java HotSpot(TM) 64-Bit Server VM warning: Option UseConcMarkSweepGC was deprecated in version 9.0 and will likely be removed in a future release.
   [junit4] <<< JVM J0: EOF ----

[...truncated 167 lines...]
   [junit4] JVM J0: stderr was not empty, see: /Users/jenkins/workspace/Lucene-Solr-master-MacOSX/lucene/build/analysis/uima/test/temp/junit4-J0-20171227_024222_3285795318454394805965.syserr
   [junit4] >>> JVM J0 emitted unexpected output (verbatim) ----
   [junit4] Java HotSpot(TM) 64-Bit Server VM warning: Option UseConcMarkSweepGC was deprecated in version 9.0 and will likely be removed in a future release.
   [junit4] <<< JVM J0: EOF ----

[...truncated 152 lines...]
   [junit4] JVM J1: stderr was not empty, see: /Users/jenkins/workspace/Lucene-Solr-master-MacOSX/lucene/build/backward-codecs/test/temp/junit4-J1-20171227_024243_2737103739064957481165.syserr
   [junit4] >>> JVM J1 emitted unexpected output (verbatim) ----
   [junit4] Java HotSpot(TM) 64-Bit Server VM warning: Option UseConcMarkSweepGC was deprecated in version 9.0 and will likely be removed in a future release.
   [junit4] <<< JVM J1: EOF ----

[...truncated 19 lines...]
   [junit4] JVM J0: stderr was not empty, see: /Users/jenkins/workspace/Lucene-Solr-master-MacOSX/lucene/build/backward-codecs/test/temp/junit4-J0-20171227_024243_2676132667283246208091.syserr
   [junit4] >>> JVM J0 emitted unexpected output (verbatim) ----
   [junit4] Java HotSpot(TM) 64-Bit Server VM warning: Option UseConcMarkSweepGC was deprecated in version 9.0 and will likely be removed in a future release.
   [junit4] <<< JVM J0: EOF ----

[...truncated 1304 lines...]
   [junit4] JVM J1: stderr was not empty, see: /Users/jenkins/workspace/Lucene-Solr-master-MacOSX/lucene/build/benchmark/test/temp/junit4-J1-20171227_024317_3288211842258166519114.syserr
   [junit4] >>> JVM J1 emitted unexpected output (verbatim) ----
   [junit4] Java HotSpot(TM) 64-Bit Server VM warning: Option UseConcMarkSweepGC was deprecated in version 9.0 and will likely be removed in a future release.
   [junit4] <<< JVM J1: EOF ----

   [junit4] JVM J0: stderr was not empty, see: /Users/jenkins/workspace/Lucene-Solr-master-MacOSX/lucene/build/benchmark/test/temp/junit4-J0-20171227_024317_32814888003057053846081.syserr
   [junit4] >>> JVM J0 emitted unexpected output (verbatim) ----
   [junit4] Java HotSpot(TM) 64-Bit Server VM warning: Option UseConcMarkSweepGC was deprecated in version 9.0 and will likely be removed in a future release.
   [junit4] <<< JVM J0: EOF ----

[...truncated 234 lines...]
   [junit4] JVM J1: stderr was not empty, see: /Users/jenkins/workspace/Lucene-Solr-master-MacOSX/lucene/build/classification/test/temp/junit4-J1-20171227_024329_34816019847728882090043.syserr
   [junit4] >>> JVM J1 emitted unexpected output (verbatim) ----
   [junit4] Java HotSpot(TM) 64-Bit Server VM warning: Option UseConcMarkSweepGC was deprecated in version 9.0 and will likely be removed in a future release.
   [junit4] <<< JVM J1: EOF ----

   [junit4] JVM J0: stderr was not empty, see: /Users/jenkins/workspace/Lucene-Solr-master-MacOSX/lucene/build/classification/test/temp/junit4-J0-20171227_024329_34818415582396938896910.syserr
   [junit4] >>> JVM J0 emitted unexpected output (verbatim) ----
   [junit4] Java HotSpot(TM) 64-Bit Server VM warning: Option UseConcMarkSweepGC was deprecated in version 9.0 and will likely be removed in a future release.
   [junit4] <<< JVM J0: EOF ----

[...truncated 257 lines...]
   [junit4] JVM J0: stderr was not empty, see: /Users/jenkins/workspace/Lucene-Solr-master-MacOSX/lucene/build/codecs/test/temp/junit4-J0-20171227_024352_5668748803921092098604.syserr
   [junit4] >>> JVM J0 emitted unexpected output (verbatim) ----
   [junit4] Java HotSpot(TM) 64-Bit Server VM warning: Option UseConcMarkSweepGC was deprecated in version 9.0 and will likely be removed in a future release.
   [junit4] <<< JVM J0: EOF ----

[...truncated 5 lines...]
   [junit4] JVM J1: stderr was not empty, see: /Users/jenkins/workspace/Lucene-Solr-master-MacOSX/lucene/build/codecs/test/temp/junit4-J1-20171227_024352_5669486285674764902459.syserr
   [junit4] >>> JVM J1 emitted unexpected output (verbatim) ----
   [junit4] Java HotSpot(TM) 64-Bit Server VM warning: Option UseConcMarkSweepGC was deprecated in version 9.0 and will likely be removed in a future release.
   [junit4] <<< JVM J1: EOF ----

[...truncated 209 lines...]
   [junit4] JVM J1: stderr was not empty, see: /Users/jenkins/workspace/Lucene-Solr-master-MacOSX/lucene/build/demo/test/temp/junit4-J1-20171227_024545_1767872085630100548446.syserr
   [junit4] >>> JVM J1 emitted unexpected output (verbatim) ----
   [junit4] Java HotSpot(TM) 64-Bit Server VM warning: Option UseConcMarkSweepGC was deprecated in version 9.0 and will likely be removed in a future release.
   [junit4] <<< JVM J1: EOF ----

[...truncated 3 lines...]
   [junit4] JVM J0: stderr was not empty, see: /Users/jenkins/workspace/Lucene-Solr-master-MacOSX/lucene/build/demo/test/temp/junit4-J0-20171227_024545_17516469074019888492350.syserr
   [junit4] >>> JVM J0 emitted unexpected output (verbatim) ----
   [junit4] Java HotSpot(TM) 64-Bit Server VM warning: Option UseConcMarkSweepGC was deprecated in version 9.0 and will likely be removed in a future release.
   [junit4] <<< JVM J0: EOF ----

[...truncated 164 lines...]
   [junit4] JVM J0: stderr was not empty, see: /Users/jenkins/workspace/Lucene-Solr-master-MacOSX/lucene/build/expressions/test/temp/junit4-J0-20171227_024550_18314366631844178342460.syserr
   [junit4] >>> JVM J0 emitted unexpected output (verbatim) ----
   [junit4] Java HotSpot(TM) 64-Bit Server VM warning: Option UseConcMarkSweepGC was deprecated in version 9.0 and will likely be removed in a future release.
   [junit4] <<< JVM J0: EOF ----

[...truncated 9 lines...]
   [junit4] JVM J1: stderr was not empty, see: /Users/jenkins/workspace/Lucene-Solr-master-MacOSX/lucene/build/expressions/test/temp/junit4-J1-20171227_024550_1842708797214116669755.syserr
   [junit4] >>> JVM J1 emitted unexpected output (verbatim) ----
   [junit4] Java HotSpot(TM) 64-Bit Server VM warning: Option UseConcMarkSweepGC was deprecated in version 9.0 and will likely be removed in a future release.
   [junit4] <<< JVM J1: EOF ----

[...truncated 226 lines...]
   [junit4] JVM J1: stderr was not empty, see: /Users/jenkins/workspace/Lucene-Solr-master-MacOSX/lucene/build/facet/test/temp/junit4-J1-20171227_024603_068158534026850982777.syserr
   [junit4] >>> JVM J1 emitted unexpected output (verbatim) ----
   [junit4] Java HotSpot(TM) 64-Bit Server VM warning: Option UseConcMarkSweepGC was deprecated in version 9.0 and will likely be removed in a future release.
   [junit4] <<< JVM J1: EOF ----

[...truncated 3 lines...]
   [junit4] JVM J0: stderr was not empty, see: /Users/jenkins/workspace/Lucene-Solr-master-MacOSX/lucene/build/facet/test/temp/junit4-J0-20171227_024603_0342504609058730033193.syserr
   [junit4] >>> JVM J0 emitted unexpected output (verbatim) ----
   [junit4] Java HotSpot(TM) 64-Bit Server VM warning: Option UseConcMarkSweepGC was deprecated in version 9.0 and will likely be removed in a future release.
   [junit4] <<< JVM J0: EOF ----

[...truncated 179 lines...]
   [junit4] JVM J0: stderr was not empty, see: /Users/jenkins/workspace/Lucene-Solr-master-MacOSX/lucene/build/grouping/test/temp/junit4-J0-20171227_024654_8963181778966672910100.syserr
   [junit4] >>> JVM J0 emitted unexpected output (verbatim) ----
   [junit4] Java HotSpot(TM) 64-Bit Server VM warning: Option UseConcMarkSweepGC was deprecated in version 9.0 and will likely be removed in a future release.
   [junit4] <<< JVM J0: EOF ----

[...truncated 3 lines...]
   [junit4] JVM J1: stderr was not empty, see: /Users/jenkins/workspace/Lucene-Solr-master-MacOSX/lucene/build/grouping/test/temp/junit4-J1-20171227_024654_89615372679892214280549.syserr
   [junit4] >>> JVM J1 emitted unexpected output (verbatim) ----
   [junit4] Java HotSpot(TM) 64-Bit Server VM warning: Option UseConcMarkSweepGC was deprecated in version 9.0 and will likely be removed in a future release.
   [junit4] <<< JVM J1: EOF ----

[...truncated 243 lines...]
   [junit4] JVM J1: stderr was not empty, see: /Users/jenkins/workspace/Lucene-Solr-master-MacOSX/lucene/build/highlighter/test/temp/junit4-J1-20171227_024708_39010513593056205048756.syserr
   [junit4] >>> JVM J1 emitted unexpected output (verbatim) ----
   [junit4] Java HotSpot(TM) 64-Bit Server VM warning: Option UseConcMarkSweepGC was deprecated in version 9.0 and will likely be removed in a future release.
   [junit4] <<< JVM J1: EOF ----

[...truncated 3 lines...]
   [junit4] JVM J0: stderr was not empty, see: /Users/jenkins/workspace/Lucene-Solr-master-MacOSX/lucene/build/highlighter/test/temp/junit4-J0-20171227_024708_3858456369120351578221.syserr
   [junit4] >>> JVM J0 emitted unexpected output (verbatim) ----
   [junit4] Java HotSpot(TM) 64-Bit Server VM warning: Option UseConcMarkSweepGC was deprecated in version 9.0 and will likely be removed in a future release.
   [junit4] <<< JVM J0: EOF ----

[...truncated 163 lines...]
   [junit4] JVM J1: stderr was not empty, see: /Users/jenkins/workspace/Lucene-Solr-master-MacOSX/lucene/build/join/test/temp/junit4-J1-20171227_024731_31918252707379686072253.syserr
   [junit4] >>> JVM J1 emitted unexpected output (verbatim) ----
   [junit4] Java HotSpot(TM) 64-Bit Server VM warning: Option UseConcMarkSweepGC was deprecated in version 9.0 and will likely be removed in a future release.
   [junit4] <<< JVM J1: EOF ----

[...truncated 3 lines...]
   [junit4] JVM J0: stderr was not empty, see: /Users/jenkins/workspace/Lucene-Solr-master-MacOSX/lucene/build/join/test/temp/junit4-J0-20171227_024731_318987013819190058048.syserr
   [junit4] >>> JVM J0 emitted unexpected output (verbatim) ----
   [junit4] Java HotSpot(TM) 64-Bit Server VM warning: Option UseConcMarkSweepGC was deprecated in version 9.0 and will likely be removed in a future release.
   [junit4] <<< JVM J0: EOF ----

[...truncated 147 lines...]
   [junit4] JVM J0: stderr was not empty, see: /Users/jenkins/workspace/Lucene-Solr-master-MacOSX/lucene/build/memory/test/temp/junit4-J0-20171227_024755_1348717226559563617010.syserr
   [junit4] >>> JVM J0 emitted unexpected output (verbatim) ----
   [junit4] Java HotSpot(TM) 64-Bit Server VM warning: Option UseConcMarkSweepGC was deprecated in version 9.0 and will likely be removed in a future release.
   [junit4] <<< JVM J0: EOF ----

[...truncated 3 lines...]
   [junit4] JVM J1: stderr was not empty, see: /Users/jenkins/workspace/Lucene-Solr-master-MacOSX/lucene/build/memory/test/temp/junit4-J1-20171227_024755_13712341197708182670449.syserr
   [junit4] >>> JVM J1 emitted unexpected output (verbatim) ----
   [junit4] Java HotSpot(TM) 64-Bit Server VM warning: Option UseConcMarkSweepGC was deprecated in version 9.0 and will likely be removed in a future release.
   [junit4] <<< JVM J1: EOF ----

[...truncated 182 lines...]
   [junit4] JVM J0: stderr was not empty, see: /Users/jenkins/workspace/Lucene-Solr-master-MacOSX/lucene/build/misc/test/temp/junit4-J0-20171227_024803_52614151845383789863416.syserr
   [junit4] >>> JVM J0 emitted unexpected output (verbatim) ----
   [junit4] Java HotSpot(TM) 64-Bit Server VM warning: Option UseConcMarkSweepGC was deprecated in version 9.0 and will likely be removed in a future release.
   [junit4] <<< JVM J0: EOF ----

[...truncated 3 lines...]
   [junit4] JVM J1: stderr was not empty, see: /Users/jenkins/workspace/Lucene-Solr-master-MacOSX/lucene/build/misc/test/temp/junit4-J1-20171227_024803_52615167319650603876456.syserr
   [junit4] >>> JVM J1 emitted unexpected output (verbatim) ----
   [junit4] Java HotSpot(TM) 64-Bit Server VM warning: Option UseConcMarkSweepGC was deprecated in version 9.0 and will likely be removed in a future release.
   [junit4] <<< JVM J1: EOF ----

[...truncated 295 lines...]
   [junit4] JVM J1: stderr was not empty, see: /Users/jenkins/workspace/Lucene-Solr-master-MacOSX/lucene/build/queries/test/temp/junit4-J1-20171227_024818_1933774243619354093886.syserr
   [junit4] >>> JVM J1 emitted unexpected output (verbatim) ----
   [junit4] Java HotSpot(TM) 64-Bit Server VM warning: Option UseConcMarkSweepGC was deprecated in version 9.0 and will likely be removed in a future release.
   [junit4] <<< JVM J1: EOF ----

[...truncated 3 lines...]
   [junit4] JVM J0: stderr was not empty, see: /Users/jenkins/workspace/Lucene-Solr-master-MacOSX/lucene/build/queries/test/temp/junit4-J0-20171227_024818_193534019007740794873.syserr
   [junit4] >>> JVM J0 emitted unexpected output (verbatim) ----
   [junit4] Java HotSpot(TM) 64-Bit Server VM warning: Option UseConcMarkSweepGC was deprecated in version 9.0 and will likely be removed in a future release.
   [junit4] <<< JVM J0: EOF ----

[...truncated 224 lines...]
   [junit4] JVM J0: stderr was not empty, see: /Users/jenkins/workspace/Lucene-Solr-master-MacOSX/lucene/build/queryparser/test/temp/junit4-J0-20171227_024826_98514931847829173318321.syserr
   [junit4] >>> JVM J0 emitted unexpected output (verbatim) ----
   [junit4] Java HotSpot(TM) 64-Bit Server VM warning: Option UseConcMarkSweepGC was deprecated in version 9.0 and will likely be removed in a future release.
   [junit4] <<< JVM J0: EOF ----

[...truncated 3 lines...]
   [junit4] JVM J1: stderr was not empty, see: /Users/jenkins/workspace/Lucene-Solr-master-MacOSX/lucene/build/queryparser/test/temp/junit4-J1-20171227_024826_9859894952303179016571.syserr
   [junit4] >>> JVM J1 emitted unexpected output (verbatim) ----
   [junit4] Java HotSpot(TM) 64-Bit Server VM warning: Option UseConcMarkSweepGC was deprecated in version 9.0 and will likely be removed in a future release.
   [junit4] <<< JVM J1: EOF ----

[...truncated 207 lines...]
   [junit4] JVM J0: stderr was not empty, see: /Users/jenkins/workspace/Lucene-Solr-master-MacOSX/lucene/build/replicator/test/temp/junit4-J0-20171227_024839_2817289076368809520382.syserr
   [junit4] >>> JVM J0 emitted unexpected output (verbatim) ----
   [junit4] Java HotSpot(TM) 64-Bit Server VM warning: Option UseConcMarkSweepGC was deprecated in version 9.0 and will likely be removed in a future release.
   [junit4] <<< JVM J0: EOF ----

[...truncated 3 lines...]
   [junit4] JVM J1: stderr was not empty, see: /Users/jenkins/workspace/Lucene-Solr-master-MacOSX/lucene/build/replicator/test/temp/junit4-J1-20171227_024839_2822349192784978493328.syserr
   [junit4] >>> JVM J1 emitted unexpected output (verbatim) ----
   [junit4] Java HotSpot(TM) 64-Bit Server VM warning: Option UseConcMarkSweepGC was deprecated in version 9.0 and will likely be removed in a future release.
   [junit4] <<< JVM J1: EOF ----

[...truncated 216 lines...]
   [junit4] JVM J1: stderr was not empty, see: /Users/jenkins/workspace/Lucene-Solr-master-MacOSX/lucene/build/sandbox/test/temp/junit4-J1-20171227_024856_163485581238625070645.syserr
   [junit4] >>> JVM J1 emitted unexpected output (verbatim) ----
   [junit4] Java HotSpot(TM) 64-Bit Server VM warning: Option UseConcMarkSweepGC was deprecated in version 9.0 and will likely be removed in a future release.
   [junit4] <<< JVM J1: EOF ----

[...truncated 7 lines...]
   [junit4] JVM J0: stderr was not empty, see: /Users/jenkins/workspace/Lucene-Solr-master-MacOSX/lucene/build/sandbox/test/temp/junit4-J0-20171227_024856_16116650661700100984050.syserr
   [junit4] >>> JVM J0 emitted unexpected output (verbatim) ----
   [junit4] Java HotSpot(TM) 64-Bit Server VM warning: Option UseConcMarkSweepGC was deprecated in version 9.0 and will likely be removed in a future release.
   [junit4] <<< JVM J0: EOF ----

[...truncated 317 lines...]
   [junit4] JVM J0: stderr was not empty, see: /Users/jenkins/workspace/Lucene-Solr-master-MacOSX/lucene/build/spatial-extras/test/temp/junit4-J0-20171227_024940_74011679371339970550692.syserr
   [junit4] >>> JVM J0 emitted unexpected output (verbatim) ----
   [junit4] Java HotSpot(TM) 64-Bit Server VM warning: Option UseConcMarkSweepGC was deprecated in version 9.0 and will likely be removed in a future release.
   [junit4] <<< JVM J0: EOF ----

[...truncated 3 lines...]
   [junit4] JVM J1: stderr was not empty, see: /Users/jenkins/workspace/Lucene-Solr-master-MacOSX/lucene/build/spatial-extras/test/temp/junit4-J1-20171227_024940_74416643240358416322427.syserr
   [junit4] >>> JVM J1 emitted unexpected output (verbatim) ----
   [junit4] Java HotSpot(TM) 64-Bit Server VM warning: Option UseConcMarkSweepGC was deprecated in version 9.0 and will likely be removed in a future release.
   [junit4] <<< JVM J1: EOF ----

[...truncated 146 lines...]
   [junit4] JVM J0: stderr was not empty, see: /Users/jenkins/workspace/Lucene-Solr-master-MacOSX/lucene/build/spatial/test/temp/junit4-J0-20171227_025003_0538688519630663870085.syserr
   [junit4] >>> JVM J0 emitted unexpected output (verbatim) ----
   [junit4] Java HotSpot(TM) 64-Bit Server VM warning: Option UseConcMarkSweepGC was deprecated in version 9.0 and will likely be removed in a future release.
   [junit4] <<< JVM J0: EOF ----

[...truncated 177 lines...]
   [junit4] JVM J1: stderr was not empty, see: /Users/jenkins/workspace/Lucene-Solr-master-MacOSX/lucene/build/spatial3d/test/temp/junit4-J1-20171227_025005_28711314495495112204518.syserr
   [junit4] >>> JVM J1 emitted unexpected output (verbatim) ----
   [junit4] Java HotSpot(TM) 64-Bit Server VM warning: Option UseConcMarkSweepGC was deprecated in version 9.0 and will likely be removed in a future release.
   [junit4] <<< JVM J1: EOF ----

[...truncated 5 lines...]
   [junit4] JVM J0: stderr was not empty, see: /Users/jenkins/workspace/Lucene-Solr-master-MacOSX/lucene/build/spatial3d/test/temp/junit4-J0-20171227_025005_2877292338004448735236.syserr
   [junit4] >>> JVM J0 emitted unexpected output (verbatim) ----
   [junit4] Java HotSpot(TM) 64-Bit Server VM warning: Option UseConcMarkSweepGC was deprecated in version 9.0 and will likely be removed in a future release.
   [junit4] <<< JVM J0: EOF ----

[...truncated 250 lines...]
   [junit4] JVM J1: stderr was not empty, see: /Users/jenkins/workspace/Lucene-Solr-master-MacOSX/lucene/build/suggest/test/temp/junit4-J1-20171227_025019_48814902488504533327644.syserr
   [junit4] >>> JVM J1 emitted unexpected output (verbatim) ----
   [junit4] Java HotSpot(TM) 64-Bit Server VM warning: Option UseConcMarkSweepGC was deprecated in version 9.0 and will likely be removed in a future release.
   [junit4] <<< JVM J1: EOF ----

[...truncated 3 lines...]
   [junit4] JVM J0: stderr was not empty, see: /Users/jenkins/workspace/Lucene-Solr-master-MacOSX/lucene/build/suggest/test/temp/junit4-J0-20171227_025019_4882155866794884745866.syserr
   [junit4] >>> JVM J0 emitted unexpected output (verbatim) ----
   [junit4] Java HotSpot(TM) 64-Bit Server VM warning: Option UseConcMarkSweepGC was deprecated in version 9.0 and will likely be removed in a future release.
   [junit4] <<< JVM J0: EOF ----

[...truncated 1729 lines...]
   [junit4] Suite: org.apache.solr.cloud.autoscaling.sim.TestComputePlanAction
   [junit4]   2> 80971 INFO  (SUITE-TestComputePlanAction-seed#[3AA8AC705E40E918]-worker) [    ] o.a.s.SolrTestCaseJ4 SecureRandom sanity checks: test.solr.allowed.securerandom=null & java.security.egd=file:/dev/./urandom
   [junit4]   2> Creating dataDir: /Users/jenkins/workspace/Lucene-Solr-master-MacOSX/solr/build/solr-core/test/J0/temp/solr.cloud.autoscaling.sim.TestComputePlanAction_3AA8AC705E40E918-001/init-core-data-001
   [junit4]   2> 80972 WARN  (SUITE-TestComputePlanAction-seed#[3AA8AC705E40E918]-worker) [    ] o.a.s.SolrTestCaseJ4 startTrackingSearchers: numOpens=1 numCloses=1
   [junit4]   2> 80973 INFO  (SUITE-TestComputePlanAction-seed#[3AA8AC705E40E918]-worker) [    ] o.a.s.SolrTestCaseJ4 Using PointFields (NUMERIC_POINTS_SYSPROP=true) w/NUMERIC_DOCVALUES_SYSPROP=true
   [junit4]   2> 80975 INFO  (SUITE-TestComputePlanAction-seed#[3AA8AC705E40E918]-worker) [    ] o.a.s.SolrTestCaseJ4 Randomized ssl (false) and clientAuth (false) via: @org.apache.solr.util.RandomizeSSL(reason="", value=0.0/0.0, ssl=0.0/0.0, clientAuth=0.0/0.0) w/ MAC_OS_X supressed clientAuth
   [junit4]   2> 80991 DEBUG (Simulated OverseerAutoScalingTriggerThread) [    ] o.a.s.c.a.OverseerTriggerThread Adding .autoAddReplicas trigger
   [junit4]   2> 80992 DEBUG (Simulated OverseerAutoScalingTriggerThread) [    ] o.a.s.c.a.OverseerTriggerThread Refreshing /autoscaling.json with znode version 0
   [junit4]   2> 80992 DEBUG (Simulated OverseerAutoScalingTriggerThread) [    ] o.a.s.c.a.NodeLostTrigger Initial livenodes: [127.0.0.1:10000_solr]
   [junit4]   2> 80992 DEBUG (Simulated OverseerAutoScalingTriggerThread) [    ] o.a.s.c.a.OverseerTriggerThread Current znodeVersion 0, lastZnodeVersion -1
   [junit4]   2> 80992 DEBUG (Simulated OverseerAutoScalingTriggerThread) [    ] o.a.s.c.a.OverseerTriggerThread Processed trigger updates upto znodeVersion 0
   [junit4]   2> 80994 INFO  (TEST-TestComputePlanAction.testNodeWithMultipleReplicasLost-seed#[3AA8AC705E40E918]) [    ] o.a.s.SolrTestCaseJ4 ###Starting testNodeWithMultipleReplicasLost
   [junit4]   2> 80995 DEBUG (TEST-TestComputePlanAction.testNodeWithMultipleReplicasLost-seed#[3AA8AC705E40E918]) [    ] o.a.s.c.a.OverseerTriggerThread Refreshing /autoscaling.json with znode version 1
   [junit4]   2> 80995 DEBUG (Simulated OverseerAutoScalingTriggerThread) [    ] o.a.s.c.a.OverseerTriggerThread -- clean old nodeAdded markers
   [junit4]   2> 80995 DEBUG (Simulated OverseerAutoScalingTriggerThread) [    ] o.a.s.c.a.OverseerTriggerThread Current znodeVersion 1, lastZnodeVersion 0
   [junit4]   2> 80995 DEBUG (Simulated OverseerAutoScalingTriggerThread) [    ] o.a.s.c.a.OverseerTriggerThread Processed trigger updates upto znodeVersion 1
   [junit4]   2> 80996 INFO  (TEST-TestComputePlanAction.testNodeWithMultipleReplicasLost-seed#[3AA8AC705E40E918]) [    ] o.a.s.c.a.s.SimCloudManager === Restarting OverseerTriggerThread and clearing object cache...
   [junit4]   2> 80996 DEBUG (Simulated OverseerAutoScalingTriggerThread) [    ] o.a.s.c.a.OverseerTriggerThread -- clean old nodeLost markers
   [junit4]   2> 80997 WARN  (ScheduledTrigger-707-thread-1) [    ] o.a.s.c.a.NodeLostTrigger NodeLostTrigger ran but was already closed
   [junit4]   2> 80997 DEBUG (Simulated OverseerAutoScalingTriggerThread) [    ] o.a.s.c.a.OverseerTriggerThread -- clean old nodeAdded markers
   [junit4]   2> 80997 WARN  (Simulated OverseerAutoScalingTriggerThread) [    ] o.a.s.c.a.OverseerTriggerThread Interrupted
   [junit4]   2> java.lang.InterruptedException
   [junit4]   2> 	at java.base/java.util.concurrent.locks.AbstractQueuedSynchronizer.acquireInterruptibly(AbstractQueuedSynchronizer.java:1247)
   [junit4]   2> 	at java.base/java.util.concurrent.locks.ReentrantLock.lockInterruptibly(ReentrantLock.java:317)
   [junit4]   2> 	at org.apache.solr.cloud.autoscaling.OverseerTriggerThread.run(OverseerTriggerThread.java:154)
   [junit4]   2> 	at java.base/java.lang.Thread.run(Thread.java:844)
   [junit4]   2> 80997 DEBUG (TEST-TestComputePlanAction.testNodeWithMultipleReplicasLost-seed#[3AA8AC705E40E918]) [    ] o.a.s.c.a.OverseerTriggerThread OverseerTriggerThread has been closed explicitly
   [junit4]   2> 80999 DEBUG (Simulated OverseerAutoScalingTriggerThread) [    ] o.a.s.c.a.OverseerTriggerThread Adding .autoAddReplicas trigger
   [junit4]   2> 80999 DEBUG (Simulated OverseerAutoScalingTriggerThread) [    ] o.a.s.c.a.OverseerTriggerThread Refreshing /autoscaling.json with znode version 2
   [junit4]   2> 80999 DEBUG (Simulated OverseerAutoScalingTriggerThread) [    ] o.a.s.c.a.NodeLostTrigger Initial livenodes: [127.0.0.1:10000_solr]
   [junit4]   2> 80999 DEBUG (Simulated OverseerAutoScalingTriggerThread) [    ] o.a.s.c.a.OverseerTriggerThread Current znodeVersion 2, lastZnodeVersion -1
   [junit4]   2> 80999 DEBUG (Simulated OverseerAutoScalingTriggerThread) [    ] o.a.s.c.a.OverseerTriggerThread Processed trigger updates upto znodeVersion 2
   [junit4]   2> 80999 DEBUG (Simulated OverseerAutoScalingTriggerThread) [    ] o.a.s.c.a.OverseerTriggerThread -- clean old nodeAdded markers
   [junit4]   2> 80999 DEBUG (Simulated OverseerAutoScalingTriggerThread) [    ] o.a.s.c.a.OverseerTriggerThread Current znodeVersion 2, lastZnodeVersion 2
   [junit4]   2> 81000 DEBUG (ScheduledTrigger-710-thread-1) [    ] o.a.s.c.a.NodeLostTrigger Running NodeLostTrigger: .auto_add_replicas with currently live nodes: 1
   [junit4]   2> 81027 DEBUG (ScheduledTrigger-710-thread-1) [    ] o.a.s.c.a.NodeLostTrigger Running NodeLostTrigger: .auto_add_replicas with currently live nodes: 1
   [junit4]   2> 81059 DEBUG (ScheduledTrigger-710-thread-2) [    ] o.a.s.c.a.NodeLostTrigger Running NodeLostTrigger: .auto_add_replicas with currently live nodes: 1
   [junit4]   2> 81087 DEBUG (ScheduledTrigger-710-thread-1) [    ] o.a.s.c.a.NodeLostTrigger Running NodeLostTrigger: .auto_add_replicas with currently live nodes: 1
   [junit4]   2> 81108 DEBUG (ScheduledTrigger-710-thread-1) [    ] o.a.s.c.a.NodeLostTrigger Running NodeLostTrigger: .auto_add_replicas with currently live nodes: 1
   [junit4]   2> 81132 DEBUG (ScheduledTrigger-710-thread-1) [    ] o.a.s.c.a.NodeLostTrigger Running NodeLostTrigger: .auto_add_replicas with currently live nodes: 1
   [junit4]   2> 81158 DEBUG (simCloudManagerPool-709-thread-1) [    ] o.a.s.c.a.AutoScalingHandler Verified autoscaling configuration
   [junit4]   2> 81159 DEBUG (simCloudManagerPool-709-thread-1) [    ] o.a.s.c.a.OverseerTriggerThread Refreshing /autoscaling.json with znode version 3
   [junit4]   2> 81159 DEBUG (ScheduledTrigger-710-thread-1) [    ] o.a.s.c.a.NodeLostTrigger Running NodeLostTrigger: .auto_add_replicas with currently live nodes: 1
   [junit4]   2> 81159 DEBUG (simCloudManagerPool-709-thread-1) [    ] o.a.s.c.a.NodeLostTrigger Initial livenodes: [127.0.0.1:10000_solr]
   [junit4]   2> 81160 DEBUG (Simulated OverseerAutoScalingTriggerThread) [    ] o.a.s.c.a.OverseerTriggerThread Processed trigger updates upto znodeVersion 3
   [junit4]   2> 81160 DEBUG (Simulated OverseerAutoScalingTriggerThread) [    ] o.a.s.c.a.OverseerTriggerThread -- clean old nodeAdded markers
   [junit4]   2> 81160 DEBUG (Simulated OverseerAutoScalingTriggerThread) [    ] o.a.s.c.a.OverseerTriggerThread Current znodeVersion 3, lastZnodeVersion 3
   [junit4]   2> 81162 DEBUG (simCloudManagerPool-709-thread-2) [    ] o.a.s.c.a.AutoScalingHandler Verified autoscaling configuration
   [junit4]   2> 81162 DEBUG (simCloudManagerPool-709-thread-2) [    ] o.a.s.c.a.OverseerTriggerThread Refreshing /autoscaling.json with znode version 4
   [junit4]   2> 81162 DEBUG (simCloudManagerPool-709-thread-2) [    ] o.a.s.c.a.NodeLostTrigger Initial livenodes: [127.0.0.1:10000_solr]
   [junit4]   2> 81162 DEBUG (Simulated OverseerAutoScalingTriggerThread) [    ] o.a.s.c.a.OverseerTriggerThread Processed trigger updates upto znodeVersion 4
   [junit4]   2> 81162 DEBUG (Simulated OverseerAutoScalingTriggerThread) [    ] o.a.s.c.a.OverseerTriggerThread -- clean old nodeAdded markers
   [junit4]   2> 81162 DEBUG (Simulated OverseerAutoScalingTriggerThread) [    ] o.a.s.c.a.OverseerTriggerThread Current znodeVersion 4, lastZnodeVersion 4
   [junit4]   2> 81182 DEBUG (ScheduledTrigger-710-thread-1) [    ] o.a.s.c.a.NodeLostTrigger Running NodeLostTrigger: .auto_add_replicas with currently live nodes: 1
   [junit4]   2> 81216 DEBUG (ScheduledTrigger-710-thread-1) [    ] o.a.s.c.a.NodeLostTrigger Running NodeLostTrigger: .auto_add_replicas with currently live nodes: 1
   [junit4]   2> 81250 DEBUG (ScheduledTrigger-710-thread-1) [    ] o.a.s.c.a.NodeLostTrigger Running NodeLostTrigger: .auto_add_replicas with currently live nodes: 1
   [junit4]   2> 81271 DEBUG (ScheduledTrigger-710-thread-1) [    ] o.a.s.c.a.NodeLostTrigger Running NodeLostTrigger: .auto_add_replicas with currently live nodes: 1
   [junit4]   2> 81295 DEBUG (simCloudManagerPool-709-thread-3) [    ] o.a.s.c.a.AutoScalingHandler Verified autoscaling configuration
   [junit4]   2> 81295 DEBUG (simCloudManagerPool-709-thread-3) [    ] o.a.s.c.a.OverseerTriggerThread Refreshing /autoscaling.json with znode version 5
   [junit4]   2> 81295 DEBUG (simCloudManagerPool-709-thread-3) [    ] o.a.s.c.a.NodeLostTrigger Initial livenodes: [127.0.0.1:10001_solr, 127.0.0.1:10000_solr, 127.0.0.1:10002_solr, 127.0.0.1:10003_solr]
   [junit4]   2> 81295 DEBUG (simCloudManagerPool-709-thread-3) [    ] o.a.s.c.a.NodeLostTrigger Initial livenodes: [127.0.0.1:10001_solr, 127.0.0.1:10000_solr, 127.0.0.1:10002_solr, 127.0.0.1:10003_solr]
   [junit4]   2> 81296 DEBUG (Simulated OverseerAutoScalingTriggerThread) [    ] o.a.s.c.a.OverseerTriggerThread Processed trigger updates upto znodeVersion 5
   [junit4]   2> 81296 DEBUG (Simulated OverseerAutoScalingTriggerThread) [    ] o.a.s.c.a.OverseerTriggerThread -- clean old nodeAdded markers
   [junit4]   2> 81296 DEBUG (Simulated OverseerAutoScalingTriggerThread) [    ] o.a.s.c.a.OverseerTriggerThread Current znodeVersion 5, lastZnodeVersion 5
   [junit4]   2> 81297 DEBUG (simCloudManagerPool-709-thread-4) [    ] o.a.s.c.o.ClusterStateMutator building a new cName: testNodeWithMultipleReplicasLost
   [junit4]   2> 81301 DEBUG (ScheduledTrigger-710-thread-1) [    ] o.a.s.c.a.NodeLostTrigger Running NodeLostTrigger: .auto_add_replicas with currently live nodes: 4
   [junit4]   2> 81301 DEBUG (ScheduledTrigger-710-thread-4) [    ] o.a.s.c.a.NodeLostTrigger Running NodeLostTrigger: node_lost_trigger with currently live nodes: 4
   [junit4]   2> 81321 DEBUG (simCloudManagerPool-709-thread-4) [    ] o.a.s.c.s.c.a.PolicyHelper Creating a new session
   [junit4]   2> 81322 DEBUG (ScheduledTrigger-710-thread-1) [    ] o.a.s.c.a.NodeLostTrigger Running NodeLostTrigger: .auto_add_replicas with currently live nodes: 4
   [junit4]   2> 81350 DEBUG (simCloudManagerPool-709-thread-4) [    ] o.a.s.c.s.c.a.PolicyHelper New session created 
   [junit4]   2> 81351 DEBUG (ScheduledTrigger-710-thread-1) [    ] o.a.s.c.a.NodeLostTrigger Running NodeLostTrigger: node_lost_trigger with currently live nodes: 4
   [junit4]   2> 81351 DEBUG (ScheduledTrigger-710-thread-1) [    ] o.a.s.c.a.NodeLostTrigger Running NodeLostTrigger: .auto_add_replicas with currently live nodes: 4
   [junit4]   2> 81370 INFO  (simCloudManagerPool-709-thread-4) [    ] o.a.s.c.s.c.a.PolicyHelper returnSession, curr-time 5068767367 sessionWrapper.createTime 5068766371593926, this.sessionWrapper.createTime 5068766371593926 
   [junit4]   2> 81370 DEBUG (simCloudManagerPool-709-thread-4) [    ] o.a.s.c.s.c.a.PolicyHelper session set to NULL
   [junit4]   2> 81375 DEBUG (ScheduledTrigger-710-thread-4) [    ] o.a.s.c.a.NodeLostTrigger Running NodeLostTrigger: .auto_add_replicas with currently live nodes: 4
   [junit4]   2> 81375 DEBUG (ScheduledTrigger-710-thread-2) [    ] o.a.s.c.a.NodeLostTrigger Running NodeLostTrigger: node_lost_trigger with currently live nodes: 4
   [junit4]   2> 81404 DEBUG (ScheduledTrigger-710-thread-2) [    ] o.a.s.c.a.NodeLostTrigger Running NodeLostTrigger: .auto_add_replicas with currently live nodes: 4
   [junit4]   2> 81404 DEBUG (ScheduledTrigger-710-thread-3) [    ] o.a.s.c.a.NodeLostTrigger Running NodeLostTrigger: node_lost_trigger with currently live nodes: 4
   [junit4]   2> 81428 DEBUG (ScheduledTrigger-710-thread-3) [    ] o.a.s.c.a.NodeLostTrigger Running NodeLostTrigger: .auto_add_replicas with currently live nodes: 4
   [junit4]   2> 81428 DEBUG (ScheduledTrigger-710-thread-3) [    ] o.a.s.c.a.NodeLostTrigger Running NodeLostTrigger: node_lost_trigger with currently live nodes: 4
   [junit4]   2> 81459 DEBUG (ScheduledTrigger-710-thread-3) [    ] o.a.s.c.a.NodeLostTrigger Running NodeLostTrigger: .auto_add_replicas with currently live nodes: 4
   [junit4]   2> 81459 DEBUG (ScheduledTrigger-710-thread-2) [    ] o.a.s.c.a.NodeLostTrigger Running NodeLostTrigger: node_lost_trigger with currently live nodes: 4
   [junit4]   2> 81466 DEBUG (TEST-TestComputePlanAction.testNodeWithMultipleReplicasLost-seed#[3AA8AC705E40E918]) [    ] o.a.s.c.a.s.TestComputePlanAction -- cluster state: znodeVersion: 2
   [junit4]   2> live nodes:[127.0.0.1:10001_solr, 127.0.0.1:10000_solr, 127.0.0.1:10002_solr, 127.0.0.1:10003_solr]
   [junit4]   2> collections:{testNodeWithMultipleReplicasLost=DocCollection(testNodeWithMultipleReplicasLost//clusterstate.json/1)={
   [junit4]   2>   "replicationFactor":"3",
   [junit4]   2>   "pullReplicas":"0",
   [junit4]   2>   "router":{"name":"compositeId"},
   [junit4]   2>   "maxShardsPerNode":"1",
   [junit4]   2>   "autoAddReplicas":"false",
   [junit4]   2>   "nrtReplicas":"3",
   [junit4]   2>   "tlogReplicas":"0",
   [junit4]   2>   "autoCreated":"true",
   [junit4]   2>   "shards":{
   [junit4]   2>     "shard2":{
   [junit4]   2>       "replicas":{
   [junit4]   2>         "core_node6":{
   [junit4]   2>           "node_name":"127.0.0.1:10002_solr",
   [junit4]   2>           "core":"testNodeWithMultipleReplicasLost_shard2_replica_n6",
   [junit4]   2>           "state":"active",
   [junit4]   2>           "type":"NRT",
   [junit4]   2>           "INDEX.sizeInBytes":123450000},
   [junit4]   2>         "core_node4":{
   [junit4]   2>           "node_name":"127.0.0.1:10001_solr",
   [junit4]   2>           "core":"testNodeWithMultipleReplicasLost_shard2_replica_n4",
   [junit4]   2>           "state":"active",
   [junit4]   2>           "type":"NRT",
   [junit4]   2>           "INDEX.sizeInBytes":123450000},
   [junit4]   2>         "core_node5":{
   [junit4]   2>           "node_name":"127.0.0.1:10000_solr",
   [junit4]   2>           "core":"testNodeWithMultipleReplicasLost_shard2_replica_n5",
   [junit4]   2>           "state":"active",
   [junit4]   2>           "type":"NRT",
   [junit4]   2>           "INDEX.sizeInBytes":123450000}},
   [junit4]   2>       "range":"0-7fffffff",
   [junit4]   2>       "state":"active"},
   [junit4]   2>     "shard1":{
   [junit4]   2>       "replicas":{
   [junit4]   2>         "core_node1":{
   [junit4]   2>           "node_name":"127.0.0.1:10003_solr",
   [junit4]   2>           "core":"testNodeWithMultipleReplicasLost_shard1_replica_n1",
   [junit4]   2>           "state":"active",
   [junit4]   2>           "type":"NRT",
   [junit4]   2>           "INDEX.sizeInBytes":123450000},
   [junit4]   2>         "core_node2":{
   [junit4]   2>           "node_name":"127.0.0.1:10002_solr",
   [junit4]   2>           "core":"testNodeWithMultipleReplicasLost_shard1_replica_n2",
   [junit4]   2>           "state":"active",
   [junit4]   2>           "type":"NRT",
   [junit4]   2>           "INDEX.sizeInBytes":123450000},
   [junit4]   2>         "core_node3":{
   [junit4]   2>           "node_name":"127.0.0.1:10000_solr",
   [junit4]   2>           "core":"testNodeWithMultipleReplicasLost_shard1_replica_n3",
   [junit4]   2>           "state":"active",
   [junit4]   2>           "type":"NRT",
   [junit4]   2>           "INDEX.sizeInBytes":123450000}},
   [junit4]   2>       "range":"80000000-ffffffff",
   [junit4]   2>       "state":"active"}}}}
   [junit4]   2> 81471 DEBUG (simCloudManagerPool-709-thread-11) [    ] o.a.s.c.a.s.SimClusterStateProvider -- elected new leader for testNodeWithMultipleReplicasLost / shard2: {"core_node6":{
   [junit4]   2>     "node_name":"127.0.0.1:10002_solr",
   [junit4]   2>     "core":"testNodeWithMultipleReplicasLost_shard2_replica_n6",
   [junit4]   2>     "leader":"true",
   [junit4]   2>     "state":"active",
   [junit4]   2>     "type":"NRT",
   [junit4]   2>     "INDEX.sizeInBytes":123450000,
   [junit4]   2>     "shard":"shard2",
   [junit4]   2>     "collection":"testNodeWithMultipleReplicasLost"}}
   [junit4]   2> 81471 DEBUG (simCloudManagerPool-709-thread-12) [    ] o.a.s.c.a.s.SimClusterStateProvider -- elected new leader for testNodeWithMultipleReplicasLost / shard1: {"core_node1":{
   [junit4]   2>     "node_name":"127.0.0.1:10003_solr",
   [junit4]   2>     "core":"testNodeWithMultipleReplicasLost_shard1_replica_n1",
   [junit4]   2>     "leader":"true",
   [junit4]   2>     "state":"active",
   [junit4]   2>     "type":"NRT",
   [junit4]   2>     "INDEX.sizeInBytes":123450000,
   [junit4]   2>     "shard":"shard1",
   [junit4]   2>     "collection":"testNodeWithMultipleReplicasLost"}}
   [junit4]   2> 81489 DEBUG (ScheduledTrigger-710-thread-3) [    ] o.a.s.c.a.NodeLostTrigger Running NodeLostTrigger: .auto_add_replicas with currently live nodes: 3
   [junit4]   2> 81489 DEBUG (ScheduledTrigger-710-thread-4) [    ] o.a.s.c.a.NodeLostTrigger Running NodeLostTrigger: node_lost_trigger with currently live nodes: 3
   [junit4]   2> 81489 DEBUG (ScheduledTrigger-710-thread-4) [    ] o.a.s.c.a.NodeLostTrigger Tracking lost node: 127.0.0.1:10000_solr
   [junit4]   2> 81489 DEBUG (ScheduledTrigger-710-thread-3) [    ] o.a.s.c.a.NodeLostTrigger Tracking lost node: 127.0.0.1:10000_solr
   [junit4]   2> 81520 DEBUG (ScheduledTrigger-710-thread-4) [    ] o.a.s.c.a.NodeLostTrigger Running NodeLostTrigger: node_lost_trigger with currently live nodes: 3
   [junit4]   2> 81520 DEBUG (ScheduledTrigger-710-thread-1) [    ] o.a.s.c.a.NodeLostTrigger Running NodeLostTrigger: .auto_add_replicas with currently live nodes: 3
   [junit4]   2> 81520 DEBUG (ScheduledTrigger-710-thread-4) [    ] o.a.s.c.a.NodeLostTrigger NodeLostTrigger firing registered processor for lost nodes: [127.0.0.1:10000_solr]
   [junit4]   2> 81522 DEBUG (ScheduledTrigger-710-thread-4) [    ] o.a.s.c.a.ScheduledTriggers ++++++++ Cooldown inactive - processing event: {
   [junit4]   2>   "id":"120205c1b8b396T4hto6ulq6couwewhww1jdshce",
   [junit4]   2>   "source":"node_lost_trigger",
   [junit4]   2>   "eventTime":5068773328991126,
   [junit4]   2>   "eventType":"NODELOST",
   [junit4]   2>   "properties":{
   [junit4]   2>     "eventTimes":[5068773328991126],
   [junit4]   2>     "nodeNames":["127.0.0.1:10000_solr"]}}
   [junit4]   2> 81527 DEBUG (AutoscalingActionExecutor-711-thread-1) [    ] o.a.s.c.a.ScheduledTriggers -- processing actions for {
   [junit4]   2>   "id":"120205c1b8b396T4hto6ulq6couwewhww1jdshce",
   [junit4]   2>   "source":"node_lost_trigger",
   [junit4]   2>   "eventTime":5068773328991126,
   [junit4]   2>   "eventType":"NODELOST",
   [junit4]   2>   "properties":{
   [junit4]   2>     "eventTimes":[5068773328991126],
   [junit4]   2>     "_enqueue_time_":5068774987189126,
   [junit4]   2>     "nodeNames":["127.0.0.1:10000_solr"]}}
   [junit4]   2> 81529 DEBUG (AutoscalingActionExecutor-711-thread-1) [    ] o.a.s.c.a.ComputePlanAction -- processing event: {
   [junit4]   2>   "id":"120205c1b8b396T4hto6ulq6couwewhww1jdshce",
   [junit4]   2>   "source":"node_lost_trigger",
   [junit4]   2>   "eventTime":5068773328991126,
   [junit4]   2>   "eventType":"NODELOST",
   [junit4]   2>   "properties":{
   [junit4]   2>     "eventTimes":[5068773328991126],
   [junit4]   2>     "_enqueue_time_":5068774987189126,
   [junit4]   2>     "nodeNames":["127.0.0.1:10000_solr"]}} with context properties: {BEFORE_ACTION=[compute_plan]}
   [junit4]   2> 81529 DEBUG (AutoscalingActionExecutor-711-thread-1) [    ] o.a.s.c.s.c.a.PolicyHelper Creating a new session
   [junit4]   2> 81536 DEBUG (AutoscalingActionExecutor-711-thread-1) [    ] o.a.s.c.s.c.a.PolicyHelper New session created 
   [junit4]   2> 81549 INFO  (AutoscalingActionExecutor-711-thread-1) [    ] o.a.s.c.a.ComputePlanAction Computed Plan: action=MOVEREPLICA&collection=testNodeWithMultipleReplicasLost&targetNode=127.0.0.1:10003_solr&inPlaceMove=true&replica=core_node5
   [junit4]   2> 81550 INFO  (AutoscalingActionExecutor-711-thread-1) [    ] o.a.s.c.a.ComputePlanAction Computed Plan: action=MOVEREPLICA&collection=testNodeWithMultipleReplicasLost&targetNode=127.0.0.1:10001_solr&inPlaceMove=true&replica=core_node3
   [junit4]   2> 81550 INFO  (AutoscalingActionExecutor-711-thread-1) [    ] o.a.s.c.s.c.a.PolicyHelper returnSession, curr-time 5068776376 sessionWrapper.createTime 5068775679836926, this.sessionWrapper.createTime 5068775679836926 
   [junit4]   2> 81550 DEBUG (AutoscalingActionExecutor-711-thread-1) [    ] o.a.s.c.s.c.a.PolicyHelper session set to NULL
   [junit4]   2> 81554 INFO  (TEST-TestComputePlanAction.testNodeWithMultipleReplicasLost-seed#[3AA8AC705E40E918]) [    ] o.a.s.c.a.s.TestComputePlanAction action=MOVEREPLICA&collection=testNodeWithMultipleReplicasLost&targetNode=127.0.0.1:10003_solr&inPlaceMove=true&replica=core_node5
   [junit4]   2> 81554 INFO  (TEST-TestComputePlanAction.testNodeWithMultipleReplicasLost-seed#[3AA8AC705E40E918]) [    ] o.a.s.c.a.s.TestComputePlanAction action=MOVEREPLICA&collection=testNodeWithMultipleReplicasLost&targetNode=127.0.0.1:10001_solr&inPlaceMove=true&replica=core_node3
   [junit4]   2> 81554 INFO  (TEST-TestComputePlanAction.testNodeWithMultipleReplicasLost-seed#[3AA8AC705E40E918]) [    ] o.a.s.c.a.s.TestComputePlanAction -------------_ FINAL STATE --------------
   [junit4]   2> 81555 INFO  (TEST-TestComputePlanAction.testNodeWithMultipleReplicasLost-seed#[3AA8AC705E40E918]) [    ] o.a.s.c.a.s.TestComputePlanAction * Node values: {
   [junit4]   2>   "127.0.0.1:10001_solr":{
   [junit4]   2>     "sysprop.java.vendor":"Oracle Corporation",
   [junit4]   2>     "cores":1,
   [junit4]   2>     "host":"127.0.0.1",
   [junit4]   2>     "freedisk":990,
   [junit4]   2>     "sysprop.java.version":"9",
   [junit4]   2>     "ip_1":"127",
   [junit4]   2>     "ip_3":"0",
   [junit4]   2>     "ip_2":"0",
   [junit4]   2>     "ip_4":"1",
   [junit4]   2>     "node":"127.0.0.1:10001_solr",
   [junit4]   2>     "metrics:solr.jvm:buffers.direct.Count":0,
   [junit4]   2>     "port":10001,
   [junit4]   2>     "heapUsage":123450000,
   [junit4]   2>     "sysLoadAvg":1.0,
   [junit4]   2>     "metrics:solr.node:ADMIN./admin/authorization.clientErrors:count":0},
   [junit4]   2>   "127.0.0.1:10000_solr":{
   [junit4]   2>     "sysprop.java.vendor":"Oracle Corporation",
   [junit4]   2>     "cores":2,
   [junit4]   2>     "host":"127.0.0.1",
   [junit4]   2>     "freedisk":980,
   [junit4]   2>     "sysprop.java.version":"9",
   [junit4]   2>     "ip_1":"127",
   [junit4]   2>     "ip_3":"0",
   [junit4]   2>     "ip_2":"0",
   [junit4]   2>     "ip_4":"1",
   [junit4]   2>     "node":"127.0.0.1:10000_solr",
   [junit4]   2>     "metrics:solr.jvm:buffers.direct.Count":0,
   [junit4]   2>     "port":10000,
   [junit4]   2>     "heapUsage":123450000,
   [junit4]   2>     "sysLoadAvg":1.0,
   [junit4]   2>     "metrics:solr.node:ADMIN./admin/authorization.clientErrors:count":0},
   [junit4]   2>   "127.0.0.1:10002_solr":{
   [junit4]   2>     "sysprop.java.vendor":"Oracle Corporation",
   [junit4]   2>     "cores":2,
   [junit4]   2>     "host":"127.0.0.1",
   [junit4]   2>     "freedisk":980,
   [junit4]   2>     "sysprop.java.version":"9",
   [junit4]   2>     "ip_1":"127",
   [junit4]   2>     "ip_3":"0",
   [junit4]   2>     "ip_2":"0",
   [junit4]   2>     "ip_4":"1",
   [junit4]   2>     "node":"127.0.0.1:10002_solr",
   [junit4]   2>     "metrics:solr.jvm:buffers.direct.Count":0,
   [junit4]   2>     "port":10002,
   [junit4]   2>     "heapUsage":123450000,
   [junit4]   2>     "sysLoadAvg":1.0,
   [junit4]   2>     "metrics:solr.node:ADMIN./admin/authorization.clientErrors:count":0},
   [junit4]   2>   "127.0.0.1:10003_solr":{
   [junit4]   2>     "sysprop.java.vendor":"Oracle Corporation",
   [junit4]   2>     "cores":1,
   [junit4]   2>     "host":"127.0.0.1",
   [junit4]   2>     "freedisk":990,
   [junit4]   2>     "sysprop.java.version":"9",
   [junit4]   2>     "ip_1":"127",
   [junit4]   2>     "ip_3":"0",
   [junit4]   2>     "ip_2":"0",
   [junit4]   2>     "ip_4":"1",
   [junit4]   2>     "node":"127.0.0.1:10003_solr",
   [junit4]   2>     "metrics:solr.jvm:buffers.direct.Count":0,
   [junit4]   2>     "port":10003,
   [junit4]   2>     "heapUsage":123450000,
   [junit4]   2>     "sysLoadAvg":1.0,
   [junit4]   2>     "metrics:solr.node:ADMIN./admin/authorization.clientErrors:count":0}}
   [junit4]   2> 81555 INFO  (TEST-TestComputePlanAction.testNodeWithMultipleReplicasLost-seed#[3AA8AC705E40E918]) [    ] o.a.s.c.a.s.TestComputePlanAction * Live nodes: [127.0.0.1:10001_solr, 127.0.0.1:10002_solr, 127.0.0.1:10003_solr]
   [junit4]   2> 81556 INFO  (TEST-TestComputePlanAction.testNodeWithMultipleReplicasLost-seed#[3AA8AC705E40E918]) [    ] o.a.s.c.a.s.TestComputePlanAction * Collection testNodeWithMultipleReplicasLost state: DocCollection(testNodeWithMultipleReplicasLost//clusterstate.json/3)={
   [junit4]   2>   "replicationFactor":"3",
   [junit4]   2>   "pullReplicas":"0",
   [junit4]   2>   "router":{"name":"compositeId"},
   [junit4]   2>   "maxShardsPerNode":"1",
   [junit4]   2>   "autoAddReplicas":"false",
   [junit4]   2>   "nrtReplicas":"3",
   [junit4]   2>   "tlogReplicas":"0",
   [junit4]   2>   "autoCreated":"true",
   [junit4]   2>   "shards":{
   [junit4]   2>     "shard2":{
   [junit4]   2>       "replicas":{
   [junit4]   2>         "core_node6":{
   [junit4]   2>           "core":"testNodeWithMultipleReplicasLost_shard2_replica_n6",
   [junit4]   2>           "leader":"true",
   [junit4]   2>           "INDEX.sizeInBytes":123450000,
   [junit4]   2>           "node_name":"127.0.0.1:10002_solr",
   [junit4]   2>           "state":"active",
   [junit4]   2>           "type":"NRT"},
   [junit4]   2>         "core_node4":{
   [junit4]   2>           "node_name":"127.0.0.1:10001_solr",
   [junit4]   2>           "core":"testNodeWithMultipleReplicasLost_shard2_replica_n4",
   [junit4]   2>           "state":"active",
   [junit4]   2>           "type":"NRT",
   [junit4]   2>           "INDEX.sizeInBytes":123450000},
   [junit4]   2>         "core_node5":{
   [junit4]   2>           "node_name":"127.0.0.1:10000_solr",
   [junit4]   2>           "core":"testNodeWithMultipleReplicasLost_shard2_replica_n5",
   [junit4]   2>           "state":"down",
   [junit4]   2>           "type":"NRT",
   [junit4]   2>           "INDEX.sizeInBytes":123450000}},
   [junit4]   2>       "range":"0-7fffffff",
   [junit4]   2>       "state":"active"},
   [junit4]   2>     "shard1":{
   [junit4]   2>       "replicas":{
   [junit4]   2>         "core_node1":{
   [junit4]   2>           "core":"testNodeWithMultipleReplicasLost_shard1_replica_n1",
   [junit4]   2>           "leader":"true",
   [junit4]   2>           "INDEX.sizeInBytes":123450000,
   [junit4]   2>           "node_name":"127.0.0.1:10003_solr",
   [junit4]   2>           "state":"active",
   [junit4]   2>           "type":"NRT"},
   [junit4]   2>         "core_node2":{
   [junit4]   2>           "node_name":"127.0.0.1:10002_solr",
   [junit4]   2>           "core":"testNodeWithMultipleReplicasLost_shard1_replica_n2",
   [junit4]   2>           "state":"active",
   [junit4]   2>           "type":"NRT",
   [junit4]   2>           "INDEX.sizeInBytes":123450000},
   [junit4]   2>         "core_node3":{
   [junit4]   2>           "node_name":"127.0.0.1:10000_solr",
   [junit4]   2>           "core":"testNodeWithMultipleReplicasLost_shard1_replica_n3",
   [junit4]   2>           "state":"down",
   [junit4]   2>           "type":"NRT",
   [junit4]   2>           "INDEX.sizeInBytes":123450000}},
   [junit4]   2>       "range":"80000000-ffffffff",
   [junit4]   2>       "state":"active"}}}
   [junit4]   2> 81556 INFO  (TEST-TestComputePlanAction.testNodeWithMultipleReplicasLost-seed#[3AA8AC705E40E918]) [    ] o.a.s.SolrTestCaseJ4 ###Ending testNodeWithMultipleReplicasLost
   [junit4]   2> 81556 INFO  (TEST-TestComputePlanAction.testNodeWithMultipleReplicasLost-seed#[3AA8AC705E40E918]) [    ] o.a.s.c.a.s.SimSolrCloudTestCase 
   [junit4]   2> 
   [junit4]   2> 81556 INFO  (TEST-TestComputePlanAction.testNodeWithMultipleReplicasLost-seed#[3AA8AC705E40E918]) [    ] o.a.s.c.a.s.SimSolrCloudTestCase #############################################
   [junit4]   2> 81556 INFO  (TEST-TestComputePlanAction.testNodeWithMultipleReplicasLost-seed#[3AA8AC705E40E918]) [    ] o.a.s.c.a.s.SimSolrCloudTestCase ############ FINAL CLUSTER STATS ############
   [junit4]   2> 81556 INFO  (TEST-TestComputePlanAction.testNodeWithMultipleReplicasLost-seed#[3AA8AC705E40E918]) [    ] o.a.s.c.a.s.SimSolrCloudTestCase #############################################
   [junit4]   2> 
   [junit4]   2> 81556 INFO  (TEST-TestComputePlanAction.testNodeWithMultipleReplicasLost-seed#[3AA8AC705E40E918]) [    ] o.a.s.c.a.s.SimSolrCloudTestCase ## Live nodes:		3
   [junit4]   2> 81557 INFO  (TEST-TestComputePlanAction.testNodeWithMultipleReplicasLost-seed#[3AA8AC705E40E918]) [    ] o.a.s.c.a.s.SimSolrCloudTestCase ## Empty nodes:	0
   [junit4]   2> 81557 INFO  (TEST-TestComputePlanAction.testNodeWithMultipleReplicasLost-seed#[3AA8AC705E40E918]) [    ] o.a.s.c.a.s.SimSolrCloudTestCase ## Dead nodes:		1
   [junit4]   2> 81558 INFO  (TEST-TestComputePlanAction.testNodeWithMultipleReplicasLost-seed#[3AA8AC705E40E918]) [    ] o.a.s.c.a.s.SimSolrCloudTestCase ##		127.0.0.1:10000_solr
   [junit4]   2> 81558 INFO  (TEST-TestComputePlanAction.testNodeWithMultipleReplicasLost-seed#[3AA8AC705E40E918]) [    ] o.a.s.c.a.s.SimSolrCloudTestCase ## Collections:	[testNodeWithMultipleReplicasLost]
   [junit4]   2> 81558 INFO  (TEST-TestComputePlanAction.testNodeWithMultipleReplicasLost-seed#[3AA8AC705E40E918]) [    ] o.a.s.c.a.s.SimSolrCloudTestCase ## Max replicas per node:	2
   [junit4]   2> 81558 INFO  (TEST-TestComputePlanAction.testNodeWithMultipleReplicasLost-seed#[3AA8AC705E40E918]) [    ] o.a.s.c.a.s.SimSolrCloudTestCase ## Min replicas per node:	1
   [junit4]   2> 81558 INFO  (TEST-TestComputePlanAction.testNodeWithMultipleReplicasLost-seed#[3AA8AC705E40E918]) [    ] o.a.s.c.a.s.SimSolrCloudTestCase ## Total replicas:		4
   [junit4]   2> 81559 INFO  (TEST-TestComputePlanAction.testNodeWithMultipleReplicasLost-seed#[3AA8AC705E40E918]) [    ] o.a.s.c.a.s.SimSolrCloudTestCase ## * testNodeWithMultipleReplicasLost		4
   [junit4]   2> 81559 INFO  (TEST-TestComputePlanAction.testNodeWithMultipleReplicasLost-seed#[3AA8AC705E40E918]) [    ] o.a.s.c.a.s.SimSolrCloudTestCase ##		- active           4
   [junit4]   2> 81559 INFO  (TEST-TestComputePlanAction.testNodeWithMultipleReplicasLost-seed#[3AA8AC705E40E918]) [    ] o.a.s.c.a.s.SimSolrCloudTestCase ######### Final Solr op counts ##########
   [junit4]   2> 81560 INFO  (TEST-TestComputePlanAction.testNodeWithMultipleReplicasLost-seed#[3AA8AC705E40E918]) [    ] o.a.s.c.a.s.SimSolrCloudTestCase ##		- CREATE             1
   [junit4]   2> 81560 INFO  (TEST-TestComputePlanAction.testNodeWithMultipleReplicasLost-seed#[3AA8AC705E40E918]) [    ] o.a.s.c.a.s.SimSolrCloudTestCase ##		- autoscaling        3
   [junit4]   2> 81560 INFO  (TEST-TestComputePlanAction.testNodeWithMultipleReplicasLost-seed#[3AA8AC705E40E918]) [    ] o.a.s.c.a.s.SimSolrCloudTestCase ##		- update             3
   [junit4]   2> 81560 INFO  (TEST-TestComputePlanAction.testNodeWithMultipleReplicasLost-seed#[3AA8AC705E40E918]) [    ] o.a.s.c.a.s.SimSolrCloudTestCase ######### Autoscaling event counts ###########
   [junit4]   2> 81561 DEBUG (AutoscalingActionExecutor-711-thread-1) [    ] o.a.s.c.a.ScheduledTriggers -- processing took 1669 ms for event id=120205c1b8b396T4hto6ulq6couwewhww1jdshce
   [junit4]   2> NOTE: reproduce with: ant test  -Dtestcase=TestComputePlanAction -Dtests.method=testNodeWithMultipleReplicasLost -Dtests.seed=3AA8AC705E40E918 -Dtests.slow=true -Dtests.locale=nnh-CM -Dtests.timezone=Egypt -Dtests.asserts=true -Dtests.file.encoding=ISO-8859-1
   [junit4] ERROR   0.57s J0 | TestComputePlanAction.testNodeWithMultipleReplicasLost <<<
   [junit4]    > Throwable #1: java.util.ConcurrentModificationException
   [junit4]    > 	at __randomizedtesting.SeedInfo.seed([3AA8AC705E40E918:A684DF2D6320844]:0)
   [junit4]    > 	at java.base/java.util.ArrayList$Itr.checkForComodification(ArrayList.java:937)
   [junit4]    > 	at java.base/java.util.ArrayList$Itr.next(ArrayList.java:891)
   [junit4]    > 	at org.apache.solr.cloud.autoscaling.sim.SimSolrCloudTestCase.tearDown(SimSolrCloudTestCase.java:141)
   [junit4]    > 	at jdk.internal.reflect.GeneratedMethodAccessor6.invoke(Unknown Source)
   [junit4]    > 	at java.base/jdk.internal.reflect.DelegatingMethodAccessorImpl.invoke(DelegatingMethodAccessorImpl.java:43)
   [junit4]    > 	at java.base/java.lang.reflect.Method.invoke(Method.java:564)
   [junit4]    > 	at java.base/java.lang.Thread.run(Thread.java:844)
   [junit4]   2> 81577 DEBUG (ScheduledTrigger-710-thread-1) [    ] o.a.s.c.a.NodeLostTrigger Running NodeLostTrigger: .auto_add_replicas with currently live nodes: 3
   [junit4]   2> 81577 DEBUG (ScheduledTrigger-710-thread-1) [    ] o.a.s.c.a.NodeLostTrigger Running NodeLostTrigger: node_lost_trigger with currently live nodes: 3
   [junit4]   2> 81595 INFO  (TEST-TestComputePlanAction.testNodeLost-seed#[3AA8AC705E40E918]) [    ] o.a.s.SolrTestCaseJ4 ###Starting testNodeLost
   [junit4]   2> 81595 DEBUG (TEST-TestComputePlanAction.testNodeLost-seed#[3AA8AC705E40E918]) [    ] o.a.s.c.a.OverseerTriggerThread Refreshing /autoscaling.json with znode version 6
   [junit4]   2> 81595 DEBUG (Simulated OverseerAutoScalingTriggerThread) [    ] o.a.s.c.a.OverseerTriggerThread Processed trigger updates upto znodeVersion 6
   [junit4]   2> 81595 DEBUG (Simulated OverseerAutoScalingTriggerThread) [    ] o.a.s.c.a.OverseerTriggerThread -- clean old nodeLost markers
   [junit4]   2> 81595 DEBUG (Simulated OverseerAutoScalingTriggerThread) [    ] o.a.s.c.a.OverseerTriggerThread -- clean old nodeAdded markers
   [junit4]   2> 81595 DEBUG (Simulated OverseerAutoScalingTriggerThread) [    ] o.a.s.c.a.OverseerTriggerThread Current znodeVersion 6, lastZnodeVersion 6
   [junit4]   2> 81596 WARN  (simCloudManagerPool-709-thread-18) [    ] o.a.s.c.a.s.SimClusterStateProvider -- can't find any active replicas for testNodeWithMultipleReplicasLost / shard1
   [junit4]   2> 81596 DEBUG (simCloudManagerPool-709-thread-17) [    ] o.a.s.c.a.s.SimClusterStateProvider -- elected new leader for testNodeWithMultipleReplicasLost / shard2: {"core_node4":{
   [junit4]   2>     "node_name":"127.0.0.1:10001_solr",
   [junit4]   2>     "core":"testNodeWithMultipleReplicasLost_shard2_replica_n4",
   [junit4]   2>     "leader":"true",
   [junit4]   2>     "state":"active",
   [junit4]   2>     "type":"NRT",
   [junit4]   2>     "INDEX.sizeInBytes":123450000,
   [junit4]   2>     "shard":"shard2",
   [junit4]   2>     "collection":"testNodeWithMultipleReplicasLost"}}
   [junit4]   2> 81597 DEBUG (TEST-TestComputePlanAction.testNodeLost-seed#[3AA8AC705E40E918]) [    ] o.a.s.c.a.s.SimNodeStateProvider - removing dead node values: 127.0.0.1:10000_solr
   [junit4]   2> 81597 INFO  (TEST-TestComputePlanAction.testNodeLost-seed#[3AA8AC705E40E918]) [    ] o.a.s.c.a.s.SimCloudManager === Restarting OverseerTriggerThread and clearing object cache...
   [junit4]   2> 81597 WARN  (Simulated OverseerAutoScalingTriggerThread) [    ] o.a.s.c.a.OverseerTriggerThread Interrupted
   [junit4]   2> java.lang.InterruptedException
   [junit4]   2> 	at java.base/java.util.concurrent.locks.AbstractQueuedSynchronizer$ConditionObject.reportInterruptAfterWait(AbstractQueuedSynchronizer.java:2037)
   [junit4]   2> 	at java.base/java.util.concurrent.locks.AbstractQueuedSynchronizer$ConditionObject.await(AbstractQueuedSynchronizer.java:2071)
   [junit4]   2> 	at org.apache.solr.cloud.autoscaling.OverseerTriggerThread.run(OverseerTriggerThread.java:166)
   [junit4]   2> 	at java.base/java.lang.Thread.run(Thread.java:844)
   [junit4]   2> 81601 DEBUG (TEST-TestComputePlanAction.testNodeLost-seed#[3AA8AC705E40E918]) [    ] o.a.s.c.a.OverseerTriggerThread OverseerTriggerThread has been closed explicitly
   [junit4]   2> 81609 DEBUG (Simulated OverseerAutoScalingTriggerThread) [    ] o.a.s.c.a.OverseerTriggerThread Adding .autoAddReplicas trigger
   [junit4]   2> 81610 DEBUG (Simulated OverseerAutoScalingTriggerThread) [    ] o.a.s.c.a.OverseerTriggerThread Refreshing /autoscaling.json with znode version 7
   [junit4]   2> 81610 DEBUG (Simulated OverseerAutoScalingTriggerThread) [    ] o.a.s.c.a.NodeLostTrigger Initial livenodes: [127.0.0.1:10001_solr]
   [junit4]   2> 81610 DEBUG (Simulated OverseerAutoScalingTriggerThread) [    ] o.a.s.c.a.OverseerTriggerThread Current znodeVersion 7, lastZnodeVersion -1
   [junit4]   2> 81611 DEBUG (Simulated OverseerAutoScalingTriggerThread) [    ] o.a.s.c.a.OverseerTriggerThread Processed trigger updates upto znodeVersion 7
   [junit4]   2> 81611 DEBUG (Simulated OverseerAutoScalingTriggerThread) [    ] o.a.s.c.a.OverseerTriggerThread -- clean old nodeAdded markers
   [junit4]   2> 81611 DEBUG (Simulated OverseerAutoScalingTriggerThread) [    ] o.a.s.c.a.OverseerTriggerThread Current znodeVersion 7, lastZnodeVersion 7
   [junit4]   2> 81611 DEBUG (ScheduledTrigger-713-thread-1) [    ] o.a.s.c.a.NodeLostTrigger Running NodeLostTrigger: .auto_add_replicas with currently live nodes: 1
   [junit4]   2> 81642 DEBUG (ScheduledTrigger-713-thread-1) [    ] o.a.s.c.a.NodeLostTrigger Running NodeLostTrigger: .auto_add_replicas with currently live nodes: 1
   [junit4]   2> 81673 DEBUG (ScheduledTrigger-713-thread-2) [    ] o.a.s.c.a.NodeLostTrigger Running NodeLostTrigger: .auto_add_replicas with currently live nodes: 1
   [junit4]   2> 81695 DEBUG (ScheduledTrigger-713-thread-1) [    ] o.a.s.c.a.NodeLostTrigger Running NodeLostTrigger: .auto_add_replicas with currently live nodes: 1
   [junit4]   2> 81719 DEBUG (ScheduledTrigger-713-thread-1) [    ] o.a.s.c.a.NodeLostTrigger Running NodeLostTrigger: .auto_add_replicas with currently live nodes: 1
   [junit4]   2> 81721 DEBUG (simCloudManagerPool-712-thread-1) [    ] o.a.s.c.a.AutoScalingHandler Verified autoscaling configuration
   [junit4]   2> 81721 DEBUG (simCloudManagerPool-712-thread-1) [    ] o.a.s.c.a.OverseerTriggerThread Refreshing /autoscaling.json with znode version 8
   [junit4]   2> 81722 DEBUG (simCloudManagerPool-712-thread-1) [    ] o.a.s.c.a.NodeLostTrigger Initial livenodes: [127.0.0.1:10001_solr]
   [junit4]   2> 81722 DEBUG (Simulated OverseerAutoScalingTriggerThread) [    ] o.a.s.c.a.OverseerTriggerThread Processed trigger updates upto znodeVersion 8
   [junit4]   2> 81722 DEBUG (Simulated OverseerAutoScalingTriggerThread) [    ] o.a.s.c.a.OverseerTriggerThread -- clean old nodeAdded markers
   [junit4]   2> 81722 DEBUG (Simulated OverseerAutoScalingTriggerThread) [    ] o.a.s.c.a.OverseerTriggerThread Current znodeVersion 8, lastZnodeVersion 8
   [junit4]   2> 81723 DEBUG (simCloudManagerPool-712-thread-2) [    ] o.a.s.c.a.AutoScalingHandler Verified autoscaling configuration
   [junit4]   2> 81723 DEBUG (simCloudManagerPool-712-thread-2) [    ] o.a.s.c.a.OverseerTriggerThread Refreshing /autoscaling.json with znode version 9
   [junit4]   2> 81723 DEBUG (simCloudManagerPool-712-thread-2) [    ] o.a.s.c.a.NodeLostTrigger Initial livenodes: [127.0.0.1:10001_solr]
   [junit4]   2> 81723 DEBUG (Simulated OverseerAutoScalingTriggerThread) [    ] o.a.s.c.a.OverseerTriggerThread Processed trigger updates upto znodeVersion 9
   [junit4]   2> 81724 DEBUG (Simulated OverseerAutoScalingTriggerThread) [    ] o.a.s.c.a.OverseerTriggerThread -- clean old nodeAdded markers
   [junit4]   2> 81724 DEBUG (Simulated OverseerAutoScalingTriggerThread) [    ] o.a.s.c.a.OverseerTriggerThread Current znodeVersion 9, lastZnodeVersion 9
   [junit4]   2> 81746 DEBUG (ScheduledTrigger-713-thread-1) [    ] o.a.s.c.a.NodeLostTrigger Running NodeLostTrigger: .auto_add_replicas with currently live nodes: 1
   [junit4]   2> 81768 DEBUG (ScheduledTrigger-713-thread-1) [    ] o.a.s.c.a.NodeLostTrigger Running NodeLostTrigger: .auto_add_replicas with currently live nodes: 1
   [junit4]   2> 81792 DEBUG (ScheduledTrigger-713-thread-1) [    ] o.a.s.c.a.NodeLostTrigger Running NodeLostTrigger: .auto_add_replicas with currently live nodes: 1
   [junit4]   2> 81823 DEBUG (ScheduledTrigger-713-thread-1) [    ] o.a.s.c.a.NodeLostTrigger Running NodeLostTrigger: .auto_add_replicas with currently live nodes: 1
   [junit4]   2> 81826 DEBUG (simCloudManagerPool-712-thread-3) [    ] o.a.s.c.a.AutoScalingHandler Verified autoscaling configuration
   [junit4]   2> 81826 DEBUG (simCloudManagerPool-712-thread-3) [    ] o.a.s.c.a.OverseerTriggerThread Refreshing /autoscaling.json with znode version 10
   [junit4]   2> 81826 DEBUG (simCloudManagerPool-712-thread-3) [    ] o.a.s.c.a.NodeLostTrigger Initial livenodes: [127.0.0.1:10001_solr, 127.0.0.1:10004_solr]
   [junit4]   2> 81826 DEBUG (simCloudManagerPool-712-thread-3) [    ] o.a.s.c.a.NodeLostTrigger Initial livenodes: [127.0.0.1:10001_solr, 127.0.0.1:10004_solr]
   [junit4]   2> 81826 DEBUG (Simulated OverseerAutoScalingTriggerThread) [    ] o.a.s.c.a.OverseerTriggerThread Processed trigger updates upto znodeVersion 10
   [junit4]   2> 81826 DEBUG (Simulated OverseerAutoScalingTriggerThread) [    ] o.a.s.c.a.OverseerTriggerThread -- clean old nodeAdded markers
   [junit4]   2> 81826 DEBUG (Simulated OverseerAutoScalingTriggerThread) [    ] o.a.s.c.a.OverseerTriggerThread Current znodeVersion 10, lastZnodeVersion 10
   [junit4]   2> 81827 DEBUG (ScheduledTrigger-713-thread-3) [    ] o.a.s.c.a.NodeLostTrigger Running NodeLostTrigger: node_lost_trigger with currently live nodes: 2
   [junit4]   2> 81827 DEBUG (simCloudManagerPool-712-thread-4) [    ] o.a.s.c.o.ClusterStateMutator building a new cName: testNodeLost
   [junit4]   2> 81844 DEBUG (simCloudManagerPool-712-thread-4) [    ] o.a.s.c.s.c.a.PolicyHelper Creating a new session
   [junit4]   2> 81844 DEBUG (simCloudManagerPool-712-thread-4) [    ] o.a.s.c.s.c.a.PolicyHelper New session created 
   [junit4]   2> 81845 INFO  (simCloudManagerPool-712-thread-4) [    ] o.a.s.c.s.c.a.PolicyHelper returnSession, curr-time 5068791106 sessionWrapper.createTime 5068791076051926, this.sessionWrapper.createTime 5068791076051926 
   [junit4]   2> 81845 DEBUG (simCloudManagerPool-712-thread-4) [    ] o.a.s.c.s.c.a.PolicyHelper session set to NULL
   [junit4]   2> 81846 DEBUG (ScheduledTrigger-713-thread-3) [    ] o.a.s.c.a.NodeLostTrigger Running NodeLostTrigger: .auto_add_replicas with currently live nodes: 2
   [junit4]   2> 81848 DEBUG (ScheduledTrigger-713-thread-1) [    ] o.a.s.c.a.NodeLostTrigger Running NodeLostTrigger: node_lost_trigger with currently live nodes: 2
   [junit4]   2> 81878 DEBUG (ScheduledTrigger-713-thread-4) [    ] o.a.s.c.a.NodeLostTrigger Running NodeLostTrigger: .auto_add_replicas with currently live nodes: 2
   [junit4]   2> 81878 DEBUG (ScheduledTrigger-713-thread-2) [    ] o.a.s.c.a.NodeLostTrigger Running NodeLostTrigger: node_lost_trigger with currently live nodes: 2
   [junit4]   2> 81879 DEBUG (TEST-TestComputePlanAction.testNodeLost-seed#[3AA8AC705E40E918]) [    ] o.a.s.c.a.s.TestComputePlanAction -- cluster state: znodeVersion: 8
   [junit4]   2> live nodes:[127.0.0.1:10001_solr, 127.0.0.1:10004_solr]
   [junit4]   2> collections:{testNodeLost=DocCollection(testNodeLost//clusterstate.json/7)={
   [junit4]   2>   "replicationFactor":"2",
   [junit4]   2>   "pullReplicas":"0",
   [junit4]   2>   "router":{"name":"compositeId"},
   [junit4]   2>   "maxShardsPerNode":"1",
   [junit4]   2>   "autoAddReplicas":"false",
   [junit4]   2>   "nrtReplicas":"2",
   [junit4]   2>   "tlogReplicas":"0",
   [junit4]   2>   "autoCreated":"true",
   [junit4]   2>   "shards":{"shard1":{
   [junit4]   2>       "replicas":{
   [junit4]   2>         "core_node1":{
   [junit4]   2>           "node_name":"127.0.0.1:10004_solr",
   [junit4]   2>           "core":"testNodeLost_shard1_replica_n1",
   [junit4]   2>           "state":"active",
   [junit4]   2>           "type":"NRT",
   [junit4]   2>           "INDEX.sizeInBytes":123450000},
   [junit4]   2>         "core_node2":{
   [junit4]   2>           "node_name":"127.0.0.1:10001_solr",
   [junit4]   2>           "core":"testNodeLost_shard1_replica_n2",
   [junit4]   2>           "state":"active",
   [junit4]   2>           "type":"NRT",
   [junit4]   2>           "INDEX.sizeInBytes":123450000}},
   [junit4]   2>       "range":"80000000-7fffffff",
   [junit4]   2>       "state":"active"}}}}
   [junit4]   2> 81880 INFO  (TEST-TestComputePlanAction.testNodeLost-seed#[3AA8AC705E40E918]) [    ] o.a.s.c.a.s.TestComputePlanAction Stopped_node : 127.0.0.1:10004_solr
   [junit4]   2> 81881 DEBUG (simCloudManagerPool-712-thread-7) [    ] o.a.s.c.a.s.SimClusterStateProvider -- elected new leader for testNodeLost / shard1: {"core_node2":{
   [junit4]   2>     "node_name":"127.0.0.1:10001_solr",
   [junit4]   2>     "core":"testNodeLost_shard1_replica_n2",
   [junit4]   2>     "leader":"true",
   [junit4]   2>     "state":"active",
   [junit4]   2>     "type":"NRT",
   [junit4]   2>     "INDEX.sizeInBytes":123450000,
   [junit4]   2>     "shard":"shard1",
   [junit4]   2>     "collection":"testNodeLost"}}
   [junit4]   2> 81904 DEBUG (ScheduledTrigger-713-thread-4) [    ] o.a.s.c.a.NodeLostTrigger Running NodeLostTrigger: .auto_add_replicas with currently live nodes: 2
   [junit4]   2> 81904 DEBUG (ScheduledTrigger-713-thread-4) [    ] o.a.s.c.a.NodeLostTrigger Tracking lost node: 127.0.0.1:10004_solr
   [junit4]   2> 81905 DEBUG (ScheduledTrigger-713-thread-1) [    ] o.a.s.c.a.NodeLostTrigger Running NodeLostTrigger: node_lost_trigger with currently live nodes: 2
   [junit4]   2> 81905 DEBUG (ScheduledTrigger-713-thread-1) [    ] o.a.s.c.a.NodeLostTrigger Tracking lost node: 127.0.0.1:10004_solr
   [junit4]   2> 81929 DEBUG (ScheduledTrigger-713-thread-4) [    ] o.a.s.c.a.NodeLostTrigger Running NodeLostTrigger: .auto_add_replicas with currently live nodes: 2
   [junit4]   2> 81929 DEBUG (ScheduledTrigger-713-thread-2) [    ] o.a.s.c.a.NodeLostTrigger Running NodeLostTrigger: node_lost_trigger with currently live nodes: 2
   [junit4]   2> 81954 DEBUG (ScheduledTrigger-713-thread-3) [    ] o.a.s.c.a.NodeLostTrigger Running NodeLostTrigger: node_lost_trigger with currently live nodes: 2
   [junit4]   2> 81954 DEBUG (ScheduledTrigger-713-thread-4) [    ] o.a.s.c.a.NodeLostTrigger Running NodeLostTrigger: .auto_add_replicas with currently live nodes: 2
   [junit4]   2> 81975 DEBUG (ScheduledTrigger-713-thread-3) [    ] o.a.s.c.a.NodeLostTrigger Running NodeLostTrigger: node_lost_trigger with currently live nodes: 2
   [junit4]   2> 81975 DEBUG (ScheduledTrigger-713-thread-3) [    ] o.a.s.c.a.NodeLostTrigger Running NodeLostTrigger: .auto_add_replicas with currently live nodes: 2
   [junit4]   2> 82005 DEBUG (ScheduledTrigger-713-thread-3) [    ] o.a.s.c.a.NodeLostTrigger Running NodeLostTrigger: node_lost_trigger with currently live nodes: 2
   [junit4]   2> 82005 DEBUG (ScheduledTrigger-713-thread-4) [    ] o.a.s.c.a.NodeLostTrigger Running NodeLostTrigger: .auto_add_replicas with currently live nodes: 2
   [junit4]   2> 82031 DEBUG (ScheduledTrigger-713-thread-4) [    ] o.a.s.c.a.NodeLostTrigger Running NodeLostTrigger: node_lost_trigger with currently live nodes: 2
   [junit4]   2> 82031 DEBUG (ScheduledTrigger-713-thread-4) [    ] o.a.s.c.a.NodeLostTrigger Running NodeLostTrigger: .auto_add_replicas with currently live nodes: 2
   [junit4]   2> 82063 DEBUG (ScheduledTrigger-713-thread-2) [    ] o.a.s.c.a.NodeLostTrigger Running NodeLostTrigger: .auto_add_replicas with currently live nodes: 2
   [junit4]   2> 82063 DEBUG (ScheduledTrigger-713-thread-4) [    ] o.a.s.c.a.NodeLostTrigger Running NodeLostTrigger: node_lost_trigger with currently live nodes: 2
   [junit4]   2> 82064 DEBUG (ScheduledTrigger-713-thread-4) [    ] o.a.s.c.a.NodeLostTrigger NodeLostTrigger firing registered processor for lost nodes: [127.0.0.1:10004_solr]
   [junit4]   2> 82064 DEBUG (ScheduledTrigger-713-thread-4) [    ] o.a.s.c.a.ScheduledTriggers ++++++++ Cooldown inactive - processing event: {
   [junit4]   2>   "id":"12020a9911dd46T4hto6ulq6couwewhww1jdshcj",
   [junit4]   2>   "source":"node_lost_trigger",
   [junit4]   2>   "eventTime":5068794121805126,
   [junit4]   2>   "eventType":"NODELOST",
   [junit4]   2>   "properties":{
   [junit4]   2>     "eventTimes":[5068794121805126],
   [junit4]   2>     "nodeNames":["127.0.0.1:10004_solr"]}}
   [junit4]   2> 82065 DEBUG (AutoscalingActionExecutor-714-thread-1) [    ] o.a.s.c.a.ScheduledTriggers -- processing actions for {
   [junit4]   2>   "id":"12020a9911dd46T4hto6ulq6couwewhww1jdshcj",
   [junit4]   2>   "source":"node_lost_trigger",
   [junit4]   2>   "eventTime":5068794121805126,
   [junit4]   2>   "eventType":"NODELOST",
   [junit4]   2>   "properties":{
   [junit4]   2>     "eventTimes":[5068794121805126],
   [junit4]   2>     "_enqueue_time_":5068802055669726,
   [junit4]   2>     "nodeNames":["127.0.0.1:10004_solr"]}}
   [junit4]   2> 82065 DEBUG (AutoscalingActionExecutor-714-thread-1) [    ] o.a.s.c.a.ComputePlanAction -- processing event: {
   [junit4]   2>   "id":"12020a9911dd46T4hto6ulq6couwewhww1jdshcj",
   [junit4]   2>   "source":"node_lost_trigger",
   [junit4]   2>   "eventTime":5068794121805126,
   [junit4]   2>   "eventType":"NODELOST",
   [junit4]   2>   "properties":{
   [junit4]   2>     "eventTimes":[5068794121805126],
   [junit4]   2>     "_enqueue_time_":5068802055669726,
   [junit4]   2>     "nodeNames":["127.0.0.1:10004_solr"]}} with context properties: {BEFORE_ACTION=[compute_plan]}
   [junit4]   2> 82065 DEBUG (AutoscalingActionExecutor-714-thread-1) [    ] o.a.s.c.s.c.a.PolicyHelper Creating a new session
   [junit4]   2> 82066 DEBUG (AutoscalingActionExecutor-714-thread-1) [    ] o.a.s.c.s.c.a.PolicyHelper New session created 
   [junit4]   2> 82067 INFO  (AutoscalingActionExecutor-714-thread-1) [    ] o.a.s.c.a.ComputePlanAction Computed Plan: action=MOVEREPLICA&collection=testNodeLost&targetNode=127.0.0.1:10005_solr&inPlaceMove=true&replica=core_node1
   [junit4]   2> 82067 INFO  (AutoscalingActionExecutor-714-thread-1) [    ] o.a.s.c.s.c.a.PolicyHelper returnSession, curr-time 5068802200 sessionWrapper.createTime 5068802175105126, this.sessionWrapper.createTime 5068802175105126 
   [junit4]   2> 82067 DEBUG (AutoscalingActionExecutor-714-thread-1) [    ] o.a.s.c.s.c.a.PolicyHelper session set to NULL
   [junit4]   2> 82069 INFO  (TEST-TestComputePlanAction.testNodeLost-seed#[3AA8AC705E40E918]) [    ] o.a.s.c.a.s.TestComputePlanAction -------------_ FINAL STATE --------------
   [junit4]   2> 82069 INFO  (TEST-TestComputePlanAction.testNodeLost-seed#[3AA8AC705E40E918]) [    ] o.a.s.c.a.s.TestComputePlanAction * Node values: {
   [junit4]   2>   "127.0.0.1:10001_solr":{
   [junit4]   2>     "sysprop.java.vendor":"Oracle Corporation",
   [junit4]   2>     "cores":1,
   [junit4]   2>     "host":"127.0.0.1",
   [junit4]   2>     "freedisk":980,
   [junit4]   2>     "sysprop.java.version":"9",
   [junit4]   2>     "ip_1":"127",
   [junit4]   2>     "ip_3":"0",
   [junit4]   2>     "ip_2":"0",
   [junit4]   2>     "ip_4":"1",
   [junit4]   2>     "node":"127.0.0.1:10001_solr",
   [junit4]   2>     "metrics:solr.jvm:buffers.direct.Count":0,
   [junit4]   2>     "port":10001,
   [junit4]   2>     "heapUsage":123450000,
   [junit4]   2>     "sysLoadAvg":1.0,
   [junit4]   2>     "metrics:solr.node:ADMIN./admin/authorization.clientErrors:count":0},
   [junit4]   2>   "127.0.0.1:10004_solr":{
   [junit4]   2>     "sysprop.java.vendor":"Oracle Corporation",
   [junit4]   2>     "cores":1,
   [junit4]   2>     "host":"127.0.0.1",
   [junit4]   2>     "freedisk":990,
   [junit4]   2>     "sysprop.java.version":"9",
   [junit4]   2>     "ip_1":"127",
   [junit4]   2>     "ip_3":"0",
   [junit4]   2>     "ip_2":"0",
   [junit4]   2>     "ip_4":"1",
   [junit4]   2>     "node":"127.0.0.1:10004_solr",
   [junit4]   2>     "metrics:solr.jvm:buffers.direct.Count":0,
   [junit4]   2>     "port":10004,
   [junit4]   2>     "heapUsage":123450000,
   [junit4]   2>     "sysLoadAvg":1.0,
   [junit4]   2>     "metrics:solr.node:ADMIN./admin/authorization.clientErrors:count":0},
   [junit4]   2>   "127.0.0.1:10005_solr":{
   [junit4]   2>     "sysprop.java.vendor":"Oracle Corporation",
   [junit4]   2>     "cores":0,
   [junit4]   2>     "host":"127.0.0.1",
   [junit4]   2>     "freedisk":1000,
   [junit4]   2>     "s

[...truncated too long message...]

ers/jenkins/workspace/Lucene-Solr-master-MacOSX/solr/build/solr-solrj/test/temp/junit4-J1-20171227_034530_6709389806093619301643.syserr
   [junit4] >>> JVM J1 emitted unexpected output (verbatim) ----
   [junit4] Java HotSpot(TM) 64-Bit Server VM warning: Option UseConcMarkSweepGC was deprecated in version 9.0 and will likely be removed in a future release.
   [junit4] <<< JVM J1: EOF ----

[...truncated 3 lines...]
   [junit4] JVM J0: stderr was not empty, see: /Users/jenkins/workspace/Lucene-Solr-master-MacOSX/solr/build/solr-solrj/test/temp/junit4-J0-20171227_034530_67012825708438282632272.syserr
   [junit4] >>> JVM J0 emitted unexpected output (verbatim) ----
   [junit4] Java HotSpot(TM) 64-Bit Server VM warning: Option UseConcMarkSweepGC was deprecated in version 9.0 and will likely be removed in a future release.
   [junit4] <<< JVM J0: EOF ----

[...truncated 1463 lines...]
   [junit4] JVM J0: stderr was not empty, see: /Users/jenkins/workspace/Lucene-Solr-master-MacOSX/solr/build/contrib/solr-analysis-extras/test/temp/junit4-J0-20171227_034959_74515579078392868449351.syserr
   [junit4] >>> JVM J0 emitted unexpected output (verbatim) ----
   [junit4] Java HotSpot(TM) 64-Bit Server VM warning: Option UseConcMarkSweepGC was deprecated in version 9.0 and will likely be removed in a future release.
   [junit4] <<< JVM J0: EOF ----

   [junit4] JVM J1: stderr was not empty, see: /Users/jenkins/workspace/Lucene-Solr-master-MacOSX/solr/build/contrib/solr-analysis-extras/test/temp/junit4-J1-20171227_034959_74517276248776431814814.syserr
   [junit4] >>> JVM J1 emitted unexpected output (verbatim) ----
   [junit4] Java HotSpot(TM) 64-Bit Server VM warning: Option UseConcMarkSweepGC was deprecated in version 9.0 and will likely be removed in a future release.
   [junit4] <<< JVM J1: EOF ----

[...truncated 785 lines...]
   [junit4] JVM J0: stderr was not empty, see: /Users/jenkins/workspace/Lucene-Solr-master-MacOSX/solr/build/contrib/solr-analytics/test/temp/junit4-J0-20171227_035013_6604561261358479005851.syserr
   [junit4] >>> JVM J0 emitted unexpected output (verbatim) ----
   [junit4] Java HotSpot(TM) 64-Bit Server VM warning: Option UseConcMarkSweepGC was deprecated in version 9.0 and will likely be removed in a future release.
   [junit4] <<< JVM J0: EOF ----

   [junit4] JVM J1: stderr was not empty, see: /Users/jenkins/workspace/Lucene-Solr-master-MacOSX/solr/build/contrib/solr-analytics/test/temp/junit4-J1-20171227_035013_6602606629468934350094.syserr
   [junit4] >>> JVM J1 emitted unexpected output (verbatim) ----
   [junit4] Java HotSpot(TM) 64-Bit Server VM warning: Option UseConcMarkSweepGC was deprecated in version 9.0 and will likely be removed in a future release.
   [junit4] <<< JVM J1: EOF ----

[...truncated 553 lines...]
   [junit4] JVM J1: stderr was not empty, see: /Users/jenkins/workspace/Lucene-Solr-master-MacOSX/solr/build/contrib/solr-clustering/test/temp/junit4-J1-20171227_035115_33414589818203782061692.syserr
   [junit4] >>> JVM J1 emitted unexpected output (verbatim) ----
   [junit4] Java HotSpot(TM) 64-Bit Server VM warning: Option UseConcMarkSweepGC was deprecated in version 9.0 and will likely be removed in a future release.
   [junit4] <<< JVM J1: EOF ----

[...truncated 3 lines...]
   [junit4] JVM J0: stderr was not empty, see: /Users/jenkins/workspace/Lucene-Solr-master-MacOSX/solr/build/contrib/solr-clustering/test/temp/junit4-J0-20171227_035115_33417733930785290374178.syserr
   [junit4] >>> JVM J0 emitted unexpected output (verbatim) ----
   [junit4] Java HotSpot(TM) 64-Bit Server VM warning: Option UseConcMarkSweepGC was deprecated in version 9.0 and will likely be removed in a future release.
   [junit4] <<< JVM J0: EOF ----

[...truncated 1258 lines...]
   [junit4] JVM J1: stderr was not empty, see: /Users/jenkins/workspace/Lucene-Solr-master-MacOSX/solr/build/contrib/solr-dataimporthandler-extras/test/temp/junit4-J1-20171227_035134_5645816628394232677354.syserr
   [junit4] >>> JVM J1 emitted unexpected output (verbatim) ----
   [junit4] Java HotSpot(TM) 64-Bit Server VM warning: Option UseConcMarkSweepGC was deprecated in version 9.0 and will likely be removed in a future release.
   [junit4] <<< JVM J1: EOF ----

[...truncated 3 lines...]
   [junit4] JVM J0: stderr was not empty, see: /Users/jenkins/workspace/Lucene-Solr-master-MacOSX/solr/build/contrib/solr-dataimporthandler-extras/test/temp/junit4-J0-20171227_035134_5642525468873926263289.syserr
   [junit4] >>> JVM J0 emitted unexpected output (verbatim) ----
   [junit4] Java HotSpot(TM) 64-Bit Server VM warning: Option UseConcMarkSweepGC was deprecated in version 9.0 and will likely be removed in a future release.
   [junit4] <<< JVM J0: EOF ----

[...truncated 649 lines...]
   [junit4] JVM J0: stderr was not empty, see: /Users/jenkins/workspace/Lucene-Solr-master-MacOSX/solr/build/contrib/solr-dataimporthandler/test/temp/junit4-J0-20171227_035144_3702646609265949672876.syserr
   [junit4] >>> JVM J0 emitted unexpected output (verbatim) ----
   [junit4] Java HotSpot(TM) 64-Bit Server VM warning: Option UseConcMarkSweepGC was deprecated in version 9.0 and will likely be removed in a future release.
   [junit4] <<< JVM J0: EOF ----

   [junit4] JVM J1: stderr was not empty, see: /Users/jenkins/workspace/Lucene-Solr-master-MacOSX/solr/build/contrib/solr-dataimporthandler/test/temp/junit4-J1-20171227_035144_3707045254604783169087.syserr
   [junit4] >>> JVM J1 emitted unexpected output (verbatim) ----
   [junit4] Java HotSpot(TM) 64-Bit Server VM warning: Option UseConcMarkSweepGC was deprecated in version 9.0 and will likely be removed in a future release.
   [junit4] <<< JVM J1: EOF ----

[...truncated 555 lines...]
   [junit4] JVM J1: stderr was not empty, see: /Users/jenkins/workspace/Lucene-Solr-master-MacOSX/solr/build/contrib/solr-cell/test/temp/junit4-J1-20171227_035210_2842683217607406199060.syserr
   [junit4] >>> JVM J1 emitted unexpected output (verbatim) ----
   [junit4] Java HotSpot(TM) 64-Bit Server VM warning: Option UseConcMarkSweepGC was deprecated in version 9.0 and will likely be removed in a future release.
   [junit4] <<< JVM J1: EOF ----

[...truncated 6 lines...]
   [junit4] JVM J0: stderr was not empty, see: /Users/jenkins/workspace/Lucene-Solr-master-MacOSX/solr/build/contrib/solr-cell/test/temp/junit4-J0-20171227_035210_28411849452436107197160.syserr
   [junit4] >>> JVM J0 emitted unexpected output (verbatim) ----
   [junit4] Java HotSpot(TM) 64-Bit Server VM warning: Option UseConcMarkSweepGC was deprecated in version 9.0 and will likely be removed in a future release.
   [junit4] <<< JVM J0: EOF ----

[...truncated 561 lines...]
   [junit4] JVM J0: stderr was not empty, see: /Users/jenkins/workspace/Lucene-Solr-master-MacOSX/solr/build/contrib/solr-langid/test/temp/junit4-J0-20171227_035224_69014622500378628095132.syserr
   [junit4] >>> JVM J0 emitted unexpected output (verbatim) ----
   [junit4] Java HotSpot(TM) 64-Bit Server VM warning: Option UseConcMarkSweepGC was deprecated in version 9.0 and will likely be removed in a future release.
   [junit4] <<< JVM J0: EOF ----

   [junit4] JVM J1: stderr was not empty, see: /Users/jenkins/workspace/Lucene-Solr-master-MacOSX/solr/build/contrib/solr-langid/test/temp/junit4-J1-20171227_035224_6903397791646252942198.syserr
   [junit4] >>> JVM J1 emitted unexpected output (verbatim) ----
   [junit4] Java HotSpot(TM) 64-Bit Server VM warning: Option UseConcMarkSweepGC was deprecated in version 9.0 and will likely be removed in a future release.
   [junit4] <<< JVM J1: EOF ----

[...truncated 654 lines...]
   [junit4] JVM J1: stderr was not empty, see: /Users/jenkins/workspace/Lucene-Solr-master-MacOSX/solr/build/contrib/solr-ltr/test/temp/junit4-J1-20171227_035233_60213864284326198308840.syserr
   [junit4] >>> JVM J1 emitted unexpected output (verbatim) ----
   [junit4] Java HotSpot(TM) 64-Bit Server VM warning: Option UseConcMarkSweepGC was deprecated in version 9.0 and will likely be removed in a future release.
   [junit4] <<< JVM J1: EOF ----

[...truncated 3 lines...]
   [junit4] JVM J0: stderr was not empty, see: /Users/jenkins/workspace/Lucene-Solr-master-MacOSX/solr/build/contrib/solr-ltr/test/temp/junit4-J0-20171227_035233_60215457660499411302322.syserr
   [junit4] >>> JVM J0 emitted unexpected output (verbatim) ----
   [junit4] Java HotSpot(TM) 64-Bit Server VM warning: Option UseConcMarkSweepGC was deprecated in version 9.0 and will likely be removed in a future release.
   [junit4] <<< JVM J0: EOF ----

[...truncated 595 lines...]
   [junit4] JVM J1: stderr was not empty, see: /Users/jenkins/workspace/Lucene-Solr-master-MacOSX/solr/build/contrib/solr-uima/test/temp/junit4-J1-20171227_035303_5507508910898750725894.syserr
   [junit4] >>> JVM J1 emitted unexpected output (verbatim) ----
   [junit4] Java HotSpot(TM) 64-Bit Server VM warning: Option UseConcMarkSweepGC was deprecated in version 9.0 and will likely be removed in a future release.
   [junit4] <<< JVM J1: EOF ----

[...truncated 3 lines...]
   [junit4] JVM J0: stderr was not empty, see: /Users/jenkins/workspace/Lucene-Solr-master-MacOSX/solr/build/contrib/solr-uima/test/temp/junit4-J0-20171227_035303_55012552279220754485638.syserr
   [junit4] >>> JVM J0 emitted unexpected output (verbatim) ----
   [junit4] Java HotSpot(TM) 64-Bit Server VM warning: Option UseConcMarkSweepGC was deprecated in version 9.0 and will likely be removed in a future release.
   [junit4] <<< JVM J0: EOF ----

[...truncated 548 lines...]
   [junit4] JVM J0: stderr was not empty, see: /Users/jenkins/workspace/Lucene-Solr-master-MacOSX/solr/build/contrib/solr-velocity/test/temp/junit4-J0-20171227_035319_9876405979596771333251.syserr
   [junit4] >>> JVM J0 emitted unexpected output (verbatim) ----
   [junit4] Java HotSpot(TM) 64-Bit Server VM warning: Option UseConcMarkSweepGC was deprecated in version 9.0 and will likely be removed in a future release.
   [junit4] <<< JVM J0: EOF ----

[...truncated 32214 lines...]

Mime
View raw message