lucene-dev mailing list archives

Site index · List index
Message view « Date » · « Thread »
Top « Date » · « Thread »
From Policeman Jenkins Server <jenk...@thetaphi.de>
Subject [JENKINS] Lucene-Solr-master-Windows (64bit/jdk-9.0.1) - Build # 7069 - Still Unstable!
Date Sun, 24 Dec 2017 16:08:05 GMT
Build: https://jenkins.thetaphi.de/job/Lucene-Solr-master-Windows/7069/
Java: 64bit/jdk-9.0.1 -XX:-UseCompressedOops -XX:+UseSerialGC

5 tests failed.
FAILED:  junit.framework.TestSuite.org.apache.solr.cloud.CleanupOldIndexTest

Error Message:
Could not remove the following files (in the order of attempts):    C:\Users\jenkins\workspace\Lucene-Solr-master-Windows\solr\build\solr-core\test\J0\temp\solr.cloud.CleanupOldIndexTest_CE6CB3A2AD01D491-001\tempDir-001\node2\oldindextest_shard1_replica_n2\data\index: java.nio.file.DirectoryNotEmptyException: C:\Users\jenkins\workspace\Lucene-Solr-master-Windows\solr\build\solr-core\test\J0\temp\solr.cloud.CleanupOldIndexTest_CE6CB3A2AD01D491-001\tempDir-001\node2\oldindextest_shard1_replica_n2\data\index    C:\Users\jenkins\workspace\Lucene-Solr-master-Windows\solr\build\solr-core\test\J0\temp\solr.cloud.CleanupOldIndexTest_CE6CB3A2AD01D491-001\tempDir-001\node2\oldindextest_shard1_replica_n2\data: java.nio.file.DirectoryNotEmptyException: C:\Users\jenkins\workspace\Lucene-Solr-master-Windows\solr\build\solr-core\test\J0\temp\solr.cloud.CleanupOldIndexTest_CE6CB3A2AD01D491-001\tempDir-001\node2\oldindextest_shard1_replica_n2\data    C:\Users\jenkins\workspace\Lucene-Solr-master-Windows\solr\build\solr-core\test\J0\temp\solr.cloud.CleanupOldIndexTest_CE6CB3A2AD01D491-001\tempDir-001\node2\oldindextest_shard1_replica_n2: java.nio.file.DirectoryNotEmptyException: C:\Users\jenkins\workspace\Lucene-Solr-master-Windows\solr\build\solr-core\test\J0\temp\solr.cloud.CleanupOldIndexTest_CE6CB3A2AD01D491-001\tempDir-001\node2\oldindextest_shard1_replica_n2    C:\Users\jenkins\workspace\Lucene-Solr-master-Windows\solr\build\solr-core\test\J0\temp\solr.cloud.CleanupOldIndexTest_CE6CB3A2AD01D491-001\tempDir-001\node2: java.nio.file.DirectoryNotEmptyException: C:\Users\jenkins\workspace\Lucene-Solr-master-Windows\solr\build\solr-core\test\J0\temp\solr.cloud.CleanupOldIndexTest_CE6CB3A2AD01D491-001\tempDir-001\node2    C:\Users\jenkins\workspace\Lucene-Solr-master-Windows\solr\build\solr-core\test\J0\temp\solr.cloud.CleanupOldIndexTest_CE6CB3A2AD01D491-001\tempDir-001: java.nio.file.DirectoryNotEmptyException: C:\Users\jenkins\workspace\Lucene-Solr-master-Windows\solr\build\solr-core\test\J0\temp\solr.cloud.CleanupOldIndexTest_CE6CB3A2AD01D491-001\tempDir-001 

Stack Trace:
java.io.IOException: Could not remove the following files (in the order of attempts):
   C:\Users\jenkins\workspace\Lucene-Solr-master-Windows\solr\build\solr-core\test\J0\temp\solr.cloud.CleanupOldIndexTest_CE6CB3A2AD01D491-001\tempDir-001\node2\oldindextest_shard1_replica_n2\data\index: java.nio.file.DirectoryNotEmptyException: C:\Users\jenkins\workspace\Lucene-Solr-master-Windows\solr\build\solr-core\test\J0\temp\solr.cloud.CleanupOldIndexTest_CE6CB3A2AD01D491-001\tempDir-001\node2\oldindextest_shard1_replica_n2\data\index
   C:\Users\jenkins\workspace\Lucene-Solr-master-Windows\solr\build\solr-core\test\J0\temp\solr.cloud.CleanupOldIndexTest_CE6CB3A2AD01D491-001\tempDir-001\node2\oldindextest_shard1_replica_n2\data: java.nio.file.DirectoryNotEmptyException: C:\Users\jenkins\workspace\Lucene-Solr-master-Windows\solr\build\solr-core\test\J0\temp\solr.cloud.CleanupOldIndexTest_CE6CB3A2AD01D491-001\tempDir-001\node2\oldindextest_shard1_replica_n2\data
   C:\Users\jenkins\workspace\Lucene-Solr-master-Windows\solr\build\solr-core\test\J0\temp\solr.cloud.CleanupOldIndexTest_CE6CB3A2AD01D491-001\tempDir-001\node2\oldindextest_shard1_replica_n2: java.nio.file.DirectoryNotEmptyException: C:\Users\jenkins\workspace\Lucene-Solr-master-Windows\solr\build\solr-core\test\J0\temp\solr.cloud.CleanupOldIndexTest_CE6CB3A2AD01D491-001\tempDir-001\node2\oldindextest_shard1_replica_n2
   C:\Users\jenkins\workspace\Lucene-Solr-master-Windows\solr\build\solr-core\test\J0\temp\solr.cloud.CleanupOldIndexTest_CE6CB3A2AD01D491-001\tempDir-001\node2: java.nio.file.DirectoryNotEmptyException: C:\Users\jenkins\workspace\Lucene-Solr-master-Windows\solr\build\solr-core\test\J0\temp\solr.cloud.CleanupOldIndexTest_CE6CB3A2AD01D491-001\tempDir-001\node2
   C:\Users\jenkins\workspace\Lucene-Solr-master-Windows\solr\build\solr-core\test\J0\temp\solr.cloud.CleanupOldIndexTest_CE6CB3A2AD01D491-001\tempDir-001: java.nio.file.DirectoryNotEmptyException: C:\Users\jenkins\workspace\Lucene-Solr-master-Windows\solr\build\solr-core\test\J0\temp\solr.cloud.CleanupOldIndexTest_CE6CB3A2AD01D491-001\tempDir-001

	at __randomizedtesting.SeedInfo.seed([CE6CB3A2AD01D491]:0)
	at org.apache.lucene.util.IOUtils.rm(IOUtils.java:329)
	at org.apache.lucene.util.TestRuleTemporaryFilesCleanup.afterAlways(TestRuleTemporaryFilesCleanup.java:216)
	at com.carrotsearch.randomizedtesting.rules.TestRuleAdapter$1.afterAlways(TestRuleAdapter.java:31)
	at com.carrotsearch.randomizedtesting.rules.StatementAdapter.evaluate(StatementAdapter.java:43)
	at com.carrotsearch.randomizedtesting.rules.StatementAdapter.evaluate(StatementAdapter.java:36)
	at org.apache.lucene.util.TestRuleAssertionsRequired$1.evaluate(TestRuleAssertionsRequired.java:53)
	at org.apache.lucene.util.TestRuleMarkFailure$1.evaluate(TestRuleMarkFailure.java:47)
	at org.apache.lucene.util.TestRuleIgnoreAfterMaxFailures$1.evaluate(TestRuleIgnoreAfterMaxFailures.java:64)
	at org.apache.lucene.util.TestRuleIgnoreTestSuites$1.evaluate(TestRuleIgnoreTestSuites.java:54)
	at com.carrotsearch.randomizedtesting.rules.StatementAdapter.evaluate(StatementAdapter.java:36)
	at com.carrotsearch.randomizedtesting.ThreadLeakControl$StatementRunner.run(ThreadLeakControl.java:368)
	at java.base/java.lang.Thread.run(Thread.java:844)


FAILED:  org.apache.solr.cloud.autoscaling.sim.TestGenericDistributedQueue.testDistributedQueue

Error Message:
Test abandoned because suite timeout was reached.

Stack Trace:
java.lang.Exception: Test abandoned because suite timeout was reached.
	at __randomizedtesting.SeedInfo.seed([CE6CB3A2AD01D491]:0)


FAILED:  junit.framework.TestSuite.org.apache.solr.cloud.autoscaling.sim.TestGenericDistributedQueue

Error Message:
Suite timeout exceeded (>= 7200000 msec).

Stack Trace:
java.lang.Exception: Suite timeout exceeded (>= 7200000 msec).
	at __randomizedtesting.SeedInfo.seed([CE6CB3A2AD01D491]:0)


FAILED:  org.apache.solr.cloud.autoscaling.sim.TestTriggerIntegration.testNodeLostTriggerRestoreState

Error Message:


Stack Trace:
java.util.ConcurrentModificationException
	at __randomizedtesting.SeedInfo.seed([CE6CB3A2AD01D491:E59366F93779C141]:0)
	at java.base/java.util.ArrayList$Itr.checkForComodification(ArrayList.java:939)
	at java.base/java.util.ArrayList$Itr.next(ArrayList.java:893)
	at org.apache.solr.cloud.autoscaling.sim.SimSolrCloudTestCase.tearDown(SimSolrCloudTestCase.java:141)
	at jdk.internal.reflect.GeneratedMethodAccessor11.invoke(Unknown Source)
	at java.base/jdk.internal.reflect.DelegatingMethodAccessorImpl.invoke(DelegatingMethodAccessorImpl.java:43)
	at java.base/java.lang.reflect.Method.invoke(Method.java:564)
	at com.carrotsearch.randomizedtesting.RandomizedRunner.invoke(RandomizedRunner.java:1737)
	at com.carrotsearch.randomizedtesting.RandomizedRunner$10.evaluate(RandomizedRunner.java:992)
	at com.carrotsearch.randomizedtesting.rules.SystemPropertiesRestoreRule$1.evaluate(SystemPropertiesRestoreRule.java:57)
	at org.apache.lucene.util.TestRuleSetupTeardownChained$1.evaluate(TestRuleSetupTeardownChained.java:49)
	at org.apache.lucene.util.AbstractBeforeAfterRule$1.evaluate(AbstractBeforeAfterRule.java:45)
	at org.apache.lucene.util.TestRuleThreadAndTestName$1.evaluate(TestRuleThreadAndTestName.java:48)
	at org.apache.lucene.util.TestRuleIgnoreAfterMaxFailures$1.evaluate(TestRuleIgnoreAfterMaxFailures.java:64)
	at org.apache.lucene.util.TestRuleMarkFailure$1.evaluate(TestRuleMarkFailure.java:47)
	at com.carrotsearch.randomizedtesting.rules.StatementAdapter.evaluate(StatementAdapter.java:36)
	at com.carrotsearch.randomizedtesting.ThreadLeakControl$StatementRunner.run(ThreadLeakControl.java:368)
	at com.carrotsearch.randomizedtesting.ThreadLeakControl.forkTimeoutingTask(ThreadLeakControl.java:817)
	at com.carrotsearch.randomizedtesting.ThreadLeakControl$3.evaluate(ThreadLeakControl.java:468)
	at com.carrotsearch.randomizedtesting.RandomizedRunner.runSingleTest(RandomizedRunner.java:943)
	at com.carrotsearch.randomizedtesting.RandomizedRunner$5.evaluate(RandomizedRunner.java:829)
	at com.carrotsearch.randomizedtesting.RandomizedRunner$6.evaluate(RandomizedRunner.java:879)
	at com.carrotsearch.randomizedtesting.RandomizedRunner$7.evaluate(RandomizedRunner.java:890)
	at com.carrotsearch.randomizedtesting.rules.StatementAdapter.evaluate(StatementAdapter.java:36)
	at com.carrotsearch.randomizedtesting.rules.SystemPropertiesRestoreRule$1.evaluate(SystemPropertiesRestoreRule.java:57)
	at org.apache.lucene.util.AbstractBeforeAfterRule$1.evaluate(AbstractBeforeAfterRule.java:45)
	at com.carrotsearch.randomizedtesting.rules.StatementAdapter.evaluate(StatementAdapter.java:36)
	at org.apache.lucene.util.TestRuleStoreClassName$1.evaluate(TestRuleStoreClassName.java:41)
	at com.carrotsearch.randomizedtesting.rules.NoShadowingOrOverridesOnMethodsRule$1.evaluate(NoShadowingOrOverridesOnMethodsRule.java:40)
	at com.carrotsearch.randomizedtesting.rules.NoShadowingOrOverridesOnMethodsRule$1.evaluate(NoShadowingOrOverridesOnMethodsRule.java:40)
	at com.carrotsearch.randomizedtesting.rules.StatementAdapter.evaluate(StatementAdapter.java:36)
	at com.carrotsearch.randomizedtesting.rules.StatementAdapter.evaluate(StatementAdapter.java:36)
	at org.apache.lucene.util.TestRuleAssertionsRequired$1.evaluate(TestRuleAssertionsRequired.java:53)
	at org.apache.lucene.util.TestRuleMarkFailure$1.evaluate(TestRuleMarkFailure.java:47)
	at org.apache.lucene.util.TestRuleIgnoreAfterMaxFailures$1.evaluate(TestRuleIgnoreAfterMaxFailures.java:64)
	at org.apache.lucene.util.TestRuleIgnoreTestSuites$1.evaluate(TestRuleIgnoreTestSuites.java:54)
	at com.carrotsearch.randomizedtesting.rules.StatementAdapter.evaluate(StatementAdapter.java:36)
	at com.carrotsearch.randomizedtesting.ThreadLeakControl$StatementRunner.run(ThreadLeakControl.java:368)
	at java.base/java.lang.Thread.run(Thread.java:844)


FAILED:  junit.framework.TestSuite.org.apache.solr.update.processor.TestOpenNLPExtractNamedEntitiesUpdateProcessorFactory

Error Message:
Could not remove the following files (in the order of attempts):    C:\Users\jenkins\workspace\Lucene-Solr-master-Windows\solr\build\contrib\solr-analysis-extras\test\J1\temp\solr.update.processor.TestOpenNLPExtractNamedEntitiesUpdateProcessorFactory_45BC7C03843AA516-001\tempDir-001\collection1\conf: java.nio.file.DirectoryNotEmptyException: C:\Users\jenkins\workspace\Lucene-Solr-master-Windows\solr\build\contrib\solr-analysis-extras\test\J1\temp\solr.update.processor.TestOpenNLPExtractNamedEntitiesUpdateProcessorFactory_45BC7C03843AA516-001\tempDir-001\collection1\conf    C:\Users\jenkins\workspace\Lucene-Solr-master-Windows\solr\build\contrib\solr-analysis-extras\test\J1\temp\solr.update.processor.TestOpenNLPExtractNamedEntitiesUpdateProcessorFactory_45BC7C03843AA516-001\tempDir-001\collection1: java.nio.file.DirectoryNotEmptyException: C:\Users\jenkins\workspace\Lucene-Solr-master-Windows\solr\build\contrib\solr-analysis-extras\test\J1\temp\solr.update.processor.TestOpenNLPExtractNamedEntitiesUpdateProcessorFactory_45BC7C03843AA516-001\tempDir-001\collection1    C:\Users\jenkins\workspace\Lucene-Solr-master-Windows\solr\build\contrib\solr-analysis-extras\test\J1\temp\solr.update.processor.TestOpenNLPExtractNamedEntitiesUpdateProcessorFactory_45BC7C03843AA516-001\tempDir-001: java.nio.file.DirectoryNotEmptyException: C:\Users\jenkins\workspace\Lucene-Solr-master-Windows\solr\build\contrib\solr-analysis-extras\test\J1\temp\solr.update.processor.TestOpenNLPExtractNamedEntitiesUpdateProcessorFactory_45BC7C03843AA516-001\tempDir-001    C:\Users\jenkins\workspace\Lucene-Solr-master-Windows\solr\build\contrib\solr-analysis-extras\test\J1\temp\solr.update.processor.TestOpenNLPExtractNamedEntitiesUpdateProcessorFactory_45BC7C03843AA516-001\tempDir-001\collection1\conf\en-test-sent.bin: java.nio.file.AccessDeniedException: C:\Users\jenkins\workspace\Lucene-Solr-master-Windows\solr\build\contrib\solr-analysis-extras\test\J1\temp\solr.update.processor.TestOpenNLPExtractNamedEntitiesUpdateProcessorFactory_45BC7C03843AA516-001\tempDir-001\collection1\conf\en-test-sent.bin    C:\Users\jenkins\workspace\Lucene-Solr-master-Windows\solr\build\contrib\solr-analysis-extras\test\J1\temp\solr.update.processor.TestOpenNLPExtractNamedEntitiesUpdateProcessorFactory_45BC7C03843AA516-001\tempDir-001\collection1\conf\en-test-ner-person.bin: java.nio.file.AccessDeniedException: C:\Users\jenkins\workspace\Lucene-Solr-master-Windows\solr\build\contrib\solr-analysis-extras\test\J1\temp\solr.update.processor.TestOpenNLPExtractNamedEntitiesUpdateProcessorFactory_45BC7C03843AA516-001\tempDir-001\collection1\conf\en-test-ner-person.bin    C:\Users\jenkins\workspace\Lucene-Solr-master-Windows\solr\build\contrib\solr-analysis-extras\test\J1\temp\solr.update.processor.TestOpenNLPExtractNamedEntitiesUpdateProcessorFactory_45BC7C03843AA516-001\tempDir-001\collection1\conf\en-test-tokenizer.bin: java.nio.file.AccessDeniedException: C:\Users\jenkins\workspace\Lucene-Solr-master-Windows\solr\build\contrib\solr-analysis-extras\test\J1\temp\solr.update.processor.TestOpenNLPExtractNamedEntitiesUpdateProcessorFactory_45BC7C03843AA516-001\tempDir-001\collection1\conf\en-test-tokenizer.bin    C:\Users\jenkins\workspace\Lucene-Solr-master-Windows\solr\build\contrib\solr-analysis-extras\test\J1\temp\solr.update.processor.TestOpenNLPExtractNamedEntitiesUpdateProcessorFactory_45BC7C03843AA516-001: java.nio.file.DirectoryNotEmptyException: C:\Users\jenkins\workspace\Lucene-Solr-master-Windows\solr\build\contrib\solr-analysis-extras\test\J1\temp\solr.update.processor.TestOpenNLPExtractNamedEntitiesUpdateProcessorFactory_45BC7C03843AA516-001 

Stack Trace:
java.io.IOException: Could not remove the following files (in the order of attempts):
   C:\Users\jenkins\workspace\Lucene-Solr-master-Windows\solr\build\contrib\solr-analysis-extras\test\J1\temp\solr.update.processor.TestOpenNLPExtractNamedEntitiesUpdateProcessorFactory_45BC7C03843AA516-001\tempDir-001\collection1\conf: java.nio.file.DirectoryNotEmptyException: C:\Users\jenkins\workspace\Lucene-Solr-master-Windows\solr\build\contrib\solr-analysis-extras\test\J1\temp\solr.update.processor.TestOpenNLPExtractNamedEntitiesUpdateProcessorFactory_45BC7C03843AA516-001\tempDir-001\collection1\conf
   C:\Users\jenkins\workspace\Lucene-Solr-master-Windows\solr\build\contrib\solr-analysis-extras\test\J1\temp\solr.update.processor.TestOpenNLPExtractNamedEntitiesUpdateProcessorFactory_45BC7C03843AA516-001\tempDir-001\collection1: java.nio.file.DirectoryNotEmptyException: C:\Users\jenkins\workspace\Lucene-Solr-master-Windows\solr\build\contrib\solr-analysis-extras\test\J1\temp\solr.update.processor.TestOpenNLPExtractNamedEntitiesUpdateProcessorFactory_45BC7C03843AA516-001\tempDir-001\collection1
   C:\Users\jenkins\workspace\Lucene-Solr-master-Windows\solr\build\contrib\solr-analysis-extras\test\J1\temp\solr.update.processor.TestOpenNLPExtractNamedEntitiesUpdateProcessorFactory_45BC7C03843AA516-001\tempDir-001: java.nio.file.DirectoryNotEmptyException: C:\Users\jenkins\workspace\Lucene-Solr-master-Windows\solr\build\contrib\solr-analysis-extras\test\J1\temp\solr.update.processor.TestOpenNLPExtractNamedEntitiesUpdateProcessorFactory_45BC7C03843AA516-001\tempDir-001
   C:\Users\jenkins\workspace\Lucene-Solr-master-Windows\solr\build\contrib\solr-analysis-extras\test\J1\temp\solr.update.processor.TestOpenNLPExtractNamedEntitiesUpdateProcessorFactory_45BC7C03843AA516-001\tempDir-001\collection1\conf\en-test-sent.bin: java.nio.file.AccessDeniedException: C:\Users\jenkins\workspace\Lucene-Solr-master-Windows\solr\build\contrib\solr-analysis-extras\test\J1\temp\solr.update.processor.TestOpenNLPExtractNamedEntitiesUpdateProcessorFactory_45BC7C03843AA516-001\tempDir-001\collection1\conf\en-test-sent.bin
   C:\Users\jenkins\workspace\Lucene-Solr-master-Windows\solr\build\contrib\solr-analysis-extras\test\J1\temp\solr.update.processor.TestOpenNLPExtractNamedEntitiesUpdateProcessorFactory_45BC7C03843AA516-001\tempDir-001\collection1\conf\en-test-ner-person.bin: java.nio.file.AccessDeniedException: C:\Users\jenkins\workspace\Lucene-Solr-master-Windows\solr\build\contrib\solr-analysis-extras\test\J1\temp\solr.update.processor.TestOpenNLPExtractNamedEntitiesUpdateProcessorFactory_45BC7C03843AA516-001\tempDir-001\collection1\conf\en-test-ner-person.bin
   C:\Users\jenkins\workspace\Lucene-Solr-master-Windows\solr\build\contrib\solr-analysis-extras\test\J1\temp\solr.update.processor.TestOpenNLPExtractNamedEntitiesUpdateProcessorFactory_45BC7C03843AA516-001\tempDir-001\collection1\conf\en-test-tokenizer.bin: java.nio.file.AccessDeniedException: C:\Users\jenkins\workspace\Lucene-Solr-master-Windows\solr\build\contrib\solr-analysis-extras\test\J1\temp\solr.update.processor.TestOpenNLPExtractNamedEntitiesUpdateProcessorFactory_45BC7C03843AA516-001\tempDir-001\collection1\conf\en-test-tokenizer.bin
   C:\Users\jenkins\workspace\Lucene-Solr-master-Windows\solr\build\contrib\solr-analysis-extras\test\J1\temp\solr.update.processor.TestOpenNLPExtractNamedEntitiesUpdateProcessorFactory_45BC7C03843AA516-001: java.nio.file.DirectoryNotEmptyException: C:\Users\jenkins\workspace\Lucene-Solr-master-Windows\solr\build\contrib\solr-analysis-extras\test\J1\temp\solr.update.processor.TestOpenNLPExtractNamedEntitiesUpdateProcessorFactory_45BC7C03843AA516-001

	at __randomizedtesting.SeedInfo.seed([45BC7C03843AA516]:0)
	at org.apache.lucene.util.IOUtils.rm(IOUtils.java:329)
	at org.apache.lucene.util.TestRuleTemporaryFilesCleanup.afterAlways(TestRuleTemporaryFilesCleanup.java:216)
	at com.carrotsearch.randomizedtesting.rules.TestRuleAdapter$1.afterAlways(TestRuleAdapter.java:31)
	at com.carrotsearch.randomizedtesting.rules.StatementAdapter.evaluate(StatementAdapter.java:43)
	at com.carrotsearch.randomizedtesting.rules.StatementAdapter.evaluate(StatementAdapter.java:36)
	at org.apache.lucene.util.TestRuleAssertionsRequired$1.evaluate(TestRuleAssertionsRequired.java:53)
	at org.apache.lucene.util.TestRuleMarkFailure$1.evaluate(TestRuleMarkFailure.java:47)
	at org.apache.lucene.util.TestRuleIgnoreAfterMaxFailures$1.evaluate(TestRuleIgnoreAfterMaxFailures.java:64)
	at org.apache.lucene.util.TestRuleIgnoreTestSuites$1.evaluate(TestRuleIgnoreTestSuites.java:54)
	at com.carrotsearch.randomizedtesting.rules.StatementAdapter.evaluate(StatementAdapter.java:36)
	at com.carrotsearch.randomizedtesting.ThreadLeakControl$StatementRunner.run(ThreadLeakControl.java:368)
	at java.base/java.lang.Thread.run(Thread.java:844)




Build Log:
[...truncated 12809 lines...]
   [junit4] Suite: org.apache.solr.cloud.CleanupOldIndexTest
   [junit4]   2> Creating dataDir: C:\Users\jenkins\workspace\Lucene-Solr-master-Windows\solr\build\solr-core\test\J0\temp\solr.cloud.CleanupOldIndexTest_CE6CB3A2AD01D491-001\init-core-data-001
   [junit4]   2> 3014274 WARN  (SUITE-CleanupOldIndexTest-seed#[CE6CB3A2AD01D491]-worker) [    ] o.a.s.SolrTestCaseJ4 startTrackingSearchers: numOpens=15 numCloses=15
   [junit4]   2> 3014274 INFO  (SUITE-CleanupOldIndexTest-seed#[CE6CB3A2AD01D491]-worker) [    ] o.a.s.SolrTestCaseJ4 Using PointFields (NUMERIC_POINTS_SYSPROP=true) w/NUMERIC_DOCVALUES_SYSPROP=true
   [junit4]   2> 3014278 INFO  (SUITE-CleanupOldIndexTest-seed#[CE6CB3A2AD01D491]-worker) [    ] o.a.s.SolrTestCaseJ4 Randomized ssl (false) and clientAuth (false) via: @org.apache.solr.util.RandomizeSSL(reason="", value=0.0/0.0, ssl=0.0/0.0, clientAuth=0.0/0.0)
   [junit4]   2> 3014278 INFO  (SUITE-CleanupOldIndexTest-seed#[CE6CB3A2AD01D491]-worker) [    ] o.a.s.SolrTestCaseJ4 SecureRandom sanity checks: test.solr.allowed.securerandom=null & java.security.egd=file:/dev/./urandom
   [junit4]   2> 3014279 INFO  (SUITE-CleanupOldIndexTest-seed#[CE6CB3A2AD01D491]-worker) [    ] o.a.s.c.MiniSolrCloudCluster Starting cluster of 2 servers in C:\Users\jenkins\workspace\Lucene-Solr-master-Windows\solr\build\solr-core\test\J0\temp\solr.cloud.CleanupOldIndexTest_CE6CB3A2AD01D491-001\tempDir-001
   [junit4]   2> 3014280 INFO  (SUITE-CleanupOldIndexTest-seed#[CE6CB3A2AD01D491]-worker) [    ] o.a.s.c.ZkTestServer STARTING ZK TEST SERVER
   [junit4]   2> 3014281 INFO  (Thread-5857) [    ] o.a.s.c.ZkTestServer client port:0.0.0.0/0.0.0.0:0
   [junit4]   2> 3014281 INFO  (Thread-5857) [    ] o.a.s.c.ZkTestServer Starting server
   [junit4]   2> 3014287 ERROR (Thread-5857) [    ] o.a.z.s.ZooKeeperServer ZKShutdownHandler is not registered, so ZooKeeper server won't take any action on ERROR or SHUTDOWN server state changes
   [junit4]   2> 3014382 INFO  (SUITE-CleanupOldIndexTest-seed#[CE6CB3A2AD01D491]-worker) [    ] o.a.s.c.ZkTestServer start zk server on port:62472
   [junit4]   2> 3014387 INFO  (zkConnectionManagerCallback-7153-thread-1) [    ] o.a.s.c.c.ConnectionManager zkClient has connected
   [junit4]   2> 3014392 INFO  (jetty-launcher-7150-thread-2) [    ] o.e.j.s.Server jetty-9.3.20.v20170531
   [junit4]   2> 3014393 INFO  (jetty-launcher-7150-thread-1) [    ] o.e.j.s.Server jetty-9.3.20.v20170531
   [junit4]   2> 3014394 INFO  (jetty-launcher-7150-thread-1) [    ] o.e.j.s.h.ContextHandler Started o.e.j.s.ServletContextHandler@f5c6f0e{/solr,null,AVAILABLE}
   [junit4]   2> 3014396 INFO  (jetty-launcher-7150-thread-1) [    ] o.e.j.s.AbstractConnector Started ServerConnector@5e3442f6{HTTP/1.1,[http/1.1]}{127.0.0.1:62476}
   [junit4]   2> 3014396 INFO  (jetty-launcher-7150-thread-1) [    ] o.e.j.s.Server Started @3024173ms
   [junit4]   2> 3014396 INFO  (jetty-launcher-7150-thread-1) [    ] o.a.s.c.s.e.JettySolrRunner Jetty properties: {hostContext=/solr, hostPort=62476}
   [junit4]   2> 3014397 ERROR (jetty-launcher-7150-thread-1) [    ] o.a.s.u.StartupLoggingUtils Missing Java Option solr.log.dir. Logging may be missing or incomplete.
   [junit4]   2> 3014397 INFO  (jetty-launcher-7150-thread-2) [    ] o.e.j.s.h.ContextHandler Started o.e.j.s.ServletContextHandler@2f7d200e{/solr,null,AVAILABLE}
   [junit4]   2> 3014397 INFO  (jetty-launcher-7150-thread-1) [    ] o.a.s.s.SolrDispatchFilter  ___      _       Welcome to Apache Solr? version 8.0.0
   [junit4]   2> 3014397 INFO  (jetty-launcher-7150-thread-1) [    ] o.a.s.s.SolrDispatchFilter / __| ___| |_ _   Starting in cloud mode on port null
   [junit4]   2> 3014397 INFO  (jetty-launcher-7150-thread-1) [    ] o.a.s.s.SolrDispatchFilter \__ \/ _ \ | '_|  Install dir: null
   [junit4]   2> 3014398 INFO  (jetty-launcher-7150-thread-1) [    ] o.a.s.s.SolrDispatchFilter |___/\___/_|_|    Start time: 2017-12-24T14:19:25.353314800Z
   [junit4]   2> 3014398 INFO  (jetty-launcher-7150-thread-2) [    ] o.e.j.s.AbstractConnector Started ServerConnector@7012f7{HTTP/1.1,[http/1.1]}{127.0.0.1:62479}
   [junit4]   2> 3014398 INFO  (jetty-launcher-7150-thread-2) [    ] o.e.j.s.Server Started @3024175ms
   [junit4]   2> 3014398 INFO  (jetty-launcher-7150-thread-2) [    ] o.a.s.c.s.e.JettySolrRunner Jetty properties: {hostContext=/solr, hostPort=62479}
   [junit4]   2> 3014399 ERROR (jetty-launcher-7150-thread-2) [    ] o.a.s.u.StartupLoggingUtils Missing Java Option solr.log.dir. Logging may be missing or incomplete.
   [junit4]   2> 3014399 INFO  (jetty-launcher-7150-thread-2) [    ] o.a.s.s.SolrDispatchFilter  ___      _       Welcome to Apache Solr? version 8.0.0
   [junit4]   2> 3014399 INFO  (jetty-launcher-7150-thread-2) [    ] o.a.s.s.SolrDispatchFilter / __| ___| |_ _   Starting in cloud mode on port null
   [junit4]   2> 3014399 INFO  (jetty-launcher-7150-thread-2) [    ] o.a.s.s.SolrDispatchFilter \__ \/ _ \ | '_|  Install dir: null
   [junit4]   2> 3014400 INFO  (jetty-launcher-7150-thread-2) [    ] o.a.s.s.SolrDispatchFilter |___/\___/_|_|    Start time: 2017-12-24T14:19:25.356099500Z
   [junit4]   2> 3014405 INFO  (zkConnectionManagerCallback-7155-thread-1) [    ] o.a.s.c.c.ConnectionManager zkClient has connected
   [junit4]   2> 3014405 INFO  (zkConnectionManagerCallback-7157-thread-1) [    ] o.a.s.c.c.ConnectionManager zkClient has connected
   [junit4]   2> 3014406 INFO  (jetty-launcher-7150-thread-2) [    ] o.a.s.s.SolrDispatchFilter solr.xml found in ZooKeeper. Loading...
   [junit4]   2> 3014407 INFO  (jetty-launcher-7150-thread-1) [    ] o.a.s.s.SolrDispatchFilter solr.xml found in ZooKeeper. Loading...
   [junit4]   2> 3014414 WARN  (NIOServerCxn.Factory:0.0.0.0/0.0.0.0:0) [    ] o.a.z.s.NIOServerCnxn caught end of stream exception
   [junit4]   2> EndOfStreamException: Unable to read additional data from client sessionid 0x16088e482bb0001, likely client has closed socket
   [junit4]   2> 	at org.apache.zookeeper.server.NIOServerCnxn.doIO(NIOServerCnxn.java:239)
   [junit4]   2> 	at org.apache.zookeeper.server.NIOServerCnxnFactory.run(NIOServerCnxnFactory.java:203)
   [junit4]   2> 	at java.base/java.lang.Thread.run(Thread.java:844)
   [junit4]   2> 3014419 INFO  (jetty-launcher-7150-thread-1) [    ] o.a.s.c.ZkContainer Zookeeper client=127.0.0.1:62472/solr
   [junit4]   2> 3014422 INFO  (jetty-launcher-7150-thread-2) [    ] o.a.s.c.ZkContainer Zookeeper client=127.0.0.1:62472/solr
   [junit4]   2> 3014424 INFO  (zkConnectionManagerCallback-7161-thread-1) [    ] o.a.s.c.c.ConnectionManager zkClient has connected
   [junit4]   2> 3014425 WARN  (NIOServerCxn.Factory:0.0.0.0/0.0.0.0:0) [    ] o.a.z.s.NIOServerCnxn caught end of stream exception
   [junit4]   2> EndOfStreamException: Unable to read additional data from client sessionid 0x16088e482bb0003, likely client has closed socket
   [junit4]   2> 	at org.apache.zookeeper.server.NIOServerCnxn.doIO(NIOServerCnxn.java:239)
   [junit4]   2> 	at org.apache.zookeeper.server.NIOServerCnxnFactory.run(NIOServerCnxnFactory.java:203)
   [junit4]   2> 	at java.base/java.lang.Thread.run(Thread.java:844)
   [junit4]   2> 3014428 INFO  (zkConnectionManagerCallback-7165-thread-1) [    ] o.a.s.c.c.ConnectionManager zkClient has connected
   [junit4]   2> 3014430 INFO  (zkConnectionManagerCallback-7167-thread-1-processing-n:127.0.0.1:62476_solr) [n:127.0.0.1:62476_solr    ] o.a.s.c.c.ConnectionManager zkClient has connected
   [junit4]   2> 3014436 INFO  (zkConnectionManagerCallback-7169-thread-1-processing-n:127.0.0.1:62479_solr) [n:127.0.0.1:62479_solr    ] o.a.s.c.c.ConnectionManager zkClient has connected
   [junit4]   2> 3014633 INFO  (jetty-launcher-7150-thread-2) [n:127.0.0.1:62479_solr    ] o.a.s.c.Overseer Overseer (id=null) closing
   [junit4]   2> 3014634 INFO  (jetty-launcher-7150-thread-1) [n:127.0.0.1:62476_solr    ] o.a.s.c.Overseer Overseer (id=null) closing
   [junit4]   2> 3014635 INFO  (jetty-launcher-7150-thread-2) [n:127.0.0.1:62479_solr    ] o.a.s.c.OverseerElectionContext I am going to be the leader 127.0.0.1:62479_solr
   [junit4]   2> 3014636 INFO  (jetty-launcher-7150-thread-2) [n:127.0.0.1:62479_solr    ] o.a.s.c.Overseer Overseer (id=99229706829365254-127.0.0.1:62479_solr-n_0000000000) starting
   [junit4]   2> 3014637 INFO  (jetty-launcher-7150-thread-1) [n:127.0.0.1:62476_solr    ] o.a.s.c.ZkController Register node as live in ZooKeeper:/live_nodes/127.0.0.1:62476_solr
   [junit4]   2> 3014637 INFO  (zkCallback-7166-thread-1-processing-n:127.0.0.1:62476_solr) [n:127.0.0.1:62476_solr    ] o.a.s.c.c.ZkStateReader Updated live nodes from ZooKeeper... (0) -> (1)
   [junit4]   2> 3014641 INFO  (zkCallback-7168-thread-1-processing-n:127.0.0.1:62479_solr) [n:127.0.0.1:62479_solr    ] o.a.s.c.c.ZkStateReader Updated live nodes from ZooKeeper... (0) -> (1)
   [junit4]   2> 3014655 INFO  (jetty-launcher-7150-thread-2) [n:127.0.0.1:62479_solr    ] o.a.s.c.ZkController Register node as live in ZooKeeper:/live_nodes/127.0.0.1:62479_solr
   [junit4]   2> 3014657 INFO  (zkCallback-7168-thread-1-processing-n:127.0.0.1:62479_solr) [n:127.0.0.1:62479_solr    ] o.a.s.c.c.ZkStateReader Updated live nodes from ZooKeeper... (1) -> (2)
   [junit4]   2> 3014657 INFO  (zkCallback-7166-thread-1-processing-n:127.0.0.1:62476_solr) [n:127.0.0.1:62476_solr    ] o.a.s.c.c.ZkStateReader Updated live nodes from ZooKeeper... (1) -> (2)
   [junit4]   2> 3014724 INFO  (jetty-launcher-7150-thread-1) [n:127.0.0.1:62476_solr    ] o.a.s.m.r.SolrJmxReporter JMX monitoring for 'solr_62476.solr.node' (registry 'solr.node') enabled at server: com.sun.jmx.mbeanserver.JmxMBeanServer@7704119d
   [junit4]   2> 3014732 INFO  (jetty-launcher-7150-thread-1) [n:127.0.0.1:62476_solr    ] o.a.s.m.r.SolrJmxReporter JMX monitoring for 'solr_62476.solr.jvm' (registry 'solr.jvm') enabled at server: com.sun.jmx.mbeanserver.JmxMBeanServer@7704119d
   [junit4]   2> 3014732 INFO  (jetty-launcher-7150-thread-1) [n:127.0.0.1:62476_solr    ] o.a.s.m.r.SolrJmxReporter JMX monitoring for 'solr_62476.solr.jetty' (registry 'solr.jetty') enabled at server: com.sun.jmx.mbeanserver.JmxMBeanServer@7704119d
   [junit4]   2> 3014733 INFO  (jetty-launcher-7150-thread-1) [n:127.0.0.1:62476_solr    ] o.a.s.c.CorePropertiesLocator Found 0 core definitions underneath C:\Users\jenkins\workspace\Lucene-Solr-master-Windows\solr\build\solr-core\test\J0\temp\solr.cloud.CleanupOldIndexTest_CE6CB3A2AD01D491-001\tempDir-001\node1\.
   [junit4]   2> 3014734 INFO  (jetty-launcher-7150-thread-2) [n:127.0.0.1:62479_solr    ] o.a.s.m.r.SolrJmxReporter JMX monitoring for 'solr_62479.solr.node' (registry 'solr.node') enabled at server: com.sun.jmx.mbeanserver.JmxMBeanServer@7704119d
   [junit4]   2> 3014759 INFO  (jetty-launcher-7150-thread-2) [n:127.0.0.1:62479_solr    ] o.a.s.m.r.SolrJmxReporter JMX monitoring for 'solr_62479.solr.jvm' (registry 'solr.jvm') enabled at server: com.sun.jmx.mbeanserver.JmxMBeanServer@7704119d
   [junit4]   2> 3014759 INFO  (jetty-launcher-7150-thread-2) [n:127.0.0.1:62479_solr    ] o.a.s.m.r.SolrJmxReporter JMX monitoring for 'solr_62479.solr.jetty' (registry 'solr.jetty') enabled at server: com.sun.jmx.mbeanserver.JmxMBeanServer@7704119d
   [junit4]   2> 3014761 INFO  (jetty-launcher-7150-thread-2) [n:127.0.0.1:62479_solr    ] o.a.s.c.CorePropertiesLocator Found 0 core definitions underneath C:\Users\jenkins\workspace\Lucene-Solr-master-Windows\solr\build\solr-core\test\J0\temp\solr.cloud.CleanupOldIndexTest_CE6CB3A2AD01D491-001\tempDir-001\node2\.
   [junit4]   2> 3014797 INFO  (zkConnectionManagerCallback-7175-thread-1) [    ] o.a.s.c.c.ConnectionManager zkClient has connected
   [junit4]   2> 3014802 INFO  (zkConnectionManagerCallback-7179-thread-1) [    ] o.a.s.c.c.ConnectionManager zkClient has connected
   [junit4]   2> 3014804 INFO  (SUITE-CleanupOldIndexTest-seed#[CE6CB3A2AD01D491]-worker) [    ] o.a.s.c.c.ZkStateReader Updated live nodes from ZooKeeper... (0) -> (2)
   [junit4]   2> 3014805 INFO  (SUITE-CleanupOldIndexTest-seed#[CE6CB3A2AD01D491]-worker) [    ] o.a.s.c.s.i.ZkClientClusterStateProvider Cluster at 127.0.0.1:62472/solr ready
   [junit4]   2> 3014822 INFO  (TEST-CleanupOldIndexTest.test-seed#[CE6CB3A2AD01D491]) [    ] o.a.s.SolrTestCaseJ4 ###Starting test
   [junit4]   2> 3014825 INFO  (qtp997467098-31379) [n:127.0.0.1:62476_solr    ] o.a.s.h.a.CollectionsHandler Invoked Collection Action :create with params async=1b64a917-32d8-4203-a2a9-7adf01fa20df&replicationFactor=2&collection.configName=conf1&name=oldindextest&nrtReplicas=2&action=CREATE&numShards=1&wt=javabin&version=2 and sendToOCPQueue=true
   [junit4]   2> 3014827 INFO  (qtp997467098-31379) [n:127.0.0.1:62476_solr    ] o.a.s.s.HttpSolrCall [admin] webapp=null path=/admin/collections params={async=1b64a917-32d8-4203-a2a9-7adf01fa20df&replicationFactor=2&collection.configName=conf1&name=oldindextest&nrtReplicas=2&action=CREATE&numShards=1&wt=javabin&version=2} status=0 QTime=2
   [junit4]   2> 3014828 INFO  (qtp997467098-31380) [n:127.0.0.1:62476_solr    ] o.a.s.h.a.CollectionsHandler Invoked Collection Action :requeststatus with params requestid=1b64a917-32d8-4203-a2a9-7adf01fa20df&action=REQUESTSTATUS&wt=javabin&version=2 and sendToOCPQueue=true
   [junit4]   2> 3014829 INFO  (qtp997467098-31380) [n:127.0.0.1:62476_solr    ] o.a.s.s.HttpSolrCall [admin] webapp=null path=/admin/collections params={requestid=1b64a917-32d8-4203-a2a9-7adf01fa20df&action=REQUESTSTATUS&wt=javabin&version=2} status=0 QTime=1
   [junit4]   2> 3014830 INFO  (OverseerThreadFactory-13207-thread-1-processing-n:127.0.0.1:62479_solr) [n:127.0.0.1:62479_solr    ] o.a.s.c.CreateCollectionCmd Create collection oldindextest
   [junit4]   2> 3014939 INFO  (OverseerStateUpdate-99229706829365254-127.0.0.1:62479_solr-n_0000000000) [n:127.0.0.1:62479_solr    ] o.a.s.c.o.SliceMutator createReplica() {
   [junit4]   2>   "operation":"ADDREPLICA",
   [junit4]   2>   "collection":"oldindextest",
   [junit4]   2>   "shard":"shard1",
   [junit4]   2>   "core":"oldindextest_shard1_replica_n1",
   [junit4]   2>   "state":"down",
   [junit4]   2>   "base_url":"http://127.0.0.1:62476/solr",
   [junit4]   2>   "type":"NRT",
   [junit4]   2>   "waitForFinalState":"false"} 
   [junit4]   2> 3014943 INFO  (OverseerStateUpdate-99229706829365254-127.0.0.1:62479_solr-n_0000000000) [n:127.0.0.1:62479_solr    ] o.a.s.c.o.SliceMutator createReplica() {
   [junit4]   2>   "operation":"ADDREPLICA",
   [junit4]   2>   "collection":"oldindextest",
   [junit4]   2>   "shard":"shard1",
   [junit4]   2>   "core":"oldindextest_shard1_replica_n2",
   [junit4]   2>   "state":"down",
   [junit4]   2>   "base_url":"http://127.0.0.1:62479/solr",
   [junit4]   2>   "type":"NRT",
   [junit4]   2>   "waitForFinalState":"false"} 
   [junit4]   2> 3015145 INFO  (qtp997467098-31382) [n:127.0.0.1:62476_solr    ] o.a.s.s.HttpSolrCall [admin] webapp=null path=/admin/cores params={qt=/admin/cores&collection.configName=conf1&newCollection=true&collection=oldindextest&version=2&replicaType=NRT&async=1b64a917-32d8-4203-a2a9-7adf01fa20df7659711285393&coreNodeName=core_node3&name=oldindextest_shard1_replica_n1&action=CREATE&numShards=1&shard=shard1&wt=javabin} status=0 QTime=0
   [junit4]   2> 3015145 INFO  (parallelCoreAdminExecutor-13208-thread-1-processing-n:127.0.0.1:62476_solr 1b64a917-32d8-4203-a2a9-7adf01fa20df7659711285393 CREATE) [n:127.0.0.1:62476_solr    ] o.a.s.h.a.CoreAdminOperation core create command qt=/admin/cores&collection.configName=conf1&newCollection=true&collection=oldindextest&version=2&replicaType=NRT&async=1b64a917-32d8-4203-a2a9-7adf01fa20df7659711285393&coreNodeName=core_node3&name=oldindextest_shard1_replica_n1&action=CREATE&numShards=1&shard=shard1&wt=javabin
   [junit4]   2> 3015146 INFO  (qtp808030496-31371) [n:127.0.0.1:62479_solr    ] o.a.s.s.HttpSolrCall [admin] webapp=null path=/admin/cores params={qt=/admin/cores&collection.configName=conf1&newCollection=true&collection=oldindextest&version=2&replicaType=NRT&async=1b64a917-32d8-4203-a2a9-7adf01fa20df7659714010087&coreNodeName=core_node4&name=oldindextest_shard1_replica_n2&action=CREATE&numShards=1&shard=shard1&wt=javabin} status=0 QTime=0
   [junit4]   2> 3015146 INFO  (parallelCoreAdminExecutor-13209-thread-1-processing-n:127.0.0.1:62479_solr 1b64a917-32d8-4203-a2a9-7adf01fa20df7659714010087 CREATE) [n:127.0.0.1:62479_solr    ] o.a.s.h.a.CoreAdminOperation core create command qt=/admin/cores&collection.configName=conf1&newCollection=true&collection=oldindextest&version=2&replicaType=NRT&async=1b64a917-32d8-4203-a2a9-7adf01fa20df7659714010087&coreNodeName=core_node4&name=oldindextest_shard1_replica_n2&action=CREATE&numShards=1&shard=shard1&wt=javabin
   [junit4]   2> 3015146 INFO  (parallelCoreAdminExecutor-13208-thread-1-processing-n:127.0.0.1:62476_solr 1b64a917-32d8-4203-a2a9-7adf01fa20df7659711285393 CREATE) [n:127.0.0.1:62476_solr    ] o.a.s.c.TransientSolrCoreCacheDefault Allocating transient cache for 2147483647 transient cores
   [junit4]   2> 3015146 INFO  (qtp997467098-31383) [n:127.0.0.1:62476_solr    ] o.a.s.h.a.CoreAdminOperation Checking request status for : 1b64a917-32d8-4203-a2a9-7adf01fa20df7659711285393
   [junit4]   2> 3015146 INFO  (qtp997467098-31383) [n:127.0.0.1:62476_solr    ] o.a.s.s.HttpSolrCall [admin] webapp=null path=/admin/cores params={qt=/admin/cores&requestid=1b64a917-32d8-4203-a2a9-7adf01fa20df7659711285393&action=REQUESTSTATUS&wt=javabin&version=2} status=0 QTime=0
   [junit4]   2> 3015147 INFO  (parallelCoreAdminExecutor-13209-thread-1-processing-n:127.0.0.1:62479_solr 1b64a917-32d8-4203-a2a9-7adf01fa20df7659714010087 CREATE) [n:127.0.0.1:62479_solr    ] o.a.s.c.TransientSolrCoreCacheDefault Allocating transient cache for 2147483647 transient cores
   [junit4]   2> 3015252 INFO  (zkCallback-7166-thread-1-processing-n:127.0.0.1:62476_solr) [n:127.0.0.1:62476_solr    ] o.a.s.c.c.ZkStateReader A cluster state change: [WatchedEvent state:SyncConnected type:NodeDataChanged path:/collections/oldindextest/state.json] for collection [oldindextest] has occurred - updating... (live nodes size: [2])
   [junit4]   2> 3015252 INFO  (zkCallback-7168-thread-1-processing-n:127.0.0.1:62479_solr) [n:127.0.0.1:62479_solr    ] o.a.s.c.c.ZkStateReader A cluster state change: [WatchedEvent state:SyncConnected type:NodeDataChanged path:/collections/oldindextest/state.json] for collection [oldindextest] has occurred - updating... (live nodes size: [2])
   [junit4]   2> 3015253 INFO  (zkCallback-7166-thread-2-processing-n:127.0.0.1:62476_solr) [n:127.0.0.1:62476_solr    ] o.a.s.c.c.ZkStateReader A cluster state change: [WatchedEvent state:SyncConnected type:NodeDataChanged path:/collections/oldindextest/state.json] for collection [oldindextest] has occurred - updating... (live nodes size: [2])
   [junit4]   2> 3015253 INFO  (zkCallback-7168-thread-2-processing-n:127.0.0.1:62479_solr) [n:127.0.0.1:62479_solr    ] o.a.s.c.c.ZkStateReader A cluster state change: [WatchedEvent state:SyncConnected type:NodeDataChanged path:/collections/oldindextest/state.json] for collection [oldindextest] has occurred - updating... (live nodes size: [2])
   [junit4]   2> 3015830 INFO  (qtp997467098-31393) [n:127.0.0.1:62476_solr    ] o.a.s.h.a.CollectionsHandler Invoked Collection Action :requeststatus with params requestid=1b64a917-32d8-4203-a2a9-7adf01fa20df&action=REQUESTSTATUS&wt=javabin&version=2 and sendToOCPQueue=true
   [junit4]   2> 3015831 INFO  (qtp997467098-31393) [n:127.0.0.1:62476_solr    ] o.a.s.s.HttpSolrCall [admin] webapp=null path=/admin/collections params={requestid=1b64a917-32d8-4203-a2a9-7adf01fa20df&action=REQUESTSTATUS&wt=javabin&version=2} status=0 QTime=1
   [junit4]   2> 3016147 INFO  (qtp997467098-31394) [n:127.0.0.1:62476_solr    ] o.a.s.h.a.CoreAdminOperation Checking request status for : 1b64a917-32d8-4203-a2a9-7adf01fa20df7659711285393
   [junit4]   2> 3016147 INFO  (qtp997467098-31394) [n:127.0.0.1:62476_solr    ] o.a.s.s.HttpSolrCall [admin] webapp=null path=/admin/cores params={qt=/admin/cores&requestid=1b64a917-32d8-4203-a2a9-7adf01fa20df7659711285393&action=REQUESTSTATUS&wt=javabin&version=2} status=0 QTime=0
   [junit4]   2> 3016161 INFO  (parallelCoreAdminExecutor-13208-thread-1-processing-n:127.0.0.1:62476_solr 1b64a917-32d8-4203-a2a9-7adf01fa20df7659711285393 CREATE) [n:127.0.0.1:62476_solr c:oldindextest s:shard1 r:core_node3 x:oldindextest_shard1_replica_n1] o.a.s.c.SolrConfig Using Lucene MatchVersion: 8.0.0
   [junit4]   2> 3016161 INFO  (parallelCoreAdminExecutor-13209-thread-1-processing-n:127.0.0.1:62479_solr 1b64a917-32d8-4203-a2a9-7adf01fa20df7659714010087 CREATE) [n:127.0.0.1:62479_solr c:oldindextest s:shard1 r:core_node4 x:oldindextest_shard1_replica_n2] o.a.s.c.SolrConfig Using Lucene MatchVersion: 8.0.0
   [junit4]   2> 3016174 INFO  (parallelCoreAdminExecutor-13208-thread-1-processing-n:127.0.0.1:62476_solr 1b64a917-32d8-4203-a2a9-7adf01fa20df7659711285393 CREATE) [n:127.0.0.1:62476_solr c:oldindextest s:shard1 r:core_node3 x:oldindextest_shard1_replica_n1] o.a.s.s.IndexSchema [oldindextest_shard1_replica_n1] Schema name=cloud-dynamic
   [junit4]   2> 3016174 INFO  (parallelCoreAdminExecutor-13209-thread-1-processing-n:127.0.0.1:62479_solr 1b64a917-32d8-4203-a2a9-7adf01fa20df7659714010087 CREATE) [n:127.0.0.1:62479_solr c:oldindextest s:shard1 r:core_node4 x:oldindextest_shard1_replica_n2] o.a.s.s.IndexSchema [oldindextest_shard1_replica_n2] Schema name=cloud-dynamic
   [junit4]   2> 3016225 INFO  (parallelCoreAdminExecutor-13208-thread-1-processing-n:127.0.0.1:62476_solr 1b64a917-32d8-4203-a2a9-7adf01fa20df7659711285393 CREATE) [n:127.0.0.1:62476_solr c:oldindextest s:shard1 r:core_node3 x:oldindextest_shard1_replica_n1] o.a.s.s.IndexSchema Loaded schema cloud-dynamic/1.6 with uniqueid field id
   [junit4]   2> 3016226 INFO  (parallelCoreAdminExecutor-13208-thread-1-processing-n:127.0.0.1:62476_solr 1b64a917-32d8-4203-a2a9-7adf01fa20df7659711285393 CREATE) [n:127.0.0.1:62476_solr c:oldindextest s:shard1 r:core_node3 x:oldindextest_shard1_replica_n1] o.a.s.c.CoreContainer Creating SolrCore 'oldindextest_shard1_replica_n1' using configuration from collection oldindextest, trusted=true
   [junit4]   2> 3016226 INFO  (parallelCoreAdminExecutor-13208-thread-1-processing-n:127.0.0.1:62476_solr 1b64a917-32d8-4203-a2a9-7adf01fa20df7659711285393 CREATE) [n:127.0.0.1:62476_solr c:oldindextest s:shard1 r:core_node3 x:oldindextest_shard1_replica_n1] o.a.s.m.r.SolrJmxReporter JMX monitoring for 'solr_62476.solr.core.oldindextest.shard1.replica_n1' (registry 'solr.core.oldindextest.shard1.replica_n1') enabled at server: com.sun.jmx.mbeanserver.JmxMBeanServer@7704119d
   [junit4]   2> 3016227 INFO  (parallelCoreAdminExecutor-13208-thread-1-processing-n:127.0.0.1:62476_solr 1b64a917-32d8-4203-a2a9-7adf01fa20df7659711285393 CREATE) [n:127.0.0.1:62476_solr c:oldindextest s:shard1 r:core_node3 x:oldindextest_shard1_replica_n1] o.a.s.c.SolrCore solr.RecoveryStrategy.Builder
   [junit4]   2> 3016227 INFO  (parallelCoreAdminExecutor-13208-thread-1-processing-n:127.0.0.1:62476_solr 1b64a917-32d8-4203-a2a9-7adf01fa20df7659711285393 CREATE) [n:127.0.0.1:62476_solr c:oldindextest s:shard1 r:core_node3 x:oldindextest_shard1_replica_n1] o.a.s.c.SolrCore [[oldindextest_shard1_replica_n1] ] Opening new SolrCore at [C:\Users\jenkins\workspace\Lucene-Solr-master-Windows\solr\build\solr-core\test\J0\temp\solr.cloud.CleanupOldIndexTest_CE6CB3A2AD01D491-001\tempDir-001\node1\oldindextest_shard1_replica_n1], dataDir=[C:\Users\jenkins\workspace\Lucene-Solr-master-Windows\solr\build\solr-core\test\J0\temp\solr.cloud.CleanupOldIndexTest_CE6CB3A2AD01D491-001\tempDir-001\node1\.\oldindextest_shard1_replica_n1\data\]
   [junit4]   2> 3016227 INFO  (parallelCoreAdminExecutor-13209-thread-1-processing-n:127.0.0.1:62479_solr 1b64a917-32d8-4203-a2a9-7adf01fa20df7659714010087 CREATE) [n:127.0.0.1:62479_solr c:oldindextest s:shard1 r:core_node4 x:oldindextest_shard1_replica_n2] o.a.s.s.IndexSchema Loaded schema cloud-dynamic/1.6 with uniqueid field id
   [junit4]   2> 3016228 INFO  (parallelCoreAdminExecutor-13209-thread-1-processing-n:127.0.0.1:62479_solr 1b64a917-32d8-4203-a2a9-7adf01fa20df7659714010087 CREATE) [n:127.0.0.1:62479_solr c:oldindextest s:shard1 r:core_node4 x:oldindextest_shard1_replica_n2] o.a.s.c.CoreContainer Creating SolrCore 'oldindextest_shard1_replica_n2' using configuration from collection oldindextest, trusted=true
   [junit4]   2> 3016228 INFO  (parallelCoreAdminExecutor-13209-thread-1-processing-n:127.0.0.1:62479_solr 1b64a917-32d8-4203-a2a9-7adf01fa20df7659714010087 CREATE) [n:127.0.0.1:62479_solr c:oldindextest s:shard1 r:core_node4 x:oldindextest_shard1_replica_n2] o.a.s.m.r.SolrJmxReporter JMX monitoring for 'solr_62479.solr.core.oldindextest.shard1.replica_n2' (registry 'solr.core.oldindextest.shard1.replica_n2') enabled at server: com.sun.jmx.mbeanserver.JmxMBeanServer@7704119d
   [junit4]   2> 3016228 INFO  (parallelCoreAdminExecutor-13209-thread-1-processing-n:127.0.0.1:62479_solr 1b64a917-32d8-4203-a2a9-7adf01fa20df7659714010087 CREATE) [n:127.0.0.1:62479_solr c:oldindextest s:shard1 r:core_node4 x:oldindextest_shard1_replica_n2] o.a.s.c.SolrCore solr.RecoveryStrategy.Builder
   [junit4]   2> 3016229 INFO  (parallelCoreAdminExecutor-13209-thread-1-processing-n:127.0.0.1:62479_solr 1b64a917-32d8-4203-a2a9-7adf01fa20df7659714010087 CREATE) [n:127.0.0.1:62479_solr c:oldindextest s:shard1 r:core_node4 x:oldindextest_shard1_replica_n2] o.a.s.c.SolrCore [[oldindextest_shard1_replica_n2] ] Opening new SolrCore at [C:\Users\jenkins\workspace\Lucene-Solr-master-Windows\solr\build\solr-core\test\J0\temp\solr.cloud.CleanupOldIndexTest_CE6CB3A2AD01D491-001\tempDir-001\node2\oldindextest_shard1_replica_n2], dataDir=[C:\Users\jenkins\workspace\Lucene-Solr-master-Windows\solr\build\solr-core\test\J0\temp\solr.cloud.CleanupOldIndexTest_CE6CB3A2AD01D491-001\tempDir-001\node2\.\oldindextest_shard1_replica_n2\data\]
   [junit4]   2> 3016392 INFO  (parallelCoreAdminExecutor-13209-thread-1-processing-n:127.0.0.1:62479_solr 1b64a917-32d8-4203-a2a9-7adf01fa20df7659714010087 CREATE) [n:127.0.0.1:62479_solr c:oldindextest s:shard1 r:core_node4 x:oldindextest_shard1_replica_n2] o.a.s.u.UpdateHandler Using UpdateLog implementation: org.apache.solr.update.UpdateLog
   [junit4]   2> 3016392 INFO  (parallelCoreAdminExecutor-13209-thread-1-processing-n:127.0.0.1:62479_solr 1b64a917-32d8-4203-a2a9-7adf01fa20df7659714010087 CREATE) [n:127.0.0.1:62479_solr c:oldindextest s:shard1 r:core_node4 x:oldindextest_shard1_replica_n2] o.a.s.u.UpdateLog Initializing UpdateLog: dataDir=null defaultSyncLevel=FLUSH numRecordsToKeep=100 maxNumLogsToKeep=10 numVersionBuckets=65536
   [junit4]   2> 3016394 INFO  (parallelCoreAdminExecutor-13209-thread-1-processing-n:127.0.0.1:62479_solr 1b64a917-32d8-4203-a2a9-7adf01fa20df7659714010087 CREATE) [n:127.0.0.1:62479_solr c:oldindextest s:shard1 r:core_node4 x:oldindextest_shard1_replica_n2] o.a.s.u.CommitTracker Hard AutoCommit: disabled
   [junit4]   2> 3016395 INFO  (parallelCoreAdminExecutor-13209-thread-1-processing-n:127.0.0.1:62479_solr 1b64a917-32d8-4203-a2a9-7adf01fa20df7659714010087 CREATE) [n:127.0.0.1:62479_solr c:oldindextest s:shard1 r:core_node4 x:oldindextest_shard1_replica_n2] o.a.s.u.CommitTracker Soft AutoCommit: disabled
   [junit4]   2> 3016399 INFO  (parallelCoreAdminExecutor-13209-thread-1-processing-n:127.0.0.1:62479_solr 1b64a917-32d8-4203-a2a9-7adf01fa20df7659714010087 CREATE) [n:127.0.0.1:62479_solr c:oldindextest s:shard1 r:core_node4 x:oldindextest_shard1_replica_n2] o.a.s.s.SolrIndexSearcher Opening [Searcher@159037fb[oldindextest_shard1_replica_n2] main]
   [junit4]   2> 3016405 INFO  (parallelCoreAdminExecutor-13209-thread-1-processing-n:127.0.0.1:62479_solr 1b64a917-32d8-4203-a2a9-7adf01fa20df7659714010087 CREATE) [n:127.0.0.1:62479_solr c:oldindextest s:shard1 r:core_node4 x:oldindextest_shard1_replica_n2] o.a.s.r.ManagedResourceStorage Configured ZooKeeperStorageIO with znodeBase: /configs/conf1
   [junit4]   2> 3016406 INFO  (parallelCoreAdminExecutor-13209-thread-1-processing-n:127.0.0.1:62479_solr 1b64a917-32d8-4203-a2a9-7adf01fa20df7659714010087 CREATE) [n:127.0.0.1:62479_solr c:oldindextest s:shard1 r:core_node4 x:oldindextest_shard1_replica_n2] o.a.s.r.ManagedResourceStorage Loaded null at path _rest_managed.json using ZooKeeperStorageIO:path=/configs/conf1
   [junit4]   2> 3016407 INFO  (parallelCoreAdminExecutor-13209-thread-1-processing-n:127.0.0.1:62479_solr 1b64a917-32d8-4203-a2a9-7adf01fa20df7659714010087 CREATE) [n:127.0.0.1:62479_solr c:oldindextest s:shard1 r:core_node4 x:oldindextest_shard1_replica_n2] o.a.s.h.ReplicationHandler Commits will be reserved for 10000ms.
   [junit4]   2> 3016408 INFO  (parallelCoreAdminExecutor-13208-thread-1-processing-n:127.0.0.1:62476_solr 1b64a917-32d8-4203-a2a9-7adf01fa20df7659711285393 CREATE) [n:127.0.0.1:62476_solr c:oldindextest s:shard1 r:core_node3 x:oldindextest_shard1_replica_n1] o.a.s.u.UpdateHandler Using UpdateLog implementation: org.apache.solr.update.UpdateLog
   [junit4]   2> 3016408 INFO  (parallelCoreAdminExecutor-13208-thread-1-processing-n:127.0.0.1:62476_solr 1b64a917-32d8-4203-a2a9-7adf01fa20df7659711285393 CREATE) [n:127.0.0.1:62476_solr c:oldindextest s:shard1 r:core_node3 x:oldindextest_shard1_replica_n1] o.a.s.u.UpdateLog Initializing UpdateLog: dataDir=null defaultSyncLevel=FLUSH numRecordsToKeep=100 maxNumLogsToKeep=10 numVersionBuckets=65536
   [junit4]   2> 3016408 INFO  (searcherExecutor-13213-thread-1-processing-x:oldindextest_shard1_replica_n2 r:core_node4 1b64a917-32d8-4203-a2a9-7adf01fa20df7659714010087 CREATE n:127.0.0.1:62479_solr s:shard1 c:oldindextest) [n:127.0.0.1:62479_solr c:oldindextest s:shard1 r:core_node4 x:oldindextest_shard1_replica_n2] o.a.s.c.SolrCore [oldindextest_shard1_replica_n2] Registered new searcher Searcher@159037fb[oldindextest_shard1_replica_n2] main{ExitableDirectoryReader(UninvertingDirectoryReader())}
   [junit4]   2> 3016410 INFO  (parallelCoreAdminExecutor-13208-thread-1-processing-n:127.0.0.1:62476_solr 1b64a917-32d8-4203-a2a9-7adf01fa20df7659711285393 CREATE) [n:127.0.0.1:62476_solr c:oldindextest s:shard1 r:core_node3 x:oldindextest_shard1_replica_n1] o.a.s.u.CommitTracker Hard AutoCommit: disabled
   [junit4]   2> 3016410 INFO  (parallelCoreAdminExecutor-13208-thread-1-processing-n:127.0.0.1:62476_solr 1b64a917-32d8-4203-a2a9-7adf01fa20df7659711285393 CREATE) [n:127.0.0.1:62476_solr c:oldindextest s:shard1 r:core_node3 x:oldindextest_shard1_replica_n1] o.a.s.u.CommitTracker Soft AutoCommit: disabled
   [junit4]   2> 3016413 INFO  (parallelCoreAdminExecutor-13209-thread-1-processing-n:127.0.0.1:62479_solr 1b64a917-32d8-4203-a2a9-7adf01fa20df7659714010087 CREATE) [n:127.0.0.1:62479_solr c:oldindextest s:shard1 r:core_node4 x:oldindextest_shard1_replica_n2] o.a.s.u.UpdateLog Could not find max version in index or recent updates, using new clock 1587675311499116544
   [junit4]   2> 3016415 INFO  (parallelCoreAdminExecutor-13208-thread-1-processing-n:127.0.0.1:62476_solr 1b64a917-32d8-4203-a2a9-7adf01fa20df7659711285393 CREATE) [n:127.0.0.1:62476_solr c:oldindextest s:shard1 r:core_node3 x:oldindextest_shard1_replica_n1] o.a.s.s.SolrIndexSearcher Opening [Searcher@3bdd164b[oldindextest_shard1_replica_n1] main]
   [junit4]   2> 3016423 INFO  (parallelCoreAdminExecutor-13208-thread-1-processing-n:127.0.0.1:62476_solr 1b64a917-32d8-4203-a2a9-7adf01fa20df7659711285393 CREATE) [n:127.0.0.1:62476_solr c:oldindextest s:shard1 r:core_node3 x:oldindextest_shard1_replica_n1] o.a.s.r.ManagedResourceStorage Configured ZooKeeperStorageIO with znodeBase: /configs/conf1
   [junit4]   2> 3016427 INFO  (parallelCoreAdminExecutor-13209-thread-1-processing-n:127.0.0.1:62479_solr 1b64a917-32d8-4203-a2a9-7adf01fa20df7659714010087 CREATE) [n:127.0.0.1:62479_solr c:oldindextest s:shard1 r:core_node4 x:oldindextest_shard1_replica_n2] o.a.s.c.ShardLeaderElectionContext Waiting until we see more replicas up for shard shard1: total=2 found=1 timeoutin=9999ms
   [junit4]   2> 3016434 INFO  (parallelCoreAdminExecutor-13208-thread-1-processing-n:127.0.0.1:62476_solr 1b64a917-32d8-4203-a2a9-7adf01fa20df7659711285393 CREATE) [n:127.0.0.1:62476_solr c:oldindextest s:shard1 r:core_node3 x:oldindextest_shard1_replica_n1] o.a.s.r.ManagedResourceStorage Loaded null at path _rest_managed.json using ZooKeeperStorageIO:path=/configs/conf1
   [junit4]   2> 3016434 INFO  (parallelCoreAdminExecutor-13208-thread-1-processing-n:127.0.0.1:62476_solr 1b64a917-32d8-4203-a2a9-7adf01fa20df7659711285393 CREATE) [n:127.0.0.1:62476_solr c:oldindextest s:shard1 r:core_node3 x:oldindextest_shard1_replica_n1] o.a.s.h.ReplicationHandler Commits will be reserved for 10000ms.
   [junit4]   2> 3016434 INFO  (parallelCoreAdminExecutor-13208-thread-1-processing-n:127.0.0.1:62476_solr 1b64a917-32d8-4203-a2a9-7adf01fa20df7659711285393 CREATE) [n:127.0.0.1:62476_solr c:oldindextest s:shard1 r:core_node3 x:oldindextest_shard1_replica_n1] o.a.s.u.UpdateLog Could not find max version in index or recent updates, using new clock 1587675311521136640
   [junit4]   2> 3016438 INFO  (searcherExecutor-13212-thread-1-processing-x:oldindextest_shard1_replica_n1 r:core_node3 1b64a917-32d8-4203-a2a9-7adf01fa20df7659711285393 CREATE n:127.0.0.1:62476_solr s:shard1 c:oldindextest) [n:127.0.0.1:62476_solr c:oldindextest s:shard1 r:core_node3 x:oldindextest_shard1_replica_n1] o.a.s.c.SolrCore [oldindextest_shard1_replica_n1] Registered new searcher Searcher@3bdd164b[oldindextest_shard1_replica_n1] main{ExitableDirectoryReader(UninvertingDirectoryReader())}
   [junit4]   2> 3016529 INFO  (zkCallback-7166-thread-2-processing-n:127.0.0.1:62476_solr) [n:127.0.0.1:62476_solr    ] o.a.s.c.c.ZkStateReader A cluster state change: [WatchedEvent state:SyncConnected type:NodeDataChanged path:/collections/oldindextest/state.json] for collection [oldindextest] has occurred - updating... (live nodes size: [2])
   [junit4]   2> 3016529 INFO  (zkCallback-7166-thread-1-processing-n:127.0.0.1:62476_solr) [n:127.0.0.1:62476_solr    ] o.a.s.c.c.ZkStateReader A cluster state change: [WatchedEvent state:SyncConnected type:NodeDataChanged path:/collections/oldindextest/state.json] for collection [oldindextest] has occurred - updating... (live nodes size: [2])
   [junit4]   2> 3016530 INFO  (zkCallback-7168-thread-2-processing-n:127.0.0.1:62479_solr) [n:127.0.0.1:62479_solr    ] o.a.s.c.c.ZkStateReader A cluster state change: [WatchedEvent state:SyncConnected type:NodeDataChanged path:/collections/oldindextest/state.json] for collection [oldindextest] has occurred - updating... (live nodes size: [2])
   [junit4]   2> 3016530 INFO  (zkCallback-7168-thread-3-processing-n:127.0.0.1:62479_solr) [n:127.0.0.1:62479_solr    ] o.a.s.c.c.ZkStateReader A cluster state change: [WatchedEvent state:SyncConnected type:NodeDataChanged path:/collections/oldindextest/state.json] for collection [oldindextest] has occurred - updating... (live nodes size: [2])
   [junit4]   2> 3016832 INFO  (qtp997467098-31395) [n:127.0.0.1:62476_solr    ] o.a.s.h.a.CollectionsHandler Invoked Collection Action :requeststatus with params requestid=1b64a917-32d8-4203-a2a9-7adf01fa20df&action=REQUESTSTATUS&wt=javabin&version=2 and sendToOCPQueue=true
   [junit4]   2> 3016834 INFO  (qtp997467098-31395) [n:127.0.0.1:62476_solr    ] o.a.s.s.HttpSolrCall [admin] webapp=null path=/admin/collections params={requestid=1b64a917-32d8-4203-a2a9-7adf01fa20df&action=REQUESTSTATUS&wt=javabin&version=2} status=0 QTime=1
   [junit4]   2> 3016931 INFO  (parallelCoreAdminExecutor-13209-thread-1-processing-n:127.0.0.1:62479_solr 1b64a917-32d8-4203-a2a9-7adf01fa20df7659714010087 CREATE) [n:127.0.0.1:62479_solr c:oldindextest s:shard1 r:core_node4 x:oldindextest_shard1_replica_n2] o.a.s.c.ShardLeaderElectionContext Enough replicas found to continue.
   [junit4]   2> 3016931 INFO  (parallelCoreAdminExecutor-13209-thread-1-processing-n:127.0.0.1:62479_solr 1b64a917-32d8-4203-a2a9-7adf01fa20df7659714010087 CREATE) [n:127.0.0.1:62479_solr c:oldindextest s:shard1 r:core_node4 x:oldindextest_shard1_replica_n2] o.a.s.c.ShardLeaderElectionContext I may be the new leader - try and sync
   [junit4]   2> 3016931 INFO  (parallelCoreAdminExecutor-13209-thread-1-processing-n:127.0.0.1:62479_solr 1b64a917-32d8-4203-a2a9-7adf01fa20df7659714010087 CREATE) [n:127.0.0.1:62479_solr c:oldindextest s:shard1 r:core_node4 x:oldindextest_shard1_replica_n2] o.a.s.c.SyncStrategy Sync replicas to http://127.0.0.1:62479/solr/oldindextest_shard1_replica_n2/
   [junit4]   2> 3016931 INFO  (parallelCoreAdminExecutor-13209-thread-1-processing-n:127.0.0.1:62479_solr 1b64a917-32d8-4203-a2a9-7adf01fa20df7659714010087 CREATE) [n:127.0.0.1:62479_solr c:oldindextest s:shard1 r:core_node4 x:oldindextest_shard1_replica_n2] o.a.s.u.PeerSync PeerSync: core=oldindextest_shard1_replica_n2 url=http://127.0.0.1:62479/solr START replicas=[http://127.0.0.1:62476/solr/oldindextest_shard1_replica_n1/] nUpdates=100
   [junit4]   2> 3016933 INFO  (qtp997467098-31379) [n:127.0.0.1:62476_solr c:oldindextest s:shard1 r:core_node3 x:oldindextest_shard1_replica_n1] o.a.s.c.S.Request [oldindextest_shard1_replica_n1]  webapp=/solr path=/get params={distrib=false&qt=/get&fingerprint=false&getVersions=100&wt=javabin&version=2} status=0 QTime=0
   [junit4]   2> 3017148 INFO  (qtp997467098-31380) [n:127.0.0.1:62476_solr    ] o.a.s.h.a.CoreAdminOperation Checking request status for : 1b64a917-32d8-4203-a2a9-7adf01fa20df7659711285393
   [junit4]   2> 3017148 INFO  (qtp997467098-31380) [n:127.0.0.1:62476_solr    ] o.a.s.s.HttpSolrCall [admin] webapp=null path=/admin/cores params={qt=/admin/cores&requestid=1b64a917-32d8-4203-a2a9-7adf01fa20df7659711285393&action=REQUESTSTATUS&wt=javabin&version=2} status=0 QTime=0
   [junit4]   2> 3017232 INFO  (parallelCoreAdminExecutor-13209-thread-1-processing-n:127.0.0.1:62479_solr 1b64a917-32d8-4203-a2a9-7adf01fa20df7659714010087 CREATE) [n:127.0.0.1:62479_solr c:oldindextest s:shard1 r:core_node4 x:oldindextest_shard1_replica_n2] o.a.s.u.PeerSync PeerSync: core=oldindextest_shard1_replica_n2 url=http://127.0.0.1:62479/solr DONE.  We have no versions.  sync failed.
   [junit4]   2> 3017232 INFO  (parallelCoreAdminExecutor-13209-thread-1-processing-n:127.0.0.1:62479_solr 1b64a917-32d8-4203-a2a9-7adf01fa20df7659714010087 CREATE) [n:127.0.0.1:62479_solr c:oldindextest s:shard1 r:core_node4 x:oldindextest_shard1_replica_n2] o.a.s.c.SyncStrategy Leader's attempt to sync with shard failed, moving to the next candidate
   [junit4]   2> 3017232 INFO  (parallelCoreAdminExecutor-13209-thread-1-processing-n:127.0.0.1:62479_solr 1b64a917-32d8-4203-a2a9-7adf01fa20df7659714010087 CREATE) [n:127.0.0.1:62479_solr c:oldindextest s:shard1 r:core_node4 x:oldindextest_shard1_replica_n2] o.a.s.c.ShardLeaderElectionContext We failed sync, but we have no versions - we can't sync in that case - we were active before, so become leader anyway
   [junit4]   2> 3017232 INFO  (parallelCoreAdminExecutor-13209-thread-1-processing-n:127.0.0.1:62479_solr 1b64a917-32d8-4203-a2a9-7adf01fa20df7659714010087 CREATE) [n:127.0.0.1:62479_solr c:oldindextest s:shard1 r:core_node4 x:oldindextest_shard1_replica_n2] o.a.s.c.ShardLeaderElectionContext Found all replicas participating in election, clear LIR
   [junit4]   2> 3017238 INFO  (parallelCoreAdminExecutor-13209-thread-1-processing-n:127.0.0.1:62479_solr 1b64a917-32d8-4203-a2a9-7adf01fa20df7659714010087 CREATE) [n:127.0.0.1:62479_solr c:oldindextest s:shard1 r:core_node4 x:oldindextest_shard1_replica_n2] o.a.s.c.ShardLeaderElectionContext I am the new leader: http://127.0.0.1:62479/solr/oldindextest_shard1_replica_n2/ shard1
   [junit4]   2> 3017343 INFO  (zkCallback-7166-thread-2-processing-n:127.0.0.1:62476_solr) [n:127.0.0.1:62476_solr    ] o.a.s.c.c.ZkStateReader A cluster state change: [WatchedEvent state:SyncConnected type:NodeDataChanged path:/collections/oldindextest/state.json] for collection [oldindextest] has occurred - updating... (live nodes size: [2])
   [junit4]   2> 3017343 INFO  (zkCallback-7166-thread-1-processing-n:127.0.0.1:62476_solr) [n:127.0.0.1:62476_solr    ] o.a.s.c.c.ZkStateReader A cluster state change: [WatchedEvent state:SyncConnected type:NodeDataChanged path:/collections/oldindextest/state.json] for collection [oldindextest] has occurred - updating... (live nodes size: [2])
   [junit4]   2> 3017343 INFO  (zkCallback-7168-thread-3-processing-n:127.0.0.1:62479_solr) [n:127.0.0.1:62479_solr    ] o.a.s.c.c.ZkStateReader A cluster state change: [WatchedEvent state:SyncConnected type:NodeDataChanged path:/collections/oldindextest/state.json] for collection [oldindextest] has occurred - updating... (live nodes size: [2])
   [junit4]   2> 3017343 INFO  (zkCallback-7168-thread-2-processing-n:127.0.0.1:62479_solr) [n:127.0.0.1:62479_solr    ] o.a.s.c.c.ZkStateReader A cluster state change: [WatchedEvent state:SyncConnected type:NodeDataChanged path:/collections/oldindextest/state.json] for collection [oldindextest] has occurred - updating... (live nodes size: [2])
   [junit4]   2> 3017391 INFO  (parallelCoreAdminExecutor-13209-thread-1-processing-n:127.0.0.1:62479_solr 1b64a917-32d8-4203-a2a9-7adf01fa20df7659714010087 CREATE) [n:127.0.0.1:62479_solr c:oldindextest s:shard1 r:core_node4 x:oldindextest_shard1_replica_n2] o.a.s.c.ZkController I am the leader, no recovery necessary
   [junit4]   2> 3017565 INFO  (zkCallback-7168-thread-2-processing-n:127.0.0.1:62479_solr) [n:127.0.0.1:62479_solr    ] o.a.s.c.c.ZkStateReader A cluster state change: [WatchedEvent state:SyncConnected type:NodeDataChanged path:/collections/oldindextest/state.json] for collection [oldindextest] has occurred - updating... (live nodes size: [2])
   [junit4]   2> 3017565 INFO  (zkCallback-7166-thread-1-processing-n:127.0.0.1:62476_solr) [n:127.0.0.1:62476_solr    ] o.a.s.c.c.ZkStateReader A cluster state change: [WatchedEvent state:SyncConnected type:NodeDataChanged path:/collections/oldindextest/state.json] for collection [oldindextest] has occurred - updating... (live nodes size: [2])
   [junit4]   2> 3017565 INFO  (zkCallback-7166-thread-2-processing-n:127.0.0.1:62476_solr) [n:127.0.0.1:62476_solr    ] o.a.s.c.c.ZkStateReader A cluster state change: [WatchedEvent state:SyncConnected type:NodeDataChanged path:/collections/oldindextest/state.json] for collection [oldindextest] has occurred - updating... (live nodes size: [2])
   [junit4]   2> 3017565 INFO  (zkCallback-7168-thread-3-processing-n:127.0.0.1:62479_solr) [n:127.0.0.1:62479_solr    ] o.a.s.c.c.ZkStateReader A cluster state change: [WatchedEvent state:SyncConnected type:NodeDataChanged path:/collections/oldindextest/state.json] for collection [oldindextest] has occurred - updating... (live nodes size: [2])
   [junit4]   2> 3017834 INFO  (qtp997467098-31380) [n:127.0.0.1:62476_solr    ] o.a.s.h.a.CollectionsHandler Invoked Collection Action :requeststatus with params requestid=1b64a917-32d8-4203-a2a9-7adf01fa20df&action=REQUESTSTATUS&wt=javabin&version=2 and sendToOCPQueue=true
   [junit4]   2> 3017835 INFO  (qtp997467098-31380) [n:127.0.0.1:62476_solr    ] o.a.s.s.HttpSolrCall [admin] webapp=null path=/admin/collections params={requestid=1b64a917-32d8-4203-a2a9-7adf01fa20df&action=REQUESTSTATUS&wt=javabin&version=2} status=0 QTime=1
   [junit4]   2> 3018150 INFO  (qtp997467098-31382) [n:127.0.0.1:62476_solr    ] o.a.s.h.a.CoreAdminOperation Checking request status for : 1b64a917-32d8-4203-a2a9-7adf01fa20df7659711285393
   [junit4]   2> 3018150 INFO  (qtp997467098-31382) [n:127.0.0.1:62476_solr    ] o.a.s.s.HttpSolrCall [admin] webapp=null path=/admin/cores params={qt=/admin/cores&requestid=1b64a917-32d8-4203-a2a9-7adf01fa20df7659711285393&action=REQUESTSTATUS&wt=javabin&version=2} status=0 QTime=0
   [junit4]   2> 3018152 INFO  (qtp808030496-31372) [n:127.0.0.1:62479_solr    ] o.a.s.h.a.CoreAdminOperation Checking request status for : 1b64a917-32d8-4203-a2a9-7adf01fa20df7659714010087
   [junit4]   2> 3018152 INFO  (qtp808030496-31372) [n:127.0.0.1:62479_solr    ] o.a.s.s.HttpSolrCall [admin] webapp=null path=/admin/cores params={qt=/admin/cores&requestid=1b64a917-32d8-4203-a2a9-7adf01fa20df7659714010087&action=REQUESTSTATUS&wt=javabin&version=2} status=0 QTime=0
   [junit4]   2> 3018156 INFO  (OverseerThreadFactory-13207-thread-1-processing-n:127.0.0.1:62479_solr) [n:127.0.0.1:62479_solr    ] o.a.s.c.OverseerTaskQueue Response ZK path: /overseer/collection-queue-work/qnr-0000000000 doesn't exist.  Requestor may have disconnected from ZooKeeper
   [junit4]   2> 3018833 INFO  (OverseerCollectionConfigSetProcessor-99229706829365254-127.0.0.1:62479_solr-n_0000000000) [n:127.0.0.1:62479_solr    ] o.a.s.c.OverseerTaskQueue Response ZK path: /overseer/collection-queue-work/qnr-0000000000 doesn't exist.  Requestor may have disconnected from ZooKeeper
   [junit4]   2> 3018837 INFO  (qtp997467098-31382) [n:127.0.0.1:62476_solr    ] o.a.s.h.a.CollectionsHandler Invoked Collection Action :requeststatus with params requestid=1b64a917-32d8-4203-a2a9-7adf01fa20df&action=REQUESTSTATUS&wt=javabin&version=2 and sendToOCPQueue=true
   [junit4]   2> 3018838 INFO  (qtp997467098-31382) [n:127.0.0.1:62476_solr    ] o.a.s.s.HttpSolrCall [admin] webapp=null path=/admin/collections params={requestid=1b64a917-32d8-4203-a2a9-7adf01fa20df&action=REQUESTSTATUS&wt=javabin&version=2} status=0 QTime=2
   [junit4]   2> 3018838 INFO  (qtp997467098-31393) [n:127.0.0.1:62476_solr    ] o.a.s.h.a.CollectionsHandler Invoked Collection Action :deletestatus with params requestid=1b64a917-32d8-4203-a2a9-7adf01fa20df&action=DELETESTATUS&wt=javabin&version=2 and sendToOCPQueue=true
   [junit4]   2> 3018838 INFO  (qtp997467098-31393) [n:127.0.0.1:62476_solr    ] o.a.s.s.HttpSolrCall [admin] webapp=null path=/admin/collections params={requestid=1b64a917-32d8-4203-a2a9-7adf01fa20df&action=DELETESTATUS&wt=javabin&version=2} status=0 QTime=1
   [junit4]   2> 3018860 INFO  (qtp997467098-31394) [n:127.0.0.1:62476_solr c:oldindextest s:shard1 r:core_node3 x:oldindextest_shard1_replica_n1] o.a.s.u.p.LogUpdateProcessorFactory [oldindextest_shard1_replica_n1]  webapp=/solr path=/update params={update.distrib=FROMLEADER&distrib.from=http://127.0.0.1:62479/solr/oldindextest_shard1_replica_n2/&wt=javabin&version=2}{add=[1-0 (1587675314051350528)]} 0 5
   [junit4]   2> 3018861 INFO  (qtp808030496-31374) [n:127.0.0.1:62479_solr c:oldindextest s:shard1 r:core_node4 x:oldindextest_shard1_replica_n2] o.a.s.u.p.LogUpdateProcessorFactory [oldindextest_shard1_replica_n2]  webapp=/solr path=/update params={wt=javabin&version=2}{add=[1-0 (1587675314051350528)]} 0 13
   [junit4]   2> 3018865 INFO  (qtp997467098-31395) [n:127.0.0.1:62476_solr c:oldindextest s:shard1 r:core_node3 x:oldindextest_shard1_replica_n1] o.a.s.u.p.LogUpdateProcessorFactory [oldindextest_shard1_replica_n1]  webapp=/solr path=/update params={update.distrib=FROMLEADER&distrib.from=http://127.0.0.1:62479/solr/oldindextest_shard1_replica_n2/&wt=javabin&version=2}{add=[1-1 (1587675314067079168)]} 0 1
   [junit4]   2> 3018866 INFO  (qtp808030496-31388) [n:127.0.0.1:62479_solr c:oldindextest s:shard1 r:core_node4 x:oldindextest_shard1_replica_n2] o.a.s.u.p.LogUpdateProcessorFactory [oldindextest_shard1_replica_n2]  webapp=/solr path=/update params={wt=javabin&version=2}{add=[1-1 (1587675314067079168)]} 0 4
   [junit4]   2> 3018870 INFO  (qtp997467098-31376) [n:127.0.0.1:62476_solr c:oldindextest s:shard1 r:core_node3 x:oldindextest_shard1_replica_n1] o.a.s.u.p.LogUpdateProcessorFactory [oldindextest_shard1_replica_n1]  webapp=/solr path=/update params={update.distrib=FROMLEADER&distrib.from=http://127.0.0.1:62479/solr/oldindextest_shard1_replica_n2/&wt=javabin&version=2}{add=[1-2 (1587675314072322048)]} 0 1
   [junit4]   2> 3018871 INFO  (qtp808030496-31391) [n:127.0.0.1:62479_solr c:oldindextest s:shard1 r:core_node4 x:oldindextest_shard1_replica_n2] o.a.s.u.p.LogUpdateProcessorFactory [oldindextest_shard1_replica_n2]  webapp=/solr path=/update params={wt=javabin&version=2}{add=[1-2 (1587675314072322048)]} 0 3
   [junit4]   2> 3018875 INFO  (qtp997467098-31379) [n:127.0.0.1:62476_solr c:oldindextest s:shard1 r:core_node3 x:oldindextest_shard1_replica_n1] o.a.s.u.p.LogUpdateProcessorFactory [oldindextest_shard1_replica_n1]  webapp=/solr path=/update params={update.distrib=FROMLEADER&distrib.from=http://127.0.0.1:62479/solr/oldindextest_shard1_replica_n2/&wt=javabin&version=2}{add=[1-3 (1587675314077564928)]} 0 1
   [junit4]   2> 3018876 INFO  (qtp808030496-31375) [n:127.0.0.1:62479_solr c:oldindextest s:shard1 r:core_node4 x:oldindextest_shard1_replica_n2] o.a.s.u.p.LogUpdateProcessorFactory [oldindextest_shard1_replica_n2]  webapp=/solr path=/update params={wt=javabin&version=2}{add=[1-3 (1587675314077564928)]} 0 3
   [junit4]   2> 3018878 INFO  (qtp997467098-31381) [n:127.0.0.1:62476_solr c:oldindextest s:shard1 r:core_node3 x:oldindextest_shard1_replica_n1] o.a.s.u.p.LogUpdateProcessorFactory [oldindextest_shard1_replica_n1]  webapp=/solr path=/update params={update.distrib=FROMLEADER&distrib.from=http://127.0.0.1:62479/solr/oldindextest_shard1_replica_n2/&wt=javabin&version=2}{delete=[1-0 (-1587675314081759232)]} 0 0
   [junit4]   2> 3018878 INFO  (qtp808030496-31392) [n:127.0.0.1:62479_solr c:oldindextest s:shard1 r:core_node4 x:oldindextest_shard1_replica_n2] o.a.s.u.p.LogUpdateProcessorFactory [oldindextest_shard1_replica_n2]  webapp=/solr path=/update params={wt=javabin&version=2}{delete=[1-0 (-1587675314081759232)]} 0 1
   [junit4]   2> 3018883 INFO  (qtp997467098-31380) [n:127.0.0.1:62476_solr c:oldindextest s:shard1 r:core_node3 x:oldindextest_shard1_replica_n1] o.a.s.u.p.LogUpdateProcessorFactory [oldindextest_shard1_replica_n1]  webapp=/solr path=/update params={update.distrib=FROMLEADER&distrib.from=http://127.0.0.1:62479/solr/oldindextest_shard1_replica_n2/&wt=javabin&version=2}{add=[1-4 (1587675314085953536)]} 0 1
   [junit4]   2> 3018884 INFO  (qtp808030496-31368) [n:127.0.0.1:62479_solr c:oldindextest s:shard1 r:core_node4 x:oldindextest_shard1_replica_n2] o.a.s.u.p.LogUpdateProcessorFactory [oldindextest_shard1_replica_n2]  webapp=/solr path=/update params={wt=javabin&version=2}{add=[1-4 (1587675314085953536)]} 0 3
   [junit4]   2> 3018886 INFO  (qtp997467098-31383) [n:127.0.0.1:62476_solr c:oldindextest s:shard1 r:core_node3 x:oldindextest_shard1_replica_n1] o.a.s.u.p.LogUpdateProcessorFactory [oldindextest_shard1_replica_n1]  webapp=/solr path=/update params={update.distrib=FROMLEADER&distrib.from=http://127.0.0.1:62479/solr/oldindextest_shard1_replica_n2/&wt=javabin&version=2}{delete=[1-1 (-1587675314091196416)]} 0 0
   [junit4]   2> 3018886 INFO  (qtp808030496-31371) [n:127.0.0.1:62479_solr c:oldindextest s:shard1 r:core_node4 x:oldindextest_shard1_replica_n2] o.a.s.u.p.LogUpdateProcessorFactory [oldindextest_shard1_replica_n2]  webapp=/solr path=/update params={wt=javabin&version=2}{delete=[1-1 (-1587675314091196416)]} 0 1
   [junit4]   2> 3018890 INFO  (qtp997467098-31382) [n:127.0.0.1:62476_solr c:oldindextest s:shard1 r:core_node3 x:oldindextest_shard1_replica_n1] o.a.s.u.p.LogUpdateProcessorFactory [oldindextest_shard1_replica_n1]  webapp=/solr path=/update params={update.distrib=FROMLEADER&distrib.from=http://127.0.0.1:62479/solr/oldindextest_shard1_replica_n2/&wt=javabin&version=2}{add=[1-5 (1587675314093293568)]} 0 1
   [junit4]   2> 3018891 INFO  (qtp808030496-31373) [n:127.0.0.1:62479_solr c:oldindextest s:shard1 r:core_node4 x:oldindextest_shard1_replica_n2] o.a.s.u.p.LogUpdateProcessorFactory [oldindextest_shard1_replica_n2]  webapp=/solr path=/update params={wt=javabin&version=2}{add=[1-5 (1587675314093293568)]} 0 3
   [junit4]   2> 3018893 INFO  (qtp997467098-31393) [n:127.0.0.1:62476_solr c:oldindextest s:shard1 r:core_node3 x:oldindextest_shard1_replica_n1] o.a.s.u.p.LogUpdateProcessorFactory [oldindextest_shard1_replica_n1]  webapp=/solr path=/update params={update.distrib=FROMLEADER&distrib.from=http://127.0.0.1:62479/solr/oldindextest_shard1_replica_n2/&wt=javabin&version=2}{delete=[1-2 (-1587675314098536448)]} 0 1
   [junit4]   2> 3018894 INFO  (qtp808030496-31372) [n:127.0.0.1:62479_solr c:oldindextest s:shard1 r:core_node4 x:oldindextest_shard1_replica_n2] o.a.s.u.p.LogUpdateProcessorFactory [oldindextest_shard1_replica_n2]  webapp=/solr path=/update params={wt=javabin&version=2}{delete=[1-2 (-1587675314098536448)]} 0 2
   [junit4]   2> 3018897 INFO  (qtp997467098-31394) [n:127.0.0.1:62476_solr c:oldindextest s:shard1 r:core_node3 x:oldindextest_shard1_replica_n1] o.a.s.u.p.LogUpdateProcessorFactory [oldindextest_shard1_replica_n1]  webapp=/solr path=/update params={update.distrib=FROMLEADER&distrib.from=http://127.0.0.1:62479/solr/oldindextest_shard1_replica_n2/&wt=javabin&version=2}{add=[1-6 (1587675314101682176)]} 0 0
   [junit4]   2> 3018897 INFO  (qtp808030496-31374) [n:127.0.0.1:62479_solr c:oldindextest s:shard1 r:core_node4 x:oldindextest_shard1_replica_n2] o.a.s.u.p.LogUpdateProcessorFactory [oldindextest_shard1_replica_n2]  webapp=/solr path=/update params={wt=javabin&version=2}{add=[1-6 (1587675314101682176)]} 0 2
   [junit4]   2> 3018900 INFO  (qtp997467098-31395) [n:127.0.0.1:62476_solr c:oldindextest s:shard1 r:core_node3 x:oldindextest_shard1_replica_n1] o.a.s.u.p.LogUpdateProcessorFactory [oldindextest_shard1_replica_n1]  webapp=/solr path=/update params={update.distrib=FROMLEADER&distrib.from=http://127.0.0.1:62479/solr/oldindextest_shard1_replica_n2/&wt=javabin&version=2}{delete=[1-3 (-1587675314104827904)]} 0 0
   [junit4]   2> 3018900 INFO  (qtp808030496-31388) [n:127.0.0.1:62479_solr c:oldindextest s:shard1 r:core_node4 x:oldindextest_shard1_replica_n2] o.a.s.u.p.LogUpdateProcessorFactory [oldindextest_shard1_replica_n2]  webapp=/solr path=/update params={wt=javabin&version=2}{delete=[1-3 (-1587675314104827904)]} 0 2
   [junit4]   2> 3018903 INFO  (qtp997467098-31376) [n:127.0.0.1:62476_solr c:oldindextest s:shard1 r:core_node3 x:oldindextest_shard1_replica_n1] o.a.s.u.p.LogUpdateProcessorFactory [oldindextest_shard1_replica_n1]  webapp=/solr path=/update params={update.distrib=FROMLEADER&distrib.from=http://127.0.0.1:62479/solr/oldindextest_shard1_replica_n2/&wt=javabin&version=2}{add=[1-7 (1587675314107973632)]} 0 0
   [junit4]   2> 3018903 INFO  (qtp808030496-31391) [n:127.0.0.1:62479_solr c:oldindextest s:shard1 r:core_node4 x:oldindextest_shard1_replica_n2] o.a.s.u.p.LogUpdateProcessorFactory [oldindextest_shard1_replica_n2]  webapp=/solr path=/update params={wt=javabin&version=2}{add=[1-7 (1587675314107973632)]} 0 2
   [junit4]   2> 3018905 INFO  (qtp997467098-31379) [n:127.0.0.1:62476_solr c:oldindextest s:shard1 r:core_node3 x:oldindextest_shard1_replica_n1] o.a.s.u.p.LogUpdateProcessorFactory [oldindextest_shard1_replica_n1]  webapp=/solr path=/update params={update.distrib=FROMLEADER&distrib.from=http://127.0.0.1:62479/solr/oldindextest_shard1_replica_n2/&wt=javabin&version=2}{add=[1-8 (1587675314111119360)]} 0 0
   [junit4]   2> 3018907 INFO  (qtp808030496-31375) [n:127.0.0.1:62479_solr c:oldindextest s:shard1 r:core_node4 x:oldindextest_shard1_replica_n2] o.a.s.u.p.LogUpdateProcessorFactory [oldindextest_shard1_replica_n2]  webapp=/solr path=/update params={wt=javabin&version=2}{add=[1-8 (1587675314111119360)]} 0 2
   [junit4]   2> 3018910 INFO  (qtp997467098-31381) [n:127.0.0.1:62476_solr c:oldindextest s:shard1 r:core_node3 x:oldindextest_shard1_replica_n1] o.a.s.u.p.LogUpdateProcessorFactory [oldindextest_shard1_replica_n1]  webapp=/solr path=/update params={update.distrib=FROMLEADER&distrib.from=http://127.0.0.1:62479/solr/oldindextest_shard1_replica_n2/&wt=javabin&version=2}{add=[1-9 (1587675314114265088)]} 0 1
   [junit4]   2> 3018910 INFO  (qtp808030496-31392) [n:127.0.0.1:62479_solr c:oldindextest s:shard1 r:core_node4 x:oldindextest_shard1_replica_n2] o.a.s.u.p.LogUpdateProcessorFactory [oldindextest_shard1_replica_n2]  webapp=/solr path=/update params={wt=javabin&version=2}{add=[1-9 (1587675314114265088)]} 0 3
   [junit4]   2> 3018912 INFO  (qtp997467098-31380) [n:127.0.0.1:62476_solr c:oldindextest s:shard1 r:core_node3 x:oldindextest_shard1_replica_n1] o.a.s.u.p.LogUpdateProcessorFactory [oldindextest_shard1_replica_n1]  webapp=/solr path=/update params={update.distrib=FROMLEADER&distrib.from=http://127.0.0.1:62479/solr/oldindextest_shard1_replica_n2/&wt=javabin&version=2}{delete=[1-4 (-1587675314118459392)]} 0 0
   [junit4]   2> 3018913 INFO  (qtp808030496-31368) [n:127.0.0.1:62479_solr c:oldindextest s:shard1 r:core_node4 x:oldindextest_shard1_replica_n2] o.a.s.u.p.LogUpdateProcessorFactory [oldindextest_shard1_replica_n2]  webapp=/solr path=/update params={wt=javabin&version=2}{delete=[1-4 (-1587675314118459392)]} 0 1
   [junit4]   2> 3018917 INFO  (qtp997467098-31383) [n:127.0.0.1:62476_solr c:oldindextest s:shard1 r:core_node3 x:oldindextest_shard1_replica_n1] o.a.s.u.p.LogUpdateProcessorFactory [oldindextest_shard1_replica_n1]  webapp=/solr path=/update params={update.distrib=FROMLEADER&distrib.from=http://127.0.0.1:62479/solr/oldindextest_shard1_replica_n2/&wt=javabin&version=2}{add=[1-10 (1587675314121605120)]} 0 1
   [junit4]   2> 3018917 INFO  (qtp808030496-31371) [n:127.0.0.1:62479_solr c:oldindextest s:shard1 r:core_node4 x:oldindextest_shard1_replica_n2] o.a.s.u.p.LogUpdateProcessorFactory [oldindextest_shard1_replica_n2]  webapp=/solr path=/update params={wt=javabin&version=2}{add=[1-10 (1587675314121605120)]} 0 3
   [junit4]   2> 3018920 INFO  (qtp997467098-31382) [n:127.0.0.1:62476_solr c:oldindextest s:shard1 r:core_node3 x:oldindextest_shard1_replica_n1] o.a.s.u.p.LogUpdateProcessorFactory [oldindextest_shard1_replica_n1]  webapp=/solr path=/update params={update.distrib=FROMLEADER&distrib.from=http://127.0.0.1:62479/solr/oldindextest_shard1_replica_n2/&wt=javabin&version=2}{add=[1-11 (1587675314125799424)]} 0 0
   [junit4]   2> 3018921 INFO  (qtp808030496-31373) [n:127.0.0.1:62479_solr c:oldindextest s:shard1 r:core_node4 x:oldindextest_shard1_replica_n2] o.a.s.u.p.LogUpdateProcessorFactory [oldindextest_shard1_replica_n2]  webapp=/solr path=/update params={wt=javabin&version=2}{add=[1-11 (1587675314125799424)]} 0 2
   [junit4]   2> 3018923 INFO  (qtp997467098-31393) [n:127.0.0.1:62476_solr c:oldindextest s:shard1 r:core_node3 x:oldindextest_shard1_replica_n1] o.a.s.u.p.LogUpdateProcessorFactory [oldindextest_shard1_replica_n1]  webapp=/solr path=/update params={update.distrib=FROMLEADER&distrib.from=http://127.0.0.1:62479/solr/oldindextest_shard1_replica_n2/&wt=javabin&version=2}{delete=[1-5 (-1587675314129993728)]} 0 0
   [junit4]   2> 3018924 INFO  (qtp808030496-31372) [n:127.0.0.1:62479_solr c:oldindextest s:shard1 r:core_node4 x:oldindextest_shard1_replica_n2] o.a.s.u.p.LogUpdateProcessorFactory [oldindextest_shard1_replica_n2]  webapp=/solr path=/update params={wt=javabin&version=2}{delete=[1-5 (-1587675314129993728)]} 0 1
   [junit4]   2> 3018927 INFO  (qtp997467098-31394) [n:127.0.0.1:62476_solr c:oldindextest s:shard1 r:core_node3 x:oldindextest_shard1_replica_n1] o.a.s.u.p.LogUpdateProcessorFactory [oldindextest_shard1_replica_n1]  webapp=/solr path=/update params={update.distrib=FROMLEADER&distrib.from=http://127.0.0.1:62479/solr/oldindextest_shard1_replica_n2/&wt=javabin&version=2}{add=[1-12 (1587675314133139456)]} 0 0
   [junit4]   2> 3018927 INFO  (qtp808030496-31374) [n:127.0.0.1:62479_solr c:oldindextest s:shard1 r:core_node4 x:oldindextest_shard1_replica_n2] o.a.s.u.p.LogUpdateProcessorFactory [oldindextest_shard1_replica_n2]  webapp=/solr path=/update params={wt=javabin&version=2}{add=[1-12 (1587675314133139456)]} 0 2
   [junit4]   2> 3018929 INFO  (qtp997467098-31395) [n:127.0.0.1:62476_solr c:oldindextest s:shard1 r:core_node3 x:oldindextest_shard1_replica_n1] o.a.s.u.p.LogUpdateProcessorFactory [oldindextest_shard1_replica_n1]  webapp=/solr path=/update params={update.distrib=FROMLEADER&distrib.from=http://127.0.0.1:62479/solr/oldindextest_shard1_replica_n2/&wt=javabin&version=2}{delete=[1-7 (-1587675314136285184)]} 0 0
   [junit4]   2> 3018930 INFO  (qtp808030496-31388) [n:127.0.0.1:62479_solr c:oldindextest s:shard1 r:core_node4 x:oldindextest_shard1_replica_n2] o.a.s.u.p.LogUpdateProcessorFactory [oldindextest_shard1_replica_n2]  webapp=/solr path=/update params={wt=javabin&version=2}{delete=[1-7 (-1587675314136285184)]} 0 2
   [junit4]   2> 3018933 INFO  (qtp997467098-31376) [n:127.0.0.1:62476_solr c:oldindextest s:shard1 r:core_node3 x:oldindextest_shard1_replica_n1] o.a.s.u.p.LogUpdateProcessorFactory [oldindextest_shard1_replica_n1]  webapp=/solr path=/update params={update.distrib=FROMLEADER&distrib.from=http://127.0.0.1:62479/solr/oldindextest_shard1_replica_n2/&wt=javabin&version=2}{add=[1-13 (1587675314139430912)]} 0 0
   [junit4]   2> 3018934 INFO  (qtp808030496-31391) [n:127.0.0.1:62479_solr c:oldindextest s:shard1 r:core_node4 x:oldindextest_shard1_replica_n2] o.a.s.u.p.LogUpdateProcessorFactory [oldindextest_shard1_replica_n2]  webapp=/solr path=/update params={wt=javabin&version=2}{add=[1-13 (1587675314139430912)]} 0 2
   [junit4]   2> 3018936 INFO  (qtp997467098-31379) [n:127.0.0.1:62476_solr c:oldindextest s:shard1 r:core_node3 x:oldindextest_shard1_replica_n1] o.a.s.u.p.LogUpdateProcessorFactory [oldindextest_shard1_replica_n1]  webapp=/solr path=/update params={update.distrib=FROMLEADER&distrib.from=http://127.0.0.1:62479/solr/oldindextest_shard1_replica_n2/&wt=javabin&version=2}{delete=[1-8 (-1587675314143625216)]} 0 0
   [junit4]   2> 3018936 INFO  (qtp808030496-31375) [n:127.0.0.1:62479_solr c:oldindextest s:shard1 r:core_node4 x:oldindextest_shard1_replica_n2] o.a.s.u.p.LogUpdateProcessorFactory [oldindextest_shard1_replica_n2]  webapp=/solr path=/update params={wt=javabin&version=2}{delete=[1-8 (-1587675314143625216)]} 0 1
   [junit4]   2> 3018939 INFO  (qtp997467098-31381) [n:127.0.0.1:62476_solr c:oldindextest s:shard1 r:core_node3 x:oldindextest_shard1_replica_n1] o.a.s.u.p.LogUpdateProcessorFactory [oldindextest_shard1_replica_n1]  webapp=/solr path=/update params={update.distrib=FROMLEADER&distrib.from=http://127.0.0.1:62479/solr/oldindextest_shard1_replica_n2/&wt=javabin&version=2}{add=[1-14 (1587675314146770944)]} 0 0
   [junit4]   2> 3018939 INFO  (qtp808030496-31392) [n:127.0.0.1:62479_solr c:oldindextest s:shard1 r:core_node4 x:oldindextest_shard1_replica_n2] o.a.s.u.p.LogUpdateProcessorFactory [oldindextest_shard1_replica_n2]  webapp=/solr path=/update params={wt=javabin&version=2}{add=[1-14 (1587675314146770944)]} 0 1
   [junit4]   2> 3018942 INFO  (qtp997467098-31380) [n:127.0.0.1:62476_solr c:oldindextest s:shard1 r:core_node3 x:oldindextest_shard1_replica_n1] o.a.s.u.p.LogUpdateProcessorFactory [oldindextest_shard1_replica_n1]  webapp=/solr path=/update params={update.distrib=FROMLEADER&distrib.from=http://127.0.0.1:62479/solr/oldindextest_shard1_replica_n2/&wt=javabin&version=2}{add=[1-15 (1587675314148868096)]} 0 0
   [junit4]   2> 3018946 INFO  (qtp808030496-31368) [n:127.0.0.1:62479_solr c:oldindextest s:shard1 r:core_node4 x:oldindextest_shard1_replica_n2] o.a.s.u.p.LogUpdateProcessorFactory [oldindextest_shard1_replica_n2]  webapp=/solr path=/update params={wt=javabin&version=2}{add=[1-15 (1587675314148868096)]} 0 5
   [junit4]   2> 3018948 INFO  (qtp997467098-31383) [n:127.0.0.1:62476_solr c:oldindextest s:shard1 r:core_node3 x:oldindextest_shard1_replica_n1] o.a.s.u.p.LogUpdateProcessorFactory [oldindextest_shard1_replica_n1]  webapp=/solr path=/update params={update.distrib=FROMLEADER&distrib.from=http://127.0.0.1:62479/solr/oldindextest_shard1_replica_n2/&wt=javabin&version=2}{delete=[1-9 (-1587675314156208128)]} 0 0
   [junit4]   2> 3018949 INFO  (qtp808030496-31371) [n:127.0.0.1:62479_solr c:oldindextest s:shard1 r:core_node4 x:oldindextest_shard1_replica_n2] o.a.s.u.p.LogUpdateProcessorFactory [oldindextest_shard1_replica_n2]  webapp=/solr path=/update params={wt=javabin&version=2}{delete=[1-9 (-1587675314156208128)]} 0 2
   [junit4]   2> 3018951 INFO  (qtp997467098-31382) [n:127.0.0.1:62476_solr c:oldindextest s:shard1 r:core_node3 x:oldindextest_shard1_replica_n1] o.a.s.u.p.LogUpdateProcessorFactory [oldindextest_shard1_replica_n1]  webapp=/solr path=/update params={update.distrib=FROMLEADER&distrib.from=http://127.0.0.1:62479/solr/oldindextest_shard1_replica_n2/&wt=javabin&version=2}{add=[1-16 (1587675314159353856)]} 0 0
   [junit4]   2> 3018952 INFO  (qtp808030496-31373) [n:127.0.0.1:62479_solr c:oldindextest s:shard1 r:core_node4 x:oldindextest_shard1_replica_n2] o.a.s.u.p.LogUpdateProcessorFactory [oldindextest_shard1_replica_n2]  webapp=/solr path=/update params={wt=javabin&version=2}{add=[1-16 (1587675314159353856)]} 0 2
   [junit4]   2> 3018954 INFO  (qtp997467098-31393) [n:127.0.0.1:62476_solr c:oldindextest s:shard1 r:core_node3 x:oldindextest_shard1_replica_n1] o.a.s.u.p.LogUpdateProcessorFactory [oldindextest_shard1_replica_n1]  webapp=/solr path=/update params={update.distrib=FROMLEADER&distrib.from=http://127.0.0.1:62479/solr/oldindextest_shard1_replica_n2/&wt=javabin&version=2}{delete=[1-11 (-1587675314162499584)]} 0 0
   [junit4]   2> 3018955 INFO  (qtp808030496-31372) [n:127.0.0.1:62479_solr c:oldindextest s:shard1 r:core_node4 x:oldindextest_shard1_replica_n2] o.a.s.u.p.LogUpdateProcessorFactory [oldindextest_shard1_replica_n2]  webapp=/solr path=/update params={wt=javabin&version=2}{delete=[1-11 (-1587675314162499584)]} 0 2
   [junit4]   2> 3018960 INFO  (qtp997467098-31394) [n:127.0.0.1:62476_solr c:oldindextest s:shard1 r:core_node3 x:oldindextest_shard1_replica_n1] o.a.s.u.p.LogUpdateProcessorFactory [oldindextest_shard1_replica_n1]  webapp=/solr path=/update params={update.distrib=FROMLEADER&distrib.from=http://127.0.0.1:62479/solr/oldindextest_shard1_replica_n2/&wt=javabin&version=2}{add=[1-17 (1587675314167742464)]} 0 0
   [junit4]   2> 3018960 INFO  (qtp808030496-31374) [n:127.0.0.1:62479_solr c:oldindextest s:shard1 r:core_node4 x:oldindextest_shard1_replica_n2] o.a.s.u.p.LogUpdateProcessorFactory [oldindextest_shard1_replica_n2]  webapp=/solr path=/update params={wt=javabin&version=2}{add=[1-17 (1587675314167742464)]} 0 2
   [junit4]   2> 3018963 INFO  (qtp997467098-31395) [n:127.0.0.1:62476_solr c:oldindextest s:shard1 r:core_node3 x:oldindextest_shard1_replica_n1] o.a.s.u.p.LogUpdateProcessorFactory [oldindextest_shard1_replica_n1]  webapp=/solr path=/update params={update.distrib=FROMLEADER&distrib.from=http://127.0.0.1:62479/solr/oldindextest_shard1_replica_n2/&wt=javabin&version=2}{add=[1-18 (1587675314170888192)]} 0 0
   [junit4]   2> 3018963 INFO  (qtp808030496-31388) [n:127.0.0.1:62479_solr c:oldindextest s:shard1 r:core_node4 x:oldindextest_shard1_replica_n2] o.a.s.u.p.LogUpdateProcessorFactory [oldindextest_shard1_replica_n2]  webapp=/solr path=/update params={wt=javabin&version=2}{add=[1-18 (1587675314170888192)]} 0 2
   [junit4]   2> 3018965 INFO  (qtp997467098-31376) [n:127.0.0.1:62476_solr c:oldindextest s:shard1 r:core_node3 x:oldindextest_shard1_replica_n1] o.a.s.u.p.LogUpdateProcessorFactory [oldindextest_shard1_replica_n1]  webapp=/solr path=/update params={update.distrib=FROMLEADER&distrib.from=http://127.0.0.1:62479/solr/oldindextest_shard1_replica_n2/&wt=javabin&version=2}{delete=[1-12 (-1587675314174033920)]} 0 0
   [junit4]   2> 3018966 INFO  (qtp808030496-31391) [n:127.0.0.1:62479_solr c:oldindextest s:shard1 r:core_node4 x:oldindextest_shard1_replica_n2] o.a.s.u.p.LogUpdateProcessorFactory [oldindextest_shard1_replica_n2]  webapp=/solr path=/update params={wt=javabin&version=2}{delete=[1-12 (-1587675314174033920)]} 0 1
   [junit4]   2> 3018969 INFO  (qtp997467098-31379) [n:127.0.0.1:62476_solr c:oldindextest s:shard1 r:core_node3 x:oldindextest_shard1_replica_n1] o.a.s.u.p.LogUpdateProcessorFactory [oldindextest_shard1_replica_n1]  webapp=/solr path=/update params={update.distrib=FROMLEADER&distrib.from=http://127.0.0.1:62479/solr/oldindextest_shard1_replica_n2/&wt=javabin&version=2}{add=[1-19 (1587675314177179648)]} 0 0
   [junit4]   2> 3018969 INFO  (qtp808030496-31375) [n:127.0.0.1:62479_solr c:oldindextest s:shard1 r:core_node4 x:oldindextest_shard1_replica_n2] o.a.s.u.p.LogUpdateProcessorFactory [oldindextest_shard1_replica_n2]  webapp=/solr path=/update params={wt=javabin&version=2}{add=[1-19 (1587675314177179648)]} 0 2
   [junit4]   2> 3018972 INFO  (qtp997467098-31381) [n:127.0.0.1:62476_solr c:oldindextest s:shard1 r:core_node3 x:oldindextest_shard1_replica_n1] o.a.s.u.p.LogUpdateProcessorFactory [oldindextest_shard1_replica_n1]  webapp=/solr path=/update params={update.distrib=FROMLEADER&distrib.from=http://127.0.0.1:62479/solr/oldindextest_shard1_replica_n2/&wt=javabin&version=2}{add=[1-20 (1587675314180325376)]} 0 0
   [junit4]   2> 3018972 INFO  (qtp808030496-31392) [n:127.0.0.1:62479_solr c:oldindextest s:shard1 r:core_node4 x:oldindextest_shard1_replica_n2] o.a.s.u.p.LogUpdateProcessorFactory [oldindextest_shard1_replica_n2]  webapp=/solr path=/update params={wt=javabin&version=2}{add=[1-20 (1587675314180325376)]} 0 1
   [junit4]   2> 3018974 INFO  (qtp997467098-31380) [n:127.0.0.1:62476_solr c:oldindextest s:shard1 r:core_node3 x:oldindextest_shard1_replica_n1] o.a.s.u.p.LogUpdateProcessorFactory [oldindextest_shard1_replica_n1]  webapp=/solr path=/update params={update.distrib=FROMLEADER&distrib.from=http://127.0.0.1:62479/solr/oldindextest_shard1_replica_n2/&wt=javabin&version=2}{delete=[1-14 (-1587675314183471104)]} 0 0
   [junit4]   2> 3018975 INFO  (qtp808030496-31368) [n:127.0.0.1:62479_solr c:oldindextest s:shard1 r:core_node4 x:oldindextest_shard1_replica_n2] o.a.s.u.p.LogUpdateProcessorFactory [oldindextest_shard1_replica_n2]  webapp=/solr path=/update params={wt=javabin&version=2}{delete=[1-14 (-1587675314183471104)]} 0 1
   [junit4]   2> 3018977 INFO  (qtp997467098-31383) [n:127.0.0.1:62476_solr c:oldindextest s:shard1 r:core_node3 x:oldindextest_shard1_replica_n1] o.a.s.u.p.LogUpdateProcessorFactory [oldindextest_shard1_replica_n1]  webapp=/solr path=/update params={update.distrib=FROMLEADER&distrib.from=http://127.0.0.1:62479/solr/oldindextest_shard1_replica_n2/&wt=javabin&version=2}{add=[1-21 (1587675314185568256)]} 0 0
   [junit4]   2> 3018977 INFO  (qtp808030496-31371) [n:127.0.0.1:62479_solr c:oldindextest s:shard1 r:core_node4 x:oldindextest_shard1_replica_n2] o.a.s.u.p.LogUpdateProcessorFactory [oldindextest_shard1_replica_n2]  webapp=/solr path=/update params={wt=javabin&version=2}{add=[1-21 (1587675314185568256)]} 0 1
   [junit4]   2> 3018979 INFO  (qtp997467098-31382) [n:127.0.0.1:62476_solr c:oldindextest s:shard1 r:core_node3 x:oldindextest_shard1_replica_n1] o.a.s.u.p.LogUpdateProcessorFactory [oldindextest_shard1_replica_n1]  webapp=/solr path=/update params={update.distrib=FROMLEADER&distrib.from=http://127.0.0.1:62479/solr/

[...truncated too long message...]

TriggerThread OverseerTriggerThread woken up but we are closed, exiting.
   [junit4]   2> 8376450 DEBUG (SUITE-TestTriggerIntegration-seed#[CE6CB3A2AD01D491]-worker) [    ] o.a.s.c.a.OverseerTriggerThread OverseerTriggerThread has been closed explicitly
   [junit4]   2> NOTE: leaving temporary files on disk at: C:\Users\jenkins\workspace\Lucene-Solr-master-Windows\solr\build\solr-core\test\J1\temp\solr.cloud.autoscaling.sim.TestTriggerIntegration_CE6CB3A2AD01D491-001
   [junit4]   2> NOTE: test params are: codec=Asserting(Lucene70): {}, docValues:{}, maxPointsInLeafNode=1288, maxMBSortInHeap=7.5962136047178515, sim=Asserting(org.apache.lucene.search.similarities.AssertingSimilarity@1939fd22), locale=fr, timezone=Asia/Famagusta
   [junit4]   2> NOTE: Windows 10 10.0 amd64/Oracle Corporation 9.0.1 (64-bit)/cpus=3,threads=1,free=87313904,total=367099904
   [junit4]   2> NOTE: All tests run in this JVM: [TestManagedSynonymGraphFilterFactory, TestSearchPerf, TestConfigSetsAPI, TestNumericTerms32, TestStressReorder, OpenCloseCoreStressTest, TestSolrQueryResponse, TestWordDelimiterFilterFactory, TestMergePolicyConfig, HdfsUnloadDistributedZkTest, SolrXmlInZkTest, NodeMutatorTest, UpdateLogTest, TestHalfAndHalfDocValues, TestSimpleTrackingShardHandler, TestScoreJoinQPNoScore, OverriddenZkACLAndCredentialsProvidersTest, TestLegacyFieldReuse, TestGenericDistributedQueue, IndexSchemaRuntimeFieldTest, CdcrReplicationDistributedZkTest, TestRTGBase, DistributedFacetPivotWhiteBoxTest, TestLegacyNumericRangeQueryBuilder, TestCloudSearcherWarming, TestPivotHelperCode, TestComplexPhraseLeadingWildcard, DocValuesMultiTest, SOLR749Test, StatelessScriptUpdateProcessorFactoryTest, TestSchemaNameResource, TestObjectReleaseTracker, SharedFSAutoReplicaFailoverTest, AliasIntegrationTest, BlockDirectoryTest, TestSolrQueryParser, UUIDUpdateProcessorFallbackTest, DistributedMLTComponentTest, TestCloudJSONFacetJoinDomain, ExecutePlanActionTest, TestHighFrequencyDictionaryFactory, UpdateParamsTest, TestSystemCollAutoCreate, TestValueSourceCache, ReplicationFactorTest, TestGraphMLResponseWriter, TestSort, DistributedFacetPivotSmallAdvancedTest, TestBulkSchemaAPI, TestDocSet, TestCoreContainer, TestExpandComponent, TestBackupRepositoryFactory, FacetPivotSmallTest, TestFileDictionaryLookup, SearchHandlerTest, TermsComponentTest, TestCloudDeleteByQuery, SolrPluginUtilsTest, TestAddFieldRealTimeGet, TlogReplayBufferedWhileIndexingTest, TestSolrDeletionPolicy1, CloneFieldUpdateProcessorFactoryTest, TestDownShardTolerantSearch, TestPolicyCloud, CoreAdminCreateDiscoverTest, HealthCheckHandlerTest, TestTrieFacet, ManagedSchemaRoundRobinCloudTest, TestEmbeddedSolrServerConstructors, TestDistributedGrouping, RulesTest, SimplePostToolTest, TestInitParams, TestCrossCoreJoin, DistributedIntervalFacetingTest, HdfsBasicDistributedZk2Test, DocValuesMissingTest, PreAnalyzedFieldTest, CopyFieldTest, TestCloudNestedDocsSort, ConnectionManagerTest, DirectSolrSpellCheckerTest, FullHLLTest, AtomicUpdatesTest, UpdateRequestProcessorFactoryTest, AnalyticsQueryTest, TestElisionMultitermQuery, AnalysisAfterCoreReloadTest, TestTlogReplica, TestClusterStateProvider, SolrGangliaReporterTest, MoveReplicaTest, TestNodeAddedTrigger, AnalysisErrorHandlingTest, DistributedQueryComponentOptimizationTest, TestExportWriter, HttpTriggerListenerTest, StatsReloadRaceTest, HdfsRestartWhileUpdatingTest, SimpleFacetsTest, TestSystemIdResolver, TestCollectionAPIs, TestFoldingMultitermQuery, PeerSyncTest, UninvertDocValuesMergePolicyTest, TestPrepRecovery, UtilsToolTest, TestStandardQParsers, DistributedQueueTest, TestPolicyCloud, TestDynamicFieldCollectionResource, TestAnalyzeInfixSuggestions, TestSolrCLIRunExample, TestHdfsBackupRestoreCore, PolyFieldTest, HdfsChaosMonkeyNothingIsSafeTest, NumberUtilsTest, TestQueryTypes, TestFilteredDocIdSet, LeaderFailureAfterFreshStartTest, TestManagedSchemaAPI, TestCoreAdminApis, TemplateUpdateProcessorTest, SystemInfoHandlerTest, TestPointFields, CollectionStateFormat2Test, QueryEqualityTest, EchoParamsTest, TestRawTransformer, TestUninvertingReader, SoftAutoCommitTest, TermVectorComponentTest, TestSortByMinMaxFunction, SimpleMLTQParserTest, AssignTest, TestCollectionAPI, TestSQLHandler, TestDefaultStatsCache, FileUtilsTest, DebugComponentTest, SecurityConfHandlerTest, SolrIndexSplitterTest, SolrShardReporterTest, TestExactSharedStatsCache, TestTriggerIntegration]
   [junit4] Completed [721/765 (3!)] on J1 in 3.08s, 11 tests, 1 error <<< FAILURES!

[...truncated 2513 lines...]
   [junit4] Suite: org.apache.solr.update.processor.TestOpenNLPExtractNamedEntitiesUpdateProcessorFactory
   [junit4]   2> Creating dataDir: C:\Users\jenkins\workspace\Lucene-Solr-master-Windows\solr\build\contrib\solr-analysis-extras\test\J1\temp\solr.update.processor.TestOpenNLPExtractNamedEntitiesUpdateProcessorFactory_45BC7C03843AA516-001\init-core-data-001
   [junit4]   2> NOTE: test params are: codec=Asserting(Lucene70): {}, docValues:{}, maxPointsInLeafNode=715, maxMBSortInHeap=6.110140916714058, sim=Asserting(org.apache.lucene.search.similarities.AssertingSimilarity@7336934f), locale=mfe-MU, timezone=Indian/Maldives
   [junit4]   2> NOTE: Windows 10 10.0 amd64/Oracle Corporation 9.0.1 (64-bit)/cpus=3,threads=1,free=41455704,total=97386496
   [junit4]   2> NOTE: All tests run in this JVM: [TestICUCollationFieldOptions, TestFoldingMultitermExtrasQuery, TestOpenNLPExtractNamedEntitiesUpdateProcessorFactory]
   [junit4]   2> NOTE: reproduce with: ant test  -Dtestcase=TestOpenNLPExtractNamedEntitiesUpdateProcessorFactory -Dtests.seed=45BC7C03843AA516 -Dtests.slow=true -Dtests.locale=mfe-MU -Dtests.timezone=Indian/Maldives -Dtests.asserts=true -Dtests.file.encoding=US-ASCII
   [junit4] ERROR   0.00s J1 | TestOpenNLPExtractNamedEntitiesUpdateProcessorFactory (suite) <<<
   [junit4]    > Throwable #1: java.io.IOException: Could not remove the following files (in the order of attempts):
   [junit4]    >    C:\Users\jenkins\workspace\Lucene-Solr-master-Windows\solr\build\contrib\solr-analysis-extras\test\J1\temp\solr.update.processor.TestOpenNLPExtractNamedEntitiesUpdateProcessorFactory_45BC7C03843AA516-001\tempDir-001\collection1\conf: java.nio.file.DirectoryNotEmptyException: C:\Users\jenkins\workspace\Lucene-Solr-master-Windows\solr\build\contrib\solr-analysis-extras\test\J1\temp\solr.update.processor.TestOpenNLPExtractNamedEntitiesUpdateProcessorFactory_45BC7C03843AA516-001\tempDir-001\collection1\conf
   [junit4]    >    C:\Users\jenkins\workspace\Lucene-Solr-master-Windows\solr\build\contrib\solr-analysis-extras\test\J1\temp\solr.update.processor.TestOpenNLPExtractNamedEntitiesUpdateProcessorFactory_45BC7C03843AA516-001\tempDir-001\collection1: java.nio.file.DirectoryNotEmptyException: C:\Users\jenkins\workspace\Lucene-Solr-master-Windows\solr\build\contrib\solr-analysis-extras\test\J1\temp\solr.update.processor.TestOpenNLPExtractNamedEntitiesUpdateProcessorFactory_45BC7C03843AA516-001\tempDir-001\collection1
   [junit4]    >    C:\Users\jenkins\workspace\Lucene-Solr-master-Windows\solr\build\contrib\solr-analysis-extras\test\J1\temp\solr.update.processor.TestOpenNLPExtractNamedEntitiesUpdateProcessorFactory_45BC7C03843AA516-001\tempDir-001: java.nio.file.DirectoryNotEmptyException: C:\Users\jenkins\workspace\Lucene-Solr-master-Windows\solr\build\contrib\solr-analysis-extras\test\J1\temp\solr.update.processor.TestOpenNLPExtractNamedEntitiesUpdateProcessorFactory_45BC7C03843AA516-001\tempDir-001
   [junit4]    >    C:\Users\jenkins\workspace\Lucene-Solr-master-Windows\solr\build\contrib\solr-analysis-extras\test\J1\temp\solr.update.processor.TestOpenNLPExtractNamedEntitiesUpdateProcessorFactory_45BC7C03843AA516-001\tempDir-001\collection1\conf\en-test-sent.bin: java.nio.file.AccessDeniedException: C:\Users\jenkins\workspace\Lucene-Solr-master-Windows\solr\build\contrib\solr-analysis-extras\test\J1\temp\solr.update.processor.TestOpenNLPExtractNamedEntitiesUpdateProcessorFactory_45BC7C03843AA516-001\tempDir-001\collection1\conf\en-test-sent.bin
   [junit4]    >    C:\Users\jenkins\workspace\Lucene-Solr-master-Windows\solr\build\contrib\solr-analysis-extras\test\J1\temp\solr.update.processor.TestOpenNLPExtractNamedEntitiesUpdateProcessorFactory_45BC7C03843AA516-001\tempDir-001\collection1\conf\en-test-ner-person.bin: java.nio.file.AccessDeniedException: C:\Users\jenkins\workspace\Lucene-Solr-master-Windows\solr\build\contrib\solr-analysis-extras\test\J1\temp\solr.update.processor.TestOpenNLPExtractNamedEntitiesUpdateProcessorFactory_45BC7C03843AA516-001\tempDir-001\collection1\conf\en-test-ner-person.bin
   [junit4]    >    C:\Users\jenkins\workspace\Lucene-Solr-master-Windows\solr\build\contrib\solr-analysis-extras\test\J1\temp\solr.update.processor.TestOpenNLPExtractNamedEntitiesUpdateProcessorFactory_45BC7C03843AA516-001\tempDir-001\collection1\conf\en-test-tokenizer.bin: java.nio.file.AccessDeniedException: C:\Users\jenkins\workspace\Lucene-Solr-master-Windows\solr\build\contrib\solr-analysis-extras\test\J1\temp\solr.update.processor.TestOpenNLPExtractNamedEntitiesUpdateProcessorFactory_45BC7C03843AA516-001\tempDir-001\collection1\conf\en-test-tokenizer.bin
   [junit4]    >    C:\Users\jenkins\workspace\Lucene-Solr-master-Windows\solr\build\contrib\solr-analysis-extras\test\J1\temp\solr.update.processor.TestOpenNLPExtractNamedEntitiesUpdateProcessorFactory_45BC7C03843AA516-001: java.nio.file.DirectoryNotEmptyException: C:\Users\jenkins\workspace\Lucene-Solr-master-Windows\solr\build\contrib\solr-analysis-extras\test\J1\temp\solr.update.processor.TestOpenNLPExtractNamedEntitiesUpdateProcessorFactory_45BC7C03843AA516-001
   [junit4]    > 	at __randomizedtesting.SeedInfo.seed([45BC7C03843AA516]:0)
   [junit4]    > 	at org.apache.lucene.util.IOUtils.rm(IOUtils.java:329)
   [junit4]    > 	at java.base/java.lang.Thread.run(Thread.java:844)
   [junit4] Completed [5/5 (1!)] on J1 in 0.63s, 8 tests, 1 error <<< FAILURES!

[...truncated 38402 lines...]

Mime
View raw message