lucene-dev mailing list archives

Site index · List index
Message view « Date » · « Thread »
Top « Date » · « Thread »
From Policeman Jenkins Server <jenk...@thetaphi.de>
Subject [JENKINS] Lucene-Solr-master-Linux (64bit/jdk-9.0.1) - Build # 21123 - Still unstable!
Date Fri, 22 Dec 2017 13:50:06 GMT
Build: https://jenkins.thetaphi.de/job/Lucene-Solr-master-Linux/21123/
Java: 64bit/jdk-9.0.1 -XX:-UseCompressedOops -XX:+UseSerialGC

4 tests failed.
FAILED:  junit.framework.TestSuite.org.apache.solr.cloud.ChaosMonkeyNothingIsSafeTest

Error Message:
9 threads leaked from SUITE scope at org.apache.solr.cloud.ChaosMonkeyNothingIsSafeTest:     1) Thread[id=2993, name=zkCallback-625-thread-3, state=TIMED_WAITING, group=TGRP-ChaosMonkeyNothingIsSafeTest]         at java.base@9.0.1/jdk.internal.misc.Unsafe.park(Native Method)         at java.base@9.0.1/java.util.concurrent.locks.LockSupport.parkNanos(LockSupport.java:234)         at java.base@9.0.1/java.util.concurrent.SynchronousQueue$TransferStack.awaitFulfill(SynchronousQueue.java:462)         at java.base@9.0.1/java.util.concurrent.SynchronousQueue$TransferStack.transfer(SynchronousQueue.java:361)         at java.base@9.0.1/java.util.concurrent.SynchronousQueue.poll(SynchronousQueue.java:937)         at java.base@9.0.1/java.util.concurrent.ThreadPoolExecutor.getTask(ThreadPoolExecutor.java:1091)         at java.base@9.0.1/java.util.concurrent.ThreadPoolExecutor.runWorker(ThreadPoolExecutor.java:1152)         at java.base@9.0.1/java.util.concurrent.ThreadPoolExecutor$Worker.run(ThreadPoolExecutor.java:641)         at java.base@9.0.1/java.lang.Thread.run(Thread.java:844)    2) Thread[id=2810, name=Connection evictor, state=TIMED_WAITING, group=TGRP-ChaosMonkeyNothingIsSafeTest]         at java.base@9.0.1/java.lang.Thread.sleep(Native Method)         at app//org.apache.http.impl.client.IdleConnectionEvictor$1.run(IdleConnectionEvictor.java:66)         at java.base@9.0.1/java.lang.Thread.run(Thread.java:844)    3) Thread[id=2815, name=zkCallback-625-thread-1, state=TIMED_WAITING, group=TGRP-ChaosMonkeyNothingIsSafeTest]         at java.base@9.0.1/jdk.internal.misc.Unsafe.park(Native Method)         at java.base@9.0.1/java.util.concurrent.locks.LockSupport.parkNanos(LockSupport.java:234)         at java.base@9.0.1/java.util.concurrent.SynchronousQueue$TransferStack.awaitFulfill(SynchronousQueue.java:462)         at java.base@9.0.1/java.util.concurrent.SynchronousQueue$TransferStack.transfer(SynchronousQueue.java:361)         at java.base@9.0.1/java.util.concurrent.SynchronousQueue.poll(SynchronousQueue.java:937)         at java.base@9.0.1/java.util.concurrent.ThreadPoolExecutor.getTask(ThreadPoolExecutor.java:1091)         at java.base@9.0.1/java.util.concurrent.ThreadPoolExecutor.runWorker(ThreadPoolExecutor.java:1152)         at java.base@9.0.1/java.util.concurrent.ThreadPoolExecutor$Worker.run(ThreadPoolExecutor.java:641)         at java.base@9.0.1/java.lang.Thread.run(Thread.java:844)    4) Thread[id=2813, name=zkConnectionManagerCallback-626-thread-1, state=WAITING, group=TGRP-ChaosMonkeyNothingIsSafeTest]         at java.base@9.0.1/jdk.internal.misc.Unsafe.park(Native Method)         at java.base@9.0.1/java.util.concurrent.locks.LockSupport.park(LockSupport.java:194)         at java.base@9.0.1/java.util.concurrent.locks.AbstractQueuedSynchronizer$ConditionObject.await(AbstractQueuedSynchronizer.java:2062)         at java.base@9.0.1/java.util.concurrent.LinkedBlockingQueue.take(LinkedBlockingQueue.java:435)         at java.base@9.0.1/java.util.concurrent.ThreadPoolExecutor.getTask(ThreadPoolExecutor.java:1092)         at java.base@9.0.1/java.util.concurrent.ThreadPoolExecutor.runWorker(ThreadPoolExecutor.java:1152)         at java.base@9.0.1/java.util.concurrent.ThreadPoolExecutor$Worker.run(ThreadPoolExecutor.java:641)         at java.base@9.0.1/java.lang.Thread.run(Thread.java:844)    5) Thread[id=2811, name=TEST-ChaosMonkeyNothingIsSafeTest.test-seed#[A8F663C7CEB1A28B]-SendThread(127.0.0.1:43883), state=TIMED_WAITING, group=TGRP-ChaosMonkeyNothingIsSafeTest]         at java.base@9.0.1/java.lang.Thread.sleep(Native Method)         at app//org.apache.zookeeper.ClientCnxn$SendThread.run(ClientCnxn.java:1051)    6) Thread[id=2812, name=TEST-ChaosMonkeyNothingIsSafeTest.test-seed#[A8F663C7CEB1A28B]-EventThread, state=WAITING, group=TGRP-ChaosMonkeyNothingIsSafeTest]         at java.base@9.0.1/jdk.internal.misc.Unsafe.park(Native Method)         at java.base@9.0.1/java.util.concurrent.locks.LockSupport.park(LockSupport.java:194)         at java.base@9.0.1/java.util.concurrent.locks.AbstractQueuedSynchronizer$ConditionObject.await(AbstractQueuedSynchronizer.java:2062)         at java.base@9.0.1/java.util.concurrent.LinkedBlockingQueue.take(LinkedBlockingQueue.java:435)         at app//org.apache.zookeeper.ClientCnxn$EventThread.run(ClientCnxn.java:501)    7) Thread[id=3010, name=zkCallback-625-thread-4, state=TIMED_WAITING, group=TGRP-ChaosMonkeyNothingIsSafeTest]         at java.base@9.0.1/jdk.internal.misc.Unsafe.park(Native Method)         at java.base@9.0.1/java.util.concurrent.locks.LockSupport.parkNanos(LockSupport.java:234)         at java.base@9.0.1/java.util.concurrent.SynchronousQueue$TransferStack.awaitFulfill(SynchronousQueue.java:462)         at java.base@9.0.1/java.util.concurrent.SynchronousQueue$TransferStack.transfer(SynchronousQueue.java:361)         at java.base@9.0.1/java.util.concurrent.SynchronousQueue.poll(SynchronousQueue.java:937)         at java.base@9.0.1/java.util.concurrent.ThreadPoolExecutor.getTask(ThreadPoolExecutor.java:1091)         at java.base@9.0.1/java.util.concurrent.ThreadPoolExecutor.runWorker(ThreadPoolExecutor.java:1152)         at java.base@9.0.1/java.util.concurrent.ThreadPoolExecutor$Worker.run(ThreadPoolExecutor.java:641)         at java.base@9.0.1/java.lang.Thread.run(Thread.java:844)    8) Thread[id=3073, name=zkCallback-625-thread-5, state=TIMED_WAITING, group=TGRP-ChaosMonkeyNothingIsSafeTest]         at java.base@9.0.1/jdk.internal.misc.Unsafe.park(Native Method)         at java.base@9.0.1/java.util.concurrent.locks.LockSupport.parkNanos(LockSupport.java:234)         at java.base@9.0.1/java.util.concurrent.SynchronousQueue$TransferStack.awaitFulfill(SynchronousQueue.java:462)         at java.base@9.0.1/java.util.concurrent.SynchronousQueue$TransferStack.transfer(SynchronousQueue.java:361)         at java.base@9.0.1/java.util.concurrent.SynchronousQueue.poll(SynchronousQueue.java:937)         at java.base@9.0.1/java.util.concurrent.ThreadPoolExecutor.getTask(ThreadPoolExecutor.java:1091)         at java.base@9.0.1/java.util.concurrent.ThreadPoolExecutor.runWorker(ThreadPoolExecutor.java:1152)         at java.base@9.0.1/java.util.concurrent.ThreadPoolExecutor$Worker.run(ThreadPoolExecutor.java:641)         at java.base@9.0.1/java.lang.Thread.run(Thread.java:844)    9) Thread[id=2992, name=zkCallback-625-thread-2, state=TIMED_WAITING, group=TGRP-ChaosMonkeyNothingIsSafeTest]         at java.base@9.0.1/jdk.internal.misc.Unsafe.park(Native Method)         at java.base@9.0.1/java.util.concurrent.locks.LockSupport.parkNanos(LockSupport.java:234)         at java.base@9.0.1/java.util.concurrent.SynchronousQueue$TransferStack.awaitFulfill(SynchronousQueue.java:462)         at java.base@9.0.1/java.util.concurrent.SynchronousQueue$TransferStack.transfer(SynchronousQueue.java:361)         at java.base@9.0.1/java.util.concurrent.SynchronousQueue.poll(SynchronousQueue.java:937)         at java.base@9.0.1/java.util.concurrent.ThreadPoolExecutor.getTask(ThreadPoolExecutor.java:1091)         at java.base@9.0.1/java.util.concurrent.ThreadPoolExecutor.runWorker(ThreadPoolExecutor.java:1152)         at java.base@9.0.1/java.util.concurrent.ThreadPoolExecutor$Worker.run(ThreadPoolExecutor.java:641)         at java.base@9.0.1/java.lang.Thread.run(Thread.java:844)

Stack Trace:
com.carrotsearch.randomizedtesting.ThreadLeakError: 9 threads leaked from SUITE scope at org.apache.solr.cloud.ChaosMonkeyNothingIsSafeTest: 
   1) Thread[id=2993, name=zkCallback-625-thread-3, state=TIMED_WAITING, group=TGRP-ChaosMonkeyNothingIsSafeTest]
        at java.base@9.0.1/jdk.internal.misc.Unsafe.park(Native Method)
        at java.base@9.0.1/java.util.concurrent.locks.LockSupport.parkNanos(LockSupport.java:234)
        at java.base@9.0.1/java.util.concurrent.SynchronousQueue$TransferStack.awaitFulfill(SynchronousQueue.java:462)
        at java.base@9.0.1/java.util.concurrent.SynchronousQueue$TransferStack.transfer(SynchronousQueue.java:361)
        at java.base@9.0.1/java.util.concurrent.SynchronousQueue.poll(SynchronousQueue.java:937)
        at java.base@9.0.1/java.util.concurrent.ThreadPoolExecutor.getTask(ThreadPoolExecutor.java:1091)
        at java.base@9.0.1/java.util.concurrent.ThreadPoolExecutor.runWorker(ThreadPoolExecutor.java:1152)
        at java.base@9.0.1/java.util.concurrent.ThreadPoolExecutor$Worker.run(ThreadPoolExecutor.java:641)
        at java.base@9.0.1/java.lang.Thread.run(Thread.java:844)
   2) Thread[id=2810, name=Connection evictor, state=TIMED_WAITING, group=TGRP-ChaosMonkeyNothingIsSafeTest]
        at java.base@9.0.1/java.lang.Thread.sleep(Native Method)
        at app//org.apache.http.impl.client.IdleConnectionEvictor$1.run(IdleConnectionEvictor.java:66)
        at java.base@9.0.1/java.lang.Thread.run(Thread.java:844)
   3) Thread[id=2815, name=zkCallback-625-thread-1, state=TIMED_WAITING, group=TGRP-ChaosMonkeyNothingIsSafeTest]
        at java.base@9.0.1/jdk.internal.misc.Unsafe.park(Native Method)
        at java.base@9.0.1/java.util.concurrent.locks.LockSupport.parkNanos(LockSupport.java:234)
        at java.base@9.0.1/java.util.concurrent.SynchronousQueue$TransferStack.awaitFulfill(SynchronousQueue.java:462)
        at java.base@9.0.1/java.util.concurrent.SynchronousQueue$TransferStack.transfer(SynchronousQueue.java:361)
        at java.base@9.0.1/java.util.concurrent.SynchronousQueue.poll(SynchronousQueue.java:937)
        at java.base@9.0.1/java.util.concurrent.ThreadPoolExecutor.getTask(ThreadPoolExecutor.java:1091)
        at java.base@9.0.1/java.util.concurrent.ThreadPoolExecutor.runWorker(ThreadPoolExecutor.java:1152)
        at java.base@9.0.1/java.util.concurrent.ThreadPoolExecutor$Worker.run(ThreadPoolExecutor.java:641)
        at java.base@9.0.1/java.lang.Thread.run(Thread.java:844)
   4) Thread[id=2813, name=zkConnectionManagerCallback-626-thread-1, state=WAITING, group=TGRP-ChaosMonkeyNothingIsSafeTest]
        at java.base@9.0.1/jdk.internal.misc.Unsafe.park(Native Method)
        at java.base@9.0.1/java.util.concurrent.locks.LockSupport.park(LockSupport.java:194)
        at java.base@9.0.1/java.util.concurrent.locks.AbstractQueuedSynchronizer$ConditionObject.await(AbstractQueuedSynchronizer.java:2062)
        at java.base@9.0.1/java.util.concurrent.LinkedBlockingQueue.take(LinkedBlockingQueue.java:435)
        at java.base@9.0.1/java.util.concurrent.ThreadPoolExecutor.getTask(ThreadPoolExecutor.java:1092)
        at java.base@9.0.1/java.util.concurrent.ThreadPoolExecutor.runWorker(ThreadPoolExecutor.java:1152)
        at java.base@9.0.1/java.util.concurrent.ThreadPoolExecutor$Worker.run(ThreadPoolExecutor.java:641)
        at java.base@9.0.1/java.lang.Thread.run(Thread.java:844)
   5) Thread[id=2811, name=TEST-ChaosMonkeyNothingIsSafeTest.test-seed#[A8F663C7CEB1A28B]-SendThread(127.0.0.1:43883), state=TIMED_WAITING, group=TGRP-ChaosMonkeyNothingIsSafeTest]
        at java.base@9.0.1/java.lang.Thread.sleep(Native Method)
        at app//org.apache.zookeeper.ClientCnxn$SendThread.run(ClientCnxn.java:1051)
   6) Thread[id=2812, name=TEST-ChaosMonkeyNothingIsSafeTest.test-seed#[A8F663C7CEB1A28B]-EventThread, state=WAITING, group=TGRP-ChaosMonkeyNothingIsSafeTest]
        at java.base@9.0.1/jdk.internal.misc.Unsafe.park(Native Method)
        at java.base@9.0.1/java.util.concurrent.locks.LockSupport.park(LockSupport.java:194)
        at java.base@9.0.1/java.util.concurrent.locks.AbstractQueuedSynchronizer$ConditionObject.await(AbstractQueuedSynchronizer.java:2062)
        at java.base@9.0.1/java.util.concurrent.LinkedBlockingQueue.take(LinkedBlockingQueue.java:435)
        at app//org.apache.zookeeper.ClientCnxn$EventThread.run(ClientCnxn.java:501)
   7) Thread[id=3010, name=zkCallback-625-thread-4, state=TIMED_WAITING, group=TGRP-ChaosMonkeyNothingIsSafeTest]
        at java.base@9.0.1/jdk.internal.misc.Unsafe.park(Native Method)
        at java.base@9.0.1/java.util.concurrent.locks.LockSupport.parkNanos(LockSupport.java:234)
        at java.base@9.0.1/java.util.concurrent.SynchronousQueue$TransferStack.awaitFulfill(SynchronousQueue.java:462)
        at java.base@9.0.1/java.util.concurrent.SynchronousQueue$TransferStack.transfer(SynchronousQueue.java:361)
        at java.base@9.0.1/java.util.concurrent.SynchronousQueue.poll(SynchronousQueue.java:937)
        at java.base@9.0.1/java.util.concurrent.ThreadPoolExecutor.getTask(ThreadPoolExecutor.java:1091)
        at java.base@9.0.1/java.util.concurrent.ThreadPoolExecutor.runWorker(ThreadPoolExecutor.java:1152)
        at java.base@9.0.1/java.util.concurrent.ThreadPoolExecutor$Worker.run(ThreadPoolExecutor.java:641)
        at java.base@9.0.1/java.lang.Thread.run(Thread.java:844)
   8) Thread[id=3073, name=zkCallback-625-thread-5, state=TIMED_WAITING, group=TGRP-ChaosMonkeyNothingIsSafeTest]
        at java.base@9.0.1/jdk.internal.misc.Unsafe.park(Native Method)
        at java.base@9.0.1/java.util.concurrent.locks.LockSupport.parkNanos(LockSupport.java:234)
        at java.base@9.0.1/java.util.concurrent.SynchronousQueue$TransferStack.awaitFulfill(SynchronousQueue.java:462)
        at java.base@9.0.1/java.util.concurrent.SynchronousQueue$TransferStack.transfer(SynchronousQueue.java:361)
        at java.base@9.0.1/java.util.concurrent.SynchronousQueue.poll(SynchronousQueue.java:937)
        at java.base@9.0.1/java.util.concurrent.ThreadPoolExecutor.getTask(ThreadPoolExecutor.java:1091)
        at java.base@9.0.1/java.util.concurrent.ThreadPoolExecutor.runWorker(ThreadPoolExecutor.java:1152)
        at java.base@9.0.1/java.util.concurrent.ThreadPoolExecutor$Worker.run(ThreadPoolExecutor.java:641)
        at java.base@9.0.1/java.lang.Thread.run(Thread.java:844)
   9) Thread[id=2992, name=zkCallback-625-thread-2, state=TIMED_WAITING, group=TGRP-ChaosMonkeyNothingIsSafeTest]
        at java.base@9.0.1/jdk.internal.misc.Unsafe.park(Native Method)
        at java.base@9.0.1/java.util.concurrent.locks.LockSupport.parkNanos(LockSupport.java:234)
        at java.base@9.0.1/java.util.concurrent.SynchronousQueue$TransferStack.awaitFulfill(SynchronousQueue.java:462)
        at java.base@9.0.1/java.util.concurrent.SynchronousQueue$TransferStack.transfer(SynchronousQueue.java:361)
        at java.base@9.0.1/java.util.concurrent.SynchronousQueue.poll(SynchronousQueue.java:937)
        at java.base@9.0.1/java.util.concurrent.ThreadPoolExecutor.getTask(ThreadPoolExecutor.java:1091)
        at java.base@9.0.1/java.util.concurrent.ThreadPoolExecutor.runWorker(ThreadPoolExecutor.java:1152)
        at java.base@9.0.1/java.util.concurrent.ThreadPoolExecutor$Worker.run(ThreadPoolExecutor.java:641)
        at java.base@9.0.1/java.lang.Thread.run(Thread.java:844)
	at __randomizedtesting.SeedInfo.seed([A8F663C7CEB1A28B]:0)


FAILED:  junit.framework.TestSuite.org.apache.solr.cloud.ChaosMonkeyNothingIsSafeTest

Error Message:
There are still zombie threads that couldn't be terminated:    1) Thread[id=2993, name=zkCallback-625-thread-3, state=TIMED_WAITING, group=TGRP-ChaosMonkeyNothingIsSafeTest]         at java.base@9.0.1/jdk.internal.misc.Unsafe.park(Native Method)         at java.base@9.0.1/java.util.concurrent.locks.LockSupport.parkNanos(LockSupport.java:234)         at java.base@9.0.1/java.util.concurrent.SynchronousQueue$TransferStack.awaitFulfill(SynchronousQueue.java:462)         at java.base@9.0.1/java.util.concurrent.SynchronousQueue$TransferStack.transfer(SynchronousQueue.java:361)         at java.base@9.0.1/java.util.concurrent.SynchronousQueue.poll(SynchronousQueue.java:937)         at java.base@9.0.1/java.util.concurrent.ThreadPoolExecutor.getTask(ThreadPoolExecutor.java:1091)         at java.base@9.0.1/java.util.concurrent.ThreadPoolExecutor.runWorker(ThreadPoolExecutor.java:1152)         at java.base@9.0.1/java.util.concurrent.ThreadPoolExecutor$Worker.run(ThreadPoolExecutor.java:641)         at java.base@9.0.1/java.lang.Thread.run(Thread.java:844)    2) Thread[id=2815, name=zkCallback-625-thread-1, state=TIMED_WAITING, group=TGRP-ChaosMonkeyNothingIsSafeTest]         at java.base@9.0.1/jdk.internal.misc.Unsafe.park(Native Method)         at java.base@9.0.1/java.util.concurrent.locks.LockSupport.parkNanos(LockSupport.java:234)         at java.base@9.0.1/java.util.concurrent.SynchronousQueue$TransferStack.awaitFulfill(SynchronousQueue.java:462)         at java.base@9.0.1/java.util.concurrent.SynchronousQueue$TransferStack.transfer(SynchronousQueue.java:361)         at java.base@9.0.1/java.util.concurrent.SynchronousQueue.poll(SynchronousQueue.java:937)         at java.base@9.0.1/java.util.concurrent.ThreadPoolExecutor.getTask(ThreadPoolExecutor.java:1091)         at java.base@9.0.1/java.util.concurrent.ThreadPoolExecutor.runWorker(ThreadPoolExecutor.java:1152)         at java.base@9.0.1/java.util.concurrent.ThreadPoolExecutor$Worker.run(ThreadPoolExecutor.java:641)         at java.base@9.0.1/java.lang.Thread.run(Thread.java:844)    3) Thread[id=2813, name=zkConnectionManagerCallback-626-thread-1, state=WAITING, group=TGRP-ChaosMonkeyNothingIsSafeTest]         at java.base@9.0.1/jdk.internal.misc.Unsafe.park(Native Method)         at java.base@9.0.1/java.util.concurrent.locks.LockSupport.park(LockSupport.java:194)         at java.base@9.0.1/java.util.concurrent.locks.AbstractQueuedSynchronizer$ConditionObject.await(AbstractQueuedSynchronizer.java:2062)         at java.base@9.0.1/java.util.concurrent.LinkedBlockingQueue.take(LinkedBlockingQueue.java:435)         at java.base@9.0.1/java.util.concurrent.ThreadPoolExecutor.getTask(ThreadPoolExecutor.java:1092)         at java.base@9.0.1/java.util.concurrent.ThreadPoolExecutor.runWorker(ThreadPoolExecutor.java:1152)         at java.base@9.0.1/java.util.concurrent.ThreadPoolExecutor$Worker.run(ThreadPoolExecutor.java:641)         at java.base@9.0.1/java.lang.Thread.run(Thread.java:844)    4) Thread[id=2811, name=TEST-ChaosMonkeyNothingIsSafeTest.test-seed#[A8F663C7CEB1A28B]-SendThread(127.0.0.1:43883), state=TIMED_WAITING, group=TGRP-ChaosMonkeyNothingIsSafeTest]         at java.base@9.0.1/java.lang.Thread.sleep(Native Method)         at app//org.apache.zookeeper.client.StaticHostProvider.next(StaticHostProvider.java:101)         at app//org.apache.zookeeper.ClientCnxn$SendThread.startConnect(ClientCnxn.java:997)         at app//org.apache.zookeeper.ClientCnxn$SendThread.run(ClientCnxn.java:1060)    5) Thread[id=3010, name=zkCallback-625-thread-4, state=TIMED_WAITING, group=TGRP-ChaosMonkeyNothingIsSafeTest]         at java.base@9.0.1/jdk.internal.misc.Unsafe.park(Native Method)         at java.base@9.0.1/java.util.concurrent.locks.LockSupport.parkNanos(LockSupport.java:234)         at java.base@9.0.1/java.util.concurrent.SynchronousQueue$TransferStack.awaitFulfill(SynchronousQueue.java:462)         at java.base@9.0.1/java.util.concurrent.SynchronousQueue$TransferStack.transfer(SynchronousQueue.java:361)         at java.base@9.0.1/java.util.concurrent.SynchronousQueue.poll(SynchronousQueue.java:937)         at java.base@9.0.1/java.util.concurrent.ThreadPoolExecutor.getTask(ThreadPoolExecutor.java:1091)         at java.base@9.0.1/java.util.concurrent.ThreadPoolExecutor.runWorker(ThreadPoolExecutor.java:1152)         at java.base@9.0.1/java.util.concurrent.ThreadPoolExecutor$Worker.run(ThreadPoolExecutor.java:641)         at java.base@9.0.1/java.lang.Thread.run(Thread.java:844)    6) Thread[id=3073, name=zkCallback-625-thread-5, state=TIMED_WAITING, group=TGRP-ChaosMonkeyNothingIsSafeTest]         at java.base@9.0.1/jdk.internal.misc.Unsafe.park(Native Method)         at java.base@9.0.1/java.util.concurrent.locks.LockSupport.parkNanos(LockSupport.java:234)         at java.base@9.0.1/java.util.concurrent.SynchronousQueue$TransferStack.awaitFulfill(SynchronousQueue.java:462)         at java.base@9.0.1/java.util.concurrent.SynchronousQueue$TransferStack.transfer(SynchronousQueue.java:361)         at java.base@9.0.1/java.util.concurrent.SynchronousQueue.poll(SynchronousQueue.java:937)         at java.base@9.0.1/java.util.concurrent.ThreadPoolExecutor.getTask(ThreadPoolExecutor.java:1091)         at java.base@9.0.1/java.util.concurrent.ThreadPoolExecutor.runWorker(ThreadPoolExecutor.java:1152)         at java.base@9.0.1/java.util.concurrent.ThreadPoolExecutor$Worker.run(ThreadPoolExecutor.java:641)         at java.base@9.0.1/java.lang.Thread.run(Thread.java:844)    7) Thread[id=2992, name=zkCallback-625-thread-2, state=TIMED_WAITING, group=TGRP-ChaosMonkeyNothingIsSafeTest]         at java.base@9.0.1/jdk.internal.misc.Unsafe.park(Native Method)         at java.base@9.0.1/java.util.concurrent.locks.LockSupport.parkNanos(LockSupport.java:234)         at java.base@9.0.1/java.util.concurrent.SynchronousQueue$TransferStack.awaitFulfill(SynchronousQueue.java:462)         at java.base@9.0.1/java.util.concurrent.SynchronousQueue$TransferStack.transfer(SynchronousQueue.java:361)         at java.base@9.0.1/java.util.concurrent.SynchronousQueue.poll(SynchronousQueue.java:937)         at java.base@9.0.1/java.util.concurrent.ThreadPoolExecutor.getTask(ThreadPoolExecutor.java:1091)         at java.base@9.0.1/java.util.concurrent.ThreadPoolExecutor.runWorker(ThreadPoolExecutor.java:1152)         at java.base@9.0.1/java.util.concurrent.ThreadPoolExecutor$Worker.run(ThreadPoolExecutor.java:641)         at java.base@9.0.1/java.lang.Thread.run(Thread.java:844)

Stack Trace:
com.carrotsearch.randomizedtesting.ThreadLeakError: There are still zombie threads that couldn't be terminated:
   1) Thread[id=2993, name=zkCallback-625-thread-3, state=TIMED_WAITING, group=TGRP-ChaosMonkeyNothingIsSafeTest]
        at java.base@9.0.1/jdk.internal.misc.Unsafe.park(Native Method)
        at java.base@9.0.1/java.util.concurrent.locks.LockSupport.parkNanos(LockSupport.java:234)
        at java.base@9.0.1/java.util.concurrent.SynchronousQueue$TransferStack.awaitFulfill(SynchronousQueue.java:462)
        at java.base@9.0.1/java.util.concurrent.SynchronousQueue$TransferStack.transfer(SynchronousQueue.java:361)
        at java.base@9.0.1/java.util.concurrent.SynchronousQueue.poll(SynchronousQueue.java:937)
        at java.base@9.0.1/java.util.concurrent.ThreadPoolExecutor.getTask(ThreadPoolExecutor.java:1091)
        at java.base@9.0.1/java.util.concurrent.ThreadPoolExecutor.runWorker(ThreadPoolExecutor.java:1152)
        at java.base@9.0.1/java.util.concurrent.ThreadPoolExecutor$Worker.run(ThreadPoolExecutor.java:641)
        at java.base@9.0.1/java.lang.Thread.run(Thread.java:844)
   2) Thread[id=2815, name=zkCallback-625-thread-1, state=TIMED_WAITING, group=TGRP-ChaosMonkeyNothingIsSafeTest]
        at java.base@9.0.1/jdk.internal.misc.Unsafe.park(Native Method)
        at java.base@9.0.1/java.util.concurrent.locks.LockSupport.parkNanos(LockSupport.java:234)
        at java.base@9.0.1/java.util.concurrent.SynchronousQueue$TransferStack.awaitFulfill(SynchronousQueue.java:462)
        at java.base@9.0.1/java.util.concurrent.SynchronousQueue$TransferStack.transfer(SynchronousQueue.java:361)
        at java.base@9.0.1/java.util.concurrent.SynchronousQueue.poll(SynchronousQueue.java:937)
        at java.base@9.0.1/java.util.concurrent.ThreadPoolExecutor.getTask(ThreadPoolExecutor.java:1091)
        at java.base@9.0.1/java.util.concurrent.ThreadPoolExecutor.runWorker(ThreadPoolExecutor.java:1152)
        at java.base@9.0.1/java.util.concurrent.ThreadPoolExecutor$Worker.run(ThreadPoolExecutor.java:641)
        at java.base@9.0.1/java.lang.Thread.run(Thread.java:844)
   3) Thread[id=2813, name=zkConnectionManagerCallback-626-thread-1, state=WAITING, group=TGRP-ChaosMonkeyNothingIsSafeTest]
        at java.base@9.0.1/jdk.internal.misc.Unsafe.park(Native Method)
        at java.base@9.0.1/java.util.concurrent.locks.LockSupport.park(LockSupport.java:194)
        at java.base@9.0.1/java.util.concurrent.locks.AbstractQueuedSynchronizer$ConditionObject.await(AbstractQueuedSynchronizer.java:2062)
        at java.base@9.0.1/java.util.concurrent.LinkedBlockingQueue.take(LinkedBlockingQueue.java:435)
        at java.base@9.0.1/java.util.concurrent.ThreadPoolExecutor.getTask(ThreadPoolExecutor.java:1092)
        at java.base@9.0.1/java.util.concurrent.ThreadPoolExecutor.runWorker(ThreadPoolExecutor.java:1152)
        at java.base@9.0.1/java.util.concurrent.ThreadPoolExecutor$Worker.run(ThreadPoolExecutor.java:641)
        at java.base@9.0.1/java.lang.Thread.run(Thread.java:844)
   4) Thread[id=2811, name=TEST-ChaosMonkeyNothingIsSafeTest.test-seed#[A8F663C7CEB1A28B]-SendThread(127.0.0.1:43883), state=TIMED_WAITING, group=TGRP-ChaosMonkeyNothingIsSafeTest]
        at java.base@9.0.1/java.lang.Thread.sleep(Native Method)
        at app//org.apache.zookeeper.client.StaticHostProvider.next(StaticHostProvider.java:101)
        at app//org.apache.zookeeper.ClientCnxn$SendThread.startConnect(ClientCnxn.java:997)
        at app//org.apache.zookeeper.ClientCnxn$SendThread.run(ClientCnxn.java:1060)
   5) Thread[id=3010, name=zkCallback-625-thread-4, state=TIMED_WAITING, group=TGRP-ChaosMonkeyNothingIsSafeTest]
        at java.base@9.0.1/jdk.internal.misc.Unsafe.park(Native Method)
        at java.base@9.0.1/java.util.concurrent.locks.LockSupport.parkNanos(LockSupport.java:234)
        at java.base@9.0.1/java.util.concurrent.SynchronousQueue$TransferStack.awaitFulfill(SynchronousQueue.java:462)
        at java.base@9.0.1/java.util.concurrent.SynchronousQueue$TransferStack.transfer(SynchronousQueue.java:361)
        at java.base@9.0.1/java.util.concurrent.SynchronousQueue.poll(SynchronousQueue.java:937)
        at java.base@9.0.1/java.util.concurrent.ThreadPoolExecutor.getTask(ThreadPoolExecutor.java:1091)
        at java.base@9.0.1/java.util.concurrent.ThreadPoolExecutor.runWorker(ThreadPoolExecutor.java:1152)
        at java.base@9.0.1/java.util.concurrent.ThreadPoolExecutor$Worker.run(ThreadPoolExecutor.java:641)
        at java.base@9.0.1/java.lang.Thread.run(Thread.java:844)
   6) Thread[id=3073, name=zkCallback-625-thread-5, state=TIMED_WAITING, group=TGRP-ChaosMonkeyNothingIsSafeTest]
        at java.base@9.0.1/jdk.internal.misc.Unsafe.park(Native Method)
        at java.base@9.0.1/java.util.concurrent.locks.LockSupport.parkNanos(LockSupport.java:234)
        at java.base@9.0.1/java.util.concurrent.SynchronousQueue$TransferStack.awaitFulfill(SynchronousQueue.java:462)
        at java.base@9.0.1/java.util.concurrent.SynchronousQueue$TransferStack.transfer(SynchronousQueue.java:361)
        at java.base@9.0.1/java.util.concurrent.SynchronousQueue.poll(SynchronousQueue.java:937)
        at java.base@9.0.1/java.util.concurrent.ThreadPoolExecutor.getTask(ThreadPoolExecutor.java:1091)
        at java.base@9.0.1/java.util.concurrent.ThreadPoolExecutor.runWorker(ThreadPoolExecutor.java:1152)
        at java.base@9.0.1/java.util.concurrent.ThreadPoolExecutor$Worker.run(ThreadPoolExecutor.java:641)
        at java.base@9.0.1/java.lang.Thread.run(Thread.java:844)
   7) Thread[id=2992, name=zkCallback-625-thread-2, state=TIMED_WAITING, group=TGRP-ChaosMonkeyNothingIsSafeTest]
        at java.base@9.0.1/jdk.internal.misc.Unsafe.park(Native Method)
        at java.base@9.0.1/java.util.concurrent.locks.LockSupport.parkNanos(LockSupport.java:234)
        at java.base@9.0.1/java.util.concurrent.SynchronousQueue$TransferStack.awaitFulfill(SynchronousQueue.java:462)
        at java.base@9.0.1/java.util.concurrent.SynchronousQueue$TransferStack.transfer(SynchronousQueue.java:361)
        at java.base@9.0.1/java.util.concurrent.SynchronousQueue.poll(SynchronousQueue.java:937)
        at java.base@9.0.1/java.util.concurrent.ThreadPoolExecutor.getTask(ThreadPoolExecutor.java:1091)
        at java.base@9.0.1/java.util.concurrent.ThreadPoolExecutor.runWorker(ThreadPoolExecutor.java:1152)
        at java.base@9.0.1/java.util.concurrent.ThreadPoolExecutor$Worker.run(ThreadPoolExecutor.java:641)
        at java.base@9.0.1/java.lang.Thread.run(Thread.java:844)
	at __randomizedtesting.SeedInfo.seed([A8F663C7CEB1A28B]:0)


FAILED:  junit.framework.TestSuite.org.apache.solr.cloud.autoscaling.SystemLogListenerTest

Error Message:
Error from server at https://127.0.0.1:43687/solr: create the collection time out:180s

Stack Trace:
org.apache.solr.client.solrj.impl.HttpSolrClient$RemoteSolrException: Error from server at https://127.0.0.1:43687/solr: create the collection time out:180s
	at __randomizedtesting.SeedInfo.seed([A8F663C7CEB1A28B]:0)
	at org.apache.solr.client.solrj.impl.HttpSolrClient.executeMethod(HttpSolrClient.java:643)
	at org.apache.solr.client.solrj.impl.HttpSolrClient.request(HttpSolrClient.java:255)
	at org.apache.solr.client.solrj.impl.HttpSolrClient.request(HttpSolrClient.java:244)
	at org.apache.solr.client.solrj.impl.LBHttpSolrClient.doRequest(LBHttpSolrClient.java:483)
	at org.apache.solr.client.solrj.impl.LBHttpSolrClient.request(LBHttpSolrClient.java:413)
	at org.apache.solr.client.solrj.impl.CloudSolrClient.sendRequest(CloudSolrClient.java:1104)
	at org.apache.solr.client.solrj.impl.CloudSolrClient.requestWithRetryOnStaleState(CloudSolrClient.java:884)
	at org.apache.solr.client.solrj.impl.CloudSolrClient.request(CloudSolrClient.java:817)
	at org.apache.solr.client.solrj.SolrRequest.process(SolrRequest.java:194)
	at org.apache.solr.client.solrj.SolrRequest.process(SolrRequest.java:211)
	at org.apache.solr.cloud.autoscaling.SystemLogListenerTest.setupCluster(SystemLogListenerTest.java:84)
	at java.base/jdk.internal.reflect.NativeMethodAccessorImpl.invoke0(Native Method)
	at java.base/jdk.internal.reflect.NativeMethodAccessorImpl.invoke(NativeMethodAccessorImpl.java:62)
	at java.base/jdk.internal.reflect.DelegatingMethodAccessorImpl.invoke(DelegatingMethodAccessorImpl.java:43)
	at java.base/java.lang.reflect.Method.invoke(Method.java:564)
	at com.carrotsearch.randomizedtesting.RandomizedRunner.invoke(RandomizedRunner.java:1737)
	at com.carrotsearch.randomizedtesting.RandomizedRunner$6.evaluate(RandomizedRunner.java:874)
	at com.carrotsearch.randomizedtesting.RandomizedRunner$7.evaluate(RandomizedRunner.java:890)
	at com.carrotsearch.randomizedtesting.rules.StatementAdapter.evaluate(StatementAdapter.java:36)
	at com.carrotsearch.randomizedtesting.rules.SystemPropertiesRestoreRule$1.evaluate(SystemPropertiesRestoreRule.java:57)
	at org.apache.lucene.util.AbstractBeforeAfterRule$1.evaluate(AbstractBeforeAfterRule.java:45)
	at com.carrotsearch.randomizedtesting.rules.StatementAdapter.evaluate(StatementAdapter.java:36)
	at org.apache.lucene.util.TestRuleStoreClassName$1.evaluate(TestRuleStoreClassName.java:41)
	at com.carrotsearch.randomizedtesting.rules.NoShadowingOrOverridesOnMethodsRule$1.evaluate(NoShadowingOrOverridesOnMethodsRule.java:40)
	at com.carrotsearch.randomizedtesting.rules.NoShadowingOrOverridesOnMethodsRule$1.evaluate(NoShadowingOrOverridesOnMethodsRule.java:40)
	at com.carrotsearch.randomizedtesting.rules.StatementAdapter.evaluate(StatementAdapter.java:36)
	at com.carrotsearch.randomizedtesting.rules.StatementAdapter.evaluate(StatementAdapter.java:36)
	at org.apache.lucene.util.TestRuleAssertionsRequired$1.evaluate(TestRuleAssertionsRequired.java:53)
	at org.apache.lucene.util.TestRuleMarkFailure$1.evaluate(TestRuleMarkFailure.java:47)
	at org.apache.lucene.util.TestRuleIgnoreAfterMaxFailures$1.evaluate(TestRuleIgnoreAfterMaxFailures.java:64)
	at org.apache.lucene.util.TestRuleIgnoreTestSuites$1.evaluate(TestRuleIgnoreTestSuites.java:54)
	at com.carrotsearch.randomizedtesting.rules.StatementAdapter.evaluate(StatementAdapter.java:36)
	at com.carrotsearch.randomizedtesting.ThreadLeakControl$StatementRunner.run(ThreadLeakControl.java:368)
	at java.base/java.lang.Thread.run(Thread.java:844)


FAILED:  org.apache.solr.cloud.ChaosMonkeyNothingIsSafeTest.test

Error Message:
Timeout occured while waiting response from server at: http://127.0.0.1:36443/gu_/collection1

Stack Trace:
org.apache.solr.client.solrj.SolrServerException: Timeout occured while waiting response from server at: http://127.0.0.1:36443/gu_/collection1
	at __randomizedtesting.SeedInfo.seed([A8F663C7CEB1A28B:20A25C1D604DCF73]:0)
	at org.apache.solr.client.solrj.impl.HttpSolrClient.executeMethod(HttpSolrClient.java:654)
	at org.apache.solr.client.solrj.impl.HttpSolrClient.request(HttpSolrClient.java:255)
	at org.apache.solr.client.solrj.impl.HttpSolrClient.request(HttpSolrClient.java:244)
	at org.apache.solr.client.solrj.impl.LBHttpSolrClient.doRequest(LBHttpSolrClient.java:483)
	at org.apache.solr.client.solrj.impl.LBHttpSolrClient.request(LBHttpSolrClient.java:413)
	at org.apache.solr.client.solrj.impl.CloudSolrClient.sendRequest(CloudSolrClient.java:1104)
	at org.apache.solr.client.solrj.impl.CloudSolrClient.requestWithRetryOnStaleState(CloudSolrClient.java:884)
	at org.apache.solr.client.solrj.impl.CloudSolrClient.request(CloudSolrClient.java:817)
	at org.apache.solr.client.solrj.SolrRequest.process(SolrRequest.java:194)
	at org.apache.solr.client.solrj.SolrClient.commit(SolrClient.java:484)
	at org.apache.solr.client.solrj.SolrClient.commit(SolrClient.java:463)
	at org.apache.solr.cloud.AbstractFullDistribZkTestBase.commit(AbstractFullDistribZkTestBase.java:1583)
	at org.apache.solr.cloud.ChaosMonkeyNothingIsSafeTest.test(ChaosMonkeyNothingIsSafeTest.java:212)
	at java.base/jdk.internal.reflect.NativeMethodAccessorImpl.invoke0(Native Method)
	at java.base/jdk.internal.reflect.NativeMethodAccessorImpl.invoke(NativeMethodAccessorImpl.java:62)
	at java.base/jdk.internal.reflect.DelegatingMethodAccessorImpl.invoke(DelegatingMethodAccessorImpl.java:43)
	at java.base/java.lang.reflect.Method.invoke(Method.java:564)
	at com.carrotsearch.randomizedtesting.RandomizedRunner.invoke(RandomizedRunner.java:1737)
	at com.carrotsearch.randomizedtesting.RandomizedRunner$8.evaluate(RandomizedRunner.java:934)
	at com.carrotsearch.randomizedtesting.RandomizedRunner$9.evaluate(RandomizedRunner.java:970)
	at com.carrotsearch.randomizedtesting.RandomizedRunner$10.evaluate(RandomizedRunner.java:984)
	at org.apache.solr.BaseDistributedSearchTestCase$ShardsRepeatRule$ShardsFixedStatement.callStatement(BaseDistributedSearchTestCase.java:993)
	at org.apache.solr.BaseDistributedSearchTestCase$ShardsRepeatRule$ShardsStatement.evaluate(BaseDistributedSearchTestCase.java:968)
	at com.carrotsearch.randomizedtesting.rules.SystemPropertiesRestoreRule$1.evaluate(SystemPropertiesRestoreRule.java:57)
	at org.apache.lucene.util.TestRuleSetupTeardownChained$1.evaluate(TestRuleSetupTeardownChained.java:49)
	at org.apache.lucene.util.AbstractBeforeAfterRule$1.evaluate(AbstractBeforeAfterRule.java:45)
	at org.apache.lucene.util.TestRuleThreadAndTestName$1.evaluate(TestRuleThreadAndTestName.java:48)
	at org.apache.lucene.util.TestRuleIgnoreAfterMaxFailures$1.evaluate(TestRuleIgnoreAfterMaxFailures.java:64)
	at org.apache.lucene.util.TestRuleMarkFailure$1.evaluate(TestRuleMarkFailure.java:47)
	at com.carrotsearch.randomizedtesting.rules.StatementAdapter.evaluate(StatementAdapter.java:36)
	at com.carrotsearch.randomizedtesting.ThreadLeakControl$StatementRunner.run(ThreadLeakControl.java:368)
	at com.carrotsearch.randomizedtesting.ThreadLeakControl.forkTimeoutingTask(ThreadLeakControl.java:817)
	at com.carrotsearch.randomizedtesting.ThreadLeakControl$3.evaluate(ThreadLeakControl.java:468)
	at com.carrotsearch.randomizedtesting.RandomizedRunner.runSingleTest(RandomizedRunner.java:943)
	at com.carrotsearch.randomizedtesting.RandomizedRunner$5.evaluate(RandomizedRunner.java:829)
	at com.carrotsearch.randomizedtesting.RandomizedRunner$6.evaluate(RandomizedRunner.java:879)
	at com.carrotsearch.randomizedtesting.RandomizedRunner$7.evaluate(RandomizedRunner.java:890)
	at com.carrotsearch.randomizedtesting.rules.StatementAdapter.evaluate(StatementAdapter.java:36)
	at com.carrotsearch.randomizedtesting.rules.SystemPropertiesRestoreRule$1.evaluate(SystemPropertiesRestoreRule.java:57)
	at org.apache.lucene.util.AbstractBeforeAfterRule$1.evaluate(AbstractBeforeAfterRule.java:45)
	at com.carrotsearch.randomizedtesting.rules.StatementAdapter.evaluate(StatementAdapter.java:36)
	at org.apache.lucene.util.TestRuleStoreClassName$1.evaluate(TestRuleStoreClassName.java:41)
	at com.carrotsearch.randomizedtesting.rules.NoShadowingOrOverridesOnMethodsRule$1.evaluate(NoShadowingOrOverridesOnMethodsRule.java:40)
	at com.carrotsearch.randomizedtesting.rules.NoShadowingOrOverridesOnMethodsRule$1.evaluate(NoShadowingOrOverridesOnMethodsRule.java:40)
	at com.carrotsearch.randomizedtesting.rules.StatementAdapter.evaluate(StatementAdapter.java:36)
	at com.carrotsearch.randomizedtesting.rules.StatementAdapter.evaluate(StatementAdapter.java:36)
	at org.apache.lucene.util.TestRuleAssertionsRequired$1.evaluate(TestRuleAssertionsRequired.java:53)
	at org.apache.lucene.util.TestRuleMarkFailure$1.evaluate(TestRuleMarkFailure.java:47)
	at org.apache.lucene.util.TestRuleIgnoreAfterMaxFailures$1.evaluate(TestRuleIgnoreAfterMaxFailures.java:64)
	at org.apache.lucene.util.TestRuleIgnoreTestSuites$1.evaluate(TestRuleIgnoreTestSuites.java:54)
	at com.carrotsearch.randomizedtesting.rules.StatementAdapter.evaluate(StatementAdapter.java:36)
	at com.carrotsearch.randomizedtesting.ThreadLeakControl$StatementRunner.run(ThreadLeakControl.java:368)
	at java.base/java.lang.Thread.run(Thread.java:844)
Caused by: java.net.SocketTimeoutException: Read timed out
	at java.base/java.net.SocketInputStream.socketRead0(Native Method)
	at java.base/java.net.SocketInputStream.socketRead(SocketInputStream.java:116)
	at java.base/java.net.SocketInputStream.read(SocketInputStream.java:171)
	at java.base/java.net.SocketInputStream.read(SocketInputStream.java:141)
	at org.apache.http.impl.io.SessionInputBufferImpl.streamRead(SessionInputBufferImpl.java:137)
	at org.apache.http.impl.io.SessionInputBufferImpl.fillBuffer(SessionInputBufferImpl.java:153)
	at org.apache.http.impl.io.SessionInputBufferImpl.readLine(SessionInputBufferImpl.java:282)
	at org.apache.http.impl.conn.DefaultHttpResponseParser.parseHead(DefaultHttpResponseParser.java:138)
	at org.apache.http.impl.conn.DefaultHttpResponseParser.parseHead(DefaultHttpResponseParser.java:56)
	at org.apache.http.impl.io.AbstractMessageParser.parse(AbstractMessageParser.java:259)
	at org.apache.http.impl.DefaultBHttpClientConnection.receiveResponseHeader(DefaultBHttpClientConnection.java:163)
	at org.apache.http.impl.conn.CPoolProxy.receiveResponseHeader(CPoolProxy.java:165)
	at org.apache.http.protocol.HttpRequestExecutor.doReceiveResponse(HttpRequestExecutor.java:273)
	at org.apache.http.protocol.HttpRequestExecutor.execute(HttpRequestExecutor.java:125)
	at org.apache.http.impl.execchain.MainClientExec.execute(MainClientExec.java:272)
	at org.apache.http.impl.execchain.ProtocolExec.execute(ProtocolExec.java:185)
	at org.apache.http.impl.execchain.RetryExec.execute(RetryExec.java:89)
	at org.apache.http.impl.execchain.RedirectExec.execute(RedirectExec.java:111)
	at org.apache.http.impl.client.InternalHttpClient.doExecute(InternalHttpClient.java:185)
	at org.apache.http.impl.client.CloseableHttpClient.execute(CloseableHttpClient.java:83)
	at org.apache.http.impl.client.CloseableHttpClient.execute(CloseableHttpClient.java:56)
	at org.apache.solr.client.solrj.impl.HttpSolrClient.executeMethod(HttpSolrClient.java:542)
	... 52 more




Build Log:
[...truncated 11877 lines...]
   [junit4] Suite: org.apache.solr.cloud.ChaosMonkeyNothingIsSafeTest
   [junit4]   2> 253234 INFO  (SUITE-ChaosMonkeyNothingIsSafeTest-seed#[A8F663C7CEB1A28B]-worker) [    ] o.a.s.SolrTestCaseJ4 SecureRandom sanity checks: test.solr.allowed.securerandom=null & java.security.egd=file:/dev/./urandom
   [junit4]   2> Creating dataDir: /home/jenkins/workspace/Lucene-Solr-master-Linux/solr/build/solr-core/test/J2/temp/solr.cloud.ChaosMonkeyNothingIsSafeTest_A8F663C7CEB1A28B-001/init-core-data-001
   [junit4]   2> 253234 WARN  (SUITE-ChaosMonkeyNothingIsSafeTest-seed#[A8F663C7CEB1A28B]-worker) [    ] o.a.s.SolrTestCaseJ4 startTrackingSearchers: numOpens=2 numCloses=2
   [junit4]   2> 253235 INFO  (SUITE-ChaosMonkeyNothingIsSafeTest-seed#[A8F663C7CEB1A28B]-worker) [    ] o.a.s.SolrTestCaseJ4 Using PointFields (NUMERIC_POINTS_SYSPROP=true) w/NUMERIC_DOCVALUES_SYSPROP=false
   [junit4]   2> 253235 INFO  (SUITE-ChaosMonkeyNothingIsSafeTest-seed#[A8F663C7CEB1A28B]-worker) [    ] o.a.s.SolrTestCaseJ4 Randomized ssl (false) and clientAuth (false) via: @org.apache.solr.SolrTestCaseJ4$SuppressSSL(bugUrl="https://issues.apache.org/jira/browse/SOLR-5776")
   [junit4]   2> 253235 INFO  (SUITE-ChaosMonkeyNothingIsSafeTest-seed#[A8F663C7CEB1A28B]-worker) [    ] o.a.s.BaseDistributedSearchTestCase Setting hostContext system property: /gu_/
   [junit4]   2> 253236 INFO  (TEST-ChaosMonkeyNothingIsSafeTest.test-seed#[A8F663C7CEB1A28B]) [    ] o.a.s.c.ZkTestServer STARTING ZK TEST SERVER
   [junit4]   2> 253237 INFO  (Thread-528) [    ] o.a.s.c.ZkTestServer client port:0.0.0.0/0.0.0.0:0
   [junit4]   2> 253237 INFO  (Thread-528) [    ] o.a.s.c.ZkTestServer Starting server
   [junit4]   2> 253238 ERROR (Thread-528) [    ] o.a.z.s.ZooKeeperServer ZKShutdownHandler is not registered, so ZooKeeper server won't take any action on ERROR or SHUTDOWN server state changes
   [junit4]   2> 253337 INFO  (TEST-ChaosMonkeyNothingIsSafeTest.test-seed#[A8F663C7CEB1A28B]) [    ] o.a.s.c.ZkTestServer start zk server on port:43883
   [junit4]   2> 253338 INFO  (zkConnectionManagerCallback-606-thread-1) [    ] o.a.s.c.c.ConnectionManager zkClient has connected
   [junit4]   2> 253340 INFO  (zkConnectionManagerCallback-608-thread-1) [    ] o.a.s.c.c.ConnectionManager zkClient has connected
   [junit4]   2> 253343 INFO  (TEST-ChaosMonkeyNothingIsSafeTest.test-seed#[A8F663C7CEB1A28B]) [    ] o.a.s.c.AbstractZkTestCase put /home/jenkins/workspace/Lucene-Solr-master-Linux/solr/core/src/test-files/solr/collection1/conf/solrconfig-tlog.xml to /configs/conf1/solrconfig.xml
   [junit4]   2> 253343 INFO  (TEST-ChaosMonkeyNothingIsSafeTest.test-seed#[A8F663C7CEB1A28B]) [    ] o.a.s.c.AbstractZkTestCase put /home/jenkins/workspace/Lucene-Solr-master-Linux/solr/core/src/test-files/solr/collection1/conf/schema15.xml to /configs/conf1/schema.xml
   [junit4]   2> 253344 INFO  (TEST-ChaosMonkeyNothingIsSafeTest.test-seed#[A8F663C7CEB1A28B]) [    ] o.a.s.c.AbstractZkTestCase put /home/jenkins/workspace/Lucene-Solr-master-Linux/solr/core/src/test-files/solr/collection1/conf/solrconfig.snippet.randomindexconfig.xml to /configs/conf1/solrconfig.snippet.randomindexconfig.xml
   [junit4]   2> 253344 INFO  (TEST-ChaosMonkeyNothingIsSafeTest.test-seed#[A8F663C7CEB1A28B]) [    ] o.a.s.c.AbstractZkTestCase put /home/jenkins/workspace/Lucene-Solr-master-Linux/solr/core/src/test-files/solr/collection1/conf/stopwords.txt to /configs/conf1/stopwords.txt
   [junit4]   2> 253344 INFO  (TEST-ChaosMonkeyNothingIsSafeTest.test-seed#[A8F663C7CEB1A28B]) [    ] o.a.s.c.AbstractZkTestCase put /home/jenkins/workspace/Lucene-Solr-master-Linux/solr/core/src/test-files/solr/collection1/conf/protwords.txt to /configs/conf1/protwords.txt
   [junit4]   2> 253345 INFO  (TEST-ChaosMonkeyNothingIsSafeTest.test-seed#[A8F663C7CEB1A28B]) [    ] o.a.s.c.AbstractZkTestCase put /home/jenkins/workspace/Lucene-Solr-master-Linux/solr/core/src/test-files/solr/collection1/conf/currency.xml to /configs/conf1/currency.xml
   [junit4]   2> 253345 INFO  (TEST-ChaosMonkeyNothingIsSafeTest.test-seed#[A8F663C7CEB1A28B]) [    ] o.a.s.c.AbstractZkTestCase put /home/jenkins/workspace/Lucene-Solr-master-Linux/solr/core/src/test-files/solr/collection1/conf/enumsConfig.xml to /configs/conf1/enumsConfig.xml
   [junit4]   2> 253346 INFO  (TEST-ChaosMonkeyNothingIsSafeTest.test-seed#[A8F663C7CEB1A28B]) [    ] o.a.s.c.AbstractZkTestCase put /home/jenkins/workspace/Lucene-Solr-master-Linux/solr/core/src/test-files/solr/collection1/conf/open-exchange-rates.json to /configs/conf1/open-exchange-rates.json
   [junit4]   2> 253346 INFO  (TEST-ChaosMonkeyNothingIsSafeTest.test-seed#[A8F663C7CEB1A28B]) [    ] o.a.s.c.AbstractZkTestCase put /home/jenkins/workspace/Lucene-Solr-master-Linux/solr/core/src/test-files/solr/collection1/conf/mapping-ISOLatin1Accent.txt to /configs/conf1/mapping-ISOLatin1Accent.txt
   [junit4]   2> 253346 INFO  (TEST-ChaosMonkeyNothingIsSafeTest.test-seed#[A8F663C7CEB1A28B]) [    ] o.a.s.c.AbstractZkTestCase put /home/jenkins/workspace/Lucene-Solr-master-Linux/solr/core/src/test-files/solr/collection1/conf/old_synonyms.txt to /configs/conf1/old_synonyms.txt
   [junit4]   2> 253347 INFO  (TEST-ChaosMonkeyNothingIsSafeTest.test-seed#[A8F663C7CEB1A28B]) [    ] o.a.s.c.AbstractZkTestCase put /home/jenkins/workspace/Lucene-Solr-master-Linux/solr/core/src/test-files/solr/collection1/conf/synonyms.txt to /configs/conf1/synonyms.txt
   [junit4]   2> 253347 INFO  (TEST-ChaosMonkeyNothingIsSafeTest.test-seed#[A8F663C7CEB1A28B]) [    ] o.a.s.c.AbstractFullDistribZkTestBase Will use TLOG replicas unless explicitly asked otherwise
   [junit4]   2> 253402 INFO  (TEST-ChaosMonkeyNothingIsSafeTest.test-seed#[A8F663C7CEB1A28B]) [    ] o.e.j.s.Server jetty-9.3.20.v20170531
   [junit4]   2> 253403 INFO  (TEST-ChaosMonkeyNothingIsSafeTest.test-seed#[A8F663C7CEB1A28B]) [    ] o.e.j.s.h.ContextHandler Started o.e.j.s.ServletContextHandler@5ca4965c{/gu_,null,AVAILABLE}
   [junit4]   2> 253404 INFO  (TEST-ChaosMonkeyNothingIsSafeTest.test-seed#[A8F663C7CEB1A28B]) [    ] o.e.j.s.AbstractConnector Started ServerConnector@642adec4{HTTP/1.1,[http/1.1]}{127.0.0.1:44529}
   [junit4]   2> 253404 INFO  (TEST-ChaosMonkeyNothingIsSafeTest.test-seed#[A8F663C7CEB1A28B]) [    ] o.e.j.s.Server Started @254856ms
   [junit4]   2> 253404 INFO  (TEST-ChaosMonkeyNothingIsSafeTest.test-seed#[A8F663C7CEB1A28B]) [    ] o.a.s.c.s.e.JettySolrRunner Jetty properties: {hostContext=/gu_, solr.data.dir=/home/jenkins/workspace/Lucene-Solr-master-Linux/solr/build/solr-core/test/J2/temp/solr.cloud.ChaosMonkeyNothingIsSafeTest_A8F663C7CEB1A28B-001/tempDir-001/control/data, hostPort=44529, coreRootDirectory=/home/jenkins/workspace/Lucene-Solr-master-Linux/solr/build/solr-core/test/J2/temp/solr.cloud.ChaosMonkeyNothingIsSafeTest_A8F663C7CEB1A28B-001/control-001/cores}
   [junit4]   2> 253404 ERROR (TEST-ChaosMonkeyNothingIsSafeTest.test-seed#[A8F663C7CEB1A28B]) [    ] o.a.s.u.StartupLoggingUtils Missing Java Option solr.log.dir. Logging may be missing or incomplete.
   [junit4]   2> 253404 INFO  (TEST-ChaosMonkeyNothingIsSafeTest.test-seed#[A8F663C7CEB1A28B]) [    ] o.a.s.s.SolrDispatchFilter  ___      _       Welcome to Apache Solr™ version 8.0.0
   [junit4]   2> 253404 INFO  (TEST-ChaosMonkeyNothingIsSafeTest.test-seed#[A8F663C7CEB1A28B]) [    ] o.a.s.s.SolrDispatchFilter / __| ___| |_ _   Starting in cloud mode on port null
   [junit4]   2> 253404 INFO  (TEST-ChaosMonkeyNothingIsSafeTest.test-seed#[A8F663C7CEB1A28B]) [    ] o.a.s.s.SolrDispatchFilter \__ \/ _ \ | '_|  Install dir: null
   [junit4]   2> 253404 INFO  (TEST-ChaosMonkeyNothingIsSafeTest.test-seed#[A8F663C7CEB1A28B]) [    ] o.a.s.s.SolrDispatchFilter |___/\___/_|_|    Start time: 2017-12-22T12:53:40.291475Z
   [junit4]   2> 253405 INFO  (zkConnectionManagerCallback-610-thread-1) [    ] o.a.s.c.c.ConnectionManager zkClient has connected
   [junit4]   2> 253406 INFO  (TEST-ChaosMonkeyNothingIsSafeTest.test-seed#[A8F663C7CEB1A28B]) [    ] o.a.s.s.SolrDispatchFilter Loading solr.xml from SolrHome (not found in ZooKeeper)
   [junit4]   2> 253406 INFO  (TEST-ChaosMonkeyNothingIsSafeTest.test-seed#[A8F663C7CEB1A28B]) [    ] o.a.s.c.SolrXmlConfig Loading container configuration from /home/jenkins/workspace/Lucene-Solr-master-Linux/solr/build/solr-core/test/J2/temp/solr.cloud.ChaosMonkeyNothingIsSafeTest_A8F663C7CEB1A28B-001/control-001/solr.xml
   [junit4]   2> 253407 INFO  (TEST-ChaosMonkeyNothingIsSafeTest.test-seed#[A8F663C7CEB1A28B]) [    ] o.a.s.c.SolrXmlConfig Configuration parameter autoReplicaFailoverWorkLoopDelay is ignored
   [junit4]   2> 253407 INFO  (TEST-ChaosMonkeyNothingIsSafeTest.test-seed#[A8F663C7CEB1A28B]) [    ] o.a.s.c.SolrXmlConfig Configuration parameter autoReplicaFailoverBadNodeExpiration is ignored
   [junit4]   2> 253413 INFO  (TEST-ChaosMonkeyNothingIsSafeTest.test-seed#[A8F663C7CEB1A28B]) [    ] o.a.s.c.SolrXmlConfig MBean server found: com.sun.jmx.mbeanserver.JmxMBeanServer@350a6dd3, but no JMX reporters were configured - adding default JMX reporter.
   [junit4]   2> 253415 INFO  (TEST-ChaosMonkeyNothingIsSafeTest.test-seed#[A8F663C7CEB1A28B]) [    ] o.a.s.c.ZkContainer Zookeeper client=127.0.0.1:43883/solr
   [junit4]   2> 253416 INFO  (zkConnectionManagerCallback-614-thread-1) [    ] o.a.s.c.c.ConnectionManager zkClient has connected
   [junit4]   2> 253421 INFO  (zkConnectionManagerCallback-616-thread-1-processing-n:127.0.0.1:44529_gu_) [n:127.0.0.1:44529_gu_    ] o.a.s.c.c.ConnectionManager zkClient has connected
   [junit4]   2> 253448 INFO  (TEST-ChaosMonkeyNothingIsSafeTest.test-seed#[A8F663C7CEB1A28B]) [n:127.0.0.1:44529_gu_    ] o.a.s.c.Overseer Overseer (id=null) closing
   [junit4]   2> 253448 INFO  (TEST-ChaosMonkeyNothingIsSafeTest.test-seed#[A8F663C7CEB1A28B]) [n:127.0.0.1:44529_gu_    ] o.a.s.c.OverseerElectionContext I am going to be the leader 127.0.0.1:44529_gu_
   [junit4]   2> 253448 INFO  (TEST-ChaosMonkeyNothingIsSafeTest.test-seed#[A8F663C7CEB1A28B]) [n:127.0.0.1:44529_gu_    ] o.a.s.c.Overseer Overseer (id=99218045018046468-127.0.0.1:44529_gu_-n_0000000000) starting
   [junit4]   2> 253450 INFO  (TEST-ChaosMonkeyNothingIsSafeTest.test-seed#[A8F663C7CEB1A28B]) [n:127.0.0.1:44529_gu_    ] o.a.s.c.ZkController Register node as live in ZooKeeper:/live_nodes/127.0.0.1:44529_gu_
   [junit4]   2> 253452 INFO  (OverseerStateUpdate-99218045018046468-127.0.0.1:44529_gu_-n_0000000000) [n:127.0.0.1:44529_gu_    ] o.a.s.c.c.ZkStateReader Updated live nodes from ZooKeeper... (0) -> (1)
   [junit4]   2> 253490 INFO  (TEST-ChaosMonkeyNothingIsSafeTest.test-seed#[A8F663C7CEB1A28B]) [n:127.0.0.1:44529_gu_    ] o.a.s.m.r.SolrJmxReporter JMX monitoring for 'solr.node' (registry 'solr.node') enabled at server: com.sun.jmx.mbeanserver.JmxMBeanServer@350a6dd3
   [junit4]   2> 253495 INFO  (TEST-ChaosMonkeyNothingIsSafeTest.test-seed#[A8F663C7CEB1A28B]) [n:127.0.0.1:44529_gu_    ] o.a.s.m.r.SolrJmxReporter JMX monitoring for 'solr.jvm' (registry 'solr.jvm') enabled at server: com.sun.jmx.mbeanserver.JmxMBeanServer@350a6dd3
   [junit4]   2> 253495 INFO  (TEST-ChaosMonkeyNothingIsSafeTest.test-seed#[A8F663C7CEB1A28B]) [n:127.0.0.1:44529_gu_    ] o.a.s.m.r.SolrJmxReporter JMX monitoring for 'solr.jetty' (registry 'solr.jetty') enabled at server: com.sun.jmx.mbeanserver.JmxMBeanServer@350a6dd3
   [junit4]   2> 253496 INFO  (TEST-ChaosMonkeyNothingIsSafeTest.test-seed#[A8F663C7CEB1A28B]) [n:127.0.0.1:44529_gu_    ] o.a.s.c.CorePropertiesLocator Found 0 core definitions underneath /home/jenkins/workspace/Lucene-Solr-master-Linux/solr/build/solr-core/test/J2/temp/solr.cloud.ChaosMonkeyNothingIsSafeTest_A8F663C7CEB1A28B-001/control-001/cores
   [junit4]   2> 253508 INFO  (zkConnectionManagerCallback-622-thread-1) [    ] o.a.s.c.c.ConnectionManager zkClient has connected
   [junit4]   2> 253509 INFO  (TEST-ChaosMonkeyNothingIsSafeTest.test-seed#[A8F663C7CEB1A28B]) [    ] o.a.s.c.c.ZkStateReader Updated live nodes from ZooKeeper... (0) -> (1)
   [junit4]   2> 253509 INFO  (TEST-ChaosMonkeyNothingIsSafeTest.test-seed#[A8F663C7CEB1A28B]) [    ] o.a.s.c.s.i.ZkClientClusterStateProvider Cluster at 127.0.0.1:43883/solr ready
   [junit4]   2> 253511 INFO  (qtp1625024297-2772) [n:127.0.0.1:44529_gu_    ] o.a.s.h.a.CollectionsHandler Invoked Collection Action :create with params replicationFactor=1&collection.configName=conf1&name=control_collection&nrtReplicas=1&action=CREATE&numShards=1&createNodeSet=127.0.0.1:44529_gu_&wt=javabin&version=2 and sendToOCPQueue=true
   [junit4]   2> 253512 INFO  (OverseerThreadFactory-1247-thread-1-processing-n:127.0.0.1:44529_gu_) [n:127.0.0.1:44529_gu_    ] o.a.s.c.CreateCollectionCmd Create collection control_collection
   [junit4]   2> 253616 INFO  (qtp1625024297-2774) [n:127.0.0.1:44529_gu_    ] o.a.s.h.a.CoreAdminOperation core create command qt=/admin/cores&collection.configName=conf1&newCollection=true&name=control_collection_shard1_replica_n1&action=CREATE&numShards=1&collection=control_collection&shard=shard1&wt=javabin&version=2&replicaType=NRT
   [junit4]   2> 253616 INFO  (qtp1625024297-2774) [n:127.0.0.1:44529_gu_    ] o.a.s.c.TransientSolrCoreCacheDefault Allocating transient cache for 4 transient cores
   [junit4]   2> 253718 INFO  (zkCallback-615-thread-1-processing-n:127.0.0.1:44529_gu_) [n:127.0.0.1:44529_gu_    ] o.a.s.c.c.ZkStateReader A cluster state change: [WatchedEvent state:SyncConnected type:NodeDataChanged path:/collections/control_collection/state.json] for collection [control_collection] has occurred - updating... (live nodes size: [1])
   [junit4]   2> 254639 INFO  (qtp1625024297-2774) [n:127.0.0.1:44529_gu_ c:control_collection s:shard1  x:control_collection_shard1_replica_n1] o.a.s.c.SolrConfig Using Lucene MatchVersion: 8.0.0
   [junit4]   2> 254651 INFO  (qtp1625024297-2774) [n:127.0.0.1:44529_gu_ c:control_collection s:shard1  x:control_collection_shard1_replica_n1] o.a.s.s.IndexSchema [control_collection_shard1_replica_n1] Schema name=test
   [junit4]   2> 254718 INFO  (qtp1625024297-2774) [n:127.0.0.1:44529_gu_ c:control_collection s:shard1  x:control_collection_shard1_replica_n1] o.a.s.s.IndexSchema Loaded schema test/1.6 with uniqueid field id
   [junit4]   2> 254724 INFO  (qtp1625024297-2774) [n:127.0.0.1:44529_gu_ c:control_collection s:shard1  x:control_collection_shard1_replica_n1] o.a.s.c.CoreContainer Creating SolrCore 'control_collection_shard1_replica_n1' using configuration from collection control_collection, trusted=true
   [junit4]   2> 254724 INFO  (qtp1625024297-2774) [n:127.0.0.1:44529_gu_ c:control_collection s:shard1  x:control_collection_shard1_replica_n1] o.a.s.m.r.SolrJmxReporter JMX monitoring for 'solr.core.control_collection.shard1.replica_n1' (registry 'solr.core.control_collection.shard1.replica_n1') enabled at server: com.sun.jmx.mbeanserver.JmxMBeanServer@350a6dd3
   [junit4]   2> 254725 INFO  (qtp1625024297-2774) [n:127.0.0.1:44529_gu_ c:control_collection s:shard1  x:control_collection_shard1_replica_n1] o.a.s.c.SolrCore solr.RecoveryStrategy.Builder
   [junit4]   2> 254725 INFO  (qtp1625024297-2774) [n:127.0.0.1:44529_gu_ c:control_collection s:shard1  x:control_collection_shard1_replica_n1] o.a.s.c.SolrCore [[control_collection_shard1_replica_n1] ] Opening new SolrCore at [/home/jenkins/workspace/Lucene-Solr-master-Linux/solr/build/solr-core/test/J2/temp/solr.cloud.ChaosMonkeyNothingIsSafeTest_A8F663C7CEB1A28B-001/control-001/cores/control_collection_shard1_replica_n1], dataDir=[/home/jenkins/workspace/Lucene-Solr-master-Linux/solr/build/solr-core/test/J2/temp/solr.cloud.ChaosMonkeyNothingIsSafeTest_A8F663C7CEB1A28B-001/control-001/cores/control_collection_shard1_replica_n1/data/]
   [junit4]   2> 254727 INFO  (qtp1625024297-2774) [n:127.0.0.1:44529_gu_ c:control_collection s:shard1  x:control_collection_shard1_replica_n1] o.a.s.u.RandomMergePolicy RandomMergePolicy wrapping class org.apache.lucene.index.LogDocMergePolicy: [LogDocMergePolicy: minMergeSize=1000, mergeFactor=38, maxMergeSize=9223372036854775807, maxMergeSizeForForcedMerge=9223372036854775807, calibrateSizeByDeletes=true, maxMergeDocs=2147483647, maxCFSSegmentSizeMB=8.796093022207999E12, noCFSRatio=0.5753211618701152]
   [junit4]   2> 254746 WARN  (qtp1625024297-2774) [n:127.0.0.1:44529_gu_ c:control_collection s:shard1  x:control_collection_shard1_replica_n1] o.a.s.c.RequestHandlers INVALID paramSet a in requestHandler {type = requestHandler,name = /dump,class = DumpRequestHandler,attributes = {initParams=a, name=/dump, class=DumpRequestHandler},args = {defaults={a=A,b=B}}}
   [junit4]   2> 254769 INFO  (qtp1625024297-2774) [n:127.0.0.1:44529_gu_ c:control_collection s:shard1  x:control_collection_shard1_replica_n1] o.a.s.u.UpdateHandler Using UpdateLog implementation: org.apache.solr.update.UpdateLog
   [junit4]   2> 254769 INFO  (qtp1625024297-2774) [n:127.0.0.1:44529_gu_ c:control_collection s:shard1  x:control_collection_shard1_replica_n1] o.a.s.u.UpdateLog Initializing UpdateLog: dataDir= defaultSyncLevel=FLUSH numRecordsToKeep=100 maxNumLogsToKeep=10 numVersionBuckets=65536
   [junit4]   2> 254769 INFO  (qtp1625024297-2774) [n:127.0.0.1:44529_gu_ c:control_collection s:shard1  x:control_collection_shard1_replica_n1] o.a.s.u.CommitTracker Hard AutoCommit: if uncommited for 15000ms; 
   [junit4]   2> 254769 INFO  (qtp1625024297-2774) [n:127.0.0.1:44529_gu_ c:control_collection s:shard1  x:control_collection_shard1_replica_n1] o.a.s.u.CommitTracker Soft AutoCommit: disabled
   [junit4]   2> 254770 INFO  (qtp1625024297-2774) [n:127.0.0.1:44529_gu_ c:control_collection s:shard1  x:control_collection_shard1_replica_n1] o.a.s.u.RandomMergePolicy RandomMergePolicy wrapping class org.apache.lucene.index.MockRandomMergePolicy: org.apache.lucene.index.MockRandomMergePolicy@15bc4e63
   [junit4]   2> 254770 INFO  (qtp1625024297-2774) [n:127.0.0.1:44529_gu_ c:control_collection s:shard1  x:control_collection_shard1_replica_n1] o.a.s.s.SolrIndexSearcher Opening [Searcher@3529c517[control_collection_shard1_replica_n1] main]
   [junit4]   2> 254771 INFO  (qtp1625024297-2774) [n:127.0.0.1:44529_gu_ c:control_collection s:shard1  x:control_collection_shard1_replica_n1] o.a.s.r.ManagedResourceStorage Configured ZooKeeperStorageIO with znodeBase: /configs/conf1
   [junit4]   2> 254772 INFO  (qtp1625024297-2774) [n:127.0.0.1:44529_gu_ c:control_collection s:shard1  x:control_collection_shard1_replica_n1] o.a.s.r.ManagedResourceStorage Loaded null at path _rest_managed.json using ZooKeeperStorageIO:path=/configs/conf1
   [junit4]   2> 254772 INFO  (qtp1625024297-2774) [n:127.0.0.1:44529_gu_ c:control_collection s:shard1  x:control_collection_shard1_replica_n1] o.a.s.h.ReplicationHandler Commits will be reserved for 10000ms.
   [junit4]   2> 254773 INFO  (searcherExecutor-1250-thread-1-processing-n:127.0.0.1:44529_gu_ x:control_collection_shard1_replica_n1 s:shard1 c:control_collection) [n:127.0.0.1:44529_gu_ c:control_collection s:shard1  x:control_collection_shard1_replica_n1] o.a.s.c.SolrCore [control_collection_shard1_replica_n1] Registered new searcher Searcher@3529c517[control_collection_shard1_replica_n1] main{ExitableDirectoryReader(UninvertingDirectoryReader())}
   [junit4]   2> 254773 INFO  (qtp1625024297-2774) [n:127.0.0.1:44529_gu_ c:control_collection s:shard1  x:control_collection_shard1_replica_n1] o.a.s.u.UpdateLog Could not find max version in index or recent updates, using new clock 1587488721899356160
   [junit4]   2> 254776 INFO  (qtp1625024297-2774) [n:127.0.0.1:44529_gu_ c:control_collection s:shard1  x:control_collection_shard1_replica_n1] o.a.s.c.ShardLeaderElectionContext Enough replicas found to continue.
   [junit4]   2> 254776 INFO  (qtp1625024297-2774) [n:127.0.0.1:44529_gu_ c:control_collection s:shard1  x:control_collection_shard1_replica_n1] o.a.s.c.ShardLeaderElectionContext I may be the new leader - try and sync
   [junit4]   2> 254776 INFO  (qtp1625024297-2774) [n:127.0.0.1:44529_gu_ c:control_collection s:shard1  x:control_collection_shard1_replica_n1] o.a.s.c.SyncStrategy Sync replicas to http://127.0.0.1:44529/gu_/control_collection_shard1_replica_n1/
   [junit4]   2> 254776 INFO  (qtp1625024297-2774) [n:127.0.0.1:44529_gu_ c:control_collection s:shard1  x:control_collection_shard1_replica_n1] o.a.s.c.SyncStrategy Sync Success - now sync replicas to me
   [junit4]   2> 254776 INFO  (qtp1625024297-2774) [n:127.0.0.1:44529_gu_ c:control_collection s:shard1  x:control_collection_shard1_replica_n1] o.a.s.c.SyncStrategy http://127.0.0.1:44529/gu_/control_collection_shard1_replica_n1/ has no replicas
   [junit4]   2> 254776 INFO  (qtp1625024297-2774) [n:127.0.0.1:44529_gu_ c:control_collection s:shard1  x:control_collection_shard1_replica_n1] o.a.s.c.ShardLeaderElectionContext Found all replicas participating in election, clear LIR
   [junit4]   2> 254777 INFO  (qtp1625024297-2774) [n:127.0.0.1:44529_gu_ c:control_collection s:shard1  x:control_collection_shard1_replica_n1] o.a.s.c.ShardLeaderElectionContext I am the new leader: http://127.0.0.1:44529/gu_/control_collection_shard1_replica_n1/ shard1
   [junit4]   2> 254878 INFO  (zkCallback-615-thread-1-processing-n:127.0.0.1:44529_gu_) [n:127.0.0.1:44529_gu_    ] o.a.s.c.c.ZkStateReader A cluster state change: [WatchedEvent state:SyncConnected type:NodeDataChanged path:/collections/control_collection/state.json] for collection [control_collection] has occurred - updating... (live nodes size: [1])
   [junit4]   2> 254927 INFO  (qtp1625024297-2774) [n:127.0.0.1:44529_gu_ c:control_collection s:shard1  x:control_collection_shard1_replica_n1] o.a.s.c.ZkController I am the leader, no recovery necessary
   [junit4]   2> 254929 INFO  (qtp1625024297-2774) [n:127.0.0.1:44529_gu_ c:control_collection s:shard1  x:control_collection_shard1_replica_n1] o.a.s.s.HttpSolrCall [admin] webapp=null path=/admin/cores params={qt=/admin/cores&collection.configName=conf1&newCollection=true&name=control_collection_shard1_replica_n1&action=CREATE&numShards=1&collection=control_collection&shard=shard1&wt=javabin&version=2&replicaType=NRT} status=0 QTime=1313
   [junit4]   2> 254932 INFO  (qtp1625024297-2772) [n:127.0.0.1:44529_gu_    ] o.a.s.h.a.CollectionsHandler Wait for new collection to be active for at most 30 seconds. Check all shard replicas
   [junit4]   2> 255030 INFO  (zkCallback-615-thread-1-processing-n:127.0.0.1:44529_gu_) [n:127.0.0.1:44529_gu_    ] o.a.s.c.c.ZkStateReader A cluster state change: [WatchedEvent state:SyncConnected type:NodeDataChanged path:/collections/control_collection/state.json] for collection [control_collection] has occurred - updating... (live nodes size: [1])
   [junit4]   2> 255514 INFO  (OverseerCollectionConfigSetProcessor-99218045018046468-127.0.0.1:44529_gu_-n_0000000000) [n:127.0.0.1:44529_gu_    ] o.a.s.c.OverseerTaskQueue Response ZK path: /overseer/collection-queue-work/qnr-0000000000 doesn't exist.  Requestor may have disconnected from ZooKeeper
   [junit4]   2> 255932 INFO  (qtp1625024297-2772) [n:127.0.0.1:44529_gu_    ] o.a.s.s.HttpSolrCall [admin] webapp=null path=/admin/collections params={replicationFactor=1&collection.configName=conf1&name=control_collection&nrtReplicas=1&action=CREATE&numShards=1&createNodeSet=127.0.0.1:44529_gu_&wt=javabin&version=2} status=0 QTime=2421
   [junit4]   2> 255937 INFO  (zkConnectionManagerCallback-626-thread-1) [    ] o.a.s.c.c.ConnectionManager zkClient has connected
   [junit4]   2> 255939 INFO  (TEST-ChaosMonkeyNothingIsSafeTest.test-seed#[A8F663C7CEB1A28B]) [    ] o.a.s.c.c.ZkStateReader Updated live nodes from ZooKeeper... (0) -> (1)
   [junit4]   2> 255940 INFO  (TEST-ChaosMonkeyNothingIsSafeTest.test-seed#[A8F663C7CEB1A28B]) [    ] o.a.s.c.s.i.ZkClientClusterStateProvider Cluster at 127.0.0.1:43883/solr ready
   [junit4]   2> 255940 INFO  (TEST-ChaosMonkeyNothingIsSafeTest.test-seed#[A8F663C7CEB1A28B]) [    ] o.a.s.c.ChaosMonkey monkey: init - expire sessions:false cause connection loss:false
   [junit4]   2> 255941 INFO  (qtp1625024297-2772) [n:127.0.0.1:44529_gu_    ] o.a.s.h.a.CollectionsHandler Invoked Collection Action :create with params replicationFactor=1&collection.configName=conf1&name=collection1&nrtReplicas=1&action=CREATE&numShards=3&createNodeSet=&stateFormat=1&wt=javabin&version=2 and sendToOCPQueue=true
   [junit4]   2> 255944 INFO  (OverseerThreadFactory-1247-thread-2-processing-n:127.0.0.1:44529_gu_) [n:127.0.0.1:44529_gu_    ] o.a.s.c.CreateCollectionCmd Create collection collection1
   [junit4]   2> 255945 WARN  (OverseerThreadFactory-1247-thread-2-processing-n:127.0.0.1:44529_gu_) [n:127.0.0.1:44529_gu_    ] o.a.s.c.CreateCollectionCmd It is unusual to create a collection (collection1) without cores.
   [junit4]   2> 256150 INFO  (qtp1625024297-2772) [n:127.0.0.1:44529_gu_    ] o.a.s.h.a.CollectionsHandler Wait for new collection to be active for at most 30 seconds. Check all shard replicas
   [junit4]   2> 256150 INFO  (qtp1625024297-2772) [n:127.0.0.1:44529_gu_    ] o.a.s.s.HttpSolrCall [admin] webapp=null path=/admin/collections params={replicationFactor=1&collection.configName=conf1&name=collection1&nrtReplicas=1&action=CREATE&numShards=3&createNodeSet=&stateFormat=1&wt=javabin&version=2} status=0 QTime=208
   [junit4]   2> 256232 INFO  (TEST-ChaosMonkeyNothingIsSafeTest.test-seed#[A8F663C7CEB1A28B]) [    ] o.a.s.c.AbstractFullDistribZkTestBase create jetty 1 in directory /home/jenkins/workspace/Lucene-Solr-master-Linux/solr/build/solr-core/test/J2/temp/solr.cloud.ChaosMonkeyNothingIsSafeTest_A8F663C7CEB1A28B-001/shard-1-001 of type TLOG
   [junit4]   2> 256232 INFO  (TEST-ChaosMonkeyNothingIsSafeTest.test-seed#[A8F663C7CEB1A28B]) [    ] o.e.j.s.Server jetty-9.3.20.v20170531
   [junit4]   2> 256233 INFO  (TEST-ChaosMonkeyNothingIsSafeTest.test-seed#[A8F663C7CEB1A28B]) [    ] o.e.j.s.h.ContextHandler Started o.e.j.s.ServletContextHandler@2578afed{/gu_,null,AVAILABLE}
   [junit4]   2> 256233 INFO  (TEST-ChaosMonkeyNothingIsSafeTest.test-seed#[A8F663C7CEB1A28B]) [    ] o.e.j.s.AbstractConnector Started ServerConnector@7eefaf3a{HTTP/1.1,[http/1.1]}{127.0.0.1:42067}
   [junit4]   2> 256233 INFO  (TEST-ChaosMonkeyNothingIsSafeTest.test-seed#[A8F663C7CEB1A28B]) [    ] o.e.j.s.Server Started @257686ms
   [junit4]   2> 256233 INFO  (TEST-ChaosMonkeyNothingIsSafeTest.test-seed#[A8F663C7CEB1A28B]) [    ] o.a.s.c.s.e.JettySolrRunner Jetty properties: {hostContext=/gu_, solrconfig=solrconfig.xml, solr.data.dir=/home/jenkins/workspace/Lucene-Solr-master-Linux/solr/build/solr-core/test/J2/temp/solr.cloud.ChaosMonkeyNothingIsSafeTest_A8F663C7CEB1A28B-001/tempDir-001/jetty1, hostPort=42067, coreRootDirectory=/home/jenkins/workspace/Lucene-Solr-master-Linux/solr/build/solr-core/test/J2/../../../../../../../../../home/jenkins/workspace/Lucene-Solr-master-Linux/solr/build/solr-core/test/J2/temp/solr.cloud.ChaosMonkeyNothingIsSafeTest_A8F663C7CEB1A28B-001/shard-1-001/cores, replicaType=TLOG}
   [junit4]   2> 256234 ERROR (TEST-ChaosMonkeyNothingIsSafeTest.test-seed#[A8F663C7CEB1A28B]) [    ] o.a.s.u.StartupLoggingUtils Missing Java Option solr.log.dir. Logging may be missing or incomplete.
   [junit4]   2> 256234 INFO  (TEST-ChaosMonkeyNothingIsSafeTest.test-seed#[A8F663C7CEB1A28B]) [    ] o.a.s.s.SolrDispatchFilter  ___      _       Welcome to Apache Solr™ version 8.0.0
   [junit4]   2> 256234 INFO  (TEST-ChaosMonkeyNothingIsSafeTest.test-seed#[A8F663C7CEB1A28B]) [    ] o.a.s.s.SolrDispatchFilter / __| ___| |_ _   Starting in cloud mode on port null
   [junit4]   2> 256234 INFO  (TEST-ChaosMonkeyNothingIsSafeTest.test-seed#[A8F663C7CEB1A28B]) [    ] o.a.s.s.SolrDispatchFilter \__ \/ _ \ | '_|  Install dir: null
   [junit4]   2> 256234 INFO  (TEST-ChaosMonkeyNothingIsSafeTest.test-seed#[A8F663C7CEB1A28B]) [    ] o.a.s.s.SolrDispatchFilter |___/\___/_|_|    Start time: 2017-12-22T12:53:43.121262Z
   [junit4]   2> 256235 INFO  (zkConnectionManagerCallback-628-thread-1) [    ] o.a.s.c.c.ConnectionManager zkClient has connected
   [junit4]   2> 256236 INFO  (TEST-ChaosMonkeyNothingIsSafeTest.test-seed#[A8F663C7CEB1A28B]) [    ] o.a.s.s.SolrDispatchFilter Loading solr.xml from SolrHome (not found in ZooKeeper)
   [junit4]   2> 256236 INFO  (TEST-ChaosMonkeyNothingIsSafeTest.test-seed#[A8F663C7CEB1A28B]) [    ] o.a.s.c.SolrXmlConfig Loading container configuration from /home/jenkins/workspace/Lucene-Solr-master-Linux/solr/build/solr-core/test/J2/temp/solr.cloud.ChaosMonkeyNothingIsSafeTest_A8F663C7CEB1A28B-001/shard-1-001/solr.xml
   [junit4]   2> 256237 INFO  (TEST-ChaosMonkeyNothingIsSafeTest.test-seed#[A8F663C7CEB1A28B]) [    ] o.a.s.c.SolrXmlConfig Configuration parameter autoReplicaFailoverWorkLoopDelay is ignored
   [junit4]   2> 256237 INFO  (TEST-ChaosMonkeyNothingIsSafeTest.test-seed#[A8F663C7CEB1A28B]) [    ] o.a.s.c.SolrXmlConfig Configuration parameter autoReplicaFailoverBadNodeExpiration is ignored
   [junit4]   2> 256238 INFO  (TEST-ChaosMonkeyNothingIsSafeTest.test-seed#[A8F663C7CEB1A28B]) [    ] o.a.s.c.SolrXmlConfig MBean server found: com.sun.jmx.mbeanserver.JmxMBeanServer@350a6dd3, but no JMX reporters were configured - adding default JMX reporter.
   [junit4]   2> 256239 INFO  (TEST-ChaosMonkeyNothingIsSafeTest.test-seed#[A8F663C7CEB1A28B]) [    ] o.a.s.c.ZkContainer Zookeeper client=127.0.0.1:43883/solr
   [junit4]   2> 256240 INFO  (zkConnectionManagerCallback-632-thread-1) [    ] o.a.s.c.c.ConnectionManager zkClient has connected
   [junit4]   2> 256243 INFO  (zkConnectionManagerCallback-634-thread-1-processing-n:127.0.0.1:42067_gu_) [n:127.0.0.1:42067_gu_    ] o.a.s.c.c.ConnectionManager zkClient has connected
   [junit4]   2> 256245 INFO  (TEST-ChaosMonkeyNothingIsSafeTest.test-seed#[A8F663C7CEB1A28B]) [n:127.0.0.1:42067_gu_    ] o.a.s.c.c.ZkStateReader Updated live nodes from ZooKeeper... (0) -> (1)
   [junit4]   2> 256245 INFO  (TEST-ChaosMonkeyNothingIsSafeTest.test-seed#[A8F663C7CEB1A28B]) [n:127.0.0.1:42067_gu_    ] o.a.s.c.Overseer Overseer (id=null) closing
   [junit4]   2> 256246 INFO  (TEST-ChaosMonkeyNothingIsSafeTest.test-seed#[A8F663C7CEB1A28B]) [n:127.0.0.1:42067_gu_    ] o.a.s.c.ZkController Register node as live in ZooKeeper:/live_nodes/127.0.0.1:42067_gu_
   [junit4]   2> 256246 INFO  (zkCallback-615-thread-1-processing-n:127.0.0.1:44529_gu_) [n:127.0.0.1:44529_gu_    ] o.a.s.c.c.ZkStateReader Updated live nodes from ZooKeeper... (1) -> (2)
   [junit4]   2> 256246 INFO  (zkCallback-625-thread-1) [    ] o.a.s.c.c.ZkStateReader Updated live nodes from ZooKeeper... (1) -> (2)
   [junit4]   2> 256246 INFO  (zkCallback-633-thread-1-processing-n:127.0.0.1:42067_gu_) [n:127.0.0.1:42067_gu_    ] o.a.s.c.c.ZkStateReader Updated live nodes from ZooKeeper... (1) -> (2)
   [junit4]   2> 256272 INFO  (TEST-ChaosMonkeyNothingIsSafeTest.test-seed#[A8F663C7CEB1A28B]) [n:127.0.0.1:42067_gu_    ] o.a.s.m.r.SolrJmxReporter JMX monitoring for 'solr.node' (registry 'solr.node') enabled at server: com.sun.jmx.mbeanserver.JmxMBeanServer@350a6dd3
   [junit4]   2> 256277 INFO  (TEST-ChaosMonkeyNothingIsSafeTest.test-seed#[A8F663C7CEB1A28B]) [n:127.0.0.1:42067_gu_    ] o.a.s.m.r.SolrJmxReporter JMX monitoring for 'solr.jvm' (registry 'solr.jvm') enabled at server: com.sun.jmx.mbeanserver.JmxMBeanServer@350a6dd3
   [junit4]   2> 256277 INFO  (TEST-ChaosMonkeyNothingIsSafeTest.test-seed#[A8F663C7CEB1A28B]) [n:127.0.0.1:42067_gu_    ] o.a.s.m.r.SolrJmxReporter JMX monitoring for 'solr.jetty' (registry 'solr.jetty') enabled at server: com.sun.jmx.mbeanserver.JmxMBeanServer@350a6dd3
   [junit4]   2> 256278 INFO  (TEST-ChaosMonkeyNothingIsSafeTest.test-seed#[A8F663C7CEB1A28B]) [n:127.0.0.1:42067_gu_    ] o.a.s.c.CorePropertiesLocator Found 0 core definitions underneath /home/jenkins/workspace/Lucene-Solr-master-Linux/solr/build/solr-core/test/J2/../../../../../../../../../home/jenkins/workspace/Lucene-Solr-master-Linux/solr/build/solr-core/test/J2/temp/solr.cloud.ChaosMonkeyNothingIsSafeTest_A8F663C7CEB1A28B-001/shard-1-001/cores
   [junit4]   2> 256292 INFO  (qtp914485561-2821) [n:127.0.0.1:42067_gu_    ] o.a.s.h.a.CollectionsHandler Invoked Collection Action :addreplica with params node=127.0.0.1:42067_gu_&action=ADDREPLICA&collection=collection1&shard=shard2&type=TLOG&wt=javabin&version=2 and sendToOCPQueue=true
   [junit4]   2> 256293 INFO  (OverseerCollectionConfigSetProcessor-99218045018046468-127.0.0.1:44529_gu_-n_0000000000) [n:127.0.0.1:44529_gu_    ] o.a.s.c.OverseerTaskQueue Response ZK path: /overseer/collection-queue-work/qnr-0000000002 doesn't exist.  Requestor may have disconnected from ZooKeeper
   [junit4]   2> 256293 INFO  (OverseerThreadFactory-1247-thread-3-processing-n:127.0.0.1:44529_gu_) [n:127.0.0.1:44529_gu_    ] o.a.s.c.AddReplicaCmd Node Identified 127.0.0.1:42067_gu_ for creating new replica
   [junit4]   2> 256294 INFO  (qtp914485561-2823) [n:127.0.0.1:42067_gu_    ] o.a.s.h.a.CoreAdminOperation core create command qt=/admin/cores&collection.configName=conf1&name=collection1_shard2_replica_t61&action=CREATE&collection=collection1&shard=shard2&wt=javabin&version=2&replicaType=TLOG
   [junit4]   2> 256295 INFO  (qtp914485561-2823) [n:127.0.0.1:42067_gu_    ] o.a.s.c.TransientSolrCoreCacheDefault Allocating transient cache for 4 transient cores
   [junit4]   2> 257319 INFO  (qtp914485561-2823) [n:127.0.0.1:42067_gu_ c:collection1 s:shard2  x:collection1_shard2_replica_t61] o.a.s.c.SolrConfig Using Lucene MatchVersion: 8.0.0
   [junit4]   2> 257351 INFO  (qtp914485561-2823) [n:127.0.0.1:42067_gu_ c:collection1 s:shard2  x:collection1_shard2_replica_t61] o.a.s.s.IndexSchema [collection1_shard2_replica_t61] Schema name=test
   [junit4]   2> 257406 INFO  (qtp914485561-2823) [n:127.0.0.1:42067_gu_ c:collection1 s:shard2  x:collection1_shard2_replica_t61] o.a.s.s.IndexSchema Loaded schema test/1.6 with uniqueid field id
   [junit4]   2> 257412 INFO  (qtp914485561-2823) [n:127.0.0.1:42067_gu_ c:collection1 s:shard2  x:collection1_shard2_replica_t61] o.a.s.c.CoreContainer Creating SolrCore 'collection1_shard2_replica_t61' using configuration from collection collection1, trusted=true
   [junit4]   2> 257412 INFO  (qtp914485561-2823) [n:127.0.0.1:42067_gu_ c:collection1 s:shard2  x:collection1_shard2_replica_t61] o.a.s.m.r.SolrJmxReporter JMX monitoring for 'solr.core.collection1.shard2.replica_t61' (registry 'solr.core.collection1.shard2.replica_t61') enabled at server: com.sun.jmx.mbeanserver.JmxMBeanServer@350a6dd3
   [junit4]   2> 257412 INFO  (qtp914485561-2823) [n:127.0.0.1:42067_gu_ c:collection1 s:shard2  x:collection1_shard2_replica_t61] o.a.s.c.SolrCore solr.RecoveryStrategy.Builder
   [junit4]   2> 257412 INFO  (qtp914485561-2823) [n:127.0.0.1:42067_gu_ c:collection1 s:shard2  x:collection1_shard2_replica_t61] o.a.s.c.SolrCore [[collection1_shard2_replica_t61] ] Opening new SolrCore at [/home/jenkins/workspace/Lucene-Solr-master-Linux/solr/build/solr-core/test/J2/temp/solr.cloud.ChaosMonkeyNothingIsSafeTest_A8F663C7CEB1A28B-001/shard-1-001/cores/collection1_shard2_replica_t61], dataDir=[/home/jenkins/workspace/Lucene-Solr-master-Linux/solr/build/solr-core/test/J2/../../../../../../../../../home/jenkins/workspace/Lucene-Solr-master-Linux/solr/build/solr-core/test/J2/temp/solr.cloud.ChaosMonkeyNothingIsSafeTest_A8F663C7CEB1A28B-001/shard-1-001/cores/collection1_shard2_replica_t61/data/]
   [junit4]   2> 257414 INFO  (qtp914485561-2823) [n:127.0.0.1:42067_gu_ c:collection1 s:shard2  x:collection1_shard2_replica_t61] o.a.s.u.RandomMergePolicy RandomMergePolicy wrapping class org.apache.lucene.index.LogDocMergePolicy: [LogDocMergePolicy: minMergeSize=1000, mergeFactor=38, maxMergeSize=9223372036854775807, maxMergeSizeForForcedMerge=9223372036854775807, calibrateSizeByDeletes=true, maxMergeDocs=2147483647, maxCFSSegmentSizeMB=8.796093022207999E12, noCFSRatio=0.5753211618701152]
   [junit4]   2> 257436 WARN  (qtp914485561-2823) [n:127.0.0.1:42067_gu_ c:collection1 s:shard2  x:collection1_shard2_replica_t61] o.a.s.c.RequestHandlers INVALID paramSet a in requestHandler {type = requestHandler,name = /dump,class = DumpRequestHandler,attributes = {initParams=a, name=/dump, class=DumpRequestHandler},args = {defaults={a=A,b=B}}}
   [junit4]   2> 257459 INFO  (qtp914485561-2823) [n:127.0.0.1:42067_gu_ c:collection1 s:shard2  x:collection1_shard2_replica_t61] o.a.s.u.UpdateHandler Using UpdateLog implementation: org.apache.solr.update.UpdateLog
   [junit4]   2> 257459 INFO  (qtp914485561-2823) [n:127.0.0.1:42067_gu_ c:collection1 s:shard2  x:collection1_shard2_replica_t61] o.a.s.u.UpdateLog Initializing UpdateLog: dataDir= defaultSyncLevel=FLUSH numRecordsToKeep=100 maxNumLogsToKeep=10 numVersionBuckets=65536
   [junit4]   2> 257460 INFO  (qtp914485561-2823) [n:127.0.0.1:42067_gu_ c:collection1 s:shard2  x:collection1_shard2_replica_t61] o.a.s.u.CommitTracker Hard AutoCommit: if uncommited for 15000ms; 
   [junit4]   2> 257460 INFO  (qtp914485561-2823) [n:127.0.0.1:42067_gu_ c:collection1 s:shard2  x:collection1_shard2_replica_t61] o.a.s.u.CommitTracker Soft AutoCommit: disabled
   [junit4]   2> 257461 INFO  (qtp914485561-2823) [n:127.0.0.1:42067_gu_ c:collection1 s:shard2  x:collection1_shard2_replica_t61] o.a.s.u.RandomMergePolicy RandomMergePolicy wrapping class org.apache.lucene.index.MockRandomMergePolicy: org.apache.lucene.index.MockRandomMergePolicy@3320197a
   [junit4]   2> 257461 INFO  (qtp914485561-2823) [n:127.0.0.1:42067_gu_ c:collection1 s:shard2  x:collection1_shard2_replica_t61] o.a.s.s.SolrIndexSearcher Opening [Searcher@3b43d419[collection1_shard2_replica_t61] main]
   [junit4]   2> 257462 INFO  (qtp914485561-2823) [n:127.0.0.1:42067_gu_ c:collection1 s:shard2  x:collection1_shard2_replica_t61] o.a.s.r.ManagedResourceStorage Configured ZooKeeperStorageIO with znodeBase: /configs/conf1
   [junit4]   2> 257462 INFO  (qtp914485561-2823) [n:127.0.0.1:42067_gu_ c:collection1 s:shard2  x:collection1_shard2_replica_t61] o.a.s.r.ManagedResourceStorage Loaded null at path _rest_managed.json using ZooKeeperStorageIO:path=/configs/conf1
   [junit4]   2> 257463 INFO  (qtp914485561-2823) [n:127.0.0.1:42067_gu_ c:collection1 s:shard2  x:collection1_shard2_replica_t61] o.a.s.h.ReplicationHandler Commits will be reserved for 10000ms.
   [junit4]   2> 257463 INFO  (searcherExecutor-1261-thread-1-processing-n:127.0.0.1:42067_gu_ x:collection1_shard2_replica_t61 s:shard2 c:collection1) [n:127.0.0.1:42067_gu_ c:collection1 s:shard2  x:collection1_shard2_replica_t61] o.a.s.c.SolrCore [collection1_shard2_replica_t61] Registered new searcher Searcher@3b43d419[collection1_shard2_replica_t61] main{ExitableDirectoryReader(UninvertingDirectoryReader())}
   [junit4]   2> 257463 INFO  (qtp914485561-2823) [n:127.0.0.1:42067_gu_ c:collection1 s:shard2  x:collection1_shard2_replica_t61] o.a.s.u.UpdateLog Could not find max version in index or recent updates, using new clock 1587488724720025600
   [junit4]   2> 257466 INFO  (qtp914485561-2823) [n:127.0.0.1:42067_gu_ c:collection1 s:shard2  x:collection1_shard2_replica_t61] o.a.s.c.ShardLeaderElectionContext Enough replicas found to continue.
   [junit4]   2> 257466 INFO  (qtp914485561-2823) [n:127.0.0.1:42067_gu_ c:collection1 s:shard2  x:collection1_shard2_replica_t61] o.a.s.c.ShardLeaderElectionContext I may be the new leader - try and sync
   [junit4]   2> 257466 INFO  (qtp914485561-2823) [n:127.0.0.1:42067_gu_ c:collection1 s:shard2  x:collection1_shard2_replica_t61] o.a.s.c.SyncStrategy Sync replicas to http://127.0.0.1:42067/gu_/collection1_shard2_replica_t61/
   [junit4]   2> 257466 INFO  (qtp914485561-2823) [n:127.0.0.1:42067_gu_ c:collection1 s:shard2  x:collection1_shard2_replica_t61] o.a.s.c.SyncStrategy Sync Success - now sync replicas to me
   [junit4]   2> 257466 INFO  (qtp914485561-2823) [n:127.0.0.1:42067_gu_ c:collection1 s:shard2  x:collection1_shard2_replica_t61] o.a.s.c.SyncStrategy http://127.0.0.1:42067/gu_/collection1_shard2_replica_t61/ has no replicas
   [junit4]   2> 257466 INFO  (qtp914485561-2823) [n:127.0.0.1:42067_gu_ c:collection1 s:shard2  x:collection1_shard2_replica_t61] o.a.s.c.ShardLeaderElectionContext Found all replicas participating in election, clear LIR
   [junit4]   2> 257466 INFO  (qtp914485561-2823) [n:127.0.0.1:42067_gu_ c:collection1 s:shard2  x:collection1_shard2_replica_t61] o.a.s.c.ZkController collection1_shard2_replica_t61 stopping background replication from leader
   [junit4]   2> 257467 INFO  (qtp914485561-2823) [n:127.0.0.1:42067_gu_ c:collection1 s:shard2  x:collection1_shard2_replica_t61] o.a.s.c.ShardLeaderElectionContext I am the new leader: http://127.0.0.1:42067/gu_/collection1_shard2_replica_t61/ shard2
   [junit4]   2> 257617 INFO  (qtp914485561-2823) [n:127.0.0.1:42067_gu_ c:collection1 s:shard2  x:collection1_shard2_replica_t61] o.a.s.c.ZkController I am the leader, no recovery necessary
   [junit4]   2> 257620 INFO  (qtp914485561-2823) [n:127.0.0.1:42067_gu_ c:collection1 s:shard2  x:collection1_shard2_replica_t61] o.a.s.s.HttpSolrCall [admin] webapp=null path=/admin/cores params={qt=/admin/cores&collection.configName=conf1&name=collection1_shard2_replica_t61&action=CREATE&collection=collection1&shard=shard2&wt=javabin&version=2&replicaType=TLOG} status=0 QTime=1325
   [junit4]   2> 257622 INFO  (qtp914485561-2821) [n:127.0.0.1:42067_gu_    ] o.a.s.s.HttpSolrCall [admin] webapp=null path=/admin/collections params={node=127.0.0.1:42067_gu_&action=ADDREPLICA&collection=collection1&shard=shard2&type=TLOG&wt=javabin&version=2} status=0 QTime=1330
   [junit4]   2> 257720 INFO  (TEST-ChaosMonkeyNothingIsSafeTest.test-seed#[A8F663C7CEB1A28B]) [    ] o.a.s.c.AbstractFullDistribZkTestBase create jetty 2 in directory /home/jenkins/workspace/Lucene-Solr-master-Linux/solr/build/solr-core/test/J2/temp/solr.cloud.ChaosMonkeyNothingIsSafeTest_A8F663C7CEB1A28B-001/shard-2-001 of type TLOG
   [junit4]   2> 257720 INFO  (TEST-ChaosMonkeyNothingIsSafeTest.test-seed#[A8F663C7CEB1A28B]) [    ] o.e.j.s.Server jetty-9.3.20.v20170531
   [junit4]   2> 257721 INFO  (TEST-ChaosMonkeyNothingIsSafeTest.test-seed#[A8F663C7CEB1A28B]) [    ] o.e.j.s.h.ContextHandler Started o.e.j.s.ServletContextHandler@7e9efde9{/gu_,null,AVAILABLE}
   [junit4]   2> 257722 INFO  (TEST-ChaosMonkeyNothingIsSafeTest.test-seed#[A8F663C7CEB1A28B]) [    ] o.e.j.s.AbstractConnector Started ServerConnector@14345006{HTTP/1.1,[http/1.1]}{127.0.0.1:36443}
   [junit4]   2> 257722 INFO  (TEST-ChaosMonkeyNothingIsSafeTest.test-seed#[A8F663C7CEB1A28B]) [    ] o.e.j.s.Server Started @259174ms
   [junit4]   2> 257722 INFO  (TEST-ChaosMonkeyNothingIsSafeTest.test-seed#[A8F663C7CEB1A28B]) [    ] o.a.s.c.s.e.JettySolrRunner Jetty properties: {hostContext=/gu_, solrconfig=solrconfig.xml, solr.data.dir=/home/jenkins/workspace/Lucene-Solr-master-Linux/solr/build/solr-core/test/J2/temp/solr.cloud.ChaosMonkeyNothingIsSafeTest_A8F663C7CEB1A28B-001/tempDir-001/jetty2, hostPort=36443, coreRootDirectory=/home/jenkins/workspace/Lucene-Solr-master-Linux/solr/build/solr-core/test/J2/temp/solr.cloud.ChaosMonkeyNothingIsSafeTest_A8F663C7CEB1A28B-001/shard-2-001/cores, replicaType=TLOG}
   [junit4]   2> 257722 ERROR (TEST-ChaosMonkeyNothingIsSafeTest.test-seed#[A8F663C7CEB1A28B]) [    ] o.a.s.u.StartupLoggingUtils Missing Java Option solr.log.dir. Logging may be missing or incomplete.
   [junit4]   2> 257722 INFO  (TEST-ChaosMonkeyNothingIsSafeTest.test-seed#[A8F663C7CEB1A28B]) [    ] o.a.s.s.SolrDispatchFilter  ___      _       Welcome to Apache Solr™ version 8.0.0
   [junit4]   2> 257722 INFO  (TEST-ChaosMonkeyNothingIsSafeTest.test-seed#[A8F663C7CEB1A28B]) [    ] o.a.s.s.SolrDispatchFilter / __| ___| |_ _   Starting in cloud mode on port null
   [junit4]   2> 257722 INFO  (TEST-ChaosMonkeyNothingIsSafeTest.test-seed#[A8F663C7CEB1A28B]) [    ] o.a.s.s.SolrDispatchFilter \__ \/ _ \ | '_|  Install dir: null
   [junit4]   2> 257722 INFO  (TEST-ChaosMonkeyNothingIsSafeTest.test-seed#[A8F663C7CEB1A28B]) [    ] o.a.s.s.SolrDispatchFilter |___/\___/_|_|    Start time: 2017-12-22T12:53:44.609552Z
   [junit4]   2> 257723 INFO  (zkConnectionManagerCallback-638-thread-1) [    ] o.a.s.c.c.ConnectionManager zkClient has connected
   [junit4]   2> 257723 INFO  (TEST-ChaosMonkeyNothingIsSafeTest.test-seed#[A8F663C7CEB1A28B]) [    ] o.a.s.s.SolrDispatchFilter Loading solr.xml from SolrHome (not found in ZooKeeper)
   [junit4]   2> 257723 INFO  (TEST-ChaosMonkeyNothingIsSafeTest.test-seed#[A8F663C7CEB1A28B]) [    ] o.a.s.c.SolrXmlConfig Loading container configuration from /home/jenkins/workspace/Lucene-Solr-master-Linux/solr/build/solr-core/test/J2/temp/solr.cloud.ChaosMonkeyNothingIsSafeTest_A8F663C7CEB1A28B-001/shard-2-001/solr.xml
   [junit4]   2> 257725 INFO  (TEST-ChaosMonkeyNothingIsSafeTest.test-seed#[A8F663C7CEB1A28B]) [    ] o.a.s.c.SolrXmlConfig Configuration parameter autoReplicaFailoverWorkLoopDelay is ignored
   [junit4]   2> 257725 INFO  (TEST-ChaosMonkeyNothingIsSafeTest.test-seed#[A8F663C7CEB1A28B]) [    ] o.a.s.c.SolrXmlConfig Configuration parameter autoReplicaFailoverBadNodeExpiration is ignored
   [junit4]   2> 257725 INFO  (TEST-ChaosMonkeyNothingIsSafeTest.test-seed#[A8F663C7CEB1A28B]) [    ] o.a.s.c.SolrXmlConfig MBean server found: com.sun.jmx.mbeanserver.JmxMBeanServer@350a6dd3, but no JMX reporters were configured - adding default JMX reporter.
   [junit4]   2> 257727 INFO  (TEST-ChaosMonkeyNothingIsSafeTest.test-seed#[A8F663C7CEB1A28B]) [    ] o.a.s.c.ZkContainer Zookeeper client=127.0.0.1:43883/solr
   [junit4]   2> 257727 INFO  (zkConnectionManagerCallback-642-thread-1) [    ] o.a.s.c.c.ConnectionManager zkClient has connected
   [junit4]   2> 257729 INFO  (zkConnectionManagerCallback-644-thread-1-processing-n:127.0.0.1:36443_gu_) [n:127.0.0.1:36443_gu_    ] o.a.s.c.c.ConnectionManager zkClient has connected
   [junit4]   2> 257732 INFO  (TEST-ChaosMonkeyNothingIsSafeTest.test-seed#[A8F663C7CEB1A28B]) [n:127.0.0.1:36443_gu_    ] o.a.s.c.c.ZkStateReader Updated live nodes from ZooKeeper... (0) -> (2)
   [junit4]   2> 257732 INFO  (TEST-ChaosMonkeyNothingIsSafeTest.test-seed#[A8F663C7CEB1A28B]) [n:127.0.0.1:36443_gu_    ] o.a.s.c.Overseer Overseer (id=null) closing
   [junit4]   2> 257733 INFO  (TEST-ChaosMonkeyNothingIsSafeTest.test-seed#[A8F663C7CEB1A28B]) [n:127.0.0.1:36443_gu_    ] o.a.s.c.ZkController Register node as live in ZooKeeper:/live_nodes/127.0.0.1:36443_gu_
   [junit4]   2> 257733 INFO  (zkCallback-633-thread-1-processing-n:127.0.0.1:42067_gu_) [n:127.0.0.1:42067_gu_    ] o.a.s.c.c.ZkStateReader Updated live nodes from ZooKeeper... (2) -> (3)
   [junit4]   2> 257733 INFO  (zkCallback-625-thread-1) [    ] o.a.s.c.c.ZkStateReader Updated live nodes from ZooKeeper... (2) -> (3)
   [junit4]   2> 257733 INFO  (zkCallback-615-thread-1-processing-n:127.0.0.1:44529_gu_) [n:127.0.0.1:44529_gu_    ] o.a.s.c.c.ZkStateReader Updated live nodes from ZooKeeper... (2) -> (3)
   [junit4]   2> 257734 INFO  (zkCallback-643-thread-1-processing-n:127.0.0.1:36443_gu_) [n:127.0.0.1:36443_gu_    ] o.a.s.c.c.ZkStateReader Updated live nodes from ZooKeeper... (2) -> (3)
   [junit4]   2> 257760 INFO  (TEST-ChaosMonkeyNothingIsSafeTest.test-seed#[A8F663C7CEB1A28B]) [n:127.0.0.1:36443_gu_    ] o.a.s.m.r.SolrJmxReporter JMX monitoring for 'solr.node' (registry 'solr.node') enabled at server: com.sun.jmx.mbeanserver.JmxMBeanServer@350a6dd3
   [junit4]   2> 257766 INFO  (TEST-ChaosMonkeyNothingIsSafeTest.test-seed#[A8F663C7CEB1A28B]) [n:127.0.0.1:36443_gu_    ] o.a.s.m.r.SolrJmxReporter JMX monitoring for 'solr.jvm' (registry 'solr.jvm') enabled at server: com.sun.jmx.mbeanserver.JmxMBeanServer@350a6dd3
   [junit4]   2> 257766 INFO  (TEST-ChaosMonkeyNothingIsSafeTest.test-seed#[A8F663C7CEB1A28B]) [n:127.0.0.1:36443_gu_    ] o.a.s.m.r.SolrJmxReporter JMX monitoring for 'solr.jetty' (registry 'solr.jetty') enabled at server: com.sun.jmx.mbeanserver.JmxMBeanServer@350a6dd3
   [junit4]   2> 257767 INFO  (TEST-ChaosMonkeyNothingIsSafeTest.test-seed#[A8F663C7CEB1A28B]) [n:127.0.0.1:36443_gu_    ] o.a.s.c.CorePropertiesLocator Found 0 core definitions underneath /home/jenkins/workspace/Lucene-Solr-master-Linux/solr/build/solr-core/test/J2/temp/solr.cloud.ChaosMonkeyNothingIsSafeTest_A8F663C7CEB1A28B-001/shard-2-001/cores
   [junit4]   2> 257785 INFO  (qtp41929092-2852) [n:127.0.0.1:36443_gu_    ] o.a.s.h.a.CollectionsHandler Invoked Collection Action :addreplica with params node=127.0.0.1:36443_gu_&action=ADDREPLICA&collection=collection1&shard=shard3&type=TLOG&wt=javabin&version=2 and sendToOCPQueue=true
   [junit4]   2> 257786 INFO  (OverseerCollectionConfigSetProcessor-99218045018046468-127.0.0.1:44529_gu_-n_0000000000) [n:127.0.0.1:44529_gu_    ] o.a.s.c.OverseerTaskQueue Response ZK path: /overseer/collection-queue-work/qnr-0000000004 doesn't exist.  Requestor may have disconnected from ZooKeeper
   [junit4]   2> 257786 INFO  (OverseerThreadFactory-1247-thread-4-processing-n:127.0.0.1:44529_gu_) [n:127.0.0.1:44529_gu_    ] o.a.s.c.AddReplicaCmd Node Identified 127.0.0.1:36443_gu_ for creating new replica
   [junit4]   2> 257788 INFO  (qtp41929092-2854) [n:127.0.0.1:36443_gu_    ] o.a.s.h.a.CoreAdminOperation core create command qt=/admin/cores&collection.configName=conf1&name=collection1_shard3_replica_t63&action=CREATE&collection=collection1&shard=shard3&wt=javabin&version=2&replicaType=TLOG
   [junit4]   2> 257788 INFO  (qtp41929092-2854) [n:127.0.0.1:36443_gu_    ] o.a.s.c.TransientSolrCoreCacheDefault Allocating transient cache for 4 transient cores
   [junit4]   2> 258835 INFO  (qtp41929092-2854) [n:127.0.0.1:36443_gu_ c:collection1 s:shard3  x:collection1_shard3_replica_t63] o.a.s.c.SolrConfig Using Lucene MatchVersion: 8.0.0
   [junit4]   2> 258848 INFO  (qtp41929092-2854) [n:127.0.0.1:36443_gu_ c:collection1 s:shard3  x:collection1_shard3_replica_t63] o.a.s.s.IndexSchema [collection1_shard3_replica_t63] Schema name=test
   [junit4]   2> 258896 INFO  (qtp41929092-2854) [n:127.0.0.1:36443_gu_ c:collection1 s:shard3  x:collection1_shard3_replica_t63] o.a.s.s.IndexSchema Loaded schema test/1.6 with uniqueid field id
   [junit4]   2> 258902 INFO  (qtp41929092-2854) [n:127.0.0.1:36443_gu_ c:collection1 s:shard3  x:collection1_shard3_replica_t63] o.a.s.c.CoreContainer Creating SolrCore 'collection1_shard3_replica_t63' using configuration from collection collection1, trusted=true
   [junit4]   2> 258903 INFO  (qtp41929092-2854) [n:127.0.0.1:36443_gu_ c:collection1 s:shard3  x:collection1_shard3_replica_t63] o.a.s

[...truncated too long message...]

Handler.handleRequestBody(CoreAdminHandler.java:174)
   [junit4]   2> 	at org.apache.solr.handler.RequestHandlerBase.handleRequest(RequestHandlerBase.java:177)
   [junit4]   2> 	at org.apache.solr.servlet.HttpSolrCall.handleAdmin(HttpSolrCall.java:736)
   [junit4]   2> 	at org.apache.solr.servlet.HttpSolrCall.handleAdminRequest(HttpSolrCall.java:717)
   [junit4]   2> 	at org.apache.solr.servlet.HttpSolrCall.call(HttpSolrCall.java:498)
   [junit4]   2> 	at org.apache.solr.servlet.SolrDispatchFilter.doFilter(SolrDispatchFilter.java:382)
   [junit4]   2> 	at org.apache.solr.servlet.SolrDispatchFilter.doFilter(SolrDispatchFilter.java:326)
   [junit4]   2> 	at org.eclipse.jetty.servlet.ServletHandler$CachedChain.doFilter(ServletHandler.java:1759)
   [junit4]   2> 	at org.apache.solr.client.solrj.embedded.JettySolrRunner$DebugFilter.doFilter(JettySolrRunner.java:139)
   [junit4]   2> 	at org.eclipse.jetty.servlet.ServletHandler$CachedChain.doFilter(ServletHandler.java:1759)
   [junit4]   2> 	at org.eclipse.jetty.servlet.ServletHandler.doHandle(ServletHandler.java:582)
   [junit4]   2> 	at org.eclipse.jetty.server.session.SessionHandler.doHandle(SessionHandler.java:224)
   [junit4]   2> 	at org.eclipse.jetty.server.handler.ContextHandler.doHandle(ContextHandler.java:1180)
   [junit4]   2> 	at org.eclipse.jetty.servlet.ServletHandler.doScope(ServletHandler.java:512)
   [junit4]   2> 	at org.eclipse.jetty.server.session.SessionHandler.doScope(SessionHandler.java:185)
   [junit4]   2> 	at org.eclipse.jetty.server.handler.ContextHandler.doScope(ContextHandler.java:1112)
   [junit4]   2> 	at org.eclipse.jetty.server.handler.ScopedHandler.handle(ScopedHandler.java:141)
   [junit4]   2> 	at org.eclipse.jetty.server.handler.gzip.GzipHandler.handle(GzipHandler.java:426)
   [junit4]   2> 	at org.eclipse.jetty.server.handler.HandlerWrapper.handle(HandlerWrapper.java:134)
   [junit4]   2> 	at org.eclipse.jetty.server.Server.handle(Server.java:534)
   [junit4]   2> 	at org.eclipse.jetty.server.HttpChannel.handle(HttpChannel.java:320)
   [junit4]   2> 	at org.eclipse.jetty.server.HttpConnection.onFillable(HttpConnection.java:251)
   [junit4]   2> 	at org.eclipse.jetty.io.AbstractConnection$ReadCallback.succeeded(AbstractConnection.java:283)
   [junit4]   2> 	at org.eclipse.jetty.io.FillInterest.fillable(FillInterest.java:108)
   [junit4]   2> 	at org.eclipse.jetty.io.ssl.SslConnection.onFillable(SslConnection.java:251)
   [junit4]   2> 	at org.eclipse.jetty.io.AbstractConnection$ReadCallback.succeeded(AbstractConnection.java:283)
   [junit4]   2> 	at org.eclipse.jetty.io.FillInterest.fillable(FillInterest.java:108)
   [junit4]   2> 	at org.eclipse.jetty.io.SelectChannelEndPoint$2.run(SelectChannelEndPoint.java:93)
   [junit4]   2> 	at org.eclipse.jetty.util.thread.strategy.ExecuteProduceConsume.executeProduceConsume(ExecuteProduceConsume.java:303)
   [junit4]   2> 	at org.eclipse.jetty.util.thread.strategy.ExecuteProduceConsume.produceConsume(ExecuteProduceConsume.java:148)
   [junit4]   2> 	at org.eclipse.jetty.util.thread.strategy.ExecuteProduceConsume.run(ExecuteProduceConsume.java:136)
   [junit4]   2> 	at org.eclipse.jetty.util.thread.QueuedThreadPool.runJob(QueuedThreadPool.java:671)
   [junit4]   2> 	at org.eclipse.jetty.util.thread.QueuedThreadPool$2.run(QueuedThreadPool.java:589)
   [junit4]   2> 	at java.base/java.lang.Thread.run(Thread.java:844)
   [junit4]   2> Caused by: org.apache.solr.common.SolrException: No registered leader was found after waiting for 1220000ms , collection: .system slice: shard1 saw state=null with live_nodes=[]
   [junit4]   2> 	at org.apache.solr.common.cloud.ZkStateReader.getLeaderRetry(ZkStateReader.java:771)
   [junit4]   2> 	at org.apache.solr.common.cloud.ZkStateReader.getLeaderUrl(ZkStateReader.java:736)
   [junit4]   2> 	at org.apache.solr.cloud.ZkController.getLeader(ZkController.java:1178)
   [junit4]   2> 	... 44 more
   [junit4]   2> 
   [junit4]   2> 691971 INFO  (qtp1870289826-4512) [n:127.0.0.1:43687_solr c:.system s:shard1 r:core_node5 x:.system_shard1_replica_n2] o.a.s.s.HttpSolrCall [admin] webapp=null path=/admin/cores params={qt=/admin/cores&coreNodeName=core_node5&collection.configName=.system&newCollection=true&name=.system_shard1_replica_n2&action=CREATE&numShards=1&collection=.system&shard=shard1&wt=javabin&version=2&replicaType=NRT} status=0 QTime=209773
   [junit4]   2> 691972 ERROR (SUITE-SystemLogListenerTest-seed#[A8F663C7CEB1A28B]-worker) [    ] o.a.z.s.ZooKeeperServer ZKShutdownHandler is not registered, so ZooKeeper server won't take any action on ERROR or SHUTDOWN server state changes
   [junit4]   2> 691972 INFO  (SUITE-SystemLogListenerTest-seed#[A8F663C7CEB1A28B]-worker) [    ] o.a.s.c.ZkTestServer connecting to 127.0.0.1:45865 45865
   [junit4]   2> 697084 INFO  (Thread-801) [    ] o.a.s.c.ZkTestServer connecting to 127.0.0.1:45865 45865
   [junit4]   2> 697085 WARN  (Thread-801) [    ] o.a.s.c.ZkTestServer Watch limit violations: 
   [junit4]   2> Maximum concurrent create/delete watches above limit:
   [junit4]   2> 
   [junit4]   2> 	4	/solr/aliases.json
   [junit4]   2> 	3	/solr/configs/.system
   [junit4]   2> 	3	/solr/security.json
   [junit4]   2> 	3	/solr/configs/.system/managed-schema
   [junit4]   2> 
   [junit4]   2> Maximum concurrent data watches above limit:
   [junit4]   2> 
   [junit4]   2> 	9	/solr/collections/.system/state.json
   [junit4]   2> 	4	/solr/clusterstate.json
   [junit4]   2> 	4	/solr/clusterprops.json
   [junit4]   2> 	2	/solr/overseer_elect/election/99218060000493575-127.0.0.1:43687_solr-n_0000000000
   [junit4]   2> 
   [junit4]   2> Maximum concurrent children watches above limit:
   [junit4]   2> 
   [junit4]   2> 	4	/solr/live_nodes
   [junit4]   2> 	4	/solr/collections
   [junit4]   2> 
   [junit4]   2> 697085 INFO  (SUITE-SystemLogListenerTest-seed#[A8F663C7CEB1A28B]-worker) [    ] o.a.s.SolrTestCaseJ4 ------------------------------------------------------- Done waiting for tracked resources to be released
   [junit4]   2> NOTE: test params are: codec=Asserting(Lucene70), sim=Asserting(org.apache.lucene.search.similarities.AssertingSimilarity@73e2ff6b), locale=pa-Arab, timezone=Europe/Moscow
   [junit4]   2> NOTE: Linux 4.10.0-40-generic amd64/Oracle Corporation 9.0.1 (64-bit)/cpus=8,threads=1,free=95552640,total=518979584
   [junit4]   2> NOTE: All tests run in this JVM: [DistributedFacetPivotSmallAdvancedTest, TestReloadAndDeleteDocs, SaslZkACLProviderTest, CollectionTooManyReplicasTest, TestLazyCores, TestSolrCloudWithDelegationTokens, ParsingFieldUpdateProcessorsTest, TestHighFrequencyDictionaryFactory, TestCustomStream, PreAnalyzedFieldManagedSchemaCloudTest, TestGraphMLResponseWriter, TestXIncludeConfig, TestCustomDocTransformer, SubstringBytesRefFilterTest, TestInPlaceUpdatesStandalone, BigEndianAscendingWordSerializerTest, TestBackupRepositoryFactory, DeleteLastCustomShardedReplicaTest, TestApiFramework, TestPayloadCheckQParserPlugin, UtilsToolTest, LeaderInitiatedRecoveryOnShardRestartTest, TestTlogReplica, SOLR749Test, TestRemoteStreaming, TestLocalFSCloudBackupRestore, FullHLLTest, TestBulkSchemaConcurrent, TestFaceting, LeaderFailoverAfterPartitionTest, TestCollapseQParserPlugin, ConcurrentDeleteAndCreateCollectionTest, SuggestComponentTest, CdcrReplicationHandlerTest, SolrRequestParserTest, DirectUpdateHandlerTest, TestSchemaSimilarityResource, HdfsUnloadDistributedZkTest, TestStreamBody, PathHierarchyTokenizerFactoryTest, SolrCmdDistributorTest, CollectionsAPIDistributedZkTest, TestUseDocValuesAsStored2, TestSimDistributedQueue, DistributedTermsComponentTest, SystemLogListenerTest]
   [junit4]   2> NOTE: reproduce with: ant test  -Dtestcase=SystemLogListenerTest -Dtests.seed=A8F663C7CEB1A28B -Dtests.multiplier=3 -Dtests.slow=true -Dtests.locale=pa-Arab -Dtests.timezone=Europe/Moscow -Dtests.asserts=true -Dtests.file.encoding=UTF-8
   [junit4] ERROR   0.00s J1 | SystemLogListenerTest (suite) <<<
   [junit4]    > Throwable #1: org.apache.solr.client.solrj.impl.HttpSolrClient$RemoteSolrException: Error from server at https://127.0.0.1:43687/solr: create the collection time out:180s
   [junit4]    > 	at __randomizedtesting.SeedInfo.seed([A8F663C7CEB1A28B]:0)
   [junit4]    > 	at org.apache.solr.client.solrj.impl.HttpSolrClient.executeMethod(HttpSolrClient.java:643)
   [junit4]    > 	at org.apache.solr.client.solrj.impl.HttpSolrClient.request(HttpSolrClient.java:255)
   [junit4]    > 	at org.apache.solr.client.solrj.impl.HttpSolrClient.request(HttpSolrClient.java:244)
   [junit4]    > 	at org.apache.solr.client.solrj.impl.LBHttpSolrClient.doRequest(LBHttpSolrClient.java:483)
   [junit4]    > 	at org.apache.solr.client.solrj.impl.LBHttpSolrClient.request(LBHttpSolrClient.java:413)
   [junit4]    > 	at org.apache.solr.client.solrj.impl.CloudSolrClient.sendRequest(CloudSolrClient.java:1104)
   [junit4]    > 	at org.apache.solr.client.solrj.impl.CloudSolrClient.requestWithRetryOnStaleState(CloudSolrClient.java:884)
   [junit4]    > 	at org.apache.solr.client.solrj.impl.CloudSolrClient.request(CloudSolrClient.java:817)
   [junit4]    > 	at org.apache.solr.client.solrj.SolrRequest.process(SolrRequest.java:194)
   [junit4]    > 	at org.apache.solr.client.solrj.SolrRequest.process(SolrRequest.java:211)
   [junit4]    > 	at org.apache.solr.cloud.autoscaling.SystemLogListenerTest.setupCluster(SystemLogListenerTest.java:84)
   [junit4]    > 	at java.base/jdk.internal.reflect.NativeMethodAccessorImpl.invoke0(Native Method)
   [junit4]    > 	at java.base/jdk.internal.reflect.NativeMethodAccessorImpl.invoke(NativeMethodAccessorImpl.java:62)
   [junit4]    > 	at java.base/jdk.internal.reflect.DelegatingMethodAccessorImpl.invoke(DelegatingMethodAccessorImpl.java:43)
   [junit4]    > 	at java.base/java.lang.reflect.Method.invoke(Method.java:564)
   [junit4]    > 	at java.base/java.lang.Thread.run(Thread.java:844)
   [junit4] Completed [558/764 (2!)] on J1 in 215.53s, 0 tests, 1 error <<< FAILURES!

[...truncated 41434 lines...]

Mime
View raw message