lucene-dev mailing list archives

Site index · List index
Message view « Date » · « Thread »
Top « Date » · « Thread »
From Policeman Jenkins Server <jenk...@thetaphi.de>
Subject [JENKINS] Lucene-Solr-master-Windows (32bit/jdk1.8.0_144) - Build # 7061 - Still Unstable!
Date Mon, 18 Dec 2017 19:51:31 GMT
Build: https://jenkins.thetaphi.de/job/Lucene-Solr-master-Windows/7061/
Java: 32bit/jdk1.8.0_144 -server -XX:+UseParallelGC

8 tests failed.
FAILED:  junit.framework.TestSuite.org.apache.lucene.index.TestBackwardsCompatibility

Error Message:
Could not remove the following files (in the order of attempts):    C:\Users\jenkins\workspace\Lucene-Solr-master-Windows\lucene\build\backward-codecs\test\J0\temp\lucene.index.TestBackwardsCompatibility_E0154F654AF646BE-001\3.0.0-nocfs-001: java.nio.file.DirectoryNotEmptyException: C:\Users\jenkins\workspace\Lucene-Solr-master-Windows\lucene\build\backward-codecs\test\J0\temp\lucene.index.TestBackwardsCompatibility_E0154F654AF646BE-001\3.0.0-nocfs-001 

Stack Trace:
java.io.IOException: Could not remove the following files (in the order of attempts):
   C:\Users\jenkins\workspace\Lucene-Solr-master-Windows\lucene\build\backward-codecs\test\J0\temp\lucene.index.TestBackwardsCompatibility_E0154F654AF646BE-001\3.0.0-nocfs-001: java.nio.file.DirectoryNotEmptyException: C:\Users\jenkins\workspace\Lucene-Solr-master-Windows\lucene\build\backward-codecs\test\J0\temp\lucene.index.TestBackwardsCompatibility_E0154F654AF646BE-001\3.0.0-nocfs-001

	at __randomizedtesting.SeedInfo.seed([E0154F654AF646BE]:0)
	at org.apache.lucene.util.IOUtils.rm(IOUtils.java:329)
	at org.apache.lucene.util.TestRuleTemporaryFilesCleanup.afterAlways(TestRuleTemporaryFilesCleanup.java:216)
	at com.carrotsearch.randomizedtesting.rules.TestRuleAdapter$1.afterAlways(TestRuleAdapter.java:31)
	at com.carrotsearch.randomizedtesting.rules.StatementAdapter.evaluate(StatementAdapter.java:43)
	at com.carrotsearch.randomizedtesting.rules.StatementAdapter.evaluate(StatementAdapter.java:36)
	at org.apache.lucene.util.TestRuleAssertionsRequired$1.evaluate(TestRuleAssertionsRequired.java:53)
	at org.apache.lucene.util.TestRuleMarkFailure$1.evaluate(TestRuleMarkFailure.java:47)
	at org.apache.lucene.util.TestRuleIgnoreAfterMaxFailures$1.evaluate(TestRuleIgnoreAfterMaxFailures.java:64)
	at org.apache.lucene.util.TestRuleIgnoreTestSuites$1.evaluate(TestRuleIgnoreTestSuites.java:54)
	at com.carrotsearch.randomizedtesting.rules.StatementAdapter.evaluate(StatementAdapter.java:36)
	at com.carrotsearch.randomizedtesting.ThreadLeakControl$StatementRunner.run(ThreadLeakControl.java:368)
	at java.lang.Thread.run(Thread.java:748)


FAILED:  org.apache.lucene.queryparser.xml.TestCorePlusExtensionsParser.testBoostingQueryXML

Error Message:
No QueryObjectBuilder defined for node BoostingQuery

Stack Trace:
org.apache.lucene.queryparser.xml.ParserException: No QueryObjectBuilder defined for node BoostingQuery
	at __randomizedtesting.SeedInfo.seed([470DFFE88EB93E6D:B7E67B46214C5A73]:0)
	at org.apache.lucene.queryparser.xml.QueryBuilderFactory.getQuery(QueryBuilderFactory.java:35)
	at org.apache.lucene.queryparser.xml.CoreParser.getQuery(CoreParser.java:190)
	at org.apache.lucene.queryparser.xml.CoreParser.parse(CoreParser.java:125)
	at org.apache.lucene.queryparser.xml.TestCoreParser.implParse(TestCoreParser.java:240)
	at org.apache.lucene.queryparser.xml.TestCoreParser.parse(TestCoreParser.java:227)
	at org.apache.lucene.queryparser.xml.TestCorePlusQueriesParser.testBoostingQueryXML(TestCorePlusQueriesParser.java:35)
	at sun.reflect.NativeMethodAccessorImpl.invoke0(Native Method)
	at sun.reflect.NativeMethodAccessorImpl.invoke(NativeMethodAccessorImpl.java:62)
	at sun.reflect.DelegatingMethodAccessorImpl.invoke(DelegatingMethodAccessorImpl.java:43)
	at java.lang.reflect.Method.invoke(Method.java:498)
	at com.carrotsearch.randomizedtesting.RandomizedRunner.invoke(RandomizedRunner.java:1737)
	at com.carrotsearch.randomizedtesting.RandomizedRunner$8.evaluate(RandomizedRunner.java:934)
	at com.carrotsearch.randomizedtesting.RandomizedRunner$9.evaluate(RandomizedRunner.java:970)
	at com.carrotsearch.randomizedtesting.RandomizedRunner$10.evaluate(RandomizedRunner.java:984)
	at org.apache.lucene.util.TestRuleSetupTeardownChained$1.evaluate(TestRuleSetupTeardownChained.java:49)
	at org.apache.lucene.util.AbstractBeforeAfterRule$1.evaluate(AbstractBeforeAfterRule.java:45)
	at org.apache.lucene.util.TestRuleThreadAndTestName$1.evaluate(TestRuleThreadAndTestName.java:48)
	at org.apache.lucene.util.TestRuleIgnoreAfterMaxFailures$1.evaluate(TestRuleIgnoreAfterMaxFailures.java:64)
	at org.apache.lucene.util.TestRuleMarkFailure$1.evaluate(TestRuleMarkFailure.java:47)
	at com.carrotsearch.randomizedtesting.rules.StatementAdapter.evaluate(StatementAdapter.java:36)
	at com.carrotsearch.randomizedtesting.ThreadLeakControl$StatementRunner.run(ThreadLeakControl.java:368)
	at com.carrotsearch.randomizedtesting.ThreadLeakControl.forkTimeoutingTask(ThreadLeakControl.java:817)
	at com.carrotsearch.randomizedtesting.ThreadLeakControl$3.evaluate(ThreadLeakControl.java:468)
	at com.carrotsearch.randomizedtesting.RandomizedRunner.runSingleTest(RandomizedRunner.java:943)
	at com.carrotsearch.randomizedtesting.RandomizedRunner$5.evaluate(RandomizedRunner.java:829)
	at com.carrotsearch.randomizedtesting.RandomizedRunner$6.evaluate(RandomizedRunner.java:879)
	at com.carrotsearch.randomizedtesting.RandomizedRunner$7.evaluate(RandomizedRunner.java:890)
	at org.apache.lucene.util.AbstractBeforeAfterRule$1.evaluate(AbstractBeforeAfterRule.java:45)
	at com.carrotsearch.randomizedtesting.rules.StatementAdapter.evaluate(StatementAdapter.java:36)
	at org.apache.lucene.util.TestRuleStoreClassName$1.evaluate(TestRuleStoreClassName.java:41)
	at com.carrotsearch.randomizedtesting.rules.NoShadowingOrOverridesOnMethodsRule$1.evaluate(NoShadowingOrOverridesOnMethodsRule.java:40)
	at com.carrotsearch.randomizedtesting.rules.NoShadowingOrOverridesOnMethodsRule$1.evaluate(NoShadowingOrOverridesOnMethodsRule.java:40)
	at com.carrotsearch.randomizedtesting.rules.StatementAdapter.evaluate(StatementAdapter.java:36)
	at com.carrotsearch.randomizedtesting.rules.StatementAdapter.evaluate(StatementAdapter.java:36)
	at com.carrotsearch.randomizedtesting.rules.StatementAdapter.evaluate(StatementAdapter.java:36)
	at org.apache.lucene.util.TestRuleAssertionsRequired$1.evaluate(TestRuleAssertionsRequired.java:53)
	at org.apache.lucene.util.TestRuleMarkFailure$1.evaluate(TestRuleMarkFailure.java:47)
	at org.apache.lucene.util.TestRuleIgnoreAfterMaxFailures$1.evaluate(TestRuleIgnoreAfterMaxFailures.java:64)
	at org.apache.lucene.util.TestRuleIgnoreTestSuites$1.evaluate(TestRuleIgnoreTestSuites.java:54)
	at com.carrotsearch.randomizedtesting.rules.StatementAdapter.evaluate(StatementAdapter.java:36)
	at com.carrotsearch.randomizedtesting.ThreadLeakControl$StatementRunner.run(ThreadLeakControl.java:368)
	at java.lang.Thread.run(Thread.java:748)


FAILED:  org.apache.lucene.queryparser.xml.TestCorePlusQueriesParser.testBoostingQueryXML

Error Message:
No QueryObjectBuilder defined for node BoostingQuery

Stack Trace:
org.apache.lucene.queryparser.xml.ParserException: No QueryObjectBuilder defined for node BoostingQuery
	at __randomizedtesting.SeedInfo.seed([470DFFE88EB93E6D:B7E67B46214C5A73]:0)
	at org.apache.lucene.queryparser.xml.QueryBuilderFactory.getQuery(QueryBuilderFactory.java:35)
	at org.apache.lucene.queryparser.xml.CoreParser.getQuery(CoreParser.java:190)
	at org.apache.lucene.queryparser.xml.CoreParser.parse(CoreParser.java:125)
	at org.apache.lucene.queryparser.xml.TestCoreParser.implParse(TestCoreParser.java:240)
	at org.apache.lucene.queryparser.xml.TestCoreParser.parse(TestCoreParser.java:227)
	at org.apache.lucene.queryparser.xml.TestCorePlusQueriesParser.testBoostingQueryXML(TestCorePlusQueriesParser.java:35)
	at sun.reflect.NativeMethodAccessorImpl.invoke0(Native Method)
	at sun.reflect.NativeMethodAccessorImpl.invoke(NativeMethodAccessorImpl.java:62)
	at sun.reflect.DelegatingMethodAccessorImpl.invoke(DelegatingMethodAccessorImpl.java:43)
	at java.lang.reflect.Method.invoke(Method.java:498)
	at com.carrotsearch.randomizedtesting.RandomizedRunner.invoke(RandomizedRunner.java:1737)
	at com.carrotsearch.randomizedtesting.RandomizedRunner$8.evaluate(RandomizedRunner.java:934)
	at com.carrotsearch.randomizedtesting.RandomizedRunner$9.evaluate(RandomizedRunner.java:970)
	at com.carrotsearch.randomizedtesting.RandomizedRunner$10.evaluate(RandomizedRunner.java:984)
	at org.apache.lucene.util.TestRuleSetupTeardownChained$1.evaluate(TestRuleSetupTeardownChained.java:49)
	at org.apache.lucene.util.AbstractBeforeAfterRule$1.evaluate(AbstractBeforeAfterRule.java:45)
	at org.apache.lucene.util.TestRuleThreadAndTestName$1.evaluate(TestRuleThreadAndTestName.java:48)
	at org.apache.lucene.util.TestRuleIgnoreAfterMaxFailures$1.evaluate(TestRuleIgnoreAfterMaxFailures.java:64)
	at org.apache.lucene.util.TestRuleMarkFailure$1.evaluate(TestRuleMarkFailure.java:47)
	at com.carrotsearch.randomizedtesting.rules.StatementAdapter.evaluate(StatementAdapter.java:36)
	at com.carrotsearch.randomizedtesting.ThreadLeakControl$StatementRunner.run(ThreadLeakControl.java:368)
	at com.carrotsearch.randomizedtesting.ThreadLeakControl.forkTimeoutingTask(ThreadLeakControl.java:817)
	at com.carrotsearch.randomizedtesting.ThreadLeakControl$3.evaluate(ThreadLeakControl.java:468)
	at com.carrotsearch.randomizedtesting.RandomizedRunner.runSingleTest(RandomizedRunner.java:943)
	at com.carrotsearch.randomizedtesting.RandomizedRunner$5.evaluate(RandomizedRunner.java:829)
	at com.carrotsearch.randomizedtesting.RandomizedRunner$6.evaluate(RandomizedRunner.java:879)
	at com.carrotsearch.randomizedtesting.RandomizedRunner$7.evaluate(RandomizedRunner.java:890)
	at org.apache.lucene.util.AbstractBeforeAfterRule$1.evaluate(AbstractBeforeAfterRule.java:45)
	at com.carrotsearch.randomizedtesting.rules.StatementAdapter.evaluate(StatementAdapter.java:36)
	at org.apache.lucene.util.TestRuleStoreClassName$1.evaluate(TestRuleStoreClassName.java:41)
	at com.carrotsearch.randomizedtesting.rules.NoShadowingOrOverridesOnMethodsRule$1.evaluate(NoShadowingOrOverridesOnMethodsRule.java:40)
	at com.carrotsearch.randomizedtesting.rules.NoShadowingOrOverridesOnMethodsRule$1.evaluate(NoShadowingOrOverridesOnMethodsRule.java:40)
	at com.carrotsearch.randomizedtesting.rules.StatementAdapter.evaluate(StatementAdapter.java:36)
	at com.carrotsearch.randomizedtesting.rules.StatementAdapter.evaluate(StatementAdapter.java:36)
	at com.carrotsearch.randomizedtesting.rules.StatementAdapter.evaluate(StatementAdapter.java:36)
	at org.apache.lucene.util.TestRuleAssertionsRequired$1.evaluate(TestRuleAssertionsRequired.java:53)
	at org.apache.lucene.util.TestRuleMarkFailure$1.evaluate(TestRuleMarkFailure.java:47)
	at org.apache.lucene.util.TestRuleIgnoreAfterMaxFailures$1.evaluate(TestRuleIgnoreAfterMaxFailures.java:64)
	at org.apache.lucene.util.TestRuleIgnoreTestSuites$1.evaluate(TestRuleIgnoreTestSuites.java:54)
	at com.carrotsearch.randomizedtesting.rules.StatementAdapter.evaluate(StatementAdapter.java:36)
	at com.carrotsearch.randomizedtesting.ThreadLeakControl$StatementRunner.run(ThreadLeakControl.java:368)
	at java.lang.Thread.run(Thread.java:748)


FAILED:  org.apache.solr.handler.dataimport.TestSolrEntityProcessorEndToEnd.testFullImportInnerEntity

Error Message:
Could not remove the following files (in the order of attempts):    C:\Users\jenkins\workspace\Lucene-Solr-master-Windows\solr\build\contrib\solr-dataimporthandler\test\J0\temp\solr.handler.dataimport.TestSolrEntityProcessorEndToEnd_FFE1AC9E2D4DB3FA-001\tempDir-003\collection1\data\index: java.nio.file.DirectoryNotEmptyException: C:\Users\jenkins\workspace\Lucene-Solr-master-Windows\solr\build\contrib\solr-dataimporthandler\test\J0\temp\solr.handler.dataimport.TestSolrEntityProcessorEndToEnd_FFE1AC9E2D4DB3FA-001\tempDir-003\collection1\data\index    C:\Users\jenkins\workspace\Lucene-Solr-master-Windows\solr\build\contrib\solr-dataimporthandler\test\J0\temp\solr.handler.dataimport.TestSolrEntityProcessorEndToEnd_FFE1AC9E2D4DB3FA-001\tempDir-003\collection1\data: java.nio.file.DirectoryNotEmptyException: C:\Users\jenkins\workspace\Lucene-Solr-master-Windows\solr\build\contrib\solr-dataimporthandler\test\J0\temp\solr.handler.dataimport.TestSolrEntityProcessorEndToEnd_FFE1AC9E2D4DB3FA-001\tempDir-003\collection1\data    C:\Users\jenkins\workspace\Lucene-Solr-master-Windows\solr\build\contrib\solr-dataimporthandler\test\J0\temp\solr.handler.dataimport.TestSolrEntityProcessorEndToEnd_FFE1AC9E2D4DB3FA-001\tempDir-003\collection1: java.nio.file.DirectoryNotEmptyException: C:\Users\jenkins\workspace\Lucene-Solr-master-Windows\solr\build\contrib\solr-dataimporthandler\test\J0\temp\solr.handler.dataimport.TestSolrEntityProcessorEndToEnd_FFE1AC9E2D4DB3FA-001\tempDir-003\collection1    C:\Users\jenkins\workspace\Lucene-Solr-master-Windows\solr\build\contrib\solr-dataimporthandler\test\J0\temp\solr.handler.dataimport.TestSolrEntityProcessorEndToEnd_FFE1AC9E2D4DB3FA-001\tempDir-003: java.nio.file.DirectoryNotEmptyException: C:\Users\jenkins\workspace\Lucene-Solr-master-Windows\solr\build\contrib\solr-dataimporthandler\test\J0\temp\solr.handler.dataimport.TestSolrEntityProcessorEndToEnd_FFE1AC9E2D4DB3FA-001\tempDir-003 

Stack Trace:
java.io.IOException: Could not remove the following files (in the order of attempts):
   C:\Users\jenkins\workspace\Lucene-Solr-master-Windows\solr\build\contrib\solr-dataimporthandler\test\J0\temp\solr.handler.dataimport.TestSolrEntityProcessorEndToEnd_FFE1AC9E2D4DB3FA-001\tempDir-003\collection1\data\index: java.nio.file.DirectoryNotEmptyException: C:\Users\jenkins\workspace\Lucene-Solr-master-Windows\solr\build\contrib\solr-dataimporthandler\test\J0\temp\solr.handler.dataimport.TestSolrEntityProcessorEndToEnd_FFE1AC9E2D4DB3FA-001\tempDir-003\collection1\data\index
   C:\Users\jenkins\workspace\Lucene-Solr-master-Windows\solr\build\contrib\solr-dataimporthandler\test\J0\temp\solr.handler.dataimport.TestSolrEntityProcessorEndToEnd_FFE1AC9E2D4DB3FA-001\tempDir-003\collection1\data: java.nio.file.DirectoryNotEmptyException: C:\Users\jenkins\workspace\Lucene-Solr-master-Windows\solr\build\contrib\solr-dataimporthandler\test\J0\temp\solr.handler.dataimport.TestSolrEntityProcessorEndToEnd_FFE1AC9E2D4DB3FA-001\tempDir-003\collection1\data
   C:\Users\jenkins\workspace\Lucene-Solr-master-Windows\solr\build\contrib\solr-dataimporthandler\test\J0\temp\solr.handler.dataimport.TestSolrEntityProcessorEndToEnd_FFE1AC9E2D4DB3FA-001\tempDir-003\collection1: java.nio.file.DirectoryNotEmptyException: C:\Users\jenkins\workspace\Lucene-Solr-master-Windows\solr\build\contrib\solr-dataimporthandler\test\J0\temp\solr.handler.dataimport.TestSolrEntityProcessorEndToEnd_FFE1AC9E2D4DB3FA-001\tempDir-003\collection1
   C:\Users\jenkins\workspace\Lucene-Solr-master-Windows\solr\build\contrib\solr-dataimporthandler\test\J0\temp\solr.handler.dataimport.TestSolrEntityProcessorEndToEnd_FFE1AC9E2D4DB3FA-001\tempDir-003: java.nio.file.DirectoryNotEmptyException: C:\Users\jenkins\workspace\Lucene-Solr-master-Windows\solr\build\contrib\solr-dataimporthandler\test\J0\temp\solr.handler.dataimport.TestSolrEntityProcessorEndToEnd_FFE1AC9E2D4DB3FA-001\tempDir-003

	at __randomizedtesting.SeedInfo.seed([FFE1AC9E2D4DB3FA:E96002B8C2EC06D]:0)
	at org.apache.lucene.util.IOUtils.rm(IOUtils.java:329)
	at org.apache.solr.handler.dataimport.TestSolrEntityProcessorEndToEnd$SolrInstance.tearDown(TestSolrEntityProcessorEndToEnd.java:360)
	at org.apache.solr.handler.dataimport.TestSolrEntityProcessorEndToEnd.tearDown(TestSolrEntityProcessorEndToEnd.java:142)
	at sun.reflect.NativeMethodAccessorImpl.invoke0(Native Method)
	at sun.reflect.NativeMethodAccessorImpl.invoke(NativeMethodAccessorImpl.java:62)
	at sun.reflect.DelegatingMethodAccessorImpl.invoke(DelegatingMethodAccessorImpl.java:43)
	at java.lang.reflect.Method.invoke(Method.java:498)
	at com.carrotsearch.randomizedtesting.RandomizedRunner.invoke(RandomizedRunner.java:1737)
	at com.carrotsearch.randomizedtesting.RandomizedRunner$10.evaluate(RandomizedRunner.java:992)
	at com.carrotsearch.randomizedtesting.rules.SystemPropertiesRestoreRule$1.evaluate(SystemPropertiesRestoreRule.java:57)
	at org.apache.lucene.util.TestRuleSetupTeardownChained$1.evaluate(TestRuleSetupTeardownChained.java:49)
	at org.apache.lucene.util.AbstractBeforeAfterRule$1.evaluate(AbstractBeforeAfterRule.java:45)
	at org.apache.lucene.util.TestRuleThreadAndTestName$1.evaluate(TestRuleThreadAndTestName.java:48)
	at org.apache.lucene.util.TestRuleIgnoreAfterMaxFailures$1.evaluate(TestRuleIgnoreAfterMaxFailures.java:64)
	at org.apache.lucene.util.TestRuleMarkFailure$1.evaluate(TestRuleMarkFailure.java:47)
	at com.carrotsearch.randomizedtesting.rules.StatementAdapter.evaluate(StatementAdapter.java:36)
	at com.carrotsearch.randomizedtesting.ThreadLeakControl$StatementRunner.run(ThreadLeakControl.java:368)
	at com.carrotsearch.randomizedtesting.ThreadLeakControl.forkTimeoutingTask(ThreadLeakControl.java:817)
	at com.carrotsearch.randomizedtesting.ThreadLeakControl$3.evaluate(ThreadLeakControl.java:468)
	at com.carrotsearch.randomizedtesting.RandomizedRunner.runSingleTest(RandomizedRunner.java:943)
	at com.carrotsearch.randomizedtesting.RandomizedRunner$5.evaluate(RandomizedRunner.java:829)
	at com.carrotsearch.randomizedtesting.RandomizedRunner$6.evaluate(RandomizedRunner.java:879)
	at com.carrotsearch.randomizedtesting.RandomizedRunner$7.evaluate(RandomizedRunner.java:890)
	at com.carrotsearch.randomizedtesting.rules.StatementAdapter.evaluate(StatementAdapter.java:36)
	at com.carrotsearch.randomizedtesting.rules.SystemPropertiesRestoreRule$1.evaluate(SystemPropertiesRestoreRule.java:57)
	at org.apache.lucene.util.AbstractBeforeAfterRule$1.evaluate(AbstractBeforeAfterRule.java:45)
	at com.carrotsearch.randomizedtesting.rules.StatementAdapter.evaluate(StatementAdapter.java:36)
	at org.apache.lucene.util.TestRuleStoreClassName$1.evaluate(TestRuleStoreClassName.java:41)
	at com.carrotsearch.randomizedtesting.rules.NoShadowingOrOverridesOnMethodsRule$1.evaluate(NoShadowingOrOverridesOnMethodsRule.java:40)
	at com.carrotsearch.randomizedtesting.rules.NoShadowingOrOverridesOnMethodsRule$1.evaluate(NoShadowingOrOverridesOnMethodsRule.java:40)
	at com.carrotsearch.randomizedtesting.rules.StatementAdapter.evaluate(StatementAdapter.java:36)
	at com.carrotsearch.randomizedtesting.rules.StatementAdapter.evaluate(StatementAdapter.java:36)
	at com.carrotsearch.randomizedtesting.rules.StatementAdapter.evaluate(StatementAdapter.java:36)
	at org.apache.lucene.util.TestRuleAssertionsRequired$1.evaluate(TestRuleAssertionsRequired.java:53)
	at org.apache.lucene.util.TestRuleMarkFailure$1.evaluate(TestRuleMarkFailure.java:47)
	at org.apache.lucene.util.TestRuleIgnoreAfterMaxFailures$1.evaluate(TestRuleIgnoreAfterMaxFailures.java:64)
	at org.apache.lucene.util.TestRuleIgnoreTestSuites$1.evaluate(TestRuleIgnoreTestSuites.java:54)
	at com.carrotsearch.randomizedtesting.rules.StatementAdapter.evaluate(StatementAdapter.java:36)
	at com.carrotsearch.randomizedtesting.ThreadLeakControl$StatementRunner.run(ThreadLeakControl.java:368)
	at java.lang.Thread.run(Thread.java:748)


FAILED:  junit.framework.TestSuite.org.apache.solr.cloud.ZkCLITest

Error Message:
Could not remove the following files (in the order of attempts):    C:\Users\jenkins\workspace\Lucene-Solr-master-Windows\solr\build\solr-core\test\J0\temp\solr.cloud.ZkCLITest_C303992F6F56A35F-001\tempDir-025\collection1\conf: java.nio.file.DirectoryNotEmptyException: C:\Users\jenkins\workspace\Lucene-Solr-master-Windows\solr\build\solr-core\test\J0\temp\solr.cloud.ZkCLITest_C303992F6F56A35F-001\tempDir-025\collection1\conf    C:\Users\jenkins\workspace\Lucene-Solr-master-Windows\solr\build\solr-core\test\J0\temp\solr.cloud.ZkCLITest_C303992F6F56A35F-001\tempDir-025\collection1: java.nio.file.DirectoryNotEmptyException: C:\Users\jenkins\workspace\Lucene-Solr-master-Windows\solr\build\solr-core\test\J0\temp\solr.cloud.ZkCLITest_C303992F6F56A35F-001\tempDir-025\collection1    C:\Users\jenkins\workspace\Lucene-Solr-master-Windows\solr\build\solr-core\test\J0\temp\solr.cloud.ZkCLITest_C303992F6F56A35F-001\tempDir-025: java.nio.file.DirectoryNotEmptyException: C:\Users\jenkins\workspace\Lucene-Solr-master-Windows\solr\build\solr-core\test\J0\temp\solr.cloud.ZkCLITest_C303992F6F56A35F-001\tempDir-025 

Stack Trace:
java.io.IOException: Could not remove the following files (in the order of attempts):
   C:\Users\jenkins\workspace\Lucene-Solr-master-Windows\solr\build\solr-core\test\J0\temp\solr.cloud.ZkCLITest_C303992F6F56A35F-001\tempDir-025\collection1\conf: java.nio.file.DirectoryNotEmptyException: C:\Users\jenkins\workspace\Lucene-Solr-master-Windows\solr\build\solr-core\test\J0\temp\solr.cloud.ZkCLITest_C303992F6F56A35F-001\tempDir-025\collection1\conf
   C:\Users\jenkins\workspace\Lucene-Solr-master-Windows\solr\build\solr-core\test\J0\temp\solr.cloud.ZkCLITest_C303992F6F56A35F-001\tempDir-025\collection1: java.nio.file.DirectoryNotEmptyException: C:\Users\jenkins\workspace\Lucene-Solr-master-Windows\solr\build\solr-core\test\J0\temp\solr.cloud.ZkCLITest_C303992F6F56A35F-001\tempDir-025\collection1
   C:\Users\jenkins\workspace\Lucene-Solr-master-Windows\solr\build\solr-core\test\J0\temp\solr.cloud.ZkCLITest_C303992F6F56A35F-001\tempDir-025: java.nio.file.DirectoryNotEmptyException: C:\Users\jenkins\workspace\Lucene-Solr-master-Windows\solr\build\solr-core\test\J0\temp\solr.cloud.ZkCLITest_C303992F6F56A35F-001\tempDir-025

	at __randomizedtesting.SeedInfo.seed([C303992F6F56A35F]:0)
	at org.apache.lucene.util.IOUtils.rm(IOUtils.java:329)
	at org.apache.lucene.util.TestRuleTemporaryFilesCleanup.afterAlways(TestRuleTemporaryFilesCleanup.java:216)
	at com.carrotsearch.randomizedtesting.rules.TestRuleAdapter$1.afterAlways(TestRuleAdapter.java:31)
	at com.carrotsearch.randomizedtesting.rules.StatementAdapter.evaluate(StatementAdapter.java:43)
	at com.carrotsearch.randomizedtesting.rules.StatementAdapter.evaluate(StatementAdapter.java:36)
	at org.apache.lucene.util.TestRuleAssertionsRequired$1.evaluate(TestRuleAssertionsRequired.java:53)
	at org.apache.lucene.util.TestRuleMarkFailure$1.evaluate(TestRuleMarkFailure.java:47)
	at org.apache.lucene.util.TestRuleIgnoreAfterMaxFailures$1.evaluate(TestRuleIgnoreAfterMaxFailures.java:64)
	at org.apache.lucene.util.TestRuleIgnoreTestSuites$1.evaluate(TestRuleIgnoreTestSuites.java:54)
	at com.carrotsearch.randomizedtesting.rules.StatementAdapter.evaluate(StatementAdapter.java:36)
	at com.carrotsearch.randomizedtesting.ThreadLeakControl$StatementRunner.run(ThreadLeakControl.java:368)
	at java.lang.Thread.run(Thread.java:748)


FAILED:  org.apache.solr.cloud.autoscaling.TriggerIntegrationTest.testEventQueue

Error Message:
action wasn't interrupted

Stack Trace:
java.lang.AssertionError: action wasn't interrupted
	at __randomizedtesting.SeedInfo.seed([C303992F6F56A35F:AB6DB81663165AA]:0)
	at org.junit.Assert.fail(Assert.java:93)
	at org.junit.Assert.assertTrue(Assert.java:43)
	at org.apache.solr.cloud.autoscaling.TriggerIntegrationTest.testEventQueue(TriggerIntegrationTest.java:707)
	at sun.reflect.NativeMethodAccessorImpl.invoke0(Native Method)
	at sun.reflect.NativeMethodAccessorImpl.invoke(NativeMethodAccessorImpl.java:62)
	at sun.reflect.DelegatingMethodAccessorImpl.invoke(DelegatingMethodAccessorImpl.java:43)
	at java.lang.reflect.Method.invoke(Method.java:498)
	at com.carrotsearch.randomizedtesting.RandomizedRunner.invoke(RandomizedRunner.java:1737)
	at com.carrotsearch.randomizedtesting.RandomizedRunner$8.evaluate(RandomizedRunner.java:934)
	at com.carrotsearch.randomizedtesting.RandomizedRunner$9.evaluate(RandomizedRunner.java:970)
	at com.carrotsearch.randomizedtesting.RandomizedRunner$10.evaluate(RandomizedRunner.java:984)
	at com.carrotsearch.randomizedtesting.rules.SystemPropertiesRestoreRule$1.evaluate(SystemPropertiesRestoreRule.java:57)
	at org.apache.lucene.util.TestRuleSetupTeardownChained$1.evaluate(TestRuleSetupTeardownChained.java:49)
	at org.apache.lucene.util.AbstractBeforeAfterRule$1.evaluate(AbstractBeforeAfterRule.java:45)
	at org.apache.lucene.util.TestRuleThreadAndTestName$1.evaluate(TestRuleThreadAndTestName.java:48)
	at org.apache.lucene.util.TestRuleIgnoreAfterMaxFailures$1.evaluate(TestRuleIgnoreAfterMaxFailures.java:64)
	at org.apache.lucene.util.TestRuleMarkFailure$1.evaluate(TestRuleMarkFailure.java:47)
	at com.carrotsearch.randomizedtesting.rules.StatementAdapter.evaluate(StatementAdapter.java:36)
	at com.carrotsearch.randomizedtesting.ThreadLeakControl$StatementRunner.run(ThreadLeakControl.java:368)
	at com.carrotsearch.randomizedtesting.ThreadLeakControl.forkTimeoutingTask(ThreadLeakControl.java:817)
	at com.carrotsearch.randomizedtesting.ThreadLeakControl$3.evaluate(ThreadLeakControl.java:468)
	at com.carrotsearch.randomizedtesting.RandomizedRunner.runSingleTest(RandomizedRunner.java:943)
	at com.carrotsearch.randomizedtesting.RandomizedRunner$5.evaluate(RandomizedRunner.java:829)
	at com.carrotsearch.randomizedtesting.RandomizedRunner$6.evaluate(RandomizedRunner.java:879)
	at com.carrotsearch.randomizedtesting.RandomizedRunner$7.evaluate(RandomizedRunner.java:890)
	at com.carrotsearch.randomizedtesting.rules.StatementAdapter.evaluate(StatementAdapter.java:36)
	at com.carrotsearch.randomizedtesting.rules.SystemPropertiesRestoreRule$1.evaluate(SystemPropertiesRestoreRule.java:57)
	at org.apache.lucene.util.AbstractBeforeAfterRule$1.evaluate(AbstractBeforeAfterRule.java:45)
	at com.carrotsearch.randomizedtesting.rules.StatementAdapter.evaluate(StatementAdapter.java:36)
	at org.apache.lucene.util.TestRuleStoreClassName$1.evaluate(TestRuleStoreClassName.java:41)
	at com.carrotsearch.randomizedtesting.rules.NoShadowingOrOverridesOnMethodsRule$1.evaluate(NoShadowingOrOverridesOnMethodsRule.java:40)
	at com.carrotsearch.randomizedtesting.rules.NoShadowingOrOverridesOnMethodsRule$1.evaluate(NoShadowingOrOverridesOnMethodsRule.java:40)
	at com.carrotsearch.randomizedtesting.rules.StatementAdapter.evaluate(StatementAdapter.java:36)
	at com.carrotsearch.randomizedtesting.rules.StatementAdapter.evaluate(StatementAdapter.java:36)
	at com.carrotsearch.randomizedtesting.rules.StatementAdapter.evaluate(StatementAdapter.java:36)
	at org.apache.lucene.util.TestRuleAssertionsRequired$1.evaluate(TestRuleAssertionsRequired.java:53)
	at org.apache.lucene.util.TestRuleMarkFailure$1.evaluate(TestRuleMarkFailure.java:47)
	at org.apache.lucene.util.TestRuleIgnoreAfterMaxFailures$1.evaluate(TestRuleIgnoreAfterMaxFailures.java:64)
	at org.apache.lucene.util.TestRuleIgnoreTestSuites$1.evaluate(TestRuleIgnoreTestSuites.java:54)
	at com.carrotsearch.randomizedtesting.rules.StatementAdapter.evaluate(StatementAdapter.java:36)
	at com.carrotsearch.randomizedtesting.ThreadLeakControl$StatementRunner.run(ThreadLeakControl.java:368)
	at java.lang.Thread.run(Thread.java:748)


FAILED:  junit.framework.TestSuite.org.apache.solr.handler.component.TermVectorComponentDistributedTest

Error Message:
Could not remove the following files (in the order of attempts):    C:\Users\jenkins\workspace\Lucene-Solr-master-Windows\solr\build\solr-core\test\J1\temp\solr.handler.component.TermVectorComponentDistributedTest_C303992F6F56A35F-001\tempDir-001\shard2\configsets: java.nio.file.DirectoryNotEmptyException: C:\Users\jenkins\workspace\Lucene-Solr-master-Windows\solr\build\solr-core\test\J1\temp\solr.handler.component.TermVectorComponentDistributedTest_C303992F6F56A35F-001\tempDir-001\shard2\configsets    C:\Users\jenkins\workspace\Lucene-Solr-master-Windows\solr\build\solr-core\test\J1\temp\solr.handler.component.TermVectorComponentDistributedTest_C303992F6F56A35F-001\tempDir-001\shard2: java.nio.file.DirectoryNotEmptyException: C:\Users\jenkins\workspace\Lucene-Solr-master-Windows\solr\build\solr-core\test\J1\temp\solr.handler.component.TermVectorComponentDistributedTest_C303992F6F56A35F-001\tempDir-001\shard2    C:\Users\jenkins\workspace\Lucene-Solr-master-Windows\solr\build\solr-core\test\J1\temp\solr.handler.component.TermVectorComponentDistributedTest_C303992F6F56A35F-001\tempDir-001: java.nio.file.DirectoryNotEmptyException: C:\Users\jenkins\workspace\Lucene-Solr-master-Windows\solr\build\solr-core\test\J1\temp\solr.handler.component.TermVectorComponentDistributedTest_C303992F6F56A35F-001\tempDir-001 

Stack Trace:
java.io.IOException: Could not remove the following files (in the order of attempts):
   C:\Users\jenkins\workspace\Lucene-Solr-master-Windows\solr\build\solr-core\test\J1\temp\solr.handler.component.TermVectorComponentDistributedTest_C303992F6F56A35F-001\tempDir-001\shard2\configsets: java.nio.file.DirectoryNotEmptyException: C:\Users\jenkins\workspace\Lucene-Solr-master-Windows\solr\build\solr-core\test\J1\temp\solr.handler.component.TermVectorComponentDistributedTest_C303992F6F56A35F-001\tempDir-001\shard2\configsets
   C:\Users\jenkins\workspace\Lucene-Solr-master-Windows\solr\build\solr-core\test\J1\temp\solr.handler.component.TermVectorComponentDistributedTest_C303992F6F56A35F-001\tempDir-001\shard2: java.nio.file.DirectoryNotEmptyException: C:\Users\jenkins\workspace\Lucene-Solr-master-Windows\solr\build\solr-core\test\J1\temp\solr.handler.component.TermVectorComponentDistributedTest_C303992F6F56A35F-001\tempDir-001\shard2
   C:\Users\jenkins\workspace\Lucene-Solr-master-Windows\solr\build\solr-core\test\J1\temp\solr.handler.component.TermVectorComponentDistributedTest_C303992F6F56A35F-001\tempDir-001: java.nio.file.DirectoryNotEmptyException: C:\Users\jenkins\workspace\Lucene-Solr-master-Windows\solr\build\solr-core\test\J1\temp\solr.handler.component.TermVectorComponentDistributedTest_C303992F6F56A35F-001\tempDir-001

	at __randomizedtesting.SeedInfo.seed([C303992F6F56A35F]:0)
	at org.apache.lucene.util.IOUtils.rm(IOUtils.java:329)
	at org.apache.lucene.util.TestRuleTemporaryFilesCleanup.afterAlways(TestRuleTemporaryFilesCleanup.java:216)
	at com.carrotsearch.randomizedtesting.rules.TestRuleAdapter$1.afterAlways(TestRuleAdapter.java:31)
	at com.carrotsearch.randomizedtesting.rules.StatementAdapter.evaluate(StatementAdapter.java:43)
	at com.carrotsearch.randomizedtesting.rules.StatementAdapter.evaluate(StatementAdapter.java:36)
	at org.apache.lucene.util.TestRuleAssertionsRequired$1.evaluate(TestRuleAssertionsRequired.java:53)
	at org.apache.lucene.util.TestRuleMarkFailure$1.evaluate(TestRuleMarkFailure.java:47)
	at org.apache.lucene.util.TestRuleIgnoreAfterMaxFailures$1.evaluate(TestRuleIgnoreAfterMaxFailures.java:64)
	at org.apache.lucene.util.TestRuleIgnoreTestSuites$1.evaluate(TestRuleIgnoreTestSuites.java:54)
	at com.carrotsearch.randomizedtesting.rules.StatementAdapter.evaluate(StatementAdapter.java:36)
	at com.carrotsearch.randomizedtesting.ThreadLeakControl$StatementRunner.run(ThreadLeakControl.java:368)
	at java.lang.Thread.run(Thread.java:748)


FAILED:  junit.framework.TestSuite.org.apache.solr.update.processor.TestOpenNLPExtractNamedEntitiesUpdateProcessorFactory

Error Message:
Could not remove the following files (in the order of attempts):    C:\Users\jenkins\workspace\Lucene-Solr-master-Windows\solr\build\contrib\solr-analysis-extras\test\J1\temp\solr.update.processor.TestOpenNLPExtractNamedEntitiesUpdateProcessorFactory_3AFC091BE73B8123-001\tempDir-001\collection1\conf: java.nio.file.DirectoryNotEmptyException: C:\Users\jenkins\workspace\Lucene-Solr-master-Windows\solr\build\contrib\solr-analysis-extras\test\J1\temp\solr.update.processor.TestOpenNLPExtractNamedEntitiesUpdateProcessorFactory_3AFC091BE73B8123-001\tempDir-001\collection1\conf    C:\Users\jenkins\workspace\Lucene-Solr-master-Windows\solr\build\contrib\solr-analysis-extras\test\J1\temp\solr.update.processor.TestOpenNLPExtractNamedEntitiesUpdateProcessorFactory_3AFC091BE73B8123-001\tempDir-001\collection1: java.nio.file.DirectoryNotEmptyException: C:\Users\jenkins\workspace\Lucene-Solr-master-Windows\solr\build\contrib\solr-analysis-extras\test\J1\temp\solr.update.processor.TestOpenNLPExtractNamedEntitiesUpdateProcessorFactory_3AFC091BE73B8123-001\tempDir-001\collection1    C:\Users\jenkins\workspace\Lucene-Solr-master-Windows\solr\build\contrib\solr-analysis-extras\test\J1\temp\solr.update.processor.TestOpenNLPExtractNamedEntitiesUpdateProcessorFactory_3AFC091BE73B8123-001\tempDir-001: java.nio.file.DirectoryNotEmptyException: C:\Users\jenkins\workspace\Lucene-Solr-master-Windows\solr\build\contrib\solr-analysis-extras\test\J1\temp\solr.update.processor.TestOpenNLPExtractNamedEntitiesUpdateProcessorFactory_3AFC091BE73B8123-001\tempDir-001    C:\Users\jenkins\workspace\Lucene-Solr-master-Windows\solr\build\contrib\solr-analysis-extras\test\J1\temp\solr.update.processor.TestOpenNLPExtractNamedEntitiesUpdateProcessorFactory_3AFC091BE73B8123-001\tempDir-001\collection1\conf\en-test-sent.bin: java.nio.file.AccessDeniedException: C:\Users\jenkins\workspace\Lucene-Solr-master-Windows\solr\build\contrib\solr-analysis-extras\test\J1\temp\solr.update.processor.TestOpenNLPExtractNamedEntitiesUpdateProcessorFactory_3AFC091BE73B8123-001\tempDir-001\collection1\conf\en-test-sent.bin    C:\Users\jenkins\workspace\Lucene-Solr-master-Windows\solr\build\contrib\solr-analysis-extras\test\J1\temp\solr.update.processor.TestOpenNLPExtractNamedEntitiesUpdateProcessorFactory_3AFC091BE73B8123-001\tempDir-001\collection1\conf\en-test-ner-person.bin: java.nio.file.AccessDeniedException: C:\Users\jenkins\workspace\Lucene-Solr-master-Windows\solr\build\contrib\solr-analysis-extras\test\J1\temp\solr.update.processor.TestOpenNLPExtractNamedEntitiesUpdateProcessorFactory_3AFC091BE73B8123-001\tempDir-001\collection1\conf\en-test-ner-person.bin    C:\Users\jenkins\workspace\Lucene-Solr-master-Windows\solr\build\contrib\solr-analysis-extras\test\J1\temp\solr.update.processor.TestOpenNLPExtractNamedEntitiesUpdateProcessorFactory_3AFC091BE73B8123-001\tempDir-001\collection1\conf\en-test-tokenizer.bin: java.nio.file.AccessDeniedException: C:\Users\jenkins\workspace\Lucene-Solr-master-Windows\solr\build\contrib\solr-analysis-extras\test\J1\temp\solr.update.processor.TestOpenNLPExtractNamedEntitiesUpdateProcessorFactory_3AFC091BE73B8123-001\tempDir-001\collection1\conf\en-test-tokenizer.bin    C:\Users\jenkins\workspace\Lucene-Solr-master-Windows\solr\build\contrib\solr-analysis-extras\test\J1\temp\solr.update.processor.TestOpenNLPExtractNamedEntitiesUpdateProcessorFactory_3AFC091BE73B8123-001: java.nio.file.DirectoryNotEmptyException: C:\Users\jenkins\workspace\Lucene-Solr-master-Windows\solr\build\contrib\solr-analysis-extras\test\J1\temp\solr.update.processor.TestOpenNLPExtractNamedEntitiesUpdateProcessorFactory_3AFC091BE73B8123-001 

Stack Trace:
java.io.IOException: Could not remove the following files (in the order of attempts):
   C:\Users\jenkins\workspace\Lucene-Solr-master-Windows\solr\build\contrib\solr-analysis-extras\test\J1\temp\solr.update.processor.TestOpenNLPExtractNamedEntitiesUpdateProcessorFactory_3AFC091BE73B8123-001\tempDir-001\collection1\conf: java.nio.file.DirectoryNotEmptyException: C:\Users\jenkins\workspace\Lucene-Solr-master-Windows\solr\build\contrib\solr-analysis-extras\test\J1\temp\solr.update.processor.TestOpenNLPExtractNamedEntitiesUpdateProcessorFactory_3AFC091BE73B8123-001\tempDir-001\collection1\conf
   C:\Users\jenkins\workspace\Lucene-Solr-master-Windows\solr\build\contrib\solr-analysis-extras\test\J1\temp\solr.update.processor.TestOpenNLPExtractNamedEntitiesUpdateProcessorFactory_3AFC091BE73B8123-001\tempDir-001\collection1: java.nio.file.DirectoryNotEmptyException: C:\Users\jenkins\workspace\Lucene-Solr-master-Windows\solr\build\contrib\solr-analysis-extras\test\J1\temp\solr.update.processor.TestOpenNLPExtractNamedEntitiesUpdateProcessorFactory_3AFC091BE73B8123-001\tempDir-001\collection1
   C:\Users\jenkins\workspace\Lucene-Solr-master-Windows\solr\build\contrib\solr-analysis-extras\test\J1\temp\solr.update.processor.TestOpenNLPExtractNamedEntitiesUpdateProcessorFactory_3AFC091BE73B8123-001\tempDir-001: java.nio.file.DirectoryNotEmptyException: C:\Users\jenkins\workspace\Lucene-Solr-master-Windows\solr\build\contrib\solr-analysis-extras\test\J1\temp\solr.update.processor.TestOpenNLPExtractNamedEntitiesUpdateProcessorFactory_3AFC091BE73B8123-001\tempDir-001
   C:\Users\jenkins\workspace\Lucene-Solr-master-Windows\solr\build\contrib\solr-analysis-extras\test\J1\temp\solr.update.processor.TestOpenNLPExtractNamedEntitiesUpdateProcessorFactory_3AFC091BE73B8123-001\tempDir-001\collection1\conf\en-test-sent.bin: java.nio.file.AccessDeniedException: C:\Users\jenkins\workspace\Lucene-Solr-master-Windows\solr\build\contrib\solr-analysis-extras\test\J1\temp\solr.update.processor.TestOpenNLPExtractNamedEntitiesUpdateProcessorFactory_3AFC091BE73B8123-001\tempDir-001\collection1\conf\en-test-sent.bin
   C:\Users\jenkins\workspace\Lucene-Solr-master-Windows\solr\build\contrib\solr-analysis-extras\test\J1\temp\solr.update.processor.TestOpenNLPExtractNamedEntitiesUpdateProcessorFactory_3AFC091BE73B8123-001\tempDir-001\collection1\conf\en-test-ner-person.bin: java.nio.file.AccessDeniedException: C:\Users\jenkins\workspace\Lucene-Solr-master-Windows\solr\build\contrib\solr-analysis-extras\test\J1\temp\solr.update.processor.TestOpenNLPExtractNamedEntitiesUpdateProcessorFactory_3AFC091BE73B8123-001\tempDir-001\collection1\conf\en-test-ner-person.bin
   C:\Users\jenkins\workspace\Lucene-Solr-master-Windows\solr\build\contrib\solr-analysis-extras\test\J1\temp\solr.update.processor.TestOpenNLPExtractNamedEntitiesUpdateProcessorFactory_3AFC091BE73B8123-001\tempDir-001\collection1\conf\en-test-tokenizer.bin: java.nio.file.AccessDeniedException: C:\Users\jenkins\workspace\Lucene-Solr-master-Windows\solr\build\contrib\solr-analysis-extras\test\J1\temp\solr.update.processor.TestOpenNLPExtractNamedEntitiesUpdateProcessorFactory_3AFC091BE73B8123-001\tempDir-001\collection1\conf\en-test-tokenizer.bin
   C:\Users\jenkins\workspace\Lucene-Solr-master-Windows\solr\build\contrib\solr-analysis-extras\test\J1\temp\solr.update.processor.TestOpenNLPExtractNamedEntitiesUpdateProcessorFactory_3AFC091BE73B8123-001: java.nio.file.DirectoryNotEmptyException: C:\Users\jenkins\workspace\Lucene-Solr-master-Windows\solr\build\contrib\solr-analysis-extras\test\J1\temp\solr.update.processor.TestOpenNLPExtractNamedEntitiesUpdateProcessorFactory_3AFC091BE73B8123-001

	at __randomizedtesting.SeedInfo.seed([3AFC091BE73B8123]:0)
	at org.apache.lucene.util.IOUtils.rm(IOUtils.java:329)
	at org.apache.lucene.util.TestRuleTemporaryFilesCleanup.afterAlways(TestRuleTemporaryFilesCleanup.java:216)
	at com.carrotsearch.randomizedtesting.rules.TestRuleAdapter$1.afterAlways(TestRuleAdapter.java:31)
	at com.carrotsearch.randomizedtesting.rules.StatementAdapter.evaluate(StatementAdapter.java:43)
	at com.carrotsearch.randomizedtesting.rules.StatementAdapter.evaluate(StatementAdapter.java:36)
	at org.apache.lucene.util.TestRuleAssertionsRequired$1.evaluate(TestRuleAssertionsRequired.java:53)
	at org.apache.lucene.util.TestRuleMarkFailure$1.evaluate(TestRuleMarkFailure.java:47)
	at org.apache.lucene.util.TestRuleIgnoreAfterMaxFailures$1.evaluate(TestRuleIgnoreAfterMaxFailures.java:64)
	at org.apache.lucene.util.TestRuleIgnoreTestSuites$1.evaluate(TestRuleIgnoreTestSuites.java:54)
	at com.carrotsearch.randomizedtesting.rules.StatementAdapter.evaluate(StatementAdapter.java:36)
	at com.carrotsearch.randomizedtesting.ThreadLeakControl$StatementRunner.run(ThreadLeakControl.java:368)
	at java.lang.Thread.run(Thread.java:748)




Build Log:
[...truncated 4781 lines...]
   [junit4] Suite: org.apache.lucene.index.TestBackwardsCompatibility
   [junit4] IGNOR/A 0.00s J0 | TestBackwardsCompatibility.testCreateSingleSegmentNoCFS
   [junit4]    > Assumption #1: backcompat creation tests must be run with -Dtests.bwcdir=/path/to/write/indexes
   [junit4] IGNOR/A 0.00s J0 | TestBackwardsCompatibility.testCreateMoreTermsIndex
   [junit4]    > Assumption #1: backcompat creation tests must be run with -Dtests.bwcdir=/path/to/write/indexes
   [junit4] IGNOR/A 0.00s J0 | TestBackwardsCompatibility.testCreateNoCFS
   [junit4]    > Assumption #1: backcompat creation tests must be run with -Dtests.bwcdir=/path/to/write/indexes
   [junit4] IGNOR/A 0.00s J0 | TestBackwardsCompatibility.testCreateSortedIndex
   [junit4]    > Assumption #1: backcompat creation tests must be run with -Dtests.bwcdir=/path/to/write/indexes
   [junit4] IGNOR/A 0.00s J0 | TestBackwardsCompatibility.testCreateCFS
   [junit4]    > Assumption #1: backcompat creation tests must be run with -Dtests.bwcdir=/path/to/write/indexes
   [junit4] IGNOR/A 0.00s J0 | TestBackwardsCompatibility.testCreateSingleSegmentCFS
   [junit4]    > Assumption #1: backcompat creation tests must be run with -Dtests.bwcdir=/path/to/write/indexes
   [junit4] IGNOR/A 0.00s J0 | TestBackwardsCompatibility.testCreateEmptyIndex
   [junit4]    > Assumption #1: backcompat creation tests must be run with -Dtests.bwcdir=/path/to/write/indexes
   [junit4] IGNOR/A 0.00s J0 | TestBackwardsCompatibility.testCreateIndexWithDocValuesUpdates
   [junit4]    > Assumption #1: backcompat creation tests must be run with -Dtests.bwcdir=/path/to/write/indexes
   [junit4]   2> NOTE: test params are: codec=Asserting(Lucene70): {content6=PostingsFormat(name=LuceneVarGapFixedInterval), content5=PostingsFormat(name=Direct), content4=PostingsFormat(name=Memory), content3=Lucene50(blocksize=128), content2=PostingsFormat(name=LuceneVarGapFixedInterval), fie?ld=PostingsFormat(name=LuceneVarGapFixedInterval), utf8=PostingsFormat(name=Memory), id=PostingsFormat(name=LuceneVarGapFixedInterval), content=PostingsFormat(name=Memory), autf8=Lucene50(blocksize=128)}, docValues:{ndv2=DocValuesFormat(name=Lucene70), ndv1=DocValuesFormat(name=Direct), utf8=DocValuesFormat(name=Direct), fie?ld=DocValuesFormat(name=Lucene70), dvShort=DocValuesFormat(name=Lucene70), dvInt=DocValuesFormat(name=Direct), longPoint2d=DocValuesFormat(name=Lucene70), dvBytesSortedVar=DocValuesFormat(name=Lucene70), dvSortedSet=DocValuesFormat(name=Lucene70), content=DocValuesFormat(name=Direct), floatPoint1d=DocValuesFormat(name=Lucene70), bdv2=DocValuesFormat(name=Lucene70), bdv2_c=DocValuesFormat(name=Lucene70), intPoint1d=DocValuesFormat(name=Memory), bdv1=DocValuesFormat(name=Direct), bdv1_c=DocValuesFormat(name=Lucene70), doublePoint2d=DocValuesFormat(name=Lucene70), dvBytesDerefVar=DocValuesFormat(name=Lucene70), id=DocValuesFormat(name=Lucene70), binaryPoint2d=DocValuesFormat(name=Direct), dvSortedNumeric=DocValuesFormat(name=Lucene70), dvBytesDerefFixed=DocValuesFormat(name=Direct), autf8=DocValuesFormat(name=Lucene70), dvBytesSortedFixed=DocValuesFormat(name=Lucene70), dvBytesStraightVar=DocValuesFormat(name=Memory), dvBytesStraightFixed=DocValuesFormat(name=Lucene70), dvLong=DocValuesFormat(name=Lucene70), longPoint1d=DocValuesFormat(name=Direct), floatPoint2d=DocValuesFormat(name=Lucene70), dvDouble=DocValuesFormat(name=Lucene70), dvFloat=DocValuesFormat(name=Lucene70), content6=DocValuesFormat(name=Lucene70), content5=DocValuesFormat(name=Memory), dvPacked=DocValuesFormat(name=Lucene70), intPoint2d=DocValuesFormat(name=Lucene70), content4=DocValuesFormat(name=Direct), content3=DocValuesFormat(name=Lucene70), content2=DocValuesFormat(name=Lucene70), doublePoint1d=DocValuesFormat(name=Lucene70), dvByte=DocValuesFormat(name=Lucene70), ndv1_c=DocValuesFormat(name=Lucene70), ndv2_c=DocValuesFormat(name=Lucene70), binaryPoint1d=DocValuesFormat(name=Lucene70)}, maxPointsInLeafNode=377, maxMBSortInHeap=5.899031867915688, sim=Asserting(org.apache.lucene.search.similarities.AssertingSimilarity@17aef08), locale=uk, timezone=America/Argentina/Tucuman
   [junit4]   2> NOTE: Windows 10 10.0 x86/Oracle Corporation 1.8.0_144 (32-bit)/cpus=3,threads=1,free=75052224,total=110886912
   [junit4]   2> NOTE: All tests run in this JVM: [TestIndexWriterOnOldIndex, TestBackwardsCompatibility]
   [junit4]   2> NOTE: reproduce with: ant test  -Dtestcase=TestBackwardsCompatibility -Dtests.seed=E0154F654AF646BE -Dtests.slow=true -Dtests.locale=uk -Dtests.timezone=America/Argentina/Tucuman -Dtests.asserts=true -Dtests.file.encoding=UTF-8
   [junit4] ERROR   0.00s J0 | TestBackwardsCompatibility (suite) <<<
   [junit4]    > Throwable #1: java.io.IOException: Could not remove the following files (in the order of attempts):
   [junit4]    >    C:\Users\jenkins\workspace\Lucene-Solr-master-Windows\lucene\build\backward-codecs\test\J0\temp\lucene.index.TestBackwardsCompatibility_E0154F654AF646BE-001\3.0.0-nocfs-001: java.nio.file.DirectoryNotEmptyException: C:\Users\jenkins\workspace\Lucene-Solr-master-Windows\lucene\build\backward-codecs\test\J0\temp\lucene.index.TestBackwardsCompatibility_E0154F654AF646BE-001\3.0.0-nocfs-001
   [junit4]    > 	at __randomizedtesting.SeedInfo.seed([E0154F654AF646BE]:0)
   [junit4]    > 	at org.apache.lucene.util.IOUtils.rm(IOUtils.java:329)
   [junit4]    > 	at java.lang.Thread.run(Thread.java:748)
   [junit4] Completed [3/3 (1!)] on J0 in 13.69s, 30 tests, 1 error, 8 skipped <<< FAILURES!

[...truncated 3823 lines...]
   [junit4] Suite: org.apache.lucene.queryparser.xml.TestCorePlusQueriesParser
   [junit4]   2> NOTE: reproduce with: ant test  -Dtestcase=TestCorePlusQueriesParser -Dtests.method=testBoostingQueryXML -Dtests.seed=470DFFE88EB93E6D -Dtests.slow=true -Dtests.locale=et -Dtests.timezone=Africa/Gaborone -Dtests.asserts=true -Dtests.file.encoding=UTF-8
   [junit4] ERROR   0.01s J0 | TestCorePlusQueriesParser.testBoostingQueryXML <<<
   [junit4]    > Throwable #1: org.apache.lucene.queryparser.xml.ParserException: No QueryObjectBuilder defined for node BoostingQuery
   [junit4]    > 	at __randomizedtesting.SeedInfo.seed([470DFFE88EB93E6D:B7E67B46214C5A73]:0)
   [junit4]    > 	at org.apache.lucene.queryparser.xml.QueryBuilderFactory.getQuery(QueryBuilderFactory.java:35)
   [junit4]    > 	at org.apache.lucene.queryparser.xml.CoreParser.getQuery(CoreParser.java:190)
   [junit4]    > 	at org.apache.lucene.queryparser.xml.CoreParser.parse(CoreParser.java:125)
   [junit4]    > 	at org.apache.lucene.queryparser.xml.TestCoreParser.implParse(TestCoreParser.java:240)
   [junit4]    > 	at org.apache.lucene.queryparser.xml.TestCoreParser.parse(TestCoreParser.java:227)
   [junit4]    > 	at org.apache.lucene.queryparser.xml.TestCorePlusQueriesParser.testBoostingQueryXML(TestCorePlusQueriesParser.java:35)
   [junit4]    > 	at java.lang.Thread.run(Thread.java:748)
   [junit4]   2> NOTE: test params are: codec=Asserting(Lucene70): {date=PostingsFormat(name=Memory), contents=FSTOrd50}, docValues:{}, maxPointsInLeafNode=1290, maxMBSortInHeap=5.511509041198021, sim=Asserting(org.apache.lucene.search.similarities.AssertingSimilarity@1e13b), locale=et, timezone=Africa/Gaborone
   [junit4]   2> NOTE: Windows 10 10.0 x86/Oracle Corporation 1.8.0_144 (32-bit)/cpus=3,threads=1,free=39655128,total=81264640
   [junit4]   2> NOTE: All tests run in this JVM: [TestStandardQP, TestCorePlusQueriesParser]
   [junit4] Completed [6/27 (1!)] on J0 in 1.11s, 21 tests, 1 error <<< FAILURES!

[...truncated 40 lines...]
   [junit4] Suite: org.apache.lucene.queryparser.xml.TestCorePlusExtensionsParser
   [junit4]   2> NOTE: reproduce with: ant test  -Dtestcase=TestCorePlusExtensionsParser -Dtests.method=testBoostingQueryXML -Dtests.seed=470DFFE88EB93E6D -Dtests.slow=true -Dtests.locale=en-GB -Dtests.timezone=Asia/Barnaul -Dtests.asserts=true -Dtests.file.encoding=UTF-8
   [junit4] ERROR   0.02s J1 | TestCorePlusExtensionsParser.testBoostingQueryXML <<<
   [junit4]    > Throwable #1: org.apache.lucene.queryparser.xml.ParserException: No QueryObjectBuilder defined for node BoostingQuery
   [junit4]    > 	at __randomizedtesting.SeedInfo.seed([470DFFE88EB93E6D:B7E67B46214C5A73]:0)
   [junit4]    > 	at org.apache.lucene.queryparser.xml.QueryBuilderFactory.getQuery(QueryBuilderFactory.java:35)
   [junit4]    > 	at org.apache.lucene.queryparser.xml.CoreParser.getQuery(CoreParser.java:190)
   [junit4]    > 	at org.apache.lucene.queryparser.xml.CoreParser.parse(CoreParser.java:125)
   [junit4]    > 	at org.apache.lucene.queryparser.xml.TestCoreParser.implParse(TestCoreParser.java:240)
   [junit4]    > 	at org.apache.lucene.queryparser.xml.TestCoreParser.parse(TestCoreParser.java:227)
   [junit4]    > 	at org.apache.lucene.queryparser.xml.TestCorePlusQueriesParser.testBoostingQueryXML(TestCorePlusQueriesParser.java:35)
   [junit4]    > 	at java.lang.Thread.run(Thread.java:748)
   [junit4]   2> NOTE: test params are: codec=FastDecompressionCompressingStoredFields(storedFieldsFormat=CompressingStoredFieldsFormat(compressionMode=FAST_DECOMPRESSION, chunkSize=3, maxDocsPerChunk=8, blockSize=6), termVectorsFormat=CompressingTermVectorsFormat(compressionMode=FAST_DECOMPRESSION, chunkSize=3, blockSize=6)), sim=Asserting(org.apache.lucene.search.similarities.AssertingSimilarity@127e3c6), locale=en-GB, timezone=Asia/Barnaul
   [junit4]   2> NOTE: Windows 10 10.0 x86/Oracle Corporation 1.8.0_144 (32-bit)/cpus=3,threads=1,free=41663088,total=79429632
   [junit4]   2> NOTE: All tests run in this JVM: [TestMultiPhraseQueryParsing, TestMultiFieldQueryParser, TestPrecedenceQueryParser, TestMultiAnalyzerQPHelper, TestCorePlusExtensionsParser]
   [junit4] Completed [20/27 (2!)] on J1 in 3.90s, 22 tests, 1 error <<< FAILURES!

[...truncated 3444 lines...]
   [junit4] Suite: org.apache.solr.cloud.ZkCLITest
   [junit4]   2> 801921 INFO  (SUITE-ZkCLITest-seed#[C303992F6F56A35F]-worker) [    ] o.a.s.SolrTestCaseJ4 SecureRandom sanity checks: test.solr.allowed.securerandom=null & java.security.egd=file:/dev/./urandom
   [junit4]   2> Creating dataDir: C:\Users\jenkins\workspace\Lucene-Solr-master-Windows\solr\build\solr-core\test\J0\temp\solr.cloud.ZkCLITest_C303992F6F56A35F-001\init-core-data-001
   [junit4]   2> 801923 WARN  (SUITE-ZkCLITest-seed#[C303992F6F56A35F]-worker) [    ] o.a.s.SolrTestCaseJ4 startTrackingSearchers: numOpens=7 numCloses=7
   [junit4]   2> 801926 INFO  (SUITE-ZkCLITest-seed#[C303992F6F56A35F]-worker) [    ] o.a.s.SolrTestCaseJ4 Using PointFields (NUMERIC_POINTS_SYSPROP=true) w/NUMERIC_DOCVALUES_SYSPROP=true
   [junit4]   2> 801930 INFO  (SUITE-ZkCLITest-seed#[C303992F6F56A35F]-worker) [    ] o.a.s.SolrTestCaseJ4 Randomized ssl (true) and clientAuth (true) via: @org.apache.solr.util.RandomizeSSL(reason=, value=NaN, ssl=NaN, clientAuth=NaN)
   [junit4]   2> 801933 INFO  (TEST-ZkCLITest.testUpConfigLinkConfigClearZk-seed#[C303992F6F56A35F]) [    ] o.a.s.SolrTestCaseJ4 ###Starting testUpConfigLinkConfigClearZk
   [junit4]   2> 801933 INFO  (TEST-ZkCLITest.testUpConfigLinkConfigClearZk-seed#[C303992F6F56A35F]) [    ] o.a.s.c.ZkCLITest ####SETUP_START testUpConfigLinkConfigClearZk
   [junit4]   2> 802077 INFO  (TEST-ZkCLITest.testUpConfigLinkConfigClearZk-seed#[C303992F6F56A35F]) [    ] o.a.s.c.ZkCLITest ZooKeeper dataDir:C:\Users\jenkins\workspace\Lucene-Solr-master-Windows\solr\build\solr-core\test\J0\temp\solr.cloud.ZkCLITest_C303992F6F56A35F-001\tempDir-002\zookeeper/server1/data
   [junit4]   2> 802077 INFO  (TEST-ZkCLITest.testUpConfigLinkConfigClearZk-seed#[C303992F6F56A35F]) [    ] o.a.s.c.ZkTestServer STARTING ZK TEST SERVER
   [junit4]   2> 802078 INFO  (Thread-2134) [    ] o.a.s.c.ZkTestServer client port:0.0.0.0/0.0.0.0:0
   [junit4]   2> 802078 INFO  (Thread-2134) [    ] o.a.s.c.ZkTestServer Starting server
   [junit4]   2> 802082 ERROR (Thread-2134) [    ] o.a.z.s.ZooKeeperServer ZKShutdownHandler is not registered, so ZooKeeper server won't take any action on ERROR or SHUTDOWN server state changes
   [junit4]   2> 802178 INFO  (TEST-ZkCLITest.testUpConfigLinkConfigClearZk-seed#[C303992F6F56A35F]) [    ] o.a.s.c.ZkTestServer start zk server on port:60371
   [junit4]   2> 802181 INFO  (zkConnectionManagerCallback-2682-thread-1) [    ] o.a.s.c.c.ConnectionManager zkClient has connected
   [junit4]   2> 802185 INFO  (zkConnectionManagerCallback-2684-thread-1) [    ] o.a.s.c.c.ConnectionManager zkClient has connected
   [junit4]   2> 802185 INFO  (TEST-ZkCLITest.testUpConfigLinkConfigClearZk-seed#[C303992F6F56A35F]) [    ] o.a.s.c.ZkCLITest ####SETUP_END testUpConfigLinkConfigClearZk
   [junit4]   2> 802220 INFO  (zkConnectionManagerCallback-2686-thread-1) [    ] o.a.s.c.c.ConnectionManager zkClient has connected
   [junit4]   2> 802222 INFO  (zkConnectionManagerCallback-2688-thread-1) [    ] o.a.s.c.c.ConnectionManager zkClient has connected
   [junit4]   2> 802223 WARN  (NIOServerCxn.Factory:0.0.0.0/0.0.0.0:0) [    ] o.a.z.s.NIOServerCnxn caught end of stream exception
   [junit4]   2> EndOfStreamException: Unable to read additional data from client sessionid 0x1606af33eb50003, likely client has closed socket
   [junit4]   2> 	at org.apache.zookeeper.server.NIOServerCnxn.doIO(NIOServerCnxn.java:239)
   [junit4]   2> 	at org.apache.zookeeper.server.NIOServerCnxnFactory.run(NIOServerCnxnFactory.java:203)
   [junit4]   2> 	at java.lang.Thread.run(Thread.java:748)
   [junit4]   2> 802364 WARN  (NIOServerCxn.Factory:0.0.0.0/0.0.0.0:0) [    ] o.a.z.s.NIOServerCnxn caught end of stream exception
   [junit4]   2> EndOfStreamException: Unable to read additional data from client sessionid 0x1606af33eb50002, likely client has closed socket
   [junit4]   2> 	at org.apache.zookeeper.server.NIOServerCnxn.doIO(NIOServerCnxn.java:239)
   [junit4]   2> 	at org.apache.zookeeper.server.NIOServerCnxnFactory.run(NIOServerCnxnFactory.java:203)
   [junit4]   2> 	at java.lang.Thread.run(Thread.java:748)
   [junit4]   2> 802366 INFO  (zkConnectionManagerCallback-2690-thread-1) [    ] o.a.s.c.c.ConnectionManager zkClient has connected
   [junit4]   2> 802368 WARN  (NIOServerCxn.Factory:0.0.0.0/0.0.0.0:0) [    ] o.a.z.s.NIOServerCnxn caught end of stream exception
   [junit4]   2> EndOfStreamException: Unable to read additional data from client sessionid 0x1606af33eb50004, likely client has closed socket
   [junit4]   2> 	at org.apache.zookeeper.server.NIOServerCnxn.doIO(NIOServerCnxn.java:239)
   [junit4]   2> 	at org.apache.zookeeper.server.NIOServerCnxnFactory.run(NIOServerCnxnFactory.java:203)
   [junit4]   2> 	at java.lang.Thread.run(Thread.java:748)
   [junit4]   2> 802373 INFO  (zkConnectionManagerCallback-2692-thread-1) [    ] o.a.s.c.c.ConnectionManager zkClient has connected
   [junit4]   2> 802377 INFO  (TEST-ZkCLITest.testUpConfigLinkConfigClearZk-seed#[C303992F6F56A35F]) [    ] o.a.s.c.c.ZkMaintenanceUtils Writing file C:\Users\jenkins\workspace\Lucene-Solr-master-Windows\solr\build\solr-core\test\J0\temp\solr.cloud.ZkCLITest_C303992F6F56A35F-001\tempDir-003\solrtest-confdropspot-org.apache.solr.cloud.ZkCLITest-1323950362786521\currency.xml
   [junit4]   2> 802379 INFO  (TEST-ZkCLITest.testUpConfigLinkConfigClearZk-seed#[C303992F6F56A35F]) [    ] o.a.s.c.c.ZkMaintenanceUtils Writing file C:\Users\jenkins\workspace\Lucene-Solr-master-Windows\solr\build\solr-core\test\J0\temp\solr.cloud.ZkCLITest_C303992F6F56A35F-001\tempDir-003\solrtest-confdropspot-org.apache.solr.cloud.ZkCLITest-1323950362786521\mapping-FoldToASCII.txt
   [junit4]   2> 802381 INFO  (TEST-ZkCLITest.testUpConfigLinkConfigClearZk-seed#[C303992F6F56A35F]) [    ] o.a.s.c.c.ZkMaintenanceUtils Writing file C:\Users\jenkins\workspace\Lucene-Solr-master-Windows\solr\build\solr-core\test\J0\temp\solr.cloud.ZkCLITest_C303992F6F56A35F-001\tempDir-003\solrtest-confdropspot-org.apache.solr.cloud.ZkCLITest-1323950362786521\managed-schema
   [junit4]   2> 802382 INFO  (TEST-ZkCLITest.testUpConfigLinkConfigClearZk-seed#[C303992F6F56A35F]) [    ] o.a.s.c.c.ZkMaintenanceUtils Writing file C:\Users\jenkins\workspace\Lucene-Solr-master-Windows\solr\build\solr-core\test\J0\temp\solr.cloud.ZkCLITest_C303992F6F56A35F-001\tempDir-003\solrtest-confdropspot-org.apache.solr.cloud.ZkCLITest-1323950362786521\protwords.txt
   [junit4]   2> 802384 INFO  (TEST-ZkCLITest.testUpConfigLinkConfigClearZk-seed#[C303992F6F56A35F]) [    ] o.a.s.c.c.ZkMaintenanceUtils Writing file C:\Users\jenkins\workspace\Lucene-Solr-master-Windows\solr\build\solr-core\test\J0\temp\solr.cloud.ZkCLITest_C303992F6F56A35F-001\tempDir-003\solrtest-confdropspot-org.apache.solr.cloud.ZkCLITest-1323950362786521\synonyms.txt
   [junit4]   2> 802385 INFO  (TEST-ZkCLITest.testUpConfigLinkConfigClearZk-seed#[C303992F6F56A35F]) [    ] o.a.s.c.c.ZkMaintenanceUtils Writing file C:\Users\jenkins\workspace\Lucene-Solr-master-Windows\solr\build\solr-core\test\J0\temp\solr.cloud.ZkCLITest_C303992F6F56A35F-001\tempDir-003\solrtest-confdropspot-org.apache.solr.cloud.ZkCLITest-1323950362786521\stopwords.txt
   [junit4]   2> 802387 INFO  (TEST-ZkCLITest.testUpConfigLinkConfigClearZk-seed#[C303992F6F56A35F]) [    ] o.a.s.c.c.ZkMaintenanceUtils Writing file C:\Users\jenkins\workspace\Lucene-Solr-master-Windows\solr\build\solr-core\test\J0\temp\solr.cloud.ZkCLITest_C303992F6F56A35F-001\tempDir-003\solrtest-confdropspot-org.apache.solr.cloud.ZkCLITest-1323950362786521\velocity\hit_grouped.vm
   [junit4]   2> 802389 INFO  (TEST-ZkCLITest.testUpConfigLinkConfigClearZk-seed#[C303992F6F56A35F]) [    ] o.a.s.c.c.ZkMaintenanceUtils Writing file C:\Users\jenkins\workspace\Lucene-Solr-master-Windows\solr\build\solr-core\test\J0\temp\solr.cloud.ZkCLITest_C303992F6F56A35F-001\tempDir-003\solrtest-confdropspot-org.apache.solr.cloud.ZkCLITest-1323950362786521\velocity\mime_type_lists.vm
   [junit4]   2> 802389 INFO  (TEST-ZkCLITest.testUpConfigLinkConfigClearZk-seed#[C303992F6F56A35F]) [    ] o.a.s.c.c.ZkMaintenanceUtils Writing file C:\Users\jenkins\workspace\Lucene-Solr-master-Windows\solr\build\solr-core\test\J0\temp\solr.cloud.ZkCLITest_C303992F6F56A35F-001\tempDir-003\solrtest-confdropspot-org.apache.solr.cloud.ZkCLITest-1323950362786521\velocity\suggest.vm
   [junit4]   2> 802391 INFO  (TEST-ZkCLITest.testUpConfigLinkConfigClearZk-seed#[C303992F6F56A35F]) [    ] o.a.s.c.c.ZkMaintenanceUtils Writing file C:\Users\jenkins\workspace\Lucene-Solr-master-Windows\solr\build\solr-core\test\J0\temp\solr.cloud.ZkCLITest_C303992F6F56A35F-001\tempDir-003\solrtest-confdropspot-org.apache.solr.cloud.ZkCLITest-1323950362786521\velocity\hit.vm
   [junit4]   2> 802392 INFO  (TEST-ZkCLITest.testUpConfigLinkConfigClearZk-seed#[C303992F6F56A35F]) [    ] o.a.s.c.c.ZkMaintenanceUtils Writing file C:\Users\jenkins\workspace\Lucene-Solr-master-Windows\solr\build\solr-core\test\J0\temp\solr.cloud.ZkCLITest_C303992F6F56A35F-001\tempDir-003\solrtest-confdropspot-org.apache.solr.cloud.ZkCLITest-1323950362786521\velocity\pagination_bottom.vm
   [junit4]   2> 802393 INFO  (TEST-ZkCLITest.testUpConfigLinkConfigClearZk-seed#[C303992F6F56A35F]) [    ] o.a.s.c.c.ZkMaintenanceUtils Writing file C:\Users\jenkins\workspace\Lucene-Solr-master-Windows\solr\build\solr-core\test\J0\temp\solr.cloud.ZkCLITest_C303992F6F56A35F-001\tempDir-003\solrtest-confdropspot-org.apache.solr.cloud.ZkCLITest-1323950362786521\velocity\jquery.autocomplete.css
   [junit4]   2> 802395 INFO  (TEST-ZkCLITest.testUpConfigLinkConfigClearZk-seed#[C303992F6F56A35F]) [    ] o.a.s.c.c.ZkMaintenanceUtils Writing file C:\Users\jenkins\workspace\Lucene-Solr-master-Windows\solr\build\solr-core\test\J0\temp\solr.cloud.ZkCLITest_C303992F6F56A35F-001\tempDir-003\solrtest-confdropspot-org.apache.solr.cloud.ZkCLITest-1323950362786521\velocity\hit_plain.vm
   [junit4]   2> 802396 INFO  (TEST-ZkCLITest.testUpConfigLinkConfigClearZk-seed#[C303992F6F56A35F]) [    ] o.a.s.c.c.ZkMaintenanceUtils Writing file C:\Users\jenkins\workspace\Lucene-Solr-master-Windows\solr\build\solr-core\test\J0\temp\solr.cloud.ZkCLITest_C303992F6F56A35F-001\tempDir-003\solrtest-confdropspot-org.apache.solr.cloud.ZkCLITest-1323950362786521\velocity\product_doc.vm
   [junit4]   2> 802397 INFO  (TEST-ZkCLITest.testUpConfigLinkConfigClearZk-seed#[C303992F6F56A35F]) [    ] o.a.s.c.c.ZkMaintenanceUtils Writing file C:\Users\jenkins\workspace\Lucene-Solr-master-Windows\solr\build\solr-core\test\J0\temp\solr.cloud.ZkCLITest_C303992F6F56A35F-001\tempDir-003\solrtest-confdropspot-org.apache.solr.cloud.ZkCLITest-1323950362786521\velocity\query_form.vm
   [junit4]   2> 802398 INFO  (TEST-ZkCLITest.testUpConfigLinkConfigClearZk-seed#[C303992F6F56A35F]) [    ] o.a.s.c.c.ZkMaintenanceUtils Writing file C:\Users\jenkins\workspace\Lucene-Solr-master-Windows\solr\build\solr-core\test\J0\temp\solr.cloud.ZkCLITest_C303992F6F56A35F-001\tempDir-003\solrtest-confdropspot-org.apache.solr.cloud.ZkCLITest-1323950362786521\velocity\facet_queries.vm
   [junit4]   2> 802400 INFO  (TEST-ZkCLITest.testUpConfigLinkConfigClearZk-seed#[C303992F6F56A35F]) [    ] o.a.s.c.c.ZkMaintenanceUtils Writing file C:\Users\jenkins\workspace\Lucene-Solr-master-Windows\solr\build\solr-core\test\J0\temp\solr.cloud.ZkCLITest_C303992F6F56A35F-001\tempDir-003\solrtest-confdropspot-org.apache.solr.cloud.ZkCLITest-1323950362786521\velocity\debug.vm
   [junit4]   2> 802401 INFO  (TEST-ZkCLITest.testUpConfigLinkConfigClearZk-seed#[C303992F6F56A35F]) [    ] o.a.s.c.c.ZkMaintenanceUtils Writing file C:\Users\jenkins\workspace\Lucene-Solr-master-Windows\solr\build\solr-core\test\J0\temp\solr.cloud.ZkCLITest_C303992F6F56A35F-001\tempDir-003\solrtest-confdropspot-org.apache.solr.cloud.ZkCLITest-1323950362786521\velocity\facet_fields.vm
   [junit4]   2> 802402 INFO  (TEST-ZkCLITest.testUpConfigLinkConfigClearZk-seed#[C303992F6F56A35F]) [    ] o.a.s.c.c.ZkMaintenanceUtils Writing file C:\Users\jenkins\workspace\Lucene-Solr-master-Windows\solr\build\solr-core\test\J0\temp\solr.cloud.ZkCLITest_C303992F6F56A35F-001\tempDir-003\solrtest-confdropspot-org.apache.solr.cloud.ZkCLITest-1323950362786521\velocity\jquery.autocomplete.js
   [junit4]   2> 802403 INFO  (TEST-ZkCLITest.testUpConfigLinkConfigClearZk-seed#[C303992F6F56A35F]) [    ] o.a.s.c.c.ZkMaintenanceUtils Writing file C:\Users\jenkins\workspace\Lucene-Solr-master-Windows\solr\build\solr-core\test\J0\temp\solr.cloud.ZkCLITest_C303992F6F56A35F-001\tempDir-003\solrtest-confdropspot-org.apache.solr.cloud.ZkCLITest-1323950362786521\velocity\results_list.vm
   [junit4]   2> 802405 INFO  (TEST-ZkCLITest.testUpConfigLinkConfigClearZk-seed#[C303992F6F56A35F]) [    ] o.a.s.c.c.ZkMaintenanceUtils Writing file C:\Users\jenkins\workspace\Lucene-Solr-master-Windows\solr\build\solr-core\test\J0\temp\solr.cloud.ZkCLITest_C303992F6F56A35F-001\tempDir-003\solrtest-confdropspot-org.apache.solr.cloud.ZkCLITest-1323950362786521\velocity\tabs.vm
   [junit4]   2> 802406 INFO  (TEST-ZkCLITest.testUpConfigLinkConfigClearZk-seed#[C303992F6F56A35F]) [    ] o.a.s.c.c.ZkMaintenanceUtils Writing file C:\Users\jenkins\workspace\Lucene-Solr-master-Windows\solr\build\solr-core\test\J0\temp\solr.cloud.ZkCLITest_C303992F6F56A35F-001\tempDir-003\solrtest-confdropspot-org.apache.solr.cloud.ZkCLITest-1323950362786521\velocity\facet_pivot.vm
   [junit4]   2> 802407 INFO  (TEST-ZkCLITest.testUpConfigLinkConfigClearZk-seed#[C303992F6F56A35F]) [    ] o.a.s.c.c.ZkMaintenanceUtils Writing file C:\Users\jenkins\workspace\Lucene-Solr-master-Windows\solr\build\solr-core\test\J0\temp\solr.cloud.ZkCLITest_C303992F6F56A35F-001\tempDir-003\solrtest-confdropspot-org.apache.solr.cloud.ZkCLITest-1323950362786521\velocity\did_you_mean.vm
   [junit4]   2> 802409 INFO  (TEST-ZkCLITest.testUpConfigLinkConfigClearZk-seed#[C303992F6F56A35F]) [    ] o.a.s.c.c.ZkMaintenanceUtils Writing file C:\Users\jenkins\workspace\Lucene-Solr-master-Windows\solr\build\solr-core\test\J0\temp\solr.cloud.ZkCLITest_C303992F6F56A35F-001\tempDir-003\solrtest-confdropspot-org.apache.solr.cloud.ZkCLITest-1323950362786521\velocity\facets.vm
   [junit4]   2> 802410 INFO  (TEST-ZkCLITest.testUpConfigLinkConfigClearZk-seed#[C303992F6F56A35F]) [    ] o.a.s.c.c.ZkMaintenanceUtils Writing file C:\Users\jenkins\workspace\Lucene-Solr-master-Windows\solr\build\solr-core\test\J0\temp\solr.cloud.ZkCLITest_C303992F6F56A35F-001\tempDir-003\solrtest-confdropspot-org.apache.solr.cloud.ZkCLITest-1323950362786521\velocity\join_doc.vm
   [junit4]   2> 802412 INFO  (TEST-ZkCLITest.testUpConfigLinkConfigClearZk-seed#[C303992F6F56A35F]) [    ] o.a.s.c.c.ZkMaintenanceUtils Writing file C:\Users\jenkins\workspace\Lucene-Solr-master-Windows\solr\build\solr-core\test\J0\temp\solr.cloud.ZkCLITest_C303992F6F56A35F-001\tempDir-003\solrtest-confdropspot-org.apache.solr.cloud.ZkCLITest-1323950362786521\velocity\footer.vm
   [junit4]   2> 802414 INFO  (TEST-ZkCLITest.testUpConfigLinkConfigClearZk-seed#[C303992F6F56A35F]) [    ] o.a.s.c.c.ZkMaintenanceUtils Writing file C:\Users\jenkins\workspace\Lucene-Solr-master-Windows\solr\build\solr-core\test\J0\temp\solr.cloud.ZkCLITest_C303992F6F56A35F-001\tempDir-003\solrtest-confdropspot-org.apache.solr.cloud.ZkCLITest-1323950362786521\velocity\query_spatial.vm
   [junit4]   2> 802416 INFO  (TEST-ZkCLITest.testUpConfigLinkConfigClearZk-seed#[C303992F6F56A35F]) [    ] o.a.s.c.c.ZkMaintenanceUtils Writing file C:\Users\jenkins\workspace\Lucene-Solr-master-Windows\solr\build\solr-core\test\J0\temp\solr.cloud.ZkCLITest_C303992F6F56A35F-001\tempDir-003\solrtest-confdropspot-org.apache.solr.cloud.ZkCLITest-1323950362786521\velocity\facet_ranges.vm
   [junit4]   2> 802418 INFO  (TEST-ZkCLITest.testUpConfigLinkConfigClearZk-seed#[C303992F6F56A35F]) [    ] o.a.s.c.c.ZkMaintenanceUtils Writing file C:\Users\jenkins\workspace\Lucene-Solr-master-Windows\solr\build\solr-core\test\J0\temp\solr.cloud.ZkCLITest_C303992F6F56A35F-001\tempDir-003\solrtest-confdropspot-org.apache.solr.cloud.ZkCLITest-1323950362786521\velocity\query_group.vm
   [junit4]   2> 802418 INFO  (TEST-ZkCLITest.testUpConfigLinkConfigClearZk-seed#[C303992F6F56A35F]) [    ] o.a.s.c.c.ZkMaintenanceUtils Writing file C:\Users\jenkins\workspace\Lucene-Solr-master-Windows\solr\build\solr-core\test\J0\temp\solr.cloud.ZkCLITest_C303992F6F56A35F-001\tempDir-003\solrtest-confdropspot-org.apache.solr.cloud.ZkCLITest-1323950362786521\velocity\head.vm
   [junit4]   2> 802421 INFO  (TEST-ZkCLITest.testUpConfigLinkConfigClearZk-seed#[C303992F6F56A35F]) [    ] o.a.s.c.c.ZkMaintenanceUtils Writing file C:\Users\jenkins\workspace\Lucene-Solr-master-Windows\solr\build\solr-core\test\J0\temp\solr.cloud.ZkCLITest_C303992F6F56A35F-001\tempDir-003\solrtest-confdropspot-org.apache.solr.cloud.ZkCLITest-1323950362786521\velocity\main.css
   [junit4]   2> 802422 INFO  (TEST-ZkCLITest.testUpConfigLinkConfigClearZk-seed#[C303992F6F56A35F]) [    ] o.a.s.c.c.ZkMaintenanceUtils Writing file C:\Users\jenkins\workspace\Lucene-Solr-master-Windows\solr\build\solr-core\test\J0\temp\solr.cloud.ZkCLITest_C303992F6F56A35F-001\tempDir-003\solrtest-confdropspot-org.apache.solr.cloud.ZkCLITest-1323950362786521\velocity\pagination_top.vm
   [junit4]   2> 802423 INFO  (TEST-ZkCLITest.testUpConfigLinkConfigClearZk-seed#[C303992F6F56A35F]) [    ] o.a.s.c.c.ZkMaintenanceUtils Writing file C:\Users\jenkins\workspace\Lucene-Solr-master-Windows\solr\build\solr-core\test\J0\temp\solr.cloud.ZkCLITest_C303992F6F56A35F-001\tempDir-003\solrtest-confdropspot-org.apache.solr.cloud.ZkCLITest-1323950362786521\velocity\README.txt
   [junit4]   2> 802425 INFO  (TEST-ZkCLITest.testUpConfigLinkConfigClearZk-seed#[C303992F6F56A35F]) [    ] o.a.s.c.c.ZkMaintenanceUtils Writing file C:\Users\jenkins\workspace\Lucene-Solr-master-Windows\solr\build\solr-core\test\J0\temp\solr.cloud.ZkCLITest_C303992F6F56A35F-001\tempDir-003\solrtest-confdropspot-org.apache.solr.cloud.ZkCLITest-1323950362786521\velocity\cluster_results.vm
   [junit4]   2> 802427 INFO  (TEST-ZkCLITest.testUpConfigLinkConfigClearZk-seed#[C303992F6F56A35F]) [    ] o.a.s.c.c.ZkMaintenanceUtils Writing file C:\Users\jenkins\workspace\Lucene-Solr-master-Windows\solr\build\solr-core\test\J0\temp\solr.cloud.ZkCLITest_C303992F6F56A35F-001\tempDir-003\solrtest-confdropspot-org.apache.solr.cloud.ZkCLITest-1323950362786521\velocity\query.vm
   [junit4]   2> 802428 INFO  (TEST-ZkCLITest.testUpConfigLinkConfigClearZk-seed#[C303992F6F56A35F]) [    ] o.a.s.c.c.ZkMaintenanceUtils Writing file C:\Users\jenkins\workspace\Lucene-Solr-master-Windows\solr\build\solr-core\test\J0\temp\solr.cloud.ZkCLITest_C303992F6F56A35F-001\tempDir-003\solrtest-confdropspot-org.apache.solr.cloud.ZkCLITest-1323950362786521\velocity\layout.vm
   [junit4]   2> 802430 INFO  (TEST-ZkCLITest.testUpConfigLinkConfigClearZk-seed#[C303992F6F56A35F]) [    ] o.a.s.c.c.ZkMaintenanceUtils Writing file C:\Users\jenkins\workspace\Lucene-Solr-master-Windows\solr\build\solr-core\test\J0\temp\solr.cloud.ZkCLITest_C303992F6F56A35F-001\tempDir-003\solrtest-confdropspot-org.apache.solr.cloud.ZkCLITest-1323950362786521\velocity\error.vm
   [junit4]   2> 802432 INFO  (TEST-ZkCLITest.testUpConfigLinkConfigClearZk-seed#[C303992F6F56A35F]) [    ] o.a.s.c.c.ZkMaintenanceUtils Writing file C:\Users\jenkins\workspace\Lucene-Solr-master-Windows\solr\build\solr-core\test\J0\temp\solr.cloud.ZkCLITest_C303992F6F56A35F-001\tempDir-003\solrtest-confdropspot-org.apache.solr.cloud.ZkCLITest-1323950362786521\velocity\header.vm
   [junit4]   2> 802434 INFO  (TEST-ZkCLITest.testUpConfigLinkConfigClearZk-seed#[C303992F6F56A35F]) [    ] o.a.s.c.c.ZkMaintenanceUtils Writing file C:\Users\jenkins\workspace\Lucene-Solr-master-Windows\solr\build\solr-core\test\J0\temp\solr.cloud.ZkCLITest_C303992F6F56A35F-001\tempDir-003\solrtest-confdropspot-org.apache.solr.cloud.ZkCLITest-1323950362786521\velocity\VM_global_library.vm
   [junit4]   2> 802435 INFO  (TEST-ZkCLITest.testUpConfigLinkConfigClearZk-seed#[C303992F6F56A35F]) [    ] o.a.s.c.c.ZkMaintenanceUtils Writing file C:\Users\jenkins\workspace\Lucene-Solr-master-Windows\solr\build\solr-core\test\J0\temp\solr.cloud.ZkCLITest_C303992F6F56A35F-001\tempDir-003\solrtest-confdropspot-org.apache.solr.cloud.ZkCLITest-1323950362786521\velocity\cluster.vm
   [junit4]   2> 802436 INFO  (TEST-ZkCLITest.testUpConfigLinkConfigClearZk-seed#[C303992F6F56A35F]) [    ] o.a.s.c.c.ZkMaintenanceUtils Writing file C:\Users\jenkins\workspace\Lucene-Solr-master-Windows\solr\build\solr-core\test\J0\temp\solr.cloud.ZkCLITest_C303992F6F56A35F-001\tempDir-003\solrtest-confdropspot-org.apache.solr.cloud.ZkCLITest-1323950362786521\velocity\richtext_doc.vm
   [junit4]   2> 802438 INFO  (TEST-ZkCLITest.testUpConfigLinkConfigClearZk-seed#[C303992F6F56A35F]) [    ] o.a.s.c.c.ZkMaintenanceUtils Writing file C:\Users\jenkins\workspace\Lucene-Solr-master-Windows\solr\build\solr-core\test\J0\temp\solr.cloud.ZkCLITest_C303992F6F56A35F-001\tempDir-003\solrtest-confdropspot-org.apache.solr.cloud.ZkCLITest-1323950362786521\velocity\browse.vm
   [junit4]   2> 802440 INFO  (TEST-ZkCLITest.testUpConfigLinkConfigClearZk-seed#[C303992F6F56A35F]) [    ] o.a.s.c.c.ZkMaintenanceUtils Writing file C:\Users\jenkins\workspace\Lucene-Solr-master-Windows\solr\build\solr-core\test\J0\temp\solr.cloud.ZkCLITest_C303992F6F56A35F-001\tempDir-003\solrtest-confdropspot-org.apache.solr.cloud.ZkCLITest-1323950362786521\_schema_analysis_synonyms_english.json
   [junit4]   2> 802441 INFO  (TEST-ZkCLITest.testUpConfigLinkConfigClearZk-seed#[C303992F6F56A35F]) [    ] o.a.s.c.c.ZkMaintenanceUtils Writing file C:\Users\jenkins\workspace\Lucene-Solr-master-Windows\solr\build\solr-core\test\J0\temp\solr.cloud.ZkCLITest_C303992F6F56A35F-001\tempDir-003\solrtest-confdropspot-org.apache.solr.cloud.ZkCLITest-1323950362786521\admin-extra.html
   [junit4]   2> 802443 INFO  (TEST-ZkCLITest.testUpConfigLinkConfigClearZk-seed#[C303992F6F56A35F]) [    ] o.a.s.c.c.ZkMaintenanceUtils Writing file C:\Users\jenkins\workspace\Lucene-Solr-master-Windows\solr\build\solr-core\test\J0\temp\solr.cloud.ZkCLITest_C303992F6F56A35F-001\tempDir-003\solrtest-confdropspot-org.apache.solr.cloud.ZkCLITest-1323950362786521\update-script.js
   [junit4]   2> 802444 INFO  (TEST-ZkCLITest.testUpConfigLinkConfigClearZk-seed#[C303992F6F56A35F]) [    ] o.a.s.c.c.ZkMaintenanceUtils Writing file C:\Users\jenkins\workspace\Lucene-Solr-master-Windows\solr\build\solr-core\test\J0\temp\solr.cloud.ZkCLITest_C303992F6F56A35F-001\tempDir-003\solrtest-confdropspot-org.apache.solr.cloud.ZkCLITest-1323950362786521\_schema_analysis_stopwords_english.json
   [junit4]   2> 802446 INFO  (TEST-ZkCLITest.testUpConfigLinkConfigClearZk-seed#[C303992F6F56A35F]) [    ] o.a.s.c.c.ZkMaintenanceUtils Writing file C:\Users\jenkins\workspace\Lucene-Solr-master-Windows\solr\build\solr-core\test\J0\temp\solr.cloud.ZkCLITest_C303992F6F56A35F-001\tempDir-003\solrtest-confdropspot-org.apache.solr.cloud.ZkCLITest-1323950362786521\solrconfig.xml
   [junit4]   2> 802448 INFO  (TEST-ZkCLITest.testUpConfigLinkConfigClearZk-seed#[C303992F6F56A35F]) [    ] o.a.s.c.c.ZkMaintenanceUtils Writing file C:\Users\jenkins\workspace\Lucene-Solr-master-Windows\solr\build\solr-core\test\J0\temp\solr.cloud.ZkCLITest_C303992F6F56A35F-001\tempDir-003\solrtest-confdropspot-org.apache.solr.cloud.ZkCLITest-1323950362786521\admin-extra.menu-top.html
   [junit4]   2> 802450 INFO  (TEST-ZkCLITest.testUpConfigLinkConfigClearZk-seed#[C303992F6F56A35F]) [    ] o.a.s.c.c.ZkMaintenanceUtils Writing file C:\Users\jenkins\workspace\Lucene-Solr-master-Windows\solr\build\solr-core\test\J0\temp\solr.cloud.ZkCLITest_C303992F6F56A35F-001\tempDir-003\solrtest-confdropspot-org.apache.solr.cloud.ZkCLITest-1323950362786521\elevate.xml
   [junit4]   2> 802454 INFO  (TEST-ZkCLITest.testUpConfigLinkConfigClearZk-seed#[C303992F6F56A35F]) [    ] o.a.s.c.c.ZkMaintenanceUtils Writing file C:\Users\jenkins\workspace\Lucene-Solr-master-Windows\solr\build\solr-core\test\J0\temp\solr.cloud.ZkCLITest_C303992F6F56A35F-001\tempDir-003\solrtest-confdropspot-org.apache.solr.cloud.ZkCLITest-1323950362786521\clustering\carrot2\README.txt
   [junit4]   2> 802455 INFO  (TEST-ZkCLITest.testUpConfigLinkConfigClearZk-seed#[C303992F6F56A35F]) [    ] o.a.s.c.c.ZkMaintenanceUtils Writing file C:\Users\jenkins\workspace\Lucene-Solr-master-Windows\solr\build\solr-core\test\J0\temp\solr.cloud.ZkCLITest_C303992F6F56A35F-001\tempDir-003\solrtest-confdropspot-org.apache.solr.cloud.ZkCLITest-1323950362786521\clustering\carrot2\lingo-attributes.xml
   [junit4]   2> 802457 INFO  (TEST-ZkCLITest.testUpConfigLinkConfigClearZk-seed#[C303992F6F56A35F]) [    ] o.a.s.c.c.ZkMaintenanceUtils Writing file C:\Users\jenkins\workspace\Lucene-Solr-master-Windows\solr\build\solr-core\test\J0\temp\solr.cloud.ZkCLITest_C303992F6F56A35F-001\tempDir-003\solrtest-confdropspot-org.apache.solr.cloud.ZkCLITest-1323950362786521\clustering\carrot2\stc-attributes.xml
   [junit4]   2> 802458 INFO  (TEST-ZkCLITest.testUpConfigLinkConfigClearZk-seed#[C303992F6F56A35F]) [    ] o.a.s.c.c.ZkMaintenanceUtils Writing file C:\Users\jenkins\workspace\Lucene-Solr-master-Windows\solr\build\solr-core\test\J0\temp\solr.cloud.ZkCLITest_C303992F6F56A35F-001\tempDir-003\solrtest-confdropspot-org.apache.solr.cloud.ZkCLITest-1323950362786521\clustering\carrot2\kmeans-attributes.xml
   [junit4]   2> 802460 INFO  (TEST-ZkCLITest.testUpConfigLinkConfigClearZk-seed#[C303992F6F56A35F]) [    ] o.a.s.c.c.ZkMaintenanceUtils Writing file C:\Users\jenkins\workspace\Lucene-Solr-master-Windows\solr\build\solr-core\test\J0\temp\solr.cloud.ZkCLITest_C303992F6F56A35F-001\tempDir-003\solrtest-confdropspot-org.apache.solr.cloud.ZkCLITest-1323950362786521\mapping-ISOLatin1Accent.txt
   [junit4]   2> 802462 INFO  (TEST-ZkCLITest.testUpConfigLinkConfigClearZk-seed#[C303992F6F56A35F]) [    ] o.a.s.c.c.ZkMaintenanceUtils Writing file C:\Users\jenkins\workspace\Lucene-Solr-master-Windows\solr\build\solr-core\test\J0\temp\solr.cloud.ZkCLITest_C303992F6F56A35F-001\tempDir-003\solrtest-confdropspot-org.apache.solr.cloud.ZkCLITest-1323950362786521\spellings.txt
   [junit4]   2> 802466 INFO  (TEST-ZkCLITest.testUpConfigLinkConfigClearZk-seed#[C303992F6F56A35F]) [    ] o.a.s.c.c.ZkMaintenanceUtils Writing file C:\Users\jenkins\workspace\Lucene-Solr-master-Windows\solr\build\solr-core\test\J0\temp\solr.cloud.ZkCLITest_C303992F6F56A35F-001\tempDir-003\solrtest-confdropspot-org.apache.solr.cloud.ZkCLITest-1323950362786521\xslt\example_atom.xsl
   [junit4]   2> 802468 INFO  (TEST-ZkCLITest.testUpConfigLinkConfigClearZk-seed#[C303992F6F56A35F]) [    ] o.a.s.c.c.ZkMaintenanceUtils Writing file C:\Users\jenkins\workspace\Lucene-Solr-master-Windows\solr\build\solr-core\test\J0\temp\solr.cloud.ZkCLITest_C303992F6F56A35F-001\tempDir-003\solrtest-confdropspot-org.apache.solr.cloud.ZkCLITest-1323950362786521\xslt\example_rss.xsl
   [junit4]   2> 802470 INFO  (TEST-ZkCLITest.testUpConfigLinkConfigClearZk-seed#[C303992F6F56A35F]) [    ] o.a.s.c.c.ZkMaintenanceUtils Writing file C:\Users\jenkins\workspace\Lucene-Solr-master-Windows\solr\build\solr-core\test\J0\temp\solr.cloud.ZkCLITest_C303992F6F56A35F-001\tempDir-003\solrtest-confdropspot-org.apache.solr.cloud.ZkCLITest-1323950362786521\xslt\luke.xsl
   [junit4]   2> 802471 INFO  (TEST-ZkCLITest.testUpConfigLinkConfigClearZk-seed#[C303992F6F56A35F]) [    ] o.a.s.c.c.ZkMaintenanceUtils Writing file C:\Users\jenkins\workspace\Lucene-Solr-master-Windows\solr\build\solr-core\test\J0\temp\solr.cloud.ZkCLITest_C303992F6F56A35F-001\tempDir-003\solrtest-confdropspot-org.apache.solr.cloud.ZkCLITest-1323950362786521\xslt\updateXml.xsl
   [junit4]   2> 802474 INFO  (TEST-ZkCLITest.testUpConfigLinkConfigClearZk-seed#[C303992F6F56A35F]) [    ] o.a.s.c.c.ZkMaintenanceUtils Writing file C:\Users\jenkins\workspace\Lucene-Solr-master-Windows\solr\build\solr-core\test\J0\temp\solr.cloud.ZkCLITest_C303992F6F56A35F-001\tempDir-003\solrtest-confdropspot-org.apache.solr.cloud.ZkCLITest-1323950362786521\xslt\example.xsl
   [junit4]   2> 802475 INFO  (TEST-ZkCLITest.testUpConfigLinkConfigClearZk-seed#[C303992F6F56A35F]) [    ] o.a.s.c.c.ZkMaintenanceUtils Writing file C:\Users\jenkins\workspace\Lucene-Solr-master-Windows\solr\build\solr-core\test\J0\temp\solr.cloud.ZkCLITest_C303992F6F56A35F-001\tempDir-003\solrtest-confdropspot-org.apache.solr.cloud.ZkCLITest-1323950362786521\_rest_managed.json
   [junit4]   2> 802477 INFO  (TEST-ZkCLITest.testUpConfigLinkConfigClearZk-seed#[C303992F6F56A35F]) [    ] o.a.s.c.c.ZkMaintenanceUtils Writing file C:\Users\jenkins\workspace\Lucene-Solr-master-Windows\solr\build\solr-core\test\J0\temp\solr.cloud.ZkCLITest_C303992F6F56A35F-001\tempDir-003\solrtest-confdropspot-org.apache.solr.cloud.ZkCLITest-1323950362786521\lang\contractions_it.txt
   [junit4]   2> 802478 INFO  (TEST-ZkCLITest.testUpConfigLinkConfigClearZk-seed#[C303992F6F56A35F]) [    ] o.a.s.c.c.ZkMaintenanceUtils Writing file C:\Users\jenkins\workspace\Lucene-Solr-master-Windows\solr\build\solr-core\test\J0\temp\solr.cloud.ZkCLITest_C303992F6F56A35F-001\tempDir-003\solrtest-confdropspot-org.apache.solr.cloud.ZkCLITest-1323950362786521\lang\contractions_ca.txt
   [junit4]   2> 802480 INFO  (TEST-ZkCLITest.testUpConfigLinkConfigClearZk-seed#[C303992F6F56A35F]) [    ] o.a.s.c.c.ZkMaintenanceUtils Writing file C:\Users\jenkins\workspace\Lucene-Solr-master-Windows\solr\build\solr-core\test\J0\temp\solr.cloud.ZkCLITest_C303992F6F56A35F-001\tempDir-003\solrtest-confdropspot-org.apache.solr.cloud.ZkCLITest-1323950362786521\lang\stemdict_nl.txt
   [junit4]   2> 802481 INFO  (TEST-ZkCLITest.testUpConfigLinkConfigClearZk-seed#[C303992F6F56A35F]) [    ] o.a.s.c.c.ZkMaintenanceUtils Writing file C:\Users\jenkins\workspace\Lucene-Solr-master-Windows\solr\build\solr-core\test\J0\temp\solr.cloud.ZkCLITest_C303992F6F56A35F-001\tempDir-003\solrtest-confdropspot-org.apache.solr.cloud.ZkCLITest-1323950362786521\lang\stopwords_hy.txt
   [junit4]   2> 802482 INFO  (TEST-ZkCLITest.testUpConfigLinkConfigClearZk-seed#[C303992F6F56A35F]) [    ] o.a.s.c.c.ZkMaintenanceUtils Writing file C:\Users\jenkins\workspace\Lucene-Solr-master-Windows\solr\build\solr-core\test\J0\temp\solr.cloud.ZkCLITest_C303992F6F56A35F-001\tempDir-003\solrtest-confdropspot-org.apache.solr.cloud.ZkCLITest-1323950362786521\lang\stopwords_no.txt
   [junit4]   2> 802483 INFO  (TEST-ZkCLITest.testUpConfigLinkConfigClearZk-seed#[C303992F6F56A35F]) [    ] o.a.s.c.c.ZkMaintenanceUtils Writing file C:\Users\jenkins\workspace\Lucene-Solr-master-Windows\solr\build\solr-core\test\J0\temp\solr.cloud.ZkCLITest_C303992F6F56A35F-001\tempDir-003\solrtest-confdropspot-org.apache.solr.cloud.ZkCLITest-1323950362786521\lang\stopwords_id.txt
   [junit4]   2> 802485 INFO  (TEST-ZkCLITest.testUpConfigLinkConfigClearZk-seed#[C303992F6F56A35F]) [    ] o.a.s.c.c.ZkMaintenanceUtils Writing file C:\Users\jenkins\workspace\Lucene-Solr-master-Windows\solr\build\solr-core\test\J0\temp\solr.cloud.ZkCLITest_C303992F6F56A35F-001\tempDir-003\solrtest-confdropspot-org.apache.solr.cloud.ZkCLITest-1323950362786521\lang\stopwords_da.txt
   [junit4]   2> 802486 INFO  (TEST-ZkCLITest.testUpConfigLinkConfigClearZk-seed#[C303992F6F56A35F]) [    ] o.a.s.c.c.ZkMaintenanceUtils Writing file C:\Users\jenkins\workspace\Lucene-Solr-master-Windows\solr\build\solr-core\test\J0\temp\solr.cloud.ZkCLITest_C303992F6F56A35F-001\tempDir-003\solrtest-confdropspot-org.apache.solr.cloud.ZkCLITest-1323950362786521\lang\stopwords_ga.txt
   [junit4]   2> 802488 INFO  (TEST-ZkCLITest.testUpConfigLinkConfigClearZk-seed#[C303992F6F56A35F]) [    ] o.a.s.c.c.ZkMaintenanceUtils Writing file C:\Users\jenkins\workspace\Lucene-Solr-master-Windows\solr\build\solr-core\test\J0\temp\solr.cloud.ZkCLITest_C303992F6F56A35F-001\tempDir-003\solrtest-confdropspot-org.apache.solr.cloud.ZkCLITest-1323950362786521\lang\stopwords_hi.txt
   [junit4]   2> 802489 INFO  (TEST-ZkCLITest.testUpConfigLinkConfigClearZk-seed#[C303992F6F56A35F]) [    ] o.a.s.c.c.ZkMaintenanceUtils Writing file C:\Users\jenkins\workspace\Lucene-Solr-master-Windows\solr\build\solr-core\test\J0\temp\solr.cloud.ZkCLITest_C303992F6F56A35F-001\tempDir-003\solrtest-confdropspot-org.apache.solr.cloud.ZkCLITest-1323950362786521\lang\stopwords_ja.txt
   [junit4]   2> 802490 INFO  (TEST-ZkCLITest.testUpConfigLinkConfigClearZk-seed#[C303992F6F56A35F]) [    ] o.a.s.c.c.ZkMaintenanceUtils Writing file C:\Users\jenkins\workspace\Lucene-Solr-master-Windows\solr\build\solr-core\test\J0\temp\solr.cloud.ZkCLITest_C303992F6F56A35F-001\tempDir-003\solrtest-confdropspot-org.apache.solr.cloud.ZkCLITest-1323950362786521\lang\stopwords_pt.txt
   [junit4]   2> 802491 INFO  (TEST-ZkCLITest.testUpConfigLinkConfigClearZk-seed#[C303992F6F56A35F]) [    ] o.a.s.c.c.ZkMaintenanceUtils Writing file C:\Users\jenkins\workspace\Lucene-Solr-master-Windows\solr\build\solr-core\test\J0\temp\solr.cloud.ZkCLITest_C303992F6F56A35F-001\tempDir-003\solrtest-confdropspot-org.apache.solr.cloud.ZkCLITest-1323950362786521\lang\stopwords_hu.txt
   [junit4]   2> 802492 INFO  (TEST-ZkCLITest.testUpConfigLinkConfigClearZk-seed#[C303992F6F56A35F]) [    ] o.a.s.c.c.ZkMaintenanceUtils Writing file C:\Users\jenkins\workspace\Lucene-Solr-master-Windows\solr\build\solr-core\test\J0\temp\solr.cloud.ZkCLITest_C303992F6F56A35F-001\tempDir-003\solrtest-confdropspot-org.apache.solr.cloud.ZkCLITest-1323950362786521\lang\stopwords_ckb.txt
   [junit4]   2> 802494 INFO  (TEST-ZkCLITest.testUpConfigLinkConfigClearZk-seed#[C303992F6F56A35F]) [    ] o.a.s.c.c.ZkMaintenanceUtils Writing file C:\Users\jenkins\workspace\Lucene-Solr-master-Windows\solr\build\solr-core\test\J0\temp\solr.cloud.ZkCLITest_C303992F6F56A35F-001\tempDir-003\solrtest-confdropspot-org.apache.solr.cloud.ZkCLITest-1323950362786521\lang\stopwords_el.txt
   [junit4]   2> 802495 INFO  (TEST-ZkCLITest.testUpConfigLinkConfigClearZk-seed#[C303992F6F56A35F]) [    ] o.a.s.c.c.ZkMaintenanceUtils Writing file C:\Users\jenkins\workspace\Lucene-Solr-master-Windows\solr\build\solr-core\test\J0\temp\solr.cloud.ZkCLITest_C303992F6F56A35F-001\tempDir-003\solrtest-confdropspot-org.apache.solr.cloud.ZkCLITest-1323950362786521\lang\stopwords_ru.txt
   [junit4]   2> 802496 INFO  (TEST-ZkCLITest.testUpConfigLinkConfigClearZk-seed#[C303992F6F56A35F]) [    ] o.a.s.c.c.ZkMaintenanceUtils Writing file C:\Users\jenkins\workspace\Lucene-Solr-master-Windows\solr\build\solr-core\test\J0\temp\solr.cloud.ZkCLITest_C303992F6F56A35F-001\tempDir-003\solrtest-confdropspot-org.apache.solr.cloud.ZkCLITest-1323950362786521\lang\stopwords_tr.txt
   [junit4]   2> 802496 INFO  (TEST-ZkCLITest.testUpConfigLinkConfigClearZk-seed#[C303992F6F56A35F]) [    ] o.a.s.c.c.ZkMaintenanceUtils Writing file C:\Users\jenkins\workspace\Lucene-Solr-master-Windows\solr\build\solr-core\test\J0\temp\solr.cloud.ZkCLITest_C303992F6F56A35F-001\tempDir-003\solrtest-confdropspot-org.apache.solr.cloud.ZkCLITest-1323950362786521\lang\stopwords_ar.txt
   [junit4]   2> 802500 INFO  (TEST-ZkCLITest.testUpConfigLinkConfigClearZk-seed#[C303992F6F56A35F]) [    ] o.a.s.c.c.ZkMaintenanceUtils Writing file C:\Users\jenkins\workspace\Lucene-Solr-master-Windows\solr\build\solr-core\test\J0\temp\solr.cloud.ZkCLITest_C303992F6F56A35F-001\tempDir-003\solrtest-confdropspot-org.apache.solr.cloud.ZkCLITest-1323950362786521\lang\userdict_ja.txt
   [junit4]   2> 802501 INFO  (TEST-ZkCLITest.testUpConfigLinkConfigClearZk-seed#[C303992F6F56A35F]) [    ] o.a.s.c.c.ZkMaintenanceUtils Writing file C:\Users\jenkins\workspace\Lucene-Solr-master-Windows\solr\build\solr-core\test\J0\temp\solr.cloud.ZkCLITest_C303992F6F56A35F-001\tempDir-003\solrtest-confdropspot-org.apache.solr.cloud.ZkCLITest-1323950362786521\lang\stopwords_eu.txt
   [junit4]   2> 802503 INFO  (TEST-ZkCLITest.testUpConfigLinkConfigClearZk-seed#[C303992F6F56A35F]) [    ] o.a.s.c.c.ZkMaintenanceUtils Writing file C:\Users\jenkins\workspace\Lucene-Solr-master-Windows\solr\build\solr-core\test\J0\temp\solr.cloud.ZkCLITest_C303992F6F56A35F-001\tempDir-003\solrtest-confdropspot-org.apache.solr.cloud.ZkCLITest-1323950362786521\lang\stopwords_it.txt
   [junit4]   2> 802503 INFO  (TEST-ZkCLITest.testUpConfigLinkConfigClearZk-seed#[C303992F6F56A35F]) [    ] o.a.s.c.c.ZkMaintenanceUtils Writing file C:\Users\jenkins\workspace\Lucene-Solr-master-Windows\solr\build\solr-core\test\J0\temp\solr.cloud.ZkCLITest_C303992F6F56A35F-001\tempDir-003\solrtest-confdropspot-org.apache.solr.cloud.ZkCLITest-1323950362786521\lang\stopwords_cz.txt
   [junit4]   2> 802505 INFO  (TEST-ZkCLITest.testUpConfigLinkConfigClearZk-seed#[C303992F6F56A35F]) [    ] o.a.s.c.c.ZkMaintenanceUtils Writing file C:\Users\jenkins\workspace\Lucene-Solr-master-Windows\solr\build\solr-core\test\J0\temp\solr.cloud.ZkCLITest_C303992F6F56A35F-001\tempDir-003\solrtest-confdropspot-org.apache.solr.cloud.ZkCLITest-1323950362786521\lang\stoptags_ja.txt
   [junit4]   2> 802507 INFO  (TEST-ZkCLITest.testUpConfigLinkConfigClearZk-seed#[C303992F6F56A35F]) [    ] o.a.s.c.c.ZkMaintenanceUtils Writing file C:\Users\jenkins\workspace\Lucene-Solr-master-Windows\solr\build\solr-core\test\J0\temp\solr.cloud.ZkCLITest_C303992F6F56A35F-001\tempDir-003\solrtest-confdropspot-org.apache.solr.cloud.ZkCLITest-1323950362786521\lang\contractions_fr.txt
   [junit4]   2> 802508 INFO  (TEST-ZkCLITest.testUpConfigLinkConfigClearZk-seed#[C303992F6F56A35F]) [    ] o.a.s.c.c.ZkMaintenanceUtils Writing file C:\Users\jenkins\workspace\Lucene-Solr-master-Windows\solr\build\solr-core\test\J0\temp\solr.cloud.ZkCLITest_C303992F6F56A35F-001\tempDir-003\solrtest-confdropspot-org.apache.solr.cloud.ZkCLITest-1323950362786521\lang\stopwords_de.txt
   [junit4]   2> 802509 INFO  (TEST-ZkCLITest.testUpConfigLinkConfigClearZk-seed#[C303992F6F56A35F]) [    ] o.a.s.c.c.ZkMaintenanceUtils Writing file C:\Users\jenkins\workspace\Lucene-Solr-master-Windows\solr\build\solr-core\test\J0\temp\solr.cloud.ZkCLITest_C303992F6F56A35F-001\tempDir-003\solrtest-confdropspot-org.apache.solr.cloud.ZkCLITest-1323950362786521\lang\stopwords_fa.txt
   [junit4]   2> 802511 INFO  (TEST-ZkCLITest.testUpConfigLinkConfigClearZk-seed#[C303992F6F56A35F]) [    ] o.a.s.c.c.ZkMaintenanceUtils Writing file C:\Users\jenkins\workspace\Lucene-Solr-master-Windows\solr\build\solr-core\test\J0\temp\solr.cloud.ZkCLITest_C303992F6F56A35F-001\tempDir-003\solrtest-confdropspot-org.apache.solr.cloud.ZkCLITest-1323950362786521\lang\contractions_ga.txt
   [junit4]   2> 802512 INFO  (TEST-ZkCLITest.testUpConfigLinkConfigClearZk-seed#[C303992F6F56A35F]) [    ] o.a.s.c.c.ZkMaintenanceUtils Writing file C:\Users\jenkins\workspace\Lucene-Solr-master-Windows\solr\build\solr-core\test\J0\temp\solr.cloud.ZkCLITest_C303992F6F56A35F-001\tempDir-003\solrtest-confdropspot-org.apache.solr.cloud.ZkCLITest-1323950362786521\lang\stopwords_ca.txt
   [junit4]   2> 802513 INFO  (TEST-ZkCLITest.testUpConfigLinkConfigClearZk-seed#[C303992F6F56A35F]) [    ] o.a.s.c.c.ZkMaintenanceUtils Writing file C:\Users\jenkins\workspace\Lucene-Solr-master-Windows\solr\build\solr-core\test\J0\temp\solr.cloud.ZkCLITest_C303992F6F56A35F-001\tempDir-003\solrtest-confdropspot-org.apache.solr.cloud.ZkCLITest-1323950362786521\lang\stopwords_nl.txt
   [junit4]   2> 802514 INFO  (TEST-ZkCLITest.testUpConfigLinkConfigClearZk-seed#[C303992F6F56A35F]) [    ] o.a.s.c.c.ZkMaintenanceUtils Writing file C:\Users\jenkins\workspace\Lucene-Solr-master-Windows\solr\build\solr-core\test\J0\temp\solr.cloud.ZkCLITest_C303992F6F56A35F-001\tempDir-003\solrtest-confdropspot-org.apache.solr.cloud.ZkCLITest-1323950362786521\lang\stopwords_bg.txt
   [junit4]   2> 802515 INFO  (TEST-ZkCLITest.testUpConfigLinkConfigClearZk-seed#[C303992F6F56A35F]) [    ] o.a.s.c.c.ZkMaintenanceUtils Writing file C:\Users\jenkins\workspace\Lucene-Solr-master-Windows\solr\build\solr-core\test\J0\temp\solr.cloud.ZkCLITest_C303992F6F56A35F-001\tempDir-003\solrtest-confdropspot-org.apache.solr.cloud.ZkCLITest-1323950362786521\lang\stopwords_en.txt
   [junit4]   2> 802516 INFO  (TEST-ZkCLITest.testUpConfigLinkConfigClearZk-seed#[C303992F6F56A35F]) [    ] o.a.s.c.c.ZkMaintenanceUtils Writing file C:\Users\jenkins\workspace\Lucene-Solr-master-Windows\solr\build\solr-core\test\J0\temp\solr.cloud.ZkCLITest_C303992F6F56A35F-001\tempDir-003\solrtest-confdropspot-org.apache.solr.cloud.ZkCLITest-1323950362786521\lang\stopwords_es.txt
   [junit4]   2> 802519 INFO  (TEST-ZkCLITest.testUpConfigLinkConfigClearZk-seed#[C303992F6F56A35F]) [    ] o.a.s.c.c.ZkMaintenanceUtils Writing file C:\Users\jenkins\workspace\Lucene-Solr-master-Windows\solr\build\s

[...truncated too long message...]

ction1 oash.ReplicationHandler.inform Commits will be reserved for 10000ms.
   [junit4]   2> 34894 T314 x:x:collection1 oasc.SolrCore.registerSearcher [collection1] Registered new searcher Searcher@1911b0f[collection1] main{ExitableDirectoryReader(UninvertingDirectoryReader())}
   [junit4]   2> ASYNC  NEW_CORE C16 name=collection1 org.apache.solr.core.SolrCore@11fef4d
   [junit4]   2> 34896 T104 C16 oasc.SolrCore.execute [collection1]  webapp=null path=null params={q=*:*&qt=&start=0&rows=20&version=2.2} hits=0 status=0 QTime=0
   [junit4]   2> ASYNC  NEW_CORE C17 name=collection1 org.apache.solr.core.SolrCore@4d7cc5
   [junit4]   2> 34910 T305 x:x:collection1 C17 oasup.LogUpdateProcessorFactory$LogUpdateProcessor.finish [collection1]  webapp=/solr path=/update params={wt=javabin&version=2}{add=[1]} 0 4
   [junit4]   2> 34912 T303 x:x:collection1 C17 oasu.DirectUpdateHandler2.commit start commit{,optimize=false,openSearcher=true,waitSearcher=true,expungeDeletes=false,softCommit=false,prepareCommit=false}
   [junit4]   2> 34913 T303 x:x:collection1 C17 oasu.SolrIndexWriter.setCommitData Calling setCommitData with IW:org.apache.solr.update.SolrIndexWriter@1be9965 commitCommandVersion:0
   [junit4]   2> 35181 T303 x:x:collection1 C17 oass.SolrIndexSearcher.<init> Opening [Searcher@1712943[collection1] main]
   [junit4]   2> 35182 T303 x:x:collection1 C17 oasu.DirectUpdateHandler2.commit end_commit_flush
   [junit4]   2> 35184 T314 x:x:collection1 C17 oasc.SolrCore.registerSearcher [collection1] Registered new searcher Searcher@1712943[collection1] main{ExitableDirectoryReader(UninvertingDirectoryReader(Uninverting(_0(8.0.0):c1)))}
   [junit4]   2> 35184 T303 x:x:collection1 C17 oasup.LogUpdateProcessorFactory$LogUpdateProcessor.finish [collection1]  webapp=/solr path=/update params={waitSearcher=true&commit=true&softCommit=false&wt=javabin&version=2}{commit=} 0 272
   [junit4]   2> 35191 T104 C16 oashdc.DIHConfiguration.verifyWithSchema id is a required field in SolrSchema . But not found in DataConfig
   [junit4]   2> 35191 T104 C16 oashd.DataImporter.loadDataConfig Data Configuration loaded successfully
   [junit4]   2> 35191 T104 C16 oashd.DataImporter.doFullImport Starting Full Import
   [junit4]   2> 35193 T104 C16 oashd.SimplePropertiesWriter.readIndexerProperties WARN Unable to read: dataimport.properties
   [junit4]   2> 35194 T104 C16 oasu.DirectUpdateHandler2.deleteAll [collection1] REMOVING ALL DOCUMENTS FROM INDEX
   [junit4]   2> 35205 T104 C16 oashd.SolrEntityProcessor.firstInit using BinaryResponseParser
   [junit4]   2> 35214 T306 x:x:collection1 C17 oasc.SolrCore.execute [collection1]  webapp=/solr path=/select params={q=*:*&fl=id,desc&start=0&timeAllowed=300000&rows=2&wt=javabin&version=2} hits=1 status=0 QTime=0
   [junit4]   2> 35217 T104 C16 oashd.DocBuilder.finish Import completed successfully
   [junit4]   2> 35219 T104 C16 oasu.DirectUpdateHandler2.commit start commit{,optimize=false,openSearcher=true,waitSearcher=true,expungeDeletes=false,softCommit=false,prepareCommit=false}
   [junit4]   2> 35219 T104 C16 oasu.SolrIndexWriter.setCommitData Calling setCommitData with IW:org.apache.solr.update.SolrIndexWriter@11f8aab commitCommandVersion:0
   [junit4]   2> 35241 T104 C16 oass.SolrIndexSearcher.<init> Opening [Searcher@e448a5[collection1] main]
   [junit4]   2> 35241 T104 C16 oasu.DirectUpdateHandler2.commit end_commit_flush
   [junit4]   2> 35248 T295 C16 oasc.SolrCore.registerSearcher [collection1] Registered new searcher Searcher@e448a5[collection1] main{ExitableDirectoryReader(UninvertingDirectoryReader(Uninverting(_0(8.0.0):c1)))}
   [junit4]   2> 35248 T104 C16 oashd.SimplePropertiesWriter.readIndexerProperties WARN Unable to read: dataimport.properties
   [junit4]   2> 35248 T104 C16 oashd.SimplePropertiesWriter.persist Wrote last indexed time to dataimport.properties
   [junit4]   2> 35248 T104 C16 oashd.DocBuilder.execute Time taken = 0:0:0.57
   [junit4]   2> 35248 T104 C16 oasup.LogUpdateProcessorFactory$LogUpdateProcessor.finish [collection1]  webapp=null path=null params={debug=on&commit=true&dataConfig=<dataConfig>%0d%0a++<document>%0d%0a++++<entity+name%3D'se'+processor%3D'SolrEntityProcessor'+++url%3D'http://127.0.0.1:53610/solr/collection1'+query%3D'*:*'+rows%3D'2'+fl%3D'id,desc'+onError%3D'skip'+/>%0d%0a++</document>%0d%0a</dataConfig>%0d%0a&clean=true&wt=xml&command=full-import}{deleteByQuery=*:*,add=[1],commit=} 0 63
   [junit4]   2> 35248 T104 C16 oasc.SolrCore.execute [collection1]  webapp=null path=null params={q=*:*&qt=&start=0&rows=20&version=2.2} hits=1 status=0 QTime=0
   [junit4]   2> 35248 T104 C16 oasc.SolrCore.execute [collection1]  webapp=null path=null params={q=id:1&qt=&start=0&rows=20&version=2.2} hits=1 status=0 QTime=0
   [junit4]   2> 35248 T104 oas.SolrTestCaseJ4.deleteCore ###deleteCore
   [junit4]   2> 35248 T104 oasc.CoreContainer.shutdown Shutting down CoreContainer instance=25295539
   [junit4]   2> 35248 T104 oasm.SolrMetricManager.closeReporters Closing metric reporters for registry=solr.node, tag=null
   [junit4]   2> 35248 T104 oasmr.SolrJmxReporter.close Closing reporter [org.apache.solr.metrics.reporters.SolrJmxReporter@7335b1: rootName = null, domain = solr.node, service url = null, agent id = null] for registry solr.node / com.codahale.metrics.MetricRegistry@8eae6c
   [junit4]   2> 35257 T104 oasm.SolrMetricManager.closeReporters Closing metric reporters for registry=solr.jvm, tag=null
   [junit4]   2> 35258 T104 oasmr.SolrJmxReporter.close Closing reporter [org.apache.solr.metrics.reporters.SolrJmxReporter@1366e6: rootName = null, domain = solr.jvm, service url = null, agent id = null] for registry solr.jvm / com.codahale.metrics.MetricRegistry@ca82cd
   [junit4]   2> 35260 T104 oasm.SolrMetricManager.closeReporters Closing metric reporters for registry=solr.jetty, tag=null
   [junit4]   2> 35261 T104 oasmr.SolrJmxReporter.close Closing reporter [org.apache.solr.metrics.reporters.SolrJmxReporter@4943b6: rootName = null, domain = solr.jetty, service url = null, agent id = null] for registry solr.jetty / com.codahale.metrics.MetricRegistry@978be7
   [junit4]   2> 35262 T318 x:x:collection1 oasc.SolrCore.close [collection1]  CLOSING SolrCore org.apache.solr.core.SolrCore@11fef4d
   [junit4]   2> 35262 T318 x:x:collection1 oasm.SolrMetricManager.closeReporters Closing metric reporters for registry=solr.core.collection1, tag=18870093
   [junit4]   2> 35262 T318 x:x:collection1 oasmr.SolrJmxReporter.close Closing reporter [org.apache.solr.metrics.reporters.SolrJmxReporter@10a4477: rootName = null, domain = solr.core.collection1, service url = null, agent id = null] for registry solr.core.collection1 / com.codahale.metrics.MetricRegistry@16995bd
   [junit4]   2> 35301 T104 oejs.AbstractConnector.doStop Stopped ServerConnector@15afca1{HTTP/1.1,[http/1.1]}{127.0.0.1:0}
   [junit4]   2> 35301 T104 oasc.CoreContainer.shutdown Shutting down CoreContainer instance=14817588
   [junit4]   2> 35301 T104 oasm.SolrMetricManager.closeReporters Closing metric reporters for registry=solr.node, tag=null
   [junit4]   2> 35301 T104 oasmr.SolrJmxReporter.close Closing reporter [org.apache.solr.metrics.reporters.SolrJmxReporter@f70778: rootName = null, domain = solr.node, service url = null, agent id = null] for registry solr.node / com.codahale.metrics.MetricRegistry@1b2fdc0
   [junit4]   2> 35309 T104 oasm.SolrMetricManager.closeReporters Closing metric reporters for registry=solr.jvm, tag=null
   [junit4]   2> 35309 T104 oasmr.SolrJmxReporter.close Closing reporter [org.apache.solr.metrics.reporters.SolrJmxReporter@4dbd0e: rootName = null, domain = solr.jvm, service url = null, agent id = null] for registry solr.jvm / com.codahale.metrics.MetricRegistry@ca82cd
   [junit4]   2> 35315 T104 oasm.SolrMetricManager.closeReporters Closing metric reporters for registry=solr.jetty, tag=null
   [junit4]   2> 35315 T104 oasmr.SolrJmxReporter.close Closing reporter [org.apache.solr.metrics.reporters.SolrJmxReporter@1441be4: rootName = null, domain = solr.jetty, service url = null, agent id = null] for registry solr.jetty / com.codahale.metrics.MetricRegistry@978be7
   [junit4]   2> 35357 T321 x:x:collection1 oasc.SolrCore.close [collection1]  CLOSING SolrCore org.apache.solr.core.SolrCore@4d7cc5
   [junit4]   2> 35357 T321 x:x:collection1 oasm.SolrMetricManager.closeReporters Closing metric reporters for registry=solr.core.collection1, tag=5078213
   [junit4]   2> 35357 T321 x:x:collection1 oasmr.SolrJmxReporter.close Closing reporter [org.apache.solr.metrics.reporters.SolrJmxReporter@1028df6: rootName = null, domain = solr.core.collection1, service url = null, agent id = null] for registry solr.core.collection1 / com.codahale.metrics.MetricRegistry@b682a
   [junit4]   2> 35393 T104 oejsh.ContextHandler.doStop Stopped o.e.j.s.ServletContextHandler@1cd3e5{/solr,null,UNAVAILABLE}
   [junit4]   2> 35408 T104 oas.SolrTestCaseJ4.tearDown ###Ending testFullImport
   [junit4]   2> NOTE: leaving temporary files on disk at: C:\Users\jenkins\workspace\Lucene-Solr-master-Windows\solr\build\contrib\solr-dataimporthandler\test\J0\temp\solr.handler.dataimport.TestSolrEntityProcessorEndToEnd_FFE1AC9E2D4DB3FA-001
   [junit4]   2> NOTE: test params are: codec=Asserting(Lucene70): {dbdesc_s=PostingsFormat(name=Direct), dbid_s=FSTOrd50, id=FSTOrd50, desc=PostingsFormat(name=Direct)}, docValues:{}, maxPointsInLeafNode=461, maxMBSortInHeap=7.6553920868368355, sim=Asserting(org.apache.lucene.search.similarities.AssertingSimilarity@a067d5), locale=tr, timezone=Africa/El_Aaiun
   [junit4]   2> NOTE: Windows 10 10.0 x86/Oracle Corporation 1.8.0_144 (32-bit)/cpus=3,threads=2,free=84474448,total=223084544
   [junit4]   2> NOTE: All tests run in this JVM: [TestZKPropertiesWriter, TestWriterImpl, TestSolrEntityProcessorEndToEnd]
   [junit4] Completed [4/38 (1!)] on J0 in 12.98s, 7 tests, 1 error <<< FAILURES!

[...truncated 38262 lines...]

Mime
View raw message