lucene-dev mailing list archives

Site index · List index
Message view « Date » · « Thread »
Top « Date » · « Thread »
From Policeman Jenkins Server <jenk...@thetaphi.de>
Subject [JENKINS] Lucene-Solr-7.x-Windows (64bit/jdk1.8.0_144) - Build # 358 - Still Unstable!
Date Mon, 25 Dec 2017 05:27:47 GMT
Build: https://jenkins.thetaphi.de/job/Lucene-Solr-7.x-Windows/358/
Java: 64bit/jdk1.8.0_144 -XX:-UseCompressedOops -XX:+UseG1GC

7 tests failed.
FAILED:  junit.framework.TestSuite.org.apache.lucene.analysis.sv.TestSwedishLightStemFilter

Error Message:
Could not remove the following files (in the order of attempts):    C:\Users\jenkins\workspace\Lucene-Solr-7.x-Windows\lucene\build\analysis\common\test\J0\temp\lucene.analysis.sv.TestSwedishLightStemFilter_3E1F961B5FC44C01-001\tempDir-001: java.nio.file.DirectoryNotEmptyException: C:\Users\jenkins\workspace\Lucene-Solr-7.x-Windows\lucene\build\analysis\common\test\J0\temp\lucene.analysis.sv.TestSwedishLightStemFilter_3E1F961B5FC44C01-001\tempDir-001    C:\Users\jenkins\workspace\Lucene-Solr-7.x-Windows\lucene\build\analysis\common\test\J0\temp\lucene.analysis.sv.TestSwedishLightStemFilter_3E1F961B5FC44C01-001\tempDir-001\extra0: java.nio.file.AccessDeniedException: C:\Users\jenkins\workspace\Lucene-Solr-7.x-Windows\lucene\build\analysis\common\test\J0\temp\lucene.analysis.sv.TestSwedishLightStemFilter_3E1F961B5FC44C01-001\tempDir-001\extra0    C:\Users\jenkins\workspace\Lucene-Solr-7.x-Windows\lucene\build\analysis\common\test\J0\temp\lucene.analysis.sv.TestSwedishLightStemFilter_3E1F961B5FC44C01-001: java.nio.file.DirectoryNotEmptyException: C:\Users\jenkins\workspace\Lucene-Solr-7.x-Windows\lucene\build\analysis\common\test\J0\temp\lucene.analysis.sv.TestSwedishLightStemFilter_3E1F961B5FC44C01-001 

Stack Trace:
java.io.IOException: Could not remove the following files (in the order of attempts):
   C:\Users\jenkins\workspace\Lucene-Solr-7.x-Windows\lucene\build\analysis\common\test\J0\temp\lucene.analysis.sv.TestSwedishLightStemFilter_3E1F961B5FC44C01-001\tempDir-001: java.nio.file.DirectoryNotEmptyException: C:\Users\jenkins\workspace\Lucene-Solr-7.x-Windows\lucene\build\analysis\common\test\J0\temp\lucene.analysis.sv.TestSwedishLightStemFilter_3E1F961B5FC44C01-001\tempDir-001
   C:\Users\jenkins\workspace\Lucene-Solr-7.x-Windows\lucene\build\analysis\common\test\J0\temp\lucene.analysis.sv.TestSwedishLightStemFilter_3E1F961B5FC44C01-001\tempDir-001\extra0: java.nio.file.AccessDeniedException: C:\Users\jenkins\workspace\Lucene-Solr-7.x-Windows\lucene\build\analysis\common\test\J0\temp\lucene.analysis.sv.TestSwedishLightStemFilter_3E1F961B5FC44C01-001\tempDir-001\extra0
   C:\Users\jenkins\workspace\Lucene-Solr-7.x-Windows\lucene\build\analysis\common\test\J0\temp\lucene.analysis.sv.TestSwedishLightStemFilter_3E1F961B5FC44C01-001: java.nio.file.DirectoryNotEmptyException: C:\Users\jenkins\workspace\Lucene-Solr-7.x-Windows\lucene\build\analysis\common\test\J0\temp\lucene.analysis.sv.TestSwedishLightStemFilter_3E1F961B5FC44C01-001

	at __randomizedtesting.SeedInfo.seed([3E1F961B5FC44C01]:0)
	at org.apache.lucene.util.IOUtils.rm(IOUtils.java:329)
	at org.apache.lucene.util.TestRuleTemporaryFilesCleanup.afterAlways(TestRuleTemporaryFilesCleanup.java:216)
	at com.carrotsearch.randomizedtesting.rules.TestRuleAdapter$1.afterAlways(TestRuleAdapter.java:31)
	at com.carrotsearch.randomizedtesting.rules.StatementAdapter.evaluate(StatementAdapter.java:43)
	at com.carrotsearch.randomizedtesting.rules.StatementAdapter.evaluate(StatementAdapter.java:36)
	at org.apache.lucene.util.TestRuleAssertionsRequired$1.evaluate(TestRuleAssertionsRequired.java:53)
	at org.apache.lucene.util.TestRuleMarkFailure$1.evaluate(TestRuleMarkFailure.java:47)
	at org.apache.lucene.util.TestRuleIgnoreAfterMaxFailures$1.evaluate(TestRuleIgnoreAfterMaxFailures.java:64)
	at org.apache.lucene.util.TestRuleIgnoreTestSuites$1.evaluate(TestRuleIgnoreTestSuites.java:54)
	at com.carrotsearch.randomizedtesting.rules.StatementAdapter.evaluate(StatementAdapter.java:36)
	at com.carrotsearch.randomizedtesting.ThreadLeakControl$StatementRunner.run(ThreadLeakControl.java:368)
	at java.lang.Thread.run(Thread.java:748)


FAILED:  junit.framework.TestSuite.org.apache.lucene.index.TestBackwardsCompatibility

Error Message:
Could not remove the following files (in the order of attempts):    C:\Users\jenkins\workspace\Lucene-Solr-7.x-Windows\lucene\build\backward-codecs\test\J0\temp\lucene.index.TestBackwardsCompatibility_61D7241E0A566E71-001\4.8.1-cfs-001: java.nio.file.DirectoryNotEmptyException: C:\Users\jenkins\workspace\Lucene-Solr-7.x-Windows\lucene\build\backward-codecs\test\J0\temp\lucene.index.TestBackwardsCompatibility_61D7241E0A566E71-001\4.8.1-cfs-001 

Stack Trace:
java.io.IOException: Could not remove the following files (in the order of attempts):
   C:\Users\jenkins\workspace\Lucene-Solr-7.x-Windows\lucene\build\backward-codecs\test\J0\temp\lucene.index.TestBackwardsCompatibility_61D7241E0A566E71-001\4.8.1-cfs-001: java.nio.file.DirectoryNotEmptyException: C:\Users\jenkins\workspace\Lucene-Solr-7.x-Windows\lucene\build\backward-codecs\test\J0\temp\lucene.index.TestBackwardsCompatibility_61D7241E0A566E71-001\4.8.1-cfs-001

	at __randomizedtesting.SeedInfo.seed([61D7241E0A566E71]:0)
	at org.apache.lucene.util.IOUtils.rm(IOUtils.java:329)
	at org.apache.lucene.util.TestRuleTemporaryFilesCleanup.afterAlways(TestRuleTemporaryFilesCleanup.java:216)
	at com.carrotsearch.randomizedtesting.rules.TestRuleAdapter$1.afterAlways(TestRuleAdapter.java:31)
	at com.carrotsearch.randomizedtesting.rules.StatementAdapter.evaluate(StatementAdapter.java:43)
	at com.carrotsearch.randomizedtesting.rules.StatementAdapter.evaluate(StatementAdapter.java:36)
	at org.apache.lucene.util.TestRuleAssertionsRequired$1.evaluate(TestRuleAssertionsRequired.java:53)
	at org.apache.lucene.util.TestRuleMarkFailure$1.evaluate(TestRuleMarkFailure.java:47)
	at org.apache.lucene.util.TestRuleIgnoreAfterMaxFailures$1.evaluate(TestRuleIgnoreAfterMaxFailures.java:64)
	at org.apache.lucene.util.TestRuleIgnoreTestSuites$1.evaluate(TestRuleIgnoreTestSuites.java:54)
	at com.carrotsearch.randomizedtesting.rules.StatementAdapter.evaluate(StatementAdapter.java:36)
	at com.carrotsearch.randomizedtesting.ThreadLeakControl$StatementRunner.run(ThreadLeakControl.java:368)
	at java.lang.Thread.run(Thread.java:748)


FAILED:  junit.framework.TestSuite.org.apache.lucene.codecs.bloom.TestBloomPostingsFormat

Error Message:
Could not remove the following files (in the order of attempts):    C:\Users\jenkins\workspace\Lucene-Solr-7.x-Windows\lucene\build\codecs\test\J0\temp\lucene.codecs.bloom.TestBloomPostingsFormat_4B1A4AE0FC2FFBCA-001\testPostingsFormat.testExact-006: java.nio.file.DirectoryNotEmptyException: C:\Users\jenkins\workspace\Lucene-Solr-7.x-Windows\lucene\build\codecs\test\J0\temp\lucene.codecs.bloom.TestBloomPostingsFormat_4B1A4AE0FC2FFBCA-001\testPostingsFormat.testExact-006    C:\Users\jenkins\workspace\Lucene-Solr-7.x-Windows\lucene\build\codecs\test\J0\temp\lucene.codecs.bloom.TestBloomPostingsFormat_4B1A4AE0FC2FFBCA-001\testPostingsFormat.testExact-006\_0_TestBloomFilteredLucenePostings_0.tip: java.nio.file.AccessDeniedException: C:\Users\jenkins\workspace\Lucene-Solr-7.x-Windows\lucene\build\codecs\test\J0\temp\lucene.codecs.bloom.TestBloomPostingsFormat_4B1A4AE0FC2FFBCA-001\testPostingsFormat.testExact-006\_0_TestBloomFilteredLucenePostings_0.tip    C:\Users\jenkins\workspace\Lucene-Solr-7.x-Windows\lucene\build\codecs\test\J0\temp\lucene.codecs.bloom.TestBloomPostingsFormat_4B1A4AE0FC2FFBCA-001: java.nio.file.DirectoryNotEmptyException: C:\Users\jenkins\workspace\Lucene-Solr-7.x-Windows\lucene\build\codecs\test\J0\temp\lucene.codecs.bloom.TestBloomPostingsFormat_4B1A4AE0FC2FFBCA-001 

Stack Trace:
java.io.IOException: Could not remove the following files (in the order of attempts):
   C:\Users\jenkins\workspace\Lucene-Solr-7.x-Windows\lucene\build\codecs\test\J0\temp\lucene.codecs.bloom.TestBloomPostingsFormat_4B1A4AE0FC2FFBCA-001\testPostingsFormat.testExact-006: java.nio.file.DirectoryNotEmptyException: C:\Users\jenkins\workspace\Lucene-Solr-7.x-Windows\lucene\build\codecs\test\J0\temp\lucene.codecs.bloom.TestBloomPostingsFormat_4B1A4AE0FC2FFBCA-001\testPostingsFormat.testExact-006
   C:\Users\jenkins\workspace\Lucene-Solr-7.x-Windows\lucene\build\codecs\test\J0\temp\lucene.codecs.bloom.TestBloomPostingsFormat_4B1A4AE0FC2FFBCA-001\testPostingsFormat.testExact-006\_0_TestBloomFilteredLucenePostings_0.tip: java.nio.file.AccessDeniedException: C:\Users\jenkins\workspace\Lucene-Solr-7.x-Windows\lucene\build\codecs\test\J0\temp\lucene.codecs.bloom.TestBloomPostingsFormat_4B1A4AE0FC2FFBCA-001\testPostingsFormat.testExact-006\_0_TestBloomFilteredLucenePostings_0.tip
   C:\Users\jenkins\workspace\Lucene-Solr-7.x-Windows\lucene\build\codecs\test\J0\temp\lucene.codecs.bloom.TestBloomPostingsFormat_4B1A4AE0FC2FFBCA-001: java.nio.file.DirectoryNotEmptyException: C:\Users\jenkins\workspace\Lucene-Solr-7.x-Windows\lucene\build\codecs\test\J0\temp\lucene.codecs.bloom.TestBloomPostingsFormat_4B1A4AE0FC2FFBCA-001

	at __randomizedtesting.SeedInfo.seed([4B1A4AE0FC2FFBCA]:0)
	at org.apache.lucene.util.IOUtils.rm(IOUtils.java:329)
	at org.apache.lucene.util.TestRuleTemporaryFilesCleanup.afterAlways(TestRuleTemporaryFilesCleanup.java:216)
	at com.carrotsearch.randomizedtesting.rules.TestRuleAdapter$1.afterAlways(TestRuleAdapter.java:31)
	at com.carrotsearch.randomizedtesting.rules.StatementAdapter.evaluate(StatementAdapter.java:43)
	at com.carrotsearch.randomizedtesting.rules.StatementAdapter.evaluate(StatementAdapter.java:36)
	at org.apache.lucene.util.TestRuleAssertionsRequired$1.evaluate(TestRuleAssertionsRequired.java:53)
	at org.apache.lucene.util.TestRuleMarkFailure$1.evaluate(TestRuleMarkFailure.java:47)
	at org.apache.lucene.util.TestRuleIgnoreAfterMaxFailures$1.evaluate(TestRuleIgnoreAfterMaxFailures.java:64)
	at org.apache.lucene.util.TestRuleIgnoreTestSuites$1.evaluate(TestRuleIgnoreTestSuites.java:54)
	at com.carrotsearch.randomizedtesting.rules.StatementAdapter.evaluate(StatementAdapter.java:36)
	at com.carrotsearch.randomizedtesting.ThreadLeakControl$StatementRunner.run(ThreadLeakControl.java:368)
	at java.lang.Thread.run(Thread.java:748)


FAILED:  org.apache.solr.cloud.autoscaling.AutoAddReplicasPlanActionTest.testSimple

Error Message:
IOException occured when talking to server at: http://127.0.0.1:54275/solr

Stack Trace:
org.apache.solr.client.solrj.SolrServerException: IOException occured when talking to server at: http://127.0.0.1:54275/solr
	at __randomizedtesting.SeedInfo.seed([4B43281DD84AA0A0:73F00CE3FFB97471]:0)
	at org.apache.solr.client.solrj.impl.HttpSolrClient.executeMethod(HttpSolrClient.java:657)
	at org.apache.solr.client.solrj.impl.HttpSolrClient.request(HttpSolrClient.java:255)
	at org.apache.solr.client.solrj.impl.HttpSolrClient.request(HttpSolrClient.java:244)
	at org.apache.solr.client.solrj.impl.LBHttpSolrClient.doRequest(LBHttpSolrClient.java:483)
	at org.apache.solr.client.solrj.impl.LBHttpSolrClient.request(LBHttpSolrClient.java:413)
	at org.apache.solr.client.solrj.impl.CloudSolrClient.sendRequest(CloudSolrClient.java:1104)
	at org.apache.solr.client.solrj.impl.CloudSolrClient.requestWithRetryOnStaleState(CloudSolrClient.java:884)
	at org.apache.solr.client.solrj.impl.CloudSolrClient.request(CloudSolrClient.java:817)
	at org.apache.solr.client.solrj.SolrClient.request(SolrClient.java:1219)
	at org.apache.solr.cloud.autoscaling.AutoAddReplicasPlanActionTest.testSimple(AutoAddReplicasPlanActionTest.java:110)
	at sun.reflect.NativeMethodAccessorImpl.invoke0(Native Method)
	at sun.reflect.NativeMethodAccessorImpl.invoke(NativeMethodAccessorImpl.java:62)
	at sun.reflect.DelegatingMethodAccessorImpl.invoke(DelegatingMethodAccessorImpl.java:43)
	at java.lang.reflect.Method.invoke(Method.java:498)
	at com.carrotsearch.randomizedtesting.RandomizedRunner.invoke(RandomizedRunner.java:1737)
	at com.carrotsearch.randomizedtesting.RandomizedRunner$8.evaluate(RandomizedRunner.java:934)
	at com.carrotsearch.randomizedtesting.RandomizedRunner$9.evaluate(RandomizedRunner.java:970)
	at com.carrotsearch.randomizedtesting.RandomizedRunner$10.evaluate(RandomizedRunner.java:984)
	at com.carrotsearch.randomizedtesting.rules.SystemPropertiesRestoreRule$1.evaluate(SystemPropertiesRestoreRule.java:57)
	at org.apache.lucene.util.TestRuleSetupTeardownChained$1.evaluate(TestRuleSetupTeardownChained.java:49)
	at org.apache.lucene.util.AbstractBeforeAfterRule$1.evaluate(AbstractBeforeAfterRule.java:45)
	at org.apache.lucene.util.TestRuleThreadAndTestName$1.evaluate(TestRuleThreadAndTestName.java:48)
	at org.apache.lucene.util.TestRuleIgnoreAfterMaxFailures$1.evaluate(TestRuleIgnoreAfterMaxFailures.java:64)
	at org.apache.lucene.util.TestRuleMarkFailure$1.evaluate(TestRuleMarkFailure.java:47)
	at com.carrotsearch.randomizedtesting.rules.StatementAdapter.evaluate(StatementAdapter.java:36)
	at com.carrotsearch.randomizedtesting.ThreadLeakControl$StatementRunner.run(ThreadLeakControl.java:368)
	at com.carrotsearch.randomizedtesting.ThreadLeakControl.forkTimeoutingTask(ThreadLeakControl.java:817)
	at com.carrotsearch.randomizedtesting.ThreadLeakControl$3.evaluate(ThreadLeakControl.java:468)
	at com.carrotsearch.randomizedtesting.RandomizedRunner.runSingleTest(RandomizedRunner.java:943)
	at com.carrotsearch.randomizedtesting.RandomizedRunner$5.evaluate(RandomizedRunner.java:829)
	at com.carrotsearch.randomizedtesting.RandomizedRunner$6.evaluate(RandomizedRunner.java:879)
	at com.carrotsearch.randomizedtesting.RandomizedRunner$7.evaluate(RandomizedRunner.java:890)
	at com.carrotsearch.randomizedtesting.rules.StatementAdapter.evaluate(StatementAdapter.java:36)
	at com.carrotsearch.randomizedtesting.rules.SystemPropertiesRestoreRule$1.evaluate(SystemPropertiesRestoreRule.java:57)
	at org.apache.lucene.util.AbstractBeforeAfterRule$1.evaluate(AbstractBeforeAfterRule.java:45)
	at com.carrotsearch.randomizedtesting.rules.StatementAdapter.evaluate(StatementAdapter.java:36)
	at org.apache.lucene.util.TestRuleStoreClassName$1.evaluate(TestRuleStoreClassName.java:41)
	at com.carrotsearch.randomizedtesting.rules.NoShadowingOrOverridesOnMethodsRule$1.evaluate(NoShadowingOrOverridesOnMethodsRule.java:40)
	at com.carrotsearch.randomizedtesting.rules.NoShadowingOrOverridesOnMethodsRule$1.evaluate(NoShadowingOrOverridesOnMethodsRule.java:40)
	at com.carrotsearch.randomizedtesting.rules.StatementAdapter.evaluate(StatementAdapter.java:36)
	at com.carrotsearch.randomizedtesting.rules.StatementAdapter.evaluate(StatementAdapter.java:36)
	at com.carrotsearch.randomizedtesting.rules.StatementAdapter.evaluate(StatementAdapter.java:36)
	at org.apache.lucene.util.TestRuleAssertionsRequired$1.evaluate(TestRuleAssertionsRequired.java:53)
	at org.apache.lucene.util.TestRuleMarkFailure$1.evaluate(TestRuleMarkFailure.java:47)
	at org.apache.lucene.util.TestRuleIgnoreAfterMaxFailures$1.evaluate(TestRuleIgnoreAfterMaxFailures.java:64)
	at org.apache.lucene.util.TestRuleIgnoreTestSuites$1.evaluate(TestRuleIgnoreTestSuites.java:54)
	at com.carrotsearch.randomizedtesting.rules.StatementAdapter.evaluate(StatementAdapter.java:36)
	at com.carrotsearch.randomizedtesting.ThreadLeakControl$StatementRunner.run(ThreadLeakControl.java:368)
	at java.lang.Thread.run(Thread.java:748)
Caused by: java.net.SocketException: Software caused connection abort: recv failed
	at java.net.SocketInputStream.socketRead0(Native Method)
	at java.net.SocketInputStream.socketRead(SocketInputStream.java:116)
	at java.net.SocketInputStream.read(SocketInputStream.java:171)
	at java.net.SocketInputStream.read(SocketInputStream.java:141)
	at org.apache.http.impl.io.SessionInputBufferImpl.streamRead(SessionInputBufferImpl.java:137)
	at org.apache.http.impl.io.SessionInputBufferImpl.fillBuffer(SessionInputBufferImpl.java:153)
	at org.apache.http.impl.io.SessionInputBufferImpl.readLine(SessionInputBufferImpl.java:282)
	at org.apache.http.impl.conn.DefaultHttpResponseParser.parseHead(DefaultHttpResponseParser.java:138)
	at org.apache.http.impl.conn.DefaultHttpResponseParser.parseHead(DefaultHttpResponseParser.java:56)
	at org.apache.http.impl.io.AbstractMessageParser.parse(AbstractMessageParser.java:259)
	at org.apache.http.impl.DefaultBHttpClientConnection.receiveResponseHeader(DefaultBHttpClientConnection.java:163)
	at org.apache.http.impl.conn.CPoolProxy.receiveResponseHeader(CPoolProxy.java:165)
	at org.apache.http.protocol.HttpRequestExecutor.doReceiveResponse(HttpRequestExecutor.java:273)
	at org.apache.http.protocol.HttpRequestExecutor.execute(HttpRequestExecutor.java:125)
	at org.apache.http.impl.execchain.MainClientExec.execute(MainClientExec.java:272)
	at org.apache.http.impl.execchain.ProtocolExec.execute(ProtocolExec.java:185)
	at org.apache.http.impl.execchain.RetryExec.execute(RetryExec.java:89)
	at org.apache.http.impl.execchain.RedirectExec.execute(RedirectExec.java:111)
	at org.apache.http.impl.client.InternalHttpClient.doExecute(InternalHttpClient.java:185)
	at org.apache.http.impl.client.CloseableHttpClient.execute(CloseableHttpClient.java:83)
	at org.apache.http.impl.client.CloseableHttpClient.execute(CloseableHttpClient.java:56)
	at org.apache.solr.client.solrj.impl.HttpSolrClient.executeMethod(HttpSolrClient.java:542)
	... 48 more


FAILED:  org.apache.solr.cloud.autoscaling.NodeAddedTriggerTest.testTrigger

Error Message:


Stack Trace:
java.lang.AssertionError
	at __randomizedtesting.SeedInfo.seed([4B43281DD84AA0A0:28881E9F4185D38D]:0)
	at org.junit.Assert.fail(Assert.java:92)
	at org.junit.Assert.assertTrue(Assert.java:43)
	at org.junit.Assert.assertTrue(Assert.java:54)
	at org.apache.solr.cloud.autoscaling.NodeAddedTriggerTest.testTrigger(NodeAddedTriggerTest.java:111)
	at sun.reflect.NativeMethodAccessorImpl.invoke0(Native Method)
	at sun.reflect.NativeMethodAccessorImpl.invoke(NativeMethodAccessorImpl.java:62)
	at sun.reflect.DelegatingMethodAccessorImpl.invoke(DelegatingMethodAccessorImpl.java:43)
	at java.lang.reflect.Method.invoke(Method.java:498)
	at com.carrotsearch.randomizedtesting.RandomizedRunner.invoke(RandomizedRunner.java:1737)
	at com.carrotsearch.randomizedtesting.RandomizedRunner$8.evaluate(RandomizedRunner.java:934)
	at com.carrotsearch.randomizedtesting.RandomizedRunner$9.evaluate(RandomizedRunner.java:970)
	at com.carrotsearch.randomizedtesting.RandomizedRunner$10.evaluate(RandomizedRunner.java:984)
	at com.carrotsearch.randomizedtesting.rules.SystemPropertiesRestoreRule$1.evaluate(SystemPropertiesRestoreRule.java:57)
	at org.apache.lucene.util.TestRuleSetupTeardownChained$1.evaluate(TestRuleSetupTeardownChained.java:49)
	at org.apache.lucene.util.AbstractBeforeAfterRule$1.evaluate(AbstractBeforeAfterRule.java:45)
	at org.apache.lucene.util.TestRuleThreadAndTestName$1.evaluate(TestRuleThreadAndTestName.java:48)
	at org.apache.lucene.util.TestRuleIgnoreAfterMaxFailures$1.evaluate(TestRuleIgnoreAfterMaxFailures.java:64)
	at org.apache.lucene.util.TestRuleMarkFailure$1.evaluate(TestRuleMarkFailure.java:47)
	at com.carrotsearch.randomizedtesting.rules.StatementAdapter.evaluate(StatementAdapter.java:36)
	at com.carrotsearch.randomizedtesting.ThreadLeakControl$StatementRunner.run(ThreadLeakControl.java:368)
	at com.carrotsearch.randomizedtesting.ThreadLeakControl.forkTimeoutingTask(ThreadLeakControl.java:817)
	at com.carrotsearch.randomizedtesting.ThreadLeakControl$3.evaluate(ThreadLeakControl.java:468)
	at com.carrotsearch.randomizedtesting.RandomizedRunner.runSingleTest(RandomizedRunner.java:943)
	at com.carrotsearch.randomizedtesting.RandomizedRunner$5.evaluate(RandomizedRunner.java:829)
	at com.carrotsearch.randomizedtesting.RandomizedRunner$6.evaluate(RandomizedRunner.java:879)
	at com.carrotsearch.randomizedtesting.RandomizedRunner$7.evaluate(RandomizedRunner.java:890)
	at com.carrotsearch.randomizedtesting.rules.StatementAdapter.evaluate(StatementAdapter.java:36)
	at com.carrotsearch.randomizedtesting.rules.SystemPropertiesRestoreRule$1.evaluate(SystemPropertiesRestoreRule.java:57)
	at org.apache.lucene.util.AbstractBeforeAfterRule$1.evaluate(AbstractBeforeAfterRule.java:45)
	at com.carrotsearch.randomizedtesting.rules.StatementAdapter.evaluate(StatementAdapter.java:36)
	at org.apache.lucene.util.TestRuleStoreClassName$1.evaluate(TestRuleStoreClassName.java:41)
	at com.carrotsearch.randomizedtesting.rules.NoShadowingOrOverridesOnMethodsRule$1.evaluate(NoShadowingOrOverridesOnMethodsRule.java:40)
	at com.carrotsearch.randomizedtesting.rules.NoShadowingOrOverridesOnMethodsRule$1.evaluate(NoShadowingOrOverridesOnMethodsRule.java:40)
	at com.carrotsearch.randomizedtesting.rules.StatementAdapter.evaluate(StatementAdapter.java:36)
	at com.carrotsearch.randomizedtesting.rules.StatementAdapter.evaluate(StatementAdapter.java:36)
	at com.carrotsearch.randomizedtesting.rules.StatementAdapter.evaluate(StatementAdapter.java:36)
	at org.apache.lucene.util.TestRuleAssertionsRequired$1.evaluate(TestRuleAssertionsRequired.java:53)
	at org.apache.lucene.util.TestRuleMarkFailure$1.evaluate(TestRuleMarkFailure.java:47)
	at org.apache.lucene.util.TestRuleIgnoreAfterMaxFailures$1.evaluate(TestRuleIgnoreAfterMaxFailures.java:64)
	at org.apache.lucene.util.TestRuleIgnoreTestSuites$1.evaluate(TestRuleIgnoreTestSuites.java:54)
	at com.carrotsearch.randomizedtesting.rules.StatementAdapter.evaluate(StatementAdapter.java:36)
	at com.carrotsearch.randomizedtesting.ThreadLeakControl$StatementRunner.run(ThreadLeakControl.java:368)
	at java.lang.Thread.run(Thread.java:748)


FAILED:  org.apache.solr.cloud.autoscaling.sim.TestTriggerIntegration.testEventQueue

Error Message:
action wasn't interrupted

Stack Trace:
java.lang.AssertionError: action wasn't interrupted
	at __randomizedtesting.SeedInfo.seed([4B43281DD84AA0A0:82F66AB3D12D6655]:0)
	at org.junit.Assert.fail(Assert.java:93)
	at org.junit.Assert.assertTrue(Assert.java:43)
	at org.apache.solr.cloud.autoscaling.sim.TestTriggerIntegration.testEventQueue(TestTriggerIntegration.java:638)
	at sun.reflect.NativeMethodAccessorImpl.invoke0(Native Method)
	at sun.reflect.NativeMethodAccessorImpl.invoke(NativeMethodAccessorImpl.java:62)
	at sun.reflect.DelegatingMethodAccessorImpl.invoke(DelegatingMethodAccessorImpl.java:43)
	at java.lang.reflect.Method.invoke(Method.java:498)
	at com.carrotsearch.randomizedtesting.RandomizedRunner.invoke(RandomizedRunner.java:1737)
	at com.carrotsearch.randomizedtesting.RandomizedRunner$8.evaluate(RandomizedRunner.java:934)
	at com.carrotsearch.randomizedtesting.RandomizedRunner$9.evaluate(RandomizedRunner.java:970)
	at com.carrotsearch.randomizedtesting.RandomizedRunner$10.evaluate(RandomizedRunner.java:984)
	at com.carrotsearch.randomizedtesting.rules.SystemPropertiesRestoreRule$1.evaluate(SystemPropertiesRestoreRule.java:57)
	at org.apache.lucene.util.TestRuleSetupTeardownChained$1.evaluate(TestRuleSetupTeardownChained.java:49)
	at org.apache.lucene.util.AbstractBeforeAfterRule$1.evaluate(AbstractBeforeAfterRule.java:45)
	at org.apache.lucene.util.TestRuleThreadAndTestName$1.evaluate(TestRuleThreadAndTestName.java:48)
	at org.apache.lucene.util.TestRuleIgnoreAfterMaxFailures$1.evaluate(TestRuleIgnoreAfterMaxFailures.java:64)
	at org.apache.lucene.util.TestRuleMarkFailure$1.evaluate(TestRuleMarkFailure.java:47)
	at com.carrotsearch.randomizedtesting.rules.StatementAdapter.evaluate(StatementAdapter.java:36)
	at com.carrotsearch.randomizedtesting.ThreadLeakControl$StatementRunner.run(ThreadLeakControl.java:368)
	at com.carrotsearch.randomizedtesting.ThreadLeakControl.forkTimeoutingTask(ThreadLeakControl.java:817)
	at com.carrotsearch.randomizedtesting.ThreadLeakControl$3.evaluate(ThreadLeakControl.java:468)
	at com.carrotsearch.randomizedtesting.RandomizedRunner.runSingleTest(RandomizedRunner.java:943)
	at com.carrotsearch.randomizedtesting.RandomizedRunner$5.evaluate(RandomizedRunner.java:829)
	at com.carrotsearch.randomizedtesting.RandomizedRunner$6.evaluate(RandomizedRunner.java:879)
	at com.carrotsearch.randomizedtesting.RandomizedRunner$7.evaluate(RandomizedRunner.java:890)
	at com.carrotsearch.randomizedtesting.rules.StatementAdapter.evaluate(StatementAdapter.java:36)
	at com.carrotsearch.randomizedtesting.rules.SystemPropertiesRestoreRule$1.evaluate(SystemPropertiesRestoreRule.java:57)
	at org.apache.lucene.util.AbstractBeforeAfterRule$1.evaluate(AbstractBeforeAfterRule.java:45)
	at com.carrotsearch.randomizedtesting.rules.StatementAdapter.evaluate(StatementAdapter.java:36)
	at org.apache.lucene.util.TestRuleStoreClassName$1.evaluate(TestRuleStoreClassName.java:41)
	at com.carrotsearch.randomizedtesting.rules.NoShadowingOrOverridesOnMethodsRule$1.evaluate(NoShadowingOrOverridesOnMethodsRule.java:40)
	at com.carrotsearch.randomizedtesting.rules.NoShadowingOrOverridesOnMethodsRule$1.evaluate(NoShadowingOrOverridesOnMethodsRule.java:40)
	at com.carrotsearch.randomizedtesting.rules.StatementAdapter.evaluate(StatementAdapter.java:36)
	at com.carrotsearch.randomizedtesting.rules.StatementAdapter.evaluate(StatementAdapter.java:36)
	at com.carrotsearch.randomizedtesting.rules.StatementAdapter.evaluate(StatementAdapter.java:36)
	at org.apache.lucene.util.TestRuleAssertionsRequired$1.evaluate(TestRuleAssertionsRequired.java:53)
	at org.apache.lucene.util.TestRuleMarkFailure$1.evaluate(TestRuleMarkFailure.java:47)
	at org.apache.lucene.util.TestRuleIgnoreAfterMaxFailures$1.evaluate(TestRuleIgnoreAfterMaxFailures.java:64)
	at org.apache.lucene.util.TestRuleIgnoreTestSuites$1.evaluate(TestRuleIgnoreTestSuites.java:54)
	at com.carrotsearch.randomizedtesting.rules.StatementAdapter.evaluate(StatementAdapter.java:36)
	at com.carrotsearch.randomizedtesting.ThreadLeakControl$StatementRunner.run(ThreadLeakControl.java:368)
	at java.lang.Thread.run(Thread.java:748)


FAILED:  junit.framework.TestSuite.org.apache.solr.update.processor.TestOpenNLPExtractNamedEntitiesUpdateProcessorFactory

Error Message:
Could not remove the following files (in the order of attempts):    C:\Users\jenkins\workspace\Lucene-Solr-7.x-Windows\solr\build\contrib\solr-analysis-extras\test\J1\temp\solr.update.processor.TestOpenNLPExtractNamedEntitiesUpdateProcessorFactory_A08AAC4A86494E13-001\tempDir-001\collection1\conf: java.nio.file.DirectoryNotEmptyException: C:\Users\jenkins\workspace\Lucene-Solr-7.x-Windows\solr\build\contrib\solr-analysis-extras\test\J1\temp\solr.update.processor.TestOpenNLPExtractNamedEntitiesUpdateProcessorFactory_A08AAC4A86494E13-001\tempDir-001\collection1\conf    C:\Users\jenkins\workspace\Lucene-Solr-7.x-Windows\solr\build\contrib\solr-analysis-extras\test\J1\temp\solr.update.processor.TestOpenNLPExtractNamedEntitiesUpdateProcessorFactory_A08AAC4A86494E13-001\tempDir-001\collection1: java.nio.file.DirectoryNotEmptyException: C:\Users\jenkins\workspace\Lucene-Solr-7.x-Windows\solr\build\contrib\solr-analysis-extras\test\J1\temp\solr.update.processor.TestOpenNLPExtractNamedEntitiesUpdateProcessorFactory_A08AAC4A86494E13-001\tempDir-001\collection1    C:\Users\jenkins\workspace\Lucene-Solr-7.x-Windows\solr\build\contrib\solr-analysis-extras\test\J1\temp\solr.update.processor.TestOpenNLPExtractNamedEntitiesUpdateProcessorFactory_A08AAC4A86494E13-001\tempDir-001: java.nio.file.DirectoryNotEmptyException: C:\Users\jenkins\workspace\Lucene-Solr-7.x-Windows\solr\build\contrib\solr-analysis-extras\test\J1\temp\solr.update.processor.TestOpenNLPExtractNamedEntitiesUpdateProcessorFactory_A08AAC4A86494E13-001\tempDir-001    C:\Users\jenkins\workspace\Lucene-Solr-7.x-Windows\solr\build\contrib\solr-analysis-extras\test\J1\temp\solr.update.processor.TestOpenNLPExtractNamedEntitiesUpdateProcessorFactory_A08AAC4A86494E13-001\tempDir-001\collection1\conf\en-test-tokenizer.bin: java.nio.file.AccessDeniedException: C:\Users\jenkins\workspace\Lucene-Solr-7.x-Windows\solr\build\contrib\solr-analysis-extras\test\J1\temp\solr.update.processor.TestOpenNLPExtractNamedEntitiesUpdateProcessorFactory_A08AAC4A86494E13-001\tempDir-001\collection1\conf\en-test-tokenizer.bin    C:\Users\jenkins\workspace\Lucene-Solr-7.x-Windows\solr\build\contrib\solr-analysis-extras\test\J1\temp\solr.update.processor.TestOpenNLPExtractNamedEntitiesUpdateProcessorFactory_A08AAC4A86494E13-001\tempDir-001\collection1\conf\en-test-sent.bin: java.nio.file.AccessDeniedException: C:\Users\jenkins\workspace\Lucene-Solr-7.x-Windows\solr\build\contrib\solr-analysis-extras\test\J1\temp\solr.update.processor.TestOpenNLPExtractNamedEntitiesUpdateProcessorFactory_A08AAC4A86494E13-001\tempDir-001\collection1\conf\en-test-sent.bin    C:\Users\jenkins\workspace\Lucene-Solr-7.x-Windows\solr\build\contrib\solr-analysis-extras\test\J1\temp\solr.update.processor.TestOpenNLPExtractNamedEntitiesUpdateProcessorFactory_A08AAC4A86494E13-001\tempDir-001\collection1\conf\en-test-ner-person.bin: java.nio.file.AccessDeniedException: C:\Users\jenkins\workspace\Lucene-Solr-7.x-Windows\solr\build\contrib\solr-analysis-extras\test\J1\temp\solr.update.processor.TestOpenNLPExtractNamedEntitiesUpdateProcessorFactory_A08AAC4A86494E13-001\tempDir-001\collection1\conf\en-test-ner-person.bin    C:\Users\jenkins\workspace\Lucene-Solr-7.x-Windows\solr\build\contrib\solr-analysis-extras\test\J1\temp\solr.update.processor.TestOpenNLPExtractNamedEntitiesUpdateProcessorFactory_A08AAC4A86494E13-001: java.nio.file.DirectoryNotEmptyException: C:\Users\jenkins\workspace\Lucene-Solr-7.x-Windows\solr\build\contrib\solr-analysis-extras\test\J1\temp\solr.update.processor.TestOpenNLPExtractNamedEntitiesUpdateProcessorFactory_A08AAC4A86494E13-001 

Stack Trace:
java.io.IOException: Could not remove the following files (in the order of attempts):
   C:\Users\jenkins\workspace\Lucene-Solr-7.x-Windows\solr\build\contrib\solr-analysis-extras\test\J1\temp\solr.update.processor.TestOpenNLPExtractNamedEntitiesUpdateProcessorFactory_A08AAC4A86494E13-001\tempDir-001\collection1\conf: java.nio.file.DirectoryNotEmptyException: C:\Users\jenkins\workspace\Lucene-Solr-7.x-Windows\solr\build\contrib\solr-analysis-extras\test\J1\temp\solr.update.processor.TestOpenNLPExtractNamedEntitiesUpdateProcessorFactory_A08AAC4A86494E13-001\tempDir-001\collection1\conf
   C:\Users\jenkins\workspace\Lucene-Solr-7.x-Windows\solr\build\contrib\solr-analysis-extras\test\J1\temp\solr.update.processor.TestOpenNLPExtractNamedEntitiesUpdateProcessorFactory_A08AAC4A86494E13-001\tempDir-001\collection1: java.nio.file.DirectoryNotEmptyException: C:\Users\jenkins\workspace\Lucene-Solr-7.x-Windows\solr\build\contrib\solr-analysis-extras\test\J1\temp\solr.update.processor.TestOpenNLPExtractNamedEntitiesUpdateProcessorFactory_A08AAC4A86494E13-001\tempDir-001\collection1
   C:\Users\jenkins\workspace\Lucene-Solr-7.x-Windows\solr\build\contrib\solr-analysis-extras\test\J1\temp\solr.update.processor.TestOpenNLPExtractNamedEntitiesUpdateProcessorFactory_A08AAC4A86494E13-001\tempDir-001: java.nio.file.DirectoryNotEmptyException: C:\Users\jenkins\workspace\Lucene-Solr-7.x-Windows\solr\build\contrib\solr-analysis-extras\test\J1\temp\solr.update.processor.TestOpenNLPExtractNamedEntitiesUpdateProcessorFactory_A08AAC4A86494E13-001\tempDir-001
   C:\Users\jenkins\workspace\Lucene-Solr-7.x-Windows\solr\build\contrib\solr-analysis-extras\test\J1\temp\solr.update.processor.TestOpenNLPExtractNamedEntitiesUpdateProcessorFactory_A08AAC4A86494E13-001\tempDir-001\collection1\conf\en-test-tokenizer.bin: java.nio.file.AccessDeniedException: C:\Users\jenkins\workspace\Lucene-Solr-7.x-Windows\solr\build\contrib\solr-analysis-extras\test\J1\temp\solr.update.processor.TestOpenNLPExtractNamedEntitiesUpdateProcessorFactory_A08AAC4A86494E13-001\tempDir-001\collection1\conf\en-test-tokenizer.bin
   C:\Users\jenkins\workspace\Lucene-Solr-7.x-Windows\solr\build\contrib\solr-analysis-extras\test\J1\temp\solr.update.processor.TestOpenNLPExtractNamedEntitiesUpdateProcessorFactory_A08AAC4A86494E13-001\tempDir-001\collection1\conf\en-test-sent.bin: java.nio.file.AccessDeniedException: C:\Users\jenkins\workspace\Lucene-Solr-7.x-Windows\solr\build\contrib\solr-analysis-extras\test\J1\temp\solr.update.processor.TestOpenNLPExtractNamedEntitiesUpdateProcessorFactory_A08AAC4A86494E13-001\tempDir-001\collection1\conf\en-test-sent.bin
   C:\Users\jenkins\workspace\Lucene-Solr-7.x-Windows\solr\build\contrib\solr-analysis-extras\test\J1\temp\solr.update.processor.TestOpenNLPExtractNamedEntitiesUpdateProcessorFactory_A08AAC4A86494E13-001\tempDir-001\collection1\conf\en-test-ner-person.bin: java.nio.file.AccessDeniedException: C:\Users\jenkins\workspace\Lucene-Solr-7.x-Windows\solr\build\contrib\solr-analysis-extras\test\J1\temp\solr.update.processor.TestOpenNLPExtractNamedEntitiesUpdateProcessorFactory_A08AAC4A86494E13-001\tempDir-001\collection1\conf\en-test-ner-person.bin
   C:\Users\jenkins\workspace\Lucene-Solr-7.x-Windows\solr\build\contrib\solr-analysis-extras\test\J1\temp\solr.update.processor.TestOpenNLPExtractNamedEntitiesUpdateProcessorFactory_A08AAC4A86494E13-001: java.nio.file.DirectoryNotEmptyException: C:\Users\jenkins\workspace\Lucene-Solr-7.x-Windows\solr\build\contrib\solr-analysis-extras\test\J1\temp\solr.update.processor.TestOpenNLPExtractNamedEntitiesUpdateProcessorFactory_A08AAC4A86494E13-001

	at __randomizedtesting.SeedInfo.seed([A08AAC4A86494E13]:0)
	at org.apache.lucene.util.IOUtils.rm(IOUtils.java:329)
	at org.apache.lucene.util.TestRuleTemporaryFilesCleanup.afterAlways(TestRuleTemporaryFilesCleanup.java:216)
	at com.carrotsearch.randomizedtesting.rules.TestRuleAdapter$1.afterAlways(TestRuleAdapter.java:31)
	at com.carrotsearch.randomizedtesting.rules.StatementAdapter.evaluate(StatementAdapter.java:43)
	at com.carrotsearch.randomizedtesting.rules.StatementAdapter.evaluate(StatementAdapter.java:36)
	at org.apache.lucene.util.TestRuleAssertionsRequired$1.evaluate(TestRuleAssertionsRequired.java:53)
	at org.apache.lucene.util.TestRuleMarkFailure$1.evaluate(TestRuleMarkFailure.java:47)
	at org.apache.lucene.util.TestRuleIgnoreAfterMaxFailures$1.evaluate(TestRuleIgnoreAfterMaxFailures.java:64)
	at org.apache.lucene.util.TestRuleIgnoreTestSuites$1.evaluate(TestRuleIgnoreTestSuites.java:54)
	at com.carrotsearch.randomizedtesting.rules.StatementAdapter.evaluate(StatementAdapter.java:36)
	at com.carrotsearch.randomizedtesting.ThreadLeakControl$StatementRunner.run(ThreadLeakControl.java:368)
	at java.lang.Thread.run(Thread.java:748)




Build Log:
[...truncated 2542 lines...]
   [junit4] Suite: org.apache.lucene.analysis.sv.TestSwedishLightStemFilter
   [junit4]   2> NOTE: test params are: codec=Asserting(Lucene70): {dummy=TestBloomFilteredLucenePostings(BloomFilteringPostingsFormat(Lucene50(blocksize=128)))}, docValues:{}, maxPointsInLeafNode=2022, maxMBSortInHeap=7.964574941214152, sim=RandomSimilarity(queryNorm=false): {}, locale=ga, timezone=Pacific/Marquesas
   [junit4]   2> NOTE: Windows 10 10.0 amd64/Oracle Corporation 1.8.0_144 (64-bit)/cpus=3,threads=1,free=23365656,total=109051904
   [junit4]   2> NOTE: All tests run in this JVM: [TestRemoveDuplicatesTokenFilterFactory, TestPortugueseLightStemFilterFactory, TestHTMLStripCharFilterFactory, TestPatternReplaceCharFilterFactory, TestSerbianNormalizationRegularFilter, TestGermanNormalizationFilterFactory, GreekAnalyzerTest, TestUnicodeWhitespaceTokenizer, TestArabicFilters, TestSnowballVocab, TestTurkishAnalyzer, TestAllAnalyzersHaveFactories, TestOnlyInCompound, TestRussianLightStemFilterFactory, TestPorterStemFilterFactory, TestKStemFilterFactory, TestLithuanianStemming, TestLengthFilter, TestFactories, TestGalicianAnalyzer, TestTeeSinkTokenFilter, TestSwedishLightStemFilter]
   [junit4]   2> NOTE: reproduce with: ant test  -Dtestcase=TestSwedishLightStemFilter -Dtests.seed=3E1F961B5FC44C01 -Dtests.slow=true -Dtests.locale=ga -Dtests.timezone=Pacific/Marquesas -Dtests.asserts=true -Dtests.file.encoding=Cp1252
   [junit4] ERROR   0.00s J0 | TestSwedishLightStemFilter (suite) <<<
   [junit4]    > Throwable #1: java.io.IOException: Could not remove the following files (in the order of attempts):
   [junit4]    >    C:\Users\jenkins\workspace\Lucene-Solr-7.x-Windows\lucene\build\analysis\common\test\J0\temp\lucene.analysis.sv.TestSwedishLightStemFilter_3E1F961B5FC44C01-001\tempDir-001: java.nio.file.DirectoryNotEmptyException: C:\Users\jenkins\workspace\Lucene-Solr-7.x-Windows\lucene\build\analysis\common\test\J0\temp\lucene.analysis.sv.TestSwedishLightStemFilter_3E1F961B5FC44C01-001\tempDir-001
   [junit4]    >    C:\Users\jenkins\workspace\Lucene-Solr-7.x-Windows\lucene\build\analysis\common\test\J0\temp\lucene.analysis.sv.TestSwedishLightStemFilter_3E1F961B5FC44C01-001\tempDir-001\extra0: java.nio.file.AccessDeniedException: C:\Users\jenkins\workspace\Lucene-Solr-7.x-Windows\lucene\build\analysis\common\test\J0\temp\lucene.analysis.sv.TestSwedishLightStemFilter_3E1F961B5FC44C01-001\tempDir-001\extra0
   [junit4]    >    C:\Users\jenkins\workspace\Lucene-Solr-7.x-Windows\lucene\build\analysis\common\test\J0\temp\lucene.analysis.sv.TestSwedishLightStemFilter_3E1F961B5FC44C01-001: java.nio.file.DirectoryNotEmptyException: C:\Users\jenkins\workspace\Lucene-Solr-7.x-Windows\lucene\build\analysis\common\test\J0\temp\lucene.analysis.sv.TestSwedishLightStemFilter_3E1F961B5FC44C01-001
   [junit4]    > 	at __randomizedtesting.SeedInfo.seed([3E1F961B5FC44C01]:0)
   [junit4]    > 	at org.apache.lucene.util.IOUtils.rm(IOUtils.java:329)
   [junit4]    > 	at java.lang.Thread.run(Thread.java:748)
   [junit4] Completed [95/285 (1!)] on J0 in 1.10s, 4 tests, 1 error <<< FAILURES!

[...truncated 2209 lines...]
   [junit4] Suite: org.apache.lucene.index.TestBackwardsCompatibility
   [junit4] IGNOR/A 0.04s J0 | TestBackwardsCompatibility.testCreateMoreTermsIndex
   [junit4]    > Assumption #1: backcompat creation tests must be run with -Dtests.bwcdir=/path/to/write/indexes
   [junit4] IGNOR/A 0.00s J0 | TestBackwardsCompatibility.testCreateSingleSegmentCFS
   [junit4]    > Assumption #1: backcompat creation tests must be run with -Dtests.bwcdir=/path/to/write/indexes
   [junit4] IGNOR/A 0.00s J0 | TestBackwardsCompatibility.testCreateSingleSegmentNoCFS
   [junit4]    > Assumption #1: backcompat creation tests must be run with -Dtests.bwcdir=/path/to/write/indexes
   [junit4] IGNOR/A 0.00s J0 | TestBackwardsCompatibility.testCreateSortedIndex
   [junit4]    > Assumption #1: backcompat creation tests must be run with -Dtests.bwcdir=/path/to/write/indexes
   [junit4] IGNOR/A 0.00s J0 | TestBackwardsCompatibility.testCreateNoCFS
   [junit4]    > Assumption #1: backcompat creation tests must be run with -Dtests.bwcdir=/path/to/write/indexes
   [junit4] IGNOR/A 0.00s J0 | TestBackwardsCompatibility.testCreateIndexWithDocValuesUpdates
   [junit4]    > Assumption #1: backcompat creation tests must be run with -Dtests.bwcdir=/path/to/write/indexes
   [junit4] IGNOR/A 0.00s J0 | TestBackwardsCompatibility.testCreateCFS
   [junit4]    > Assumption #1: backcompat creation tests must be run with -Dtests.bwcdir=/path/to/write/indexes
   [junit4] IGNOR/A 0.00s J0 | TestBackwardsCompatibility.testCreateEmptyIndex
   [junit4]    > Assumption #1: backcompat creation tests must be run with -Dtests.bwcdir=/path/to/write/indexes
   [junit4]   2> NOTE: test params are: codec=Asserting(Lucene70): {content6=PostingsFormat(name=Memory), content5=TestBloomFilteredLucenePostings(BloomFilteringPostingsFormat(Lucene50(blocksize=128))), content4=FST50, trieInt=PostingsFormat(name=Memory), content3=FSTOrd50, content2=PostingsFormat(name=Memory), fie?ld=PostingsFormat(name=Memory), utf8=PostingsFormat(name=Memory), trieLong=TestBloomFilteredLucenePostings(BloomFilteringPostingsFormat(Lucene50(blocksize=128))), id=FST50, content=PostingsFormat(name=Memory), autf8=TestBloomFilteredLucenePostings(BloomFilteringPostingsFormat(Lucene50(blocksize=128)))}, docValues:{utf8=DocValuesFormat(name=Asserting), fie?ld=DocValuesFormat(name=Asserting), dvShort=DocValuesFormat(name=Memory), dvInt=DocValuesFormat(name=Asserting), longPoint2d=DocValuesFormat(name=Lucene70), dvBytesSortedVar=DocValuesFormat(name=Asserting), dvSortedSet=DocValuesFormat(name=Lucene70), content=DocValuesFormat(name=Asserting), floatPoint1d=DocValuesFormat(name=Lucene70), intPoint1d=DocValuesFormat(name=Lucene70), doublePoint2d=DocValuesFormat(name=Asserting), trieLong=DocValuesFormat(name=Memory), dvBytesDerefVar=DocValuesFormat(name=Memory), id=DocValuesFormat(name=Lucene70), binaryPoint2d=DocValuesFormat(name=Asserting), dvSortedNumeric=DocValuesFormat(name=Lucene70), dvBytesDerefFixed=DocValuesFormat(name=Lucene70), autf8=DocValuesFormat(name=Memory), dvBytesSortedFixed=DocValuesFormat(name=Memory), trieInt=DocValuesFormat(name=Asserting), dvBytesStraightVar=DocValuesFormat(name=Lucene70), dvBytesStraightFixed=DocValuesFormat(name=Asserting), dvLong=DocValuesFormat(name=Lucene70), longPoint1d=DocValuesFormat(name=Lucene70), floatPoint2d=DocValuesFormat(name=Memory), dvDouble=DocValuesFormat(name=Lucene70), dvFloat=DocValuesFormat(name=Memory), content6=DocValuesFormat(name=Asserting), content5=DocValuesFormat(name=Memory), dvPacked=DocValuesFormat(name=Lucene70), intPoint2d=DocValuesFormat(name=Lucene70), content4=DocValuesFormat(name=Lucene70), content3=DocValuesFormat(name=Lucene70), content2=DocValuesFormat(name=Asserting), doublePoint1d=DocValuesFormat(name=Lucene70), dvByte=DocValuesFormat(name=Lucene70), binaryPoint1d=DocValuesFormat(name=Memory)}, maxPointsInLeafNode=340, maxMBSortInHeap=5.250166922110133, sim=RandomSimilarity(queryNorm=true): {content6=DFR I(F)Z(0.3), content5=DFR I(ne)BZ(0.3), content2=IB SPL-D1, utf8=DFR I(ne)L3(800.0), fie?ld=DFR GZ(0.3), content=IB SPL-L3(800.0), autf8=DFR GZ(0.3)}, locale=es-VE, timezone=Africa/Bujumbura
   [junit4]   2> NOTE: Windows 10 10.0 amd64/Oracle Corporation 1.8.0_144 (64-bit)/cpus=3,threads=1,free=46962232,total=110100480
   [junit4]   2> NOTE: All tests run in this JVM: [TestBackwardsCompatibility]
   [junit4]   2> NOTE: reproduce with: ant test  -Dtestcase=TestBackwardsCompatibility -Dtests.seed=61D7241E0A566E71 -Dtests.slow=true -Dtests.locale=es-VE -Dtests.timezone=Africa/Bujumbura -Dtests.asserts=true -Dtests.file.encoding=US-ASCII
   [junit4] ERROR   0.00s J0 | TestBackwardsCompatibility (suite) <<<
   [junit4]    > Throwable #1: java.io.IOException: Could not remove the following files (in the order of attempts):
   [junit4]    >    C:\Users\jenkins\workspace\Lucene-Solr-7.x-Windows\lucene\build\backward-codecs\test\J0\temp\lucene.index.TestBackwardsCompatibility_61D7241E0A566E71-001\4.8.1-cfs-001: java.nio.file.DirectoryNotEmptyException: C:\Users\jenkins\workspace\Lucene-Solr-7.x-Windows\lucene\build\backward-codecs\test\J0\temp\lucene.index.TestBackwardsCompatibility_61D7241E0A566E71-001\4.8.1-cfs-001
   [junit4]    > 	at __randomizedtesting.SeedInfo.seed([61D7241E0A566E71]:0)
   [junit4]    > 	at org.apache.lucene.util.IOUtils.rm(IOUtils.java:329)
   [junit4]    > 	at java.lang.Thread.run(Thread.java:748)
   [junit4] Completed [3/8 (1!)] on J0 in 30.96s, 30 tests, 1 error, 8 skipped <<< FAILURES!

[...truncated 1766 lines...]
   [junit4] Suite: org.apache.lucene.codecs.bloom.TestBloomPostingsFormat
   [junit4]   2> NOTE: test params are: codec=Asserting(Lucene70): {}, docValues:{}, maxPointsInLeafNode=281, maxMBSortInHeap=6.511837369915366, sim=RandomSimilarity(queryNorm=true): {f_DOCS_AND_FREQS=IB LL-DZ(0.3), field=DFR I(ne)B3(800.0), f_DOCS_AND_FREQS_AND_POSITIONS_AND_OFFSETS=DFR GB1, f_DOCS_AND_FREQS_AND_POSITIONS=DFR I(ne)B2, body=DFR I(ne)LZ(0.3), f_DOCS=DFR I(F)1}, locale=fr-BE, timezone=Asia/Amman
   [junit4]   2> NOTE: Windows 10 10.0 amd64/Oracle Corporation 1.8.0_144 (64-bit)/cpus=3,threads=1,free=83648368,total=106954752
   [junit4]   2> NOTE: All tests run in this JVM: [TestFSTOrdPostingsFormat, TestSimpleTextPointsFormat, TestSimpleTextTermVectorsFormat, TestOrdsBlockTree, TestFixedGapPostingsFormat, TestBloomPostingsFormat]
   [junit4]   2> NOTE: reproduce with: ant test  -Dtestcase=TestBloomPostingsFormat -Dtests.seed=4B1A4AE0FC2FFBCA -Dtests.slow=true -Dtests.locale=fr-BE -Dtests.timezone=Asia/Amman -Dtests.asserts=true -Dtests.file.encoding=ISO-8859-1
   [junit4] ERROR   0.00s J0 | TestBloomPostingsFormat (suite) <<<
   [junit4]    > Throwable #1: java.io.IOException: Could not remove the following files (in the order of attempts):
   [junit4]    >    C:\Users\jenkins\workspace\Lucene-Solr-7.x-Windows\lucene\build\codecs\test\J0\temp\lucene.codecs.bloom.TestBloomPostingsFormat_4B1A4AE0FC2FFBCA-001\testPostingsFormat.testExact-006: java.nio.file.DirectoryNotEmptyException: C:\Users\jenkins\workspace\Lucene-Solr-7.x-Windows\lucene\build\codecs\test\J0\temp\lucene.codecs.bloom.TestBloomPostingsFormat_4B1A4AE0FC2FFBCA-001\testPostingsFormat.testExact-006
   [junit4]    >    C:\Users\jenkins\workspace\Lucene-Solr-7.x-Windows\lucene\build\codecs\test\J0\temp\lucene.codecs.bloom.TestBloomPostingsFormat_4B1A4AE0FC2FFBCA-001\testPostingsFormat.testExact-006\_0_TestBloomFilteredLucenePostings_0.tip: java.nio.file.AccessDeniedException: C:\Users\jenkins\workspace\Lucene-Solr-7.x-Windows\lucene\build\codecs\test\J0\temp\lucene.codecs.bloom.TestBloomPostingsFormat_4B1A4AE0FC2FFBCA-001\testPostingsFormat.testExact-006\_0_TestBloomFilteredLucenePostings_0.tip
   [junit4]    >    C:\Users\jenkins\workspace\Lucene-Solr-7.x-Windows\lucene\build\codecs\test\J0\temp\lucene.codecs.bloom.TestBloomPostingsFormat_4B1A4AE0FC2FFBCA-001: java.nio.file.DirectoryNotEmptyException: C:\Users\jenkins\workspace\Lucene-Solr-7.x-Windows\lucene\build\codecs\test\J0\temp\lucene.codecs.bloom.TestBloomPostingsFormat_4B1A4AE0FC2FFBCA-001
   [junit4]    > 	at __randomizedtesting.SeedInfo.seed([4B1A4AE0FC2FFBCA]:0)
   [junit4]    > 	at org.apache.lucene.util.IOUtils.rm(IOUtils.java:329)
   [junit4]    > 	at java.lang.Thread.run(Thread.java:748)
   [junit4] Completed [12/20 (1!)] on J0 in 2.50s, 25 tests, 1 error <<< FAILURES!

[...truncated 5523 lines...]
   [junit4] Suite: org.apache.solr.cloud.autoscaling.AutoAddReplicasPlanActionTest
   [junit4]   2> 546844 INFO  (SUITE-AutoAddReplicasPlanActionTest-seed#[4B43281DD84AA0A0]-worker) [    ] o.a.s.SolrTestCaseJ4 SecureRandom sanity checks: test.solr.allowed.securerandom=null & java.security.egd=file:/dev/./urandom
   [junit4]   2> Creating dataDir: C:\Users\jenkins\workspace\Lucene-Solr-7.x-Windows\solr\build\solr-core\test\J1\temp\solr.cloud.autoscaling.AutoAddReplicasPlanActionTest_4B43281DD84AA0A0-001\init-core-data-001
   [junit4]   2> 546845 WARN  (SUITE-AutoAddReplicasPlanActionTest-seed#[4B43281DD84AA0A0]-worker) [    ] o.a.s.SolrTestCaseJ4 startTrackingSearchers: numOpens=10 numCloses=10
   [junit4]   2> 546846 INFO  (SUITE-AutoAddReplicasPlanActionTest-seed#[4B43281DD84AA0A0]-worker) [    ] o.a.s.SolrTestCaseJ4 Using PointFields (NUMERIC_POINTS_SYSPROP=true) w/NUMERIC_DOCVALUES_SYSPROP=true
   [junit4]   2> 546849 INFO  (SUITE-AutoAddReplicasPlanActionTest-seed#[4B43281DD84AA0A0]-worker) [    ] o.a.s.SolrTestCaseJ4 Randomized ssl (false) and clientAuth (false) via: @org.apache.solr.util.RandomizeSSL(reason=, value=NaN, ssl=NaN, clientAuth=NaN)
   [junit4]   2> 546851 INFO  (SUITE-AutoAddReplicasPlanActionTest-seed#[4B43281DD84AA0A0]-worker) [    ] o.a.s.c.MiniSolrCloudCluster Starting cluster of 3 servers in C:\Users\jenkins\workspace\Lucene-Solr-7.x-Windows\solr\build\solr-core\test\J1\temp\solr.cloud.autoscaling.AutoAddReplicasPlanActionTest_4B43281DD84AA0A0-001\tempDir-001
   [junit4]   2> 546851 INFO  (SUITE-AutoAddReplicasPlanActionTest-seed#[4B43281DD84AA0A0]-worker) [    ] o.a.s.c.ZkTestServer STARTING ZK TEST SERVER
   [junit4]   2> 546851 INFO  (Thread-993) [    ] o.a.s.c.ZkTestServer client port:0.0.0.0/0.0.0.0:0
   [junit4]   2> 546851 INFO  (Thread-993) [    ] o.a.s.c.ZkTestServer Starting server
   [junit4]   2> 546854 ERROR (Thread-993) [    ] o.a.z.s.ZooKeeperServer ZKShutdownHandler is not registered, so ZooKeeper server won't take any action on ERROR or SHUTDOWN server state changes
   [junit4]   2> 546951 INFO  (SUITE-AutoAddReplicasPlanActionTest-seed#[4B43281DD84AA0A0]-worker) [    ] o.a.s.c.ZkTestServer start zk server on port:54271
   [junit4]   2> 546954 INFO  (zkConnectionManagerCallback-1168-thread-1) [    ] o.a.s.c.c.ConnectionManager zkClient has connected
   [junit4]   2> 546959 INFO  (jetty-launcher-1165-thread-3) [    ] o.e.j.s.Server jetty-9.3.20.v20170531
   [junit4]   2> 546959 INFO  (jetty-launcher-1165-thread-2) [    ] o.e.j.s.Server jetty-9.3.20.v20170531
   [junit4]   2> 546959 INFO  (jetty-launcher-1165-thread-2) [    ] o.e.j.s.h.ContextHandler Started o.e.j.s.ServletContextHandler@1fa3136b{/solr,null,AVAILABLE}
   [junit4]   2> 546959 INFO  (jetty-launcher-1165-thread-3) [    ] o.e.j.s.h.ContextHandler Started o.e.j.s.ServletContextHandler@49d4d05b{/solr,null,AVAILABLE}
   [junit4]   2> 546961 INFO  (jetty-launcher-1165-thread-1) [    ] o.e.j.s.Server jetty-9.3.20.v20170531
   [junit4]   2> 546962 INFO  (jetty-launcher-1165-thread-1) [    ] o.e.j.s.h.ContextHandler Started o.e.j.s.ServletContextHandler@32afbf4b{/solr,null,AVAILABLE}
   [junit4]   2> 546962 INFO  (jetty-launcher-1165-thread-3) [    ] o.e.j.s.AbstractConnector Started ServerConnector@3df76e56{HTTP/1.1,[http/1.1]}{127.0.0.1:54277}
   [junit4]   2> 546962 INFO  (jetty-launcher-1165-thread-3) [    ] o.e.j.s.Server Started @555029ms
   [junit4]   2> 546962 INFO  (jetty-launcher-1165-thread-3) [    ] o.a.s.c.s.e.JettySolrRunner Jetty properties: {hostContext=/solr, hostPort=54277}
   [junit4]   2> 546962 ERROR (jetty-launcher-1165-thread-3) [    ] o.a.s.u.StartupLoggingUtils Missing Java Option solr.log.dir. Logging may be missing or incomplete.
   [junit4]   2> 546962 INFO  (jetty-launcher-1165-thread-3) [    ] o.a.s.s.SolrDispatchFilter  ___      _       Welcome to Apache Solr™ version 7.3.0
   [junit4]   2> 546962 INFO  (jetty-launcher-1165-thread-3) [    ] o.a.s.s.SolrDispatchFilter / __| ___| |_ _   Starting in cloud mode on port null
   [junit4]   2> 546962 INFO  (jetty-launcher-1165-thread-3) [    ] o.a.s.s.SolrDispatchFilter \__ \/ _ \ | '_|  Install dir: null
   [junit4]   2> 546962 INFO  (jetty-launcher-1165-thread-3) [    ] o.a.s.s.SolrDispatchFilter |___/\___/_|_|    Start time: 2017-12-25T04:11:45.515Z
   [junit4]   2> 546962 INFO  (jetty-launcher-1165-thread-1) [    ] o.e.j.s.AbstractConnector Started ServerConnector@4c68b37b{HTTP/1.1,[http/1.1]}{127.0.0.1:54281}
   [junit4]   2> 546962 INFO  (jetty-launcher-1165-thread-1) [    ] o.e.j.s.Server Started @555030ms
   [junit4]   2> 546962 INFO  (jetty-launcher-1165-thread-1) [    ] o.a.s.c.s.e.JettySolrRunner Jetty properties: {hostContext=/solr, hostPort=54281}
   [junit4]   2> 546962 ERROR (jetty-launcher-1165-thread-1) [    ] o.a.s.u.StartupLoggingUtils Missing Java Option solr.log.dir. Logging may be missing or incomplete.
   [junit4]   2> 546962 INFO  (jetty-launcher-1165-thread-1) [    ] o.a.s.s.SolrDispatchFilter  ___      _       Welcome to Apache Solr™ version 7.3.0
   [junit4]   2> 546962 INFO  (jetty-launcher-1165-thread-1) [    ] o.a.s.s.SolrDispatchFilter / __| ___| |_ _   Starting in cloud mode on port null
   [junit4]   2> 546962 INFO  (jetty-launcher-1165-thread-1) [    ] o.a.s.s.SolrDispatchFilter \__ \/ _ \ | '_|  Install dir: null
   [junit4]   2> 546962 INFO  (jetty-launcher-1165-thread-1) [    ] o.a.s.s.SolrDispatchFilter |___/\___/_|_|    Start time: 2017-12-25T04:11:45.515Z
   [junit4]   2> 546962 INFO  (jetty-launcher-1165-thread-2) [    ] o.e.j.s.AbstractConnector Started ServerConnector@6c30ab70{HTTP/1.1,[http/1.1]}{127.0.0.1:54275}
   [junit4]   2> 546963 INFO  (jetty-launcher-1165-thread-2) [    ] o.e.j.s.Server Started @555031ms
   [junit4]   2> 546963 INFO  (jetty-launcher-1165-thread-2) [    ] o.a.s.c.s.e.JettySolrRunner Jetty properties: {hostContext=/solr, hostPort=54275}
   [junit4]   2> 546963 ERROR (jetty-launcher-1165-thread-2) [    ] o.a.s.u.StartupLoggingUtils Missing Java Option solr.log.dir. Logging may be missing or incomplete.
   [junit4]   2> 546963 INFO  (jetty-launcher-1165-thread-2) [    ] o.a.s.s.SolrDispatchFilter  ___      _       Welcome to Apache Solr™ version 7.3.0
   [junit4]   2> 546963 INFO  (jetty-launcher-1165-thread-2) [    ] o.a.s.s.SolrDispatchFilter / __| ___| |_ _   Starting in cloud mode on port null
   [junit4]   2> 546963 INFO  (jetty-launcher-1165-thread-2) [    ] o.a.s.s.SolrDispatchFilter \__ \/ _ \ | '_|  Install dir: null
   [junit4]   2> 546963 INFO  (jetty-launcher-1165-thread-2) [    ] o.a.s.s.SolrDispatchFilter |___/\___/_|_|    Start time: 2017-12-25T04:11:45.516Z
   [junit4]   2> 546972 INFO  (zkConnectionManagerCallback-1170-thread-1) [    ] o.a.s.c.c.ConnectionManager zkClient has connected
   [junit4]   2> 546972 INFO  (zkConnectionManagerCallback-1174-thread-1) [    ] o.a.s.c.c.ConnectionManager zkClient has connected
   [junit4]   2> 546972 INFO  (zkConnectionManagerCallback-1172-thread-1) [    ] o.a.s.c.c.ConnectionManager zkClient has connected
   [junit4]   2> 546972 INFO  (jetty-launcher-1165-thread-3) [    ] o.a.s.s.SolrDispatchFilter solr.xml found in ZooKeeper. Loading...
   [junit4]   2> 546972 INFO  (jetty-launcher-1165-thread-2) [    ] o.a.s.s.SolrDispatchFilter solr.xml found in ZooKeeper. Loading...
   [junit4]   2> 546972 INFO  (jetty-launcher-1165-thread-1) [    ] o.a.s.s.SolrDispatchFilter solr.xml found in ZooKeeper. Loading...
   [junit4]   2> 546989 INFO  (jetty-launcher-1165-thread-2) [    ] o.a.s.c.ZkContainer Zookeeper client=127.0.0.1:54271/solr
   [junit4]   2> 546989 INFO  (jetty-launcher-1165-thread-3) [    ] o.a.s.c.ZkContainer Zookeeper client=127.0.0.1:54271/solr
   [junit4]   2> 546991 INFO  (jetty-launcher-1165-thread-1) [    ] o.a.s.c.ZkContainer Zookeeper client=127.0.0.1:54271/solr
   [junit4]   2> 546993 INFO  (zkConnectionManagerCallback-1181-thread-1) [    ] o.a.s.c.c.ConnectionManager zkClient has connected
   [junit4]   2> 546994 INFO  (zkConnectionManagerCallback-1184-thread-1) [    ] o.a.s.c.c.ConnectionManager zkClient has connected
   [junit4]   2> 546994 INFO  (zkConnectionManagerCallback-1186-thread-1) [    ] o.a.s.c.c.ConnectionManager zkClient has connected
   [junit4]   2> 546994 WARN  (NIOServerCxn.Factory:0.0.0.0/0.0.0.0:0) [    ] o.a.z.s.NIOServerCnxn caught end of stream exception
   [junit4]   2> EndOfStreamException: Unable to read additional data from client sessionid 0x1608bde897f0004, likely client has closed socket
   [junit4]   2> 	at org.apache.zookeeper.server.NIOServerCnxn.doIO(NIOServerCnxn.java:239)
   [junit4]   2> 	at org.apache.zookeeper.server.NIOServerCnxnFactory.run(NIOServerCnxnFactory.java:203)
   [junit4]   2> 	at java.lang.Thread.run(Thread.java:748)
   [junit4]   2> 546995 WARN  (NIOServerCxn.Factory:0.0.0.0/0.0.0.0:0) [    ] o.a.z.s.NIOServerCnxn caught end of stream exception
   [junit4]   2> EndOfStreamException: Unable to read additional data from client sessionid 0x1608bde897f0005, likely client has closed socket
   [junit4]   2> 	at org.apache.zookeeper.server.NIOServerCnxn.doIO(NIOServerCnxn.java:239)
   [junit4]   2> 	at org.apache.zookeeper.server.NIOServerCnxnFactory.run(NIOServerCnxnFactory.java:203)
   [junit4]   2> 	at java.lang.Thread.run(Thread.java:748)
   [junit4]   2> 546998 INFO  (zkConnectionManagerCallback-1188-thread-1-processing-n:127.0.0.1:54275_solr) [n:127.0.0.1:54275_solr    ] o.a.s.c.c.ConnectionManager zkClient has connected
   [junit4]   2> 546998 INFO  (zkConnectionManagerCallback-1190-thread-1-processing-n:127.0.0.1:54277_solr) [n:127.0.0.1:54277_solr    ] o.a.s.c.c.ConnectionManager zkClient has connected
   [junit4]   2> 547000 INFO  (zkConnectionManagerCallback-1192-thread-1-processing-n:127.0.0.1:54281_solr) [n:127.0.0.1:54281_solr    ] o.a.s.c.c.ConnectionManager zkClient has connected
   [junit4]   2> 547213 INFO  (jetty-launcher-1165-thread-2) [n:127.0.0.1:54275_solr    ] o.a.s.c.Overseer Overseer (id=null) closing
   [junit4]   2> 547215 INFO  (jetty-launcher-1165-thread-2) [n:127.0.0.1:54275_solr    ] o.a.s.c.OverseerElectionContext I am going to be the leader 127.0.0.1:54275_solr
   [junit4]   2> 547217 INFO  (jetty-launcher-1165-thread-2) [n:127.0.0.1:54275_solr    ] o.a.s.c.Overseer Overseer (id=99232979707953159-127.0.0.1:54275_solr-n_0000000000) starting
   [junit4]   2> 547236 INFO  (jetty-launcher-1165-thread-2) [n:127.0.0.1:54275_solr    ] o.a.s.c.ZkController Register node as live in ZooKeeper:/live_nodes/127.0.0.1:54275_solr
   [junit4]   2> 547344 INFO  (jetty-launcher-1165-thread-3) [n:127.0.0.1:54277_solr    ] o.a.s.c.c.ZkStateReader Updated live nodes from ZooKeeper... (0) -> (1)
   [junit4]   2> 547346 INFO  (jetty-launcher-1165-thread-1) [n:127.0.0.1:54281_solr    ] o.a.s.c.c.ZkStateReader Updated live nodes from ZooKeeper... (0) -> (1)
   [junit4]   2> 547350 INFO  (jetty-launcher-1165-thread-3) [n:127.0.0.1:54277_solr    ] o.a.s.c.Overseer Overseer (id=null) closing
   [junit4]   2> 547352 INFO  (jetty-launcher-1165-thread-1) [n:127.0.0.1:54281_solr    ] o.a.s.c.Overseer Overseer (id=null) closing
   [junit4]   2> 547358 INFO  (jetty-launcher-1165-thread-3) [n:127.0.0.1:54277_solr    ] o.a.s.c.ZkController Register node as live in ZooKeeper:/live_nodes/127.0.0.1:54277_solr
   [junit4]   2> 547365 INFO  (jetty-launcher-1165-thread-1) [n:127.0.0.1:54281_solr    ] o.a.s.c.ZkController Register node as live in ZooKeeper:/live_nodes/127.0.0.1:54281_solr
   [junit4]   2> 547388 INFO  (jetty-launcher-1165-thread-2) [n:127.0.0.1:54275_solr    ] o.a.s.m.r.SolrJmxReporter JMX monitoring for 'solr_54275.solr.node' (registry 'solr.node') enabled at server: com.sun.jmx.mbeanserver.JmxMBeanServer@2c09cae7
   [junit4]   2> 547394 INFO  (jetty-launcher-1165-thread-2) [n:127.0.0.1:54275_solr    ] o.a.s.m.r.SolrJmxReporter JMX monitoring for 'solr_54275.solr.jvm' (registry 'solr.jvm') enabled at server: com.sun.jmx.mbeanserver.JmxMBeanServer@2c09cae7
   [junit4]   2> 547394 INFO  (jetty-launcher-1165-thread-2) [n:127.0.0.1:54275_solr    ] o.a.s.m.r.SolrJmxReporter JMX monitoring for 'solr_54275.solr.jetty' (registry 'solr.jetty') enabled at server: com.sun.jmx.mbeanserver.JmxMBeanServer@2c09cae7
   [junit4]   2> 547395 INFO  (jetty-launcher-1165-thread-2) [n:127.0.0.1:54275_solr    ] o.a.s.c.CorePropertiesLocator Found 0 core definitions underneath C:\Users\jenkins\workspace\Lucene-Solr-7.x-Windows\solr\build\solr-core\test\J1\temp\solr.cloud.autoscaling.AutoAddReplicasPlanActionTest_4B43281DD84AA0A0-001\tempDir-001\node3\.
   [junit4]   2> 547509 INFO  (zkCallback-1187-thread-1-processing-n:127.0.0.1:54275_solr) [n:127.0.0.1:54275_solr    ] o.a.s.c.c.ZkStateReader Updated live nodes from ZooKeeper... (0) -> (3)
   [junit4]   2> 547510 INFO  (zkCallback-1189-thread-1-processing-n:127.0.0.1:54277_solr) [n:127.0.0.1:54277_solr    ] o.a.s.c.c.ZkStateReader Updated live nodes from ZooKeeper... (1) -> (3)
   [junit4]   2> 547511 INFO  (zkCallback-1191-thread-1-processing-n:127.0.0.1:54281_solr) [n:127.0.0.1:54281_solr    ] o.a.s.c.c.ZkStateReader Updated live nodes from ZooKeeper... (1) -> (3)
   [junit4]   2> 547517 INFO  (jetty-launcher-1165-thread-1) [n:127.0.0.1:54281_solr    ] o.a.s.m.r.SolrJmxReporter JMX monitoring for 'solr_54281.solr.node' (registry 'solr.node') enabled at server: com.sun.jmx.mbeanserver.JmxMBeanServer@2c09cae7
   [junit4]   2> 547535 INFO  (jetty-launcher-1165-thread-1) [n:127.0.0.1:54281_solr    ] o.a.s.m.r.SolrJmxReporter JMX monitoring for 'solr_54281.solr.jvm' (registry 'solr.jvm') enabled at server: com.sun.jmx.mbeanserver.JmxMBeanServer@2c09cae7
   [junit4]   2> 547535 INFO  (jetty-launcher-1165-thread-1) [n:127.0.0.1:54281_solr    ] o.a.s.m.r.SolrJmxReporter JMX monitoring for 'solr_54281.solr.jetty' (registry 'solr.jetty') enabled at server: com.sun.jmx.mbeanserver.JmxMBeanServer@2c09cae7
   [junit4]   2> 547539 INFO  (jetty-launcher-1165-thread-1) [n:127.0.0.1:54281_solr    ] o.a.s.c.CorePropertiesLocator Found 0 core definitions underneath C:\Users\jenkins\workspace\Lucene-Solr-7.x-Windows\solr\build\solr-core\test\J1\temp\solr.cloud.autoscaling.AutoAddReplicasPlanActionTest_4B43281DD84AA0A0-001\tempDir-001\node1\.
   [junit4]   2> 547552 INFO  (jetty-launcher-1165-thread-3) [n:127.0.0.1:54277_solr    ] o.a.s.m.r.SolrJmxReporter JMX monitoring for 'solr_54277.solr.node' (registry 'solr.node') enabled at server: com.sun.jmx.mbeanserver.JmxMBeanServer@2c09cae7
   [junit4]   2> 547564 INFO  (jetty-launcher-1165-thread-3) [n:127.0.0.1:54277_solr    ] o.a.s.m.r.SolrJmxReporter JMX monitoring for 'solr_54277.solr.jvm' (registry 'solr.jvm') enabled at server: com.sun.jmx.mbeanserver.JmxMBeanServer@2c09cae7
   [junit4]   2> 547564 INFO  (jetty-launcher-1165-thread-3) [n:127.0.0.1:54277_solr    ] o.a.s.m.r.SolrJmxReporter JMX monitoring for 'solr_54277.solr.jetty' (registry 'solr.jetty') enabled at server: com.sun.jmx.mbeanserver.JmxMBeanServer@2c09cae7
   [junit4]   2> 547567 INFO  (jetty-launcher-1165-thread-3) [n:127.0.0.1:54277_solr    ] o.a.s.c.CorePropertiesLocator Found 0 core definitions underneath C:\Users\jenkins\workspace\Lucene-Solr-7.x-Windows\solr\build\solr-core\test\J1\temp\solr.cloud.autoscaling.AutoAddReplicasPlanActionTest_4B43281DD84AA0A0-001\tempDir-001\node2\.
   [junit4]   2> 547662 INFO  (zkConnectionManagerCallback-1200-thread-1) [    ] o.a.s.c.c.ConnectionManager zkClient has connected
   [junit4]   2> 547670 INFO  (zkConnectionManagerCallback-1204-thread-1) [    ] o.a.s.c.c.ConnectionManager zkClient has connected
   [junit4]   2> 547672 INFO  (SUITE-AutoAddReplicasPlanActionTest-seed#[4B43281DD84AA0A0]-worker) [    ] o.a.s.c.c.ZkStateReader Updated live nodes from ZooKeeper... (0) -> (3)
   [junit4]   2> 547674 INFO  (SUITE-AutoAddReplicasPlanActionTest-seed#[4B43281DD84AA0A0]-worker) [    ] o.a.s.c.s.i.ZkClientClusterStateProvider Cluster at 127.0.0.1:54271/solr ready
   [junit4]   2> 547706 INFO  (TEST-AutoAddReplicasPlanActionTest.testSimple-seed#[4B43281DD84AA0A0]) [    ] o.a.s.SolrTestCaseJ4 ###Starting testSimple
   [junit4]   2> 547723 INFO  (qtp632359135-5450) [n:127.0.0.1:54275_solr    ] o.a.s.h.a.CollectionsHandler Invoked Collection Action :create with params replicationFactor=2&collection.configName=conf&maxShardsPerNode=2&autoAddReplicas=true&name=testSimple1&nrtReplicas=2&action=CREATE&numShards=2&createNodeSet=127.0.0.1:54275_solr,127.0.0.1:54281_solr&wt=javabin&version=2 and sendToOCPQueue=true
   [junit4]   2> 547729 INFO  (OverseerThreadFactory-2509-thread-1-processing-n:127.0.0.1:54275_solr) [n:127.0.0.1:54275_solr    ] o.a.s.c.CreateCollectionCmd Create collection testSimple1
   [junit4]   2> 547860 INFO  (OverseerStateUpdate-99232979707953159-127.0.0.1:54275_solr-n_0000000000) [n:127.0.0.1:54275_solr    ] o.a.s.c.o.SliceMutator createReplica() {
   [junit4]   2>   "operation":"ADDREPLICA",
   [junit4]   2>   "collection":"testSimple1",
   [junit4]   2>   "shard":"shard1",
   [junit4]   2>   "core":"testSimple1_shard1_replica_n1",
   [junit4]   2>   "state":"down",
   [junit4]   2>   "base_url":"http://127.0.0.1:54275/solr",
   [junit4]   2>   "type":"NRT",
   [junit4]   2>   "waitForFinalState":"false"} 
   [junit4]   2> 547861 INFO  (OverseerStateUpdate-99232979707953159-127.0.0.1:54275_solr-n_0000000000) [n:127.0.0.1:54275_solr    ] o.a.s.c.o.SliceMutator createReplica() {
   [junit4]   2>   "operation":"ADDREPLICA",
   [junit4]   2>   "collection":"testSimple1",
   [junit4]   2>   "shard":"shard1",
   [junit4]   2>   "core":"testSimple1_shard1_replica_n2",
   [junit4]   2>   "state":"down",
   [junit4]   2>   "base_url":"http://127.0.0.1:54281/solr",
   [junit4]   2>   "type":"NRT",
   [junit4]   2>   "waitForFinalState":"false"} 
   [junit4]   2> 547862 INFO  (OverseerStateUpdate-99232979707953159-127.0.0.1:54275_solr-n_0000000000) [n:127.0.0.1:54275_solr    ] o.a.s.c.o.SliceMutator createReplica() {
   [junit4]   2>   "operation":"ADDREPLICA",
   [junit4]   2>   "collection":"testSimple1",
   [junit4]   2>   "shard":"shard2",
   [junit4]   2>   "core":"testSimple1_shard2_replica_n3",
   [junit4]   2>   "state":"down",
   [junit4]   2>   "base_url":"http://127.0.0.1:54275/solr",
   [junit4]   2>   "type":"NRT",
   [junit4]   2>   "waitForFinalState":"false"} 
   [junit4]   2> 547864 INFO  (OverseerStateUpdate-99232979707953159-127.0.0.1:54275_solr-n_0000000000) [n:127.0.0.1:54275_solr    ] o.a.s.c.o.SliceMutator createReplica() {
   [junit4]   2>   "operation":"ADDREPLICA",
   [junit4]   2>   "collection":"testSimple1",
   [junit4]   2>   "shard":"shard2",
   [junit4]   2>   "core":"testSimple1_shard2_replica_n4",
   [junit4]   2>   "state":"down",
   [junit4]   2>   "base_url":"http://127.0.0.1:54281/solr",
   [junit4]   2>   "type":"NRT",
   [junit4]   2>   "waitForFinalState":"false"} 
   [junit4]   2> 548079 INFO  (qtp632359135-5447) [n:127.0.0.1:54275_solr    ] o.a.s.h.a.CoreAdminOperation core create command qt=/admin/cores&coreNodeName=core_node5&collection.configName=conf&newCollection=true&name=testSimple1_shard1_replica_n1&action=CREATE&numShards=2&collection=testSimple1&shard=shard1&wt=javabin&version=2&replicaType=NRT
   [junit4]   2> 548080 INFO  (qtp632359135-5447) [n:127.0.0.1:54275_solr    ] o.a.s.c.TransientSolrCoreCacheDefault Allocating transient cache for 2147483647 transient cores
   [junit4]   2> 548093 INFO  (qtp632359135-5445) [n:127.0.0.1:54275_solr    ] o.a.s.h.a.CoreAdminOperation core create command qt=/admin/cores&coreNodeName=core_node7&collection.configName=conf&newCollection=true&name=testSimple1_shard2_replica_n3&action=CREATE&numShards=2&collection=testSimple1&shard=shard2&wt=javabin&version=2&replicaType=NRT
   [junit4]   2> 548095 INFO  (qtp1041635439-5460) [n:127.0.0.1:54281_solr    ] o.a.s.h.a.CoreAdminOperation core create command qt=/admin/cores&coreNodeName=core_node6&collection.configName=conf&newCollection=true&name=testSimple1_shard1_replica_n2&action=CREATE&numShards=2&collection=testSimple1&shard=shard1&wt=javabin&version=2&replicaType=NRT
   [junit4]   2> 548097 INFO  (qtp1041635439-5460) [n:127.0.0.1:54281_solr    ] o.a.s.c.TransientSolrCoreCacheDefault Allocating transient cache for 2147483647 transient cores
   [junit4]   2> 548103 INFO  (qtp1041635439-5456) [n:127.0.0.1:54281_solr    ] o.a.s.h.a.CoreAdminOperation core create command qt=/admin/cores&coreNodeName=core_node8&collection.configName=conf&newCollection=true&name=testSimple1_shard2_replica_n4&action=CREATE&numShards=2&collection=testSimple1&shard=shard2&wt=javabin&version=2&replicaType=NRT
   [junit4]   2> 548217 INFO  (zkCallback-1187-thread-1-processing-n:127.0.0.1:54275_solr) [n:127.0.0.1:54275_solr    ] o.a.s.c.c.ZkStateReader A cluster state change: [WatchedEvent state:SyncConnected type:NodeDataChanged path:/collections/testSimple1/state.json] for collection [testSimple1] has occurred - updating... (live nodes size: [3])
   [junit4]   2> 548217 INFO  (zkCallback-1191-thread-1-processing-n:127.0.0.1:54281_solr) [n:127.0.0.1:54281_solr    ] o.a.s.c.c.ZkStateReader A cluster state change: [WatchedEvent state:SyncConnected type:NodeDataChanged path:/collections/testSimple1/state.json] for collection [testSimple1] has occurred - updating... (live nodes size: [3])
   [junit4]   2> 548219 INFO  (zkCallback-1187-thread-2-processing-n:127.0.0.1:54275_solr) [n:127.0.0.1:54275_solr    ] o.a.s.c.c.ZkStateReader A cluster state change: [WatchedEvent state:SyncConnected type:NodeDataChanged path:/collections/testSimple1/state.json] for collection [testSimple1] has occurred - updating... (live nodes size: [3])
   [junit4]   2> 548219 INFO  (zkCallback-1191-thread-2-processing-n:127.0.0.1:54281_solr) [n:127.0.0.1:54281_solr    ] o.a.s.c.c.ZkStateReader A cluster state change: [WatchedEvent state:SyncConnected type:NodeDataChanged path:/collections/testSimple1/state.json] for collection [testSimple1] has occurred - updating... (live nodes size: [3])
   [junit4]   2> 549149 INFO  (qtp632359135-5447) [n:127.0.0.1:54275_solr c:testSimple1 s:shard1 r:core_node5 x:testSimple1_shard1_replica_n1] o.a.s.c.SolrConfig Using Lucene MatchVersion: 7.3.0
   [junit4]   2> 549151 INFO  (qtp632359135-5445) [n:127.0.0.1:54275_solr c:testSimple1 s:shard2 r:core_node7 x:testSimple1_shard2_replica_n3] o.a.s.c.SolrConfig Using Lucene MatchVersion: 7.3.0
   [junit4]   2> 549155 INFO  (qtp1041635439-5460) [n:127.0.0.1:54281_solr c:testSimple1 s:shard1 r:core_node6 x:testSimple1_shard1_replica_n2] o.a.s.c.SolrConfig Using Lucene MatchVersion: 7.3.0
   [junit4]   2> 549158 INFO  (qtp632359135-5447) [n:127.0.0.1:54275_solr c:testSimple1 s:shard1 r:core_node5 x:testSimple1_shard1_replica_n1] o.a.s.s.IndexSchema [testSimple1_shard1_replica_n1] Schema name=minimal
   [junit4]   2> 549160 INFO  (qtp1041635439-5456) [n:127.0.0.1:54281_solr c:testSimple1 s:shard2 r:core_node8 x:testSimple1_shard2_replica_n4] o.a.s.c.SolrConfig Using Lucene MatchVersion: 7.3.0
   [junit4]   2> 549164 INFO  (qtp632359135-5447) [n:127.0.0.1:54275_solr c:testSimple1 s:shard1 r:core_node5 x:testSimple1_shard1_replica_n1] o.a.s.s.IndexSchema Loaded schema minimal/1.1 with uniqueid field id
   [junit4]   2> 549164 INFO  (qtp632359135-5447) [n:127.0.0.1:54275_solr c:testSimple1 s:shard1 r:core_node5 x:testSimple1_shard1_replica_n1] o.a.s.c.CoreContainer Creating SolrCore 'testSimple1_shard1_replica_n1' using configuration from collection testSimple1, trusted=true
   [junit4]   2> 549164 INFO  (qtp632359135-5447) [n:127.0.0.1:54275_solr c:testSimple1 s:shard1 r:core_node5 x:testSimple1_shard1_replica_n1] o.a.s.m.r.SolrJmxReporter JMX monitoring for 'solr_54275.solr.core.testSimple1.shard1.replica_n1' (registry 'solr.core.testSimple1.shard1.replica_n1') enabled at server: com.sun.jmx.mbeanserver.JmxMBeanServer@2c09cae7
   [junit4]   2> 549165 INFO  (qtp632359135-5447) [n:127.0.0.1:54275_solr c:testSimple1 s:shard1 r:core_node5 x:testSimple1_shard1_replica_n1] o.a.s.c.SolrCore solr.RecoveryStrategy.Builder
   [junit4]   2> 549165 INFO  (qtp632359135-5447) [n:127.0.0.1:54275_solr c:testSimple1 s:shard1 r:core_node5 x:testSimple1_shard1_replica_n1] o.a.s.c.SolrCore [[testSimple1_shard1_replica_n1] ] Opening new SolrCore at [C:\Users\jenkins\workspace\Lucene-Solr-7.x-Windows\solr\build\solr-core\test\J1\temp\solr.cloud.autoscaling.AutoAddReplicasPlanActionTest_4B43281DD84AA0A0-001\tempDir-001\node3\testSimple1_shard1_replica_n1], dataDir=[C:\Users\jenkins\workspace\Lucene-Solr-7.x-Windows\solr\build\solr-core\test\J1\temp\solr.cloud.autoscaling.AutoAddReplicasPlanActionTest_4B43281DD84AA0A0-001\tempDir-001\node3\.\testSimple1_shard1_replica_n1\data\]
   [junit4]   2> 549169 INFO  (qtp632359135-5445) [n:127.0.0.1:54275_solr c:testSimple1 s:shard2 r:core_node7 x:testSimple1_shard2_replica_n3] o.a.s.s.IndexSchema [testSimple1_shard2_replica_n3] Schema name=minimal
   [junit4]   2> 549169 INFO  (qtp1041635439-5460) [n:127.0.0.1:54281_solr c:testSimple1 s:shard1 r:core_node6 x:testSimple1_shard1_replica_n2] o.a.s.s.IndexSchema [testSimple1_shard1_replica_n2] Schema name=minimal
   [junit4]   2> 549171 INFO  (qtp632359135-5445) [n:127.0.0.1:54275_solr c:testSimple1 s:shard2 r:core_node7 x:testSimple1_shard2_replica_n3] o.a.s.s.IndexSchema Loaded schema minimal/1.1 with uniqueid field id
   [junit4]   2> 549171 INFO  (qtp632359135-5445) [n:127.0.0.1:54275_solr c:testSimple1 s:shard2 r:core_node7 x:testSimple1_shard2_replica_n3] o.a.s.c.CoreContainer Creating SolrCore 'testSimple1_shard2_replica_n3' using configuration from collection testSimple1, trusted=true
   [junit4]   2> 549171 INFO  (qtp1041635439-5460) [n:127.0.0.1:54281_solr c:testSimple1 s:shard1 r:core_node6 x:testSimple1_shard1_replica_n2] o.a.s.s.IndexSchema Loaded schema minimal/1.1 with uniqueid field id
   [junit4]   2> 549171 INFO  (qtp1041635439-5460) [n:127.0.0.1:54281_solr c:testSimple1 s:shard1 r:core_node6 x:testSimple1_shard1_replica_n2] o.a.s.c.CoreContainer Creating SolrCore 'testSimple1_shard1_replica_n2' using configuration from collection testSimple1, trusted=true
   [junit4]   2> 549171 INFO  (qtp632359135-5445) [n:127.0.0.1:54275_solr c:testSimple1 s:shard2 r:core_node7 x:testSimple1_shard2_replica_n3] o.a.s.m.r.SolrJmxReporter JMX monitoring for 'solr_54275.solr.core.testSimple1.shard2.replica_n3' (registry 'solr.core.testSimple1.shard2.replica_n3') enabled at server: com.sun.jmx.mbeanserver.JmxMBeanServer@2c09cae7
   [junit4]   2> 549172 INFO  (qtp632359135-5445) [n:127.0.0.1:54275_solr c:testSimple1 s:shard2 r:core_node7 x:testSimple1_shard2_replica_n3] o.a.s.c.SolrCore solr.RecoveryStrategy.Builder
   [junit4]   2> 549172 INFO  (qtp632359135-5445) [n:127.0.0.1:54275_solr c:testSimple1 s:shard2 r:core_node7 x:testSimple1_shard2_replica_n3] o.a.s.c.SolrCore [[testSimple1_shard2_replica_n3] ] Opening new SolrCore at [C:\Users\jenkins\workspace\Lucene-Solr-7.x-Windows\solr\build\solr-core\test\J1\temp\solr.cloud.autoscaling.AutoAddReplicasPlanActionTest_4B43281DD84AA0A0-001\tempDir-001\node3\testSimple1_shard2_replica_n3], dataDir=[C:\Users\jenkins\workspace\Lucene-Solr-7.x-Windows\solr\build\solr-core\test\J1\temp\solr.cloud.autoscaling.AutoAddReplicasPlanActionTest_4B43281DD84AA0A0-001\tempDir-001\node3\.\testSimple1_shard2_replica_n3\data\]
   [junit4]   2> 549172 INFO  (qtp1041635439-5460) [n:127.0.0.1:54281_solr c:testSimple1 s:shard1 r:core_node6 x:testSimple1_shard1_replica_n2] o.a.s.m.r.SolrJmxReporter JMX monitoring for 'solr_54281.solr.core.testSimple1.shard1.replica_n2' (registry 'solr.core.testSimple1.shard1.replica_n2') enabled at server: com.sun.jmx.mbeanserver.JmxMBeanServer@2c09cae7
   [junit4]   2> 549172 INFO  (qtp1041635439-5460) [n:127.0.0.1:54281_solr c:testSimple1 s:shard1 r:core_node6 x:testSimple1_shard1_replica_n2] o.a.s.c.SolrCore solr.RecoveryStrategy.Builder
   [junit4]   2> 549172 INFO  (qtp1041635439-5460) [n:127.0.0.1:54281_solr c:testSimple1 s:shard1 r:core_node6 x:testSimple1_shard1_replica_n2] o.a.s.c.SolrCore [[testSimple1_shard1_replica_n2] ] Opening new SolrCore at [C:\Users\jenkins\workspace\Lucene-Solr-7.x-Windows\solr\build\solr-core\test\J1\temp\solr.cloud.autoscaling.AutoAddReplicasPlanActionTest_4B43281DD84AA0A0-001\tempDir-001\node1\testSimple1_shard1_replica_n2], dataDir=[C:\Users\jenkins\workspace\Lucene-Solr-7.x-Windows\solr\build\solr-core\test\J1\temp\solr.cloud.autoscaling.AutoAddReplicasPlanActionTest_4B43281DD84AA0A0-001\tempDir-001\node1\.\testSimple1_shard1_replica_n2\data\]
   [junit4]   2> 549175 INFO  (qtp1041635439-5456) [n:127.0.0.1:54281_solr c:testSimple1 s:shard2 r:core_node8 x:testSimple1_shard2_replica_n4] o.a.s.s.IndexSchema [testSimple1_shard2_replica_n4] Schema name=minimal
   [junit4]   2> 549178 INFO  (qtp1041635439-5456) [n:127.0.0.1:54281_solr c:testSimple1 s:shard2 r:core_node8 x:testSimple1_shard2_replica_n4] o.a.s.s.IndexSchema Loaded schema minimal/1.1 with uniqueid field id
   [junit4]   2> 549178 INFO  (qtp1041635439-5456) [n:127.0.0.1:54281_solr c:testSimple1 s:shard2 r:core_node8 x:testSimple1_shard2_replica_n4] o.a.s.c.CoreContainer Creating SolrCore 'testSimple1_shard2_replica_n4' using configuration from collection testSimple1, trusted=true
   [junit4]   2> 549178 INFO  (qtp1041635439-5456) [n:127.0.0.1:54281_solr c:testSimple1 s:shard2 r:core_node8 x:testSimple1_shard2_replica_n4] o.a.s.m.r.SolrJmxReporter JMX monitoring for 'solr_54281.solr.core.testSimple1.shard2.replica_n4' (registry 'solr.core.testSimple1.shard2.replica_n4') enabled at server: com.sun.jmx.mbeanserver.JmxMBeanServer@2c09cae7
   [junit4]   2> 549178 INFO  (qtp1041635439-5456) [n:127.0.0.1:54281_solr c:testSimple1 s:shard2 r:core_node8 x:testSimple1_shard2_replica_n4] o.a.s.c.SolrCore solr.RecoveryStrategy.Builder
   [junit4]   2> 549178 INFO  (qtp1041635439-5456) [n:127.0.0.1:54281_solr c:testSimple1 s:shard2 r:core_node8 x:testSimple1_shard2_replica_n4] o.a.s.c.SolrCore [[testSimple1_shard2_replica_n4] ] Opening new SolrCore at [C:\Users\jenkins\workspace\Lucene-Solr-7.x-Windows\solr\build\solr-core\test\J1\temp\solr.cloud.autoscaling.AutoAddReplicasPlanActionTest_4B43281DD84AA0A0-001\tempDir-001\node1\testSimple1_shard2_replica_n4], dataDir=[C:\Users\jenkins\workspace\Lucene-Solr-7.x-Windows\solr\build\solr-core\test\J1\temp\solr.cloud.autoscaling.AutoAddReplicasPlanActionTest_4B43281DD84AA0A0-001\tempDir-001\node1\.\testSimple1_shard2_replica_n4\data\]
   [junit4]   2> 549272 INFO  (qtp632359135-5445) [n:127.0.0.1:54275_solr c:testSimple1 s:shard2 r:core_node7 x:testSimple1_shard2_replica_n3] o.a.s.u.UpdateHandler Using UpdateLog implementation: org.apache.solr.update.UpdateLog
   [junit4]   2> 549272 INFO  (qtp632359135-5445) [n:127.0.0.1:54275_solr c:testSimple1 s:shard2 r:core_node7 x:testSimple1_shard2_replica_n3] o.a.s.u.UpdateLog Initializing UpdateLog: dataDir=null defaultSyncLevel=FLUSH numRecordsToKeep=100 maxNumLogsToKeep=10 numVersionBuckets=65536
   [junit4]   2> 549273 INFO  (qtp1041635439-5460) [n:127.0.0.1:54281_solr c:testSimple1 s:shard1 r:core_node6 x:testSimple1_shard1_replica_n2] o.a.s.u.UpdateHandler Using UpdateLog implementation: org.apache.solr.update.UpdateLog
   [junit4]   2> 549273 INFO  (qtp1041635439-5460) [n:127.0.0.1:54281_solr c:testSimple1 s:shard1 r:core_node6 x:testSimple1_shard1_replica_n2] o.a.s.u.UpdateLog Initializing UpdateLog: dataDir=null defaultSyncLevel=FLUSH numRecordsToKeep=100 maxNumLogsToKeep=10 numVersionBuckets=65536
   [junit4]   2> 549274 INFO  (qtp632359135-5447) [n:127.0.0.1:54275_solr c:testSimple1 s:shard1 r:core_node5 x:testSimple1_shard1_replica_n1] o.a.s.u.UpdateHandler Using UpdateLog implementation: org.apache.solr.update.UpdateLog
   [junit4]   2> 549274 INFO  (qtp632359135-5447) [n:127.0.0.1:54275_solr c:testSimple1 s:shard1 r:core_node5 x:testSimple1_shard1_replica_n1] o.a.s.u.UpdateLog Initializing UpdateLog: dataDir=null defaultSyncLevel=FLUSH numRecordsToKeep=100 maxNumLogsToKeep=10 numVersionBuckets=65536
   [junit4]   2> 549276 INFO  (qtp1041635439-5460) [n:127.0.0.1:54281_solr c:testSimple1 s:shard1 r:core_node6 x:testSimple1_shard1_replica_n2] o.a.s.u.CommitTracker Hard AutoCommit: disabled
   [junit4]   2> 549276 INFO  (qtp1041635439-5460) [n:127.0.0.1:54281_solr c:testSimple1 s:shard1 r:core_node6 x:testSimple1_shard1_replica_n2] o.a.s.u.CommitTracker Soft AutoCommit: disabled
   [junit4]   2> 549276 INFO  (qtp632359135-5447) [n:127.0.0.1:54275_solr c:testSimple1 s:shard1 r:core_node5 x:testSimple1_shard1_replica_n1] o.a.s.u.CommitTracker Hard AutoCommit: disabled
   [junit4]   2> 549276 INFO  (qtp632359135-5447) [n:127.0.0.1:54275_solr c:testSimple1 s:shard1 r:core_node5 x:testSimple1_shard1_replica_n1] o.a.s.u.CommitTracker Soft AutoCommit: disabled
   [junit4]   2> 549278 INFO  (qtp1041635439-5460) [n:127.0.0.1:54281_solr c:testSimple1 s:shard1 r:core_node6 x:testSimple1_shard1_replica_n2] o.a.s.s.SolrIndexSearcher Opening [Searcher@236ff60a[testSimple1_shard1_replica_n2] main]
   [junit4]   2> 549278 INFO  (qtp632359135-5445) [n:127.0.0.1:54275_solr c:testSimple1 s:shard2 r:core_node7 x:testSimple1_shard2_replica_n3] o.a.s.u.CommitTracker Hard AutoCommit: disabled
   [junit4]   2> 549278 INFO  (qtp632359135-5445) [n:127.0.0.1:54275_solr c:testSimple1 s:shard2 r:core_node7 x:testSimple1_shard2_replica_n3] o.a.s.u.CommitTracker Soft AutoCommit: disabled
   [junit4]   2> 549279 INFO  (qtp1041635439-5460) [n:127.0.0.1:54281_solr c:testSimple1 s:shard1 r:core_node6 x:testSimple1_shard1_replica_n2] o.a.s.r.ManagedResourceStorage Configured ZooKeeperStorageIO with znodeBase: /configs/conf
   [junit4]   2> 549279 INFO  (qtp1041635439-5460) [n:127.0.0.1:54281_solr c:testSimple1 s:shard1 r:core_node6 x:testSimple1_shard1_replica_n2] o.a.s.r.ManagedResourceStorage Loaded null at path _rest_managed.json using ZooKeeperStorageIO:path=/configs/conf
   [junit4]   2> 549279 INFO  (qtp632359135-5447) [n:127.0.0.1:54275_solr c:testSimple1 s:shard1 r:core_node5 x:testSimple1_shard1_replica_n1] o.a.s.s.SolrIndexSearcher Opening [Searcher@3f295e24[testSimple1_shard1_replica_n1] main]
   [junit4]   2> 549279 INFO  (qtp1041635439-5460) [n:127.0.0.1:54281_solr c:testSimple1 s:shard1 r:core_node6 x:testSimple1_shard1_replica_n2] o.a.s.h.ReplicationHandler Commits will be reserved for 10000ms.
   [junit4]   2> 549279 INFO  (qtp1041635439-5460) [n:127.0.0.1:54281_solr c:testSimple1 s:shard1 r:core_node6 x:testSimple1_shard1_replica_n2] o.a.s.u.UpdateLog Could not find max version in index or recent updates, using new clock 1587727677870047232
   [junit4]   2> 549280 INFO  (searcherExecutor-2514-thread-1-processing-n:127.0.0.1:54281_solr x:testSimple1_shard1_replica_n2 s:shard1 c:testSimple1 r:core_node6) [n:127.0.0.1:54281_solr c:testSimple1 s:shard1 r:core_node6 x:testSimple1_shard1_replica_n2] o.a.s.c.SolrCore [testSimple1_shard1_replica_n2] Registered new searcher Searcher@236ff60a[testSimple1_shard1_replica_n2] main{ExitableDirectoryReader(UninvertingDirectoryReader())}
   [junit4]   2> 549281 INFO  (qtp632359135-5447) [n:127.0.0.1:54275_solr c:testSimple1 s:shard1 r:core_node5 x:testSimple1_shard1_replica_n1] o.a.s.r.ManagedResourceStorage Configured ZooKeeperStorageIO with znodeBase: /configs/conf
   [junit4]   2> 549281 INFO  (qtp632359135-5447) [n:127.0.0.1:54275_solr c:testSimple1 s:shard1 r:core_node5 x:testSimple1_shard1_replica_n1] o.a.s.r.ManagedResourceStorage Loaded null at path _rest_managed.json using ZooKeeperStorageIO:path=/configs/conf
   [junit4]   2> 549282 INFO  (qtp632359135-5447) [n:127.0.0.1:54275_solr c:testSimple1 s:shard1 r:core_node5 x:testSimple1_shard1_replica_n1] o.a.s.h.ReplicationHandler Commits will be reserved for 10000ms.
   [junit4]   2> 549282 INFO  (qtp632359135-5447) [n:127.0.0.1:54275_solr c:testSimple1 s:shard1 r:core_node5 x:testSimple1_shard1_replica_n1] o.a.s.u.UpdateLog Could not find max version in index or recent updates, using new clock 1587727677873192960
   [junit4]   2> 549285 INFO  (searcherExecutor-2512-thread-1-processing-n:127.0.0.1:54275_solr x:testSimple1_shard1_replica_n1 s:shard1 c:testSimple1 r:core_node5) [n:127.0.0.1:54275_solr c:testSimple1 s:shard1 r:core_node5 x:testSimple1_shard1_replica_n1] o.a.s.c.SolrCore [testSimple1_shard1_replica_n1] Registered new searcher Searcher@3f295e24[testSimple1_shard1_replica_n1] main{ExitableDirectoryReader(UninvertingDirectoryReader())}
   [junit4]   2> 549286 INFO  (qtp1041635439-5456) [n:127.0.0.1:54281_solr c:testSimple1 s:shard2 r:core_node8 x:testSimple1_shard2_replica_n4] o.a.s.u.UpdateHandler Using UpdateLog implementation: org.apache.solr.update.UpdateLog
   [junit4]   2> 549286 INFO  (qtp1041635439-5456) [n:127.0.0.1:54281_solr c:testSimple1 s:shard2 r:core_node8 x:testSimple1_shard2_replica_n4] o.a.s.u.UpdateLog Initializing UpdateLog: dataDir=null defaultSyncLevel=FLUSH numRecordsToKeep=100 maxNumLogsToKeep=10 numVersionBuckets=65536
   [junit4]   2> 549287 INFO  (qtp632359135-5445) [n:127.0.0.1:54275_solr c:testSimple1 s:shard2 r:core_node7 x:testSimple1_shard2_replica_n3] o.a.s.s.SolrIndexSearcher Opening [Searcher@25270162[testSimple1_shard2_replica_n3] main]
   [junit4]   2> 549288 INFO  (qtp1041635439-5456) [n:127.0.0.1:54281_solr c:testSimple1 s:shard2 r:core_node8 x:testSimple1_shard2_replica_n4] o.a.s.u.CommitTracker Hard AutoCommit: disabled
   [junit4]   2> 549288 INFO  (qtp1041635439-5456) [n:127.0.0.1:54281_solr c:testSimple1 s:shard2 r:core_node8 x:testSimple1_shard2_replica_n4] o.a.s.u.CommitTracker Soft AutoCommit: disabled
   [junit4]   2> 549289 INFO  (qtp632359135-5445) [n:127.0.0.1:54275_solr c:testSimple1 s:shard2 r:core_node7 x:testSimple1_shard2_replica_n3] o.a.s.r.ManagedResourceStorage Configured ZooKeeperStorageIO with znodeBase: /configs/conf
   [junit4]   2> 549289 INFO  (qtp1041635439-5460) [n:127.0.0.1:54281_solr c:testSimple1 s:shard1 r:core_node6 x:testSimple1_shard1_replica_n2] o.a.s.c.ShardLeaderElectionContext Enough replicas found to continue.
   [junit4]   2> 549289 INFO  (qtp1041635439-5460) [n:127.0.0.1:54281_solr c:testSimple1 s:shard1 r:core_node6 x:testSimple1_shard1_replica_n2] o.a.s.c.ShardLeaderElectionContext I may be the new leader - try and sync
   [junit4]   2> 549289 INFO  (qtp1041635439-5460) [n:127.0.0.1:54281_solr c:testSimple1 s:shard1 r:core_node6 x:testSimple1_shard1_replica_n2] o.a.s.c.SyncStrategy Sync replicas to http://127.0.0.1:54281/solr/testSimple1_shard1_replica_n2/
   [junit4]   2> 549289 INFO  (qtp632359135-5445) [n:127.0.0.1:54275_solr c:testSimple1 s:shard2 r:core_node7 x:testSimple1_shard2_replica_n3] o.a.s.r.ManagedResourceStorage Loaded null at path _rest_managed.json using ZooKeeperStorageIO:path=/configs/conf
   [junit4]   2> 549289 INFO  (qtp1041635439-5460) [n:127.0.0.1:54281_solr c:testSimple1 s:shard1 r:core_node6 x:testSimple1_shard1_replica_n2] o.a.s.u.PeerSync PeerSync: core=testSimple1_shard1_replica_n2 url=http://127.0.0.1:54281/solr START replicas=[http://127.0.0.1:54275/solr/testSimple1_shard1_replica_n1/] nUpdates=100
   [junit4]   2> 549289 INFO  (qtp1041635439-5456) [n:127.0.0.1:54281_solr c:testSimple1 s:shard2 r:core_node8 x:testSimple1_shard2_replica_n4] o.a.s.s.SolrIndexSearcher Opening [Searcher@42e50db[testSimple1_shard2_replica_n4] main]
   [junit4]   2> 549289 INFO  (qtp632359135-5445) [n:127.0.0.1:54275_solr c:testSimple1 s:shard2 r:core_node7 x:testSimple1_shard2_replica_n3] o.a.s.h.ReplicationHandler Commits will be reserved for 10000ms.
   [junit4]   2> 549290 INFO  (searcherExecutor-2513-thread-1-processing-n:127.0.0.1:54275_solr x:testSimple1_shard2_replica_n3 s:shard2 c:testSimple1 r:core_node7) [n:127.0.0.1:54275_solr c:testSimple1 s:shard2 r:core_node7 x:testSimple1_shard2_replica_n3] o.a.s.c.SolrCore [testSimple1_shard2_replica_n3] Registered new searcher Searcher@25270162[testSimple1_shard2_replica_n3] main{ExitableDirectoryReader(UninvertingDirectoryReader())}
   [junit4]   2> 549290 INFO  (qtp632359135-5445) [n:127.0.0.1:54275_solr c:testSimple1 s:shard2 r:core_node7 x:testSimple1_shard2_replica_n3] o.a.s.u.UpdateLog Could not find max version in index or recent updates, using new clock 1587727677881581568
   [junit4]   2> 549291 INFO  (qtp632359135-5442) [n:127.0.0.1:54275_solr c:testSimple1 s:shard1 r:core_node5 x:testSimple1_shard1_replica_n1] o.a.s.c.S.Request [testSimple1_shard1_replica_n1]  webapp=/solr path=/get params={distrib=false&qt=/get&fingerprint=false&getVersions=100&wt=javabin&version=2} status=0 QTime=0
   [junit4]   2> 549291 INFO  (qtp1041635439-5456) [n:127.0.0.1:54281_solr c:testSimple1 s:shard2 r:core_node8 x:testSimple1_shard2_replica_n4] o.a.s.r.ManagedResourceStorage Configured ZooKeeperStorageIO with znodeBase: /configs/conf
   [junit4]   2> 549291 INFO  (qtp1041635439-5456) [n:127.0.0.1:54281_solr c:testSimple1 s:shard2 r:core_node8 x:testSimple1_shard2_replica_n4] o.a.s.r.ManagedResourceStorage Loaded null at path _rest_managed.json using ZooKeeperStorageIO:path=/configs/conf
   [junit4]   2> 549291 INFO  (qtp1041635439-5456) [n:127.0.0.1:54281_solr c:testSimple1 s:shard2 r:core_node8 x:testSimple1_shard2_replica_n4] o.a.s.h.ReplicationHandler Commits will be reserved for 10000ms.
   [junit4]   2> 549291 INFO  (qtp1041635439-5456) [n:127.0.0.1:54281_solr c:testSimple1 s:shard2 r:core_node8 x:testSimple1_shard2_replica_n4] o.a.s.u.UpdateLog Could not find max version in index or recent updates, using new clock 1587727677882630144
   [junit4]   2> 549291 INFO  (searcherExecutor-2515-thread-1-processing-n:127.0.0.1:54281_solr x:testSimple1_shard2_replica_n4 s:shard2 c:testSimple1 r:core_node8) [n:127.0.0.1:54281_solr c:testSimple1 s:shard2 r:core_node8 x:testSimple1_shard2_replica_n4] o.a.s.c.SolrCore [testSimple1_shard2_replica_n4] Registered new searcher Searcher@42e50db[testSimple1_shard2_replica_n4] main{ExitableDirectoryReader(UninvertingDirectoryReader())}
   [junit4]   2> 549297 INFO  (qtp1041635439-5456) [n:127.0.0.1:54281_solr c:testSimple1 s:shard2 r:core_node8 x:testSimple1_shard2_replica_n4] o.a.s.c.ShardLeaderElectionContext Enough replicas found to continue.
   [junit4]   2> 549297 INFO  (qtp1041635439-5456) [n:127.0.0.1:54281_solr c:testSimple1 s:shard2 r:core_node8 x:testSimple1_shard2_replica_n4] o.a.s.c.ShardLeaderElectionContext I may be the new leader - try and sync
   [junit4]   2> 549297 INFO  (qtp1041635439-5456) [n:127.0.0.1:54281_solr c:testSimple1 s:shard2 r:core_node8 x:testSimple1_shard2_replica_n4] o.a.s.c.SyncStrategy Sync replicas to http://127.0.0.1:54281/solr/testSimple1_shard2_replica_n4/
   [junit4]   2> 549298 INFO  (qtp1041635439-5456) [n:127.0.0.1:54281_solr c:testSimple1 s:shard2 r:core_node8 x:testSimple1_shard2_replica_n4] o.a.s.u.PeerSync PeerSync: core=testSimple1_shard2_replica_n4 url=http://127.0.0.1:54281/solr START replicas=[http://127.0.0.1:54275/solr/testSimple1_shard2_replica_n3/] nUpdates=100
   [junit4]   2> 549299 INFO  (qtp632359135-5476) [n:127.0.0.1:54275_solr c:testSimple1 s:shard2 r:core_node7 x:testSimple1_shard2_replica_n3] o.a.s.c.S.Request [testSimple1_shard2_replica_n3]  webapp=/solr path=/get params={distrib=false&qt=/get&fingerprint=false&getVersions=100&wt=javabin&version=2} status=0 QTime=0
   [junit4]   2> 549399 INFO  (zkCallback-1187-thread-2-processing-n:127.0.0.1:54275_solr) [n:127.0.0.1:54275_solr    ] o.a.s.c.c.ZkStateReader A cluster state change: [WatchedEvent state:SyncConnected type:NodeDataChanged path:/collections/testSimple1/state.json] for collection [testSimple1] has occurred - updating... (live nodes size: [3])
   [junit4]   2> 549399 INFO  (zkCallback-1191-thread-2-processing-n:127.0.0.1:54281_solr) [n:127.0.0.1:54281_solr    ] o.a.s.c.c.ZkStateReader A cluster state change: [WatchedEvent state:SyncConnected type:NodeDataChanged path:/collections/testSimple1/state.json] for collection [testSimple1] has occurred - updating... (live nodes size: [3])
   [junit4]   2> 549399 INFO  (zkCallback-1187-thread-1-processing-n:127.0.0.1:54275_solr) [n:127.0.0.1:54275_solr    ] o.a.s.c.c.ZkStateReader A cluster state change: [WatchedEvent state:SyncConnected type:NodeDataChanged path:/collections/testSimple1/state.json] for collection [testSimple1] has oc

[...truncated too long message...]

 DistributedFacetPivotSmallTest, DistributedFacetPivotLongTailTest, DeleteReplicaTest, TestMaxTokenLenTokenizer, SolrMetricManagerTest, TestFastOutputStream, TestShardHandlerFactory, SimpleCollectionCreateDeleteTest, ClassificationUpdateProcessorTest, SchemaVersionSpecificBehaviorTest, TestCloudRecovery, TestDocSet, TestReloadDeadlock, TestExtendedDismaxParser, V2ApiIntegrationTest, ExplicitHLLTest, MultiThreadedOCPTest, MissingSegmentRecoveryTest, TestShortCircuitedRequests, DistributedFacetExistsSmallTest, TestSSLRandomization, TestComplexPhraseQParserPlugin, SimpleFacetsTest, SolrJmxReporterTest, BlobRepositoryCloudTest, ParsingFieldUpdateProcessorsTest, TestLeaderElectionWithEmptyReplica, SOLR749Test, TestCloudManagedSchema, DocValuesMultiTest, TestCollationFieldDocValues, CoreAdminRequestStatusTest, TestSearchPerf, SystemLogListenerTest, TestSolrQueryParser, SolrGraphiteReporterTest, TestLMJelinekMercerSimilarityFactory, TestLRUCache, JsonLoaderTest, TestSQLHandlerNonCloud, DistributedSuggestComponentTest, TestLegacyNumericUtils, OverseerRolesTest, TestUseDocValuesAsStored, LoggingHandlerTest, TestSkipOverseerOperations, TestFoldingMultitermQuery, TestDistributedMissingSort, SampleTest, TestSolrIndexConfig, AutoscalingHistoryHandlerTest, TestSolrJ, TestSubQueryTransformerCrossCore, TestNumericRangeQuery64, TestQueryTypes, PingRequestHandlerTest, TriggerIntegrationTest, TestStressReorder, BasicFunctionalityTest, OpenCloseCoreStressTest, PreAnalyzedFieldTest, UpdateRequestProcessorFactoryTest, TestTrackingShardHandlerFactory, TestBadConfig, TestCollapseQParserPlugin, DOMUtilTest, TestSort, TestDocBasedVersionConstraints, QueryEqualityTest, RequestLoggingTest, TestConfigsApi, BaseCdcrDistributedZkTest, CloudExitableDirectoryReaderTest, TestSha256AuthenticationProvider, BasicDistributedZk2Test, UnloadDistributedZkTest, SyncSliceTest, FullSolrCloudDistribCmdsTest, LeaderElectionTest, ZkSolrClientTest, TestZkChroot, TestRandomDVFaceting, ZkCLITest, ShardRoutingCustomTest, TestDistributedSearch, TestFaceting, TestRecovery, DistributedSpellCheckComponentTest, TermVectorComponentDistributedTest, TestRealTimeGet, TestStressVersions, DistributedTermsComponentTest, TestCoreContainer, SolrCoreTest, SolrCmdDistributorTest, PeerSyncTest, DirectUpdateHandlerTest, TestIndexSearcher, ShowFileRequestHandlerTest, SolrIndexSplitterTest, TestCoreDiscovery, SuggesterTSTTest, TestTrie, SpatialFilterTest, TestCSVLoader, PolyFieldTest, NoCacheHeaderTest, WordBreakSolrSpellCheckerTest, TestPseudoReturnFields, FieldMutatingUpdateProcessorTest, TestWordDelimiterFilterFactory, DefaultValueUpdateProcessorTest, TestRemoteStreaming, DistanceFunctionTest, XsltUpdateRequestHandlerTest, TestSurroundQueryParser, TestWriterPerf, TermsComponentTest, TermVectorComponentTest, IndexSchemaTest, TestCSVResponseWriter, MBeansHandlerTest, TestQuerySenderNoQuery, SolrIndexConfigTest, TestMergePolicyConfig, MinimalSchemaTest, TestFuzzyAnalyzedSuggestions, TestPostingsSolrHighlighter, TestLuceneMatchVersion, SynonymTokenizerTest, TestSweetSpotSimilarityFactory, TestIBSimilarityFactory, TestFastWriter, ResourceLoaderTest, ScriptEngineTest, PluginInfoTest, DateFieldTest, ClusterStateTest, TestDocumentBuilder, FileUtilsTest, TestRTGBase, DistributedIntervalFacetingTest, TestTolerantSearch, TestEmbeddedSolrServerConstructors, TestEmbeddedSolrServerSchemaAPI, TestJettySolrRunner, ConnectionReuseTest, AssignBackwardCompatibilityTest, AsyncCallRequestStatusResponseTest, ChaosMonkeyNothingIsSafeWithPullReplicasTest, CollectionsAPIAsyncDistributedZkTest, DeleteInactiveReplicaTest, DeleteStatusTest, DistribCursorPagingTest, DistribJoinFromCollectionTest, DistributedVersionInfoTest, LeaderElectionContextKeyTest, LeaderFailoverAfterPartitionTest, LeaderInitiatedRecoveryOnShardRestartTest, LegacyCloudClusterPropTest, MoveReplicaHDFSFailoverTest, MoveReplicaHDFSTest, NodeMutatorTest, OverseerCollectionConfigSetProcessorTest, OverseerStatusTest, RollingRestartTest, SolrCLIZkUtilsTest, SolrXmlInZkTest, TestAuthenticationFramework, TestCloudPivotFacet, TestConfigSetsAPIZkFailure, TestDistribDocBasedVersion, TestExclusionRuleCollectionAccess, TestLeaderElectionZkExpiry, TestLockTree, TestRandomFlRTGCloud, TestSolrCloudWithSecureImpersonation, TestStressInPlaceUpdates, TestStressLiveNodes, TestTolerantUpdateProcessorCloud, TestTolerantUpdateProcessorRandomCloud, TestUtilizeNode, VMParamsZkACLAndCredentialsProvidersTest, ZkFailoverTest, ComputePlanActionTest, ExecutePlanActionTest, MetricTriggerTest, TestPolicyCloud, TestNodeAddedTrigger, TestNodeLostTrigger, TestSimDistributedQueue, TestTriggerIntegration]
   [junit4] Completed [589/764 (3!)] on J1 in 3.22s, 11 tests, 1 failure <<< FAILURES!

[...truncated 2985 lines...]
   [junit4] Suite: org.apache.solr.update.processor.TestOpenNLPExtractNamedEntitiesUpdateProcessorFactory
   [junit4]   2> Creating dataDir: C:\Users\jenkins\workspace\Lucene-Solr-7.x-Windows\solr\build\contrib\solr-analysis-extras\test\J1\temp\solr.update.processor.TestOpenNLPExtractNamedEntitiesUpdateProcessorFactory_A08AAC4A86494E13-001\init-core-data-001
   [junit4]   2> NOTE: test params are: codec=CheapBastard, sim=RandomSimilarity(queryNorm=false): {}, locale=sl, timezone=Africa/Bamako
   [junit4]   2> NOTE: Windows 10 10.0 amd64/Oracle Corporation 1.8.0_144 (64-bit)/cpus=3,threads=1,free=36592616,total=100663296
   [junit4]   2> NOTE: All tests run in this JVM: [TestFoldingMultitermExtrasQuery, TestOpenNLPExtractNamedEntitiesUpdateProcessorFactory]
   [junit4]   2> NOTE: reproduce with: ant test  -Dtestcase=TestOpenNLPExtractNamedEntitiesUpdateProcessorFactory -Dtests.seed=A08AAC4A86494E13 -Dtests.slow=true -Dtests.locale=sl -Dtests.timezone=Africa/Bamako -Dtests.asserts=true -Dtests.file.encoding=US-ASCII
   [junit4] ERROR   0.00s J1 | TestOpenNLPExtractNamedEntitiesUpdateProcessorFactory (suite) <<<
   [junit4]    > Throwable #1: java.io.IOException: Could not remove the following files (in the order of attempts):
   [junit4]    >    C:\Users\jenkins\workspace\Lucene-Solr-7.x-Windows\solr\build\contrib\solr-analysis-extras\test\J1\temp\solr.update.processor.TestOpenNLPExtractNamedEntitiesUpdateProcessorFactory_A08AAC4A86494E13-001\tempDir-001\collection1\conf: java.nio.file.DirectoryNotEmptyException: C:\Users\jenkins\workspace\Lucene-Solr-7.x-Windows\solr\build\contrib\solr-analysis-extras\test\J1\temp\solr.update.processor.TestOpenNLPExtractNamedEntitiesUpdateProcessorFactory_A08AAC4A86494E13-001\tempDir-001\collection1\conf
   [junit4]    >    C:\Users\jenkins\workspace\Lucene-Solr-7.x-Windows\solr\build\contrib\solr-analysis-extras\test\J1\temp\solr.update.processor.TestOpenNLPExtractNamedEntitiesUpdateProcessorFactory_A08AAC4A86494E13-001\tempDir-001\collection1: java.nio.file.DirectoryNotEmptyException: C:\Users\jenkins\workspace\Lucene-Solr-7.x-Windows\solr\build\contrib\solr-analysis-extras\test\J1\temp\solr.update.processor.TestOpenNLPExtractNamedEntitiesUpdateProcessorFactory_A08AAC4A86494E13-001\tempDir-001\collection1
   [junit4]    >    C:\Users\jenkins\workspace\Lucene-Solr-7.x-Windows\solr\build\contrib\solr-analysis-extras\test\J1\temp\solr.update.processor.TestOpenNLPExtractNamedEntitiesUpdateProcessorFactory_A08AAC4A86494E13-001\tempDir-001: java.nio.file.DirectoryNotEmptyException: C:\Users\jenkins\workspace\Lucene-Solr-7.x-Windows\solr\build\contrib\solr-analysis-extras\test\J1\temp\solr.update.processor.TestOpenNLPExtractNamedEntitiesUpdateProcessorFactory_A08AAC4A86494E13-001\tempDir-001
   [junit4]    >    C:\Users\jenkins\workspace\Lucene-Solr-7.x-Windows\solr\build\contrib\solr-analysis-extras\test\J1\temp\solr.update.processor.TestOpenNLPExtractNamedEntitiesUpdateProcessorFactory_A08AAC4A86494E13-001\tempDir-001\collection1\conf\en-test-tokenizer.bin: java.nio.file.AccessDeniedException: C:\Users\jenkins\workspace\Lucene-Solr-7.x-Windows\solr\build\contrib\solr-analysis-extras\test\J1\temp\solr.update.processor.TestOpenNLPExtractNamedEntitiesUpdateProcessorFactory_A08AAC4A86494E13-001\tempDir-001\collection1\conf\en-test-tokenizer.bin
   [junit4]    >    C:\Users\jenkins\workspace\Lucene-Solr-7.x-Windows\solr\build\contrib\solr-analysis-extras\test\J1\temp\solr.update.processor.TestOpenNLPExtractNamedEntitiesUpdateProcessorFactory_A08AAC4A86494E13-001\tempDir-001\collection1\conf\en-test-sent.bin: java.nio.file.AccessDeniedException: C:\Users\jenkins\workspace\Lucene-Solr-7.x-Windows\solr\build\contrib\solr-analysis-extras\test\J1\temp\solr.update.processor.TestOpenNLPExtractNamedEntitiesUpdateProcessorFactory_A08AAC4A86494E13-001\tempDir-001\collection1\conf\en-test-sent.bin
   [junit4]    >    C:\Users\jenkins\workspace\Lucene-Solr-7.x-Windows\solr\build\contrib\solr-analysis-extras\test\J1\temp\solr.update.processor.TestOpenNLPExtractNamedEntitiesUpdateProcessorFactory_A08AAC4A86494E13-001\tempDir-001\collection1\conf\en-test-ner-person.bin: java.nio.file.AccessDeniedException: C:\Users\jenkins\workspace\Lucene-Solr-7.x-Windows\solr\build\contrib\solr-analysis-extras\test\J1\temp\solr.update.processor.TestOpenNLPExtractNamedEntitiesUpdateProcessorFactory_A08AAC4A86494E13-001\tempDir-001\collection1\conf\en-test-ner-person.bin
   [junit4]    >    C:\Users\jenkins\workspace\Lucene-Solr-7.x-Windows\solr\build\contrib\solr-analysis-extras\test\J1\temp\solr.update.processor.TestOpenNLPExtractNamedEntitiesUpdateProcessorFactory_A08AAC4A86494E13-001: java.nio.file.DirectoryNotEmptyException: C:\Users\jenkins\workspace\Lucene-Solr-7.x-Windows\solr\build\contrib\solr-analysis-extras\test\J1\temp\solr.update.processor.TestOpenNLPExtractNamedEntitiesUpdateProcessorFactory_A08AAC4A86494E13-001
   [junit4]    > 	at __randomizedtesting.SeedInfo.seed([A08AAC4A86494E13]:0)
   [junit4]    > 	at org.apache.lucene.util.IOUtils.rm(IOUtils.java:329)
   [junit4]    > 	at java.lang.Thread.run(Thread.java:748)
   [junit4] Completed [4/5 (1!)] on J1 in 1.75s, 8 tests, 1 error <<< FAILURES!

[...truncated 45770 lines...]

Mime
View raw message