lucene-dev mailing list archives

Site index · List index
Message view « Date » · « Thread »
Top « Date » · « Thread »
From Policeman Jenkins Server <jenk...@thetaphi.de>
Subject [JENKINS] Lucene-Solr-master-MacOSX (64bit/jdk-9) - Build # 4345 - Still Unstable!
Date Tue, 26 Dec 2017 17:15:29 GMT
Build: https://jenkins.thetaphi.de/job/Lucene-Solr-master-MacOSX/4345/
Java: 64bit/jdk-9 -XX:-UseCompressedOops -XX:+UseConcMarkSweepGC

1 tests failed.
FAILED:  org.apache.solr.cloud.autoscaling.sim.TestDistribStateManager.testGetSetRemoveData

Error Message:
Node watch should have fired!

Stack Trace:
java.lang.AssertionError: Node watch should have fired!
	at __randomizedtesting.SeedInfo.seed([1488A915ED83084:27D865C30A56F68E]:0)
	at org.junit.Assert.fail(Assert.java:93)
	at org.apache.solr.cloud.autoscaling.sim.TestDistribStateManager.testGetSetRemoveData(TestDistribStateManager.java:256)
	at java.base/jdk.internal.reflect.NativeMethodAccessorImpl.invoke0(Native Method)
	at java.base/jdk.internal.reflect.NativeMethodAccessorImpl.invoke(NativeMethodAccessorImpl.java:62)
	at java.base/jdk.internal.reflect.DelegatingMethodAccessorImpl.invoke(DelegatingMethodAccessorImpl.java:43)
	at java.base/java.lang.reflect.Method.invoke(Method.java:564)
	at com.carrotsearch.randomizedtesting.RandomizedRunner.invoke(RandomizedRunner.java:1737)
	at com.carrotsearch.randomizedtesting.RandomizedRunner$8.evaluate(RandomizedRunner.java:934)
	at com.carrotsearch.randomizedtesting.RandomizedRunner$9.evaluate(RandomizedRunner.java:970)
	at com.carrotsearch.randomizedtesting.RandomizedRunner$10.evaluate(RandomizedRunner.java:984)
	at com.carrotsearch.randomizedtesting.rules.SystemPropertiesRestoreRule$1.evaluate(SystemPropertiesRestoreRule.java:57)
	at org.apache.lucene.util.TestRuleSetupTeardownChained$1.evaluate(TestRuleSetupTeardownChained.java:49)
	at org.apache.lucene.util.AbstractBeforeAfterRule$1.evaluate(AbstractBeforeAfterRule.java:45)
	at org.apache.lucene.util.TestRuleThreadAndTestName$1.evaluate(TestRuleThreadAndTestName.java:48)
	at org.apache.lucene.util.TestRuleIgnoreAfterMaxFailures$1.evaluate(TestRuleIgnoreAfterMaxFailures.java:64)
	at org.apache.lucene.util.TestRuleMarkFailure$1.evaluate(TestRuleMarkFailure.java:47)
	at com.carrotsearch.randomizedtesting.rules.StatementAdapter.evaluate(StatementAdapter.java:36)
	at com.carrotsearch.randomizedtesting.ThreadLeakControl$StatementRunner.run(ThreadLeakControl.java:368)
	at com.carrotsearch.randomizedtesting.ThreadLeakControl.forkTimeoutingTask(ThreadLeakControl.java:817)
	at com.carrotsearch.randomizedtesting.ThreadLeakControl$3.evaluate(ThreadLeakControl.java:468)
	at com.carrotsearch.randomizedtesting.RandomizedRunner.runSingleTest(RandomizedRunner.java:943)
	at com.carrotsearch.randomizedtesting.RandomizedRunner$5.evaluate(RandomizedRunner.java:829)
	at com.carrotsearch.randomizedtesting.RandomizedRunner$6.evaluate(RandomizedRunner.java:879)
	at com.carrotsearch.randomizedtesting.RandomizedRunner$7.evaluate(RandomizedRunner.java:890)
	at com.carrotsearch.randomizedtesting.rules.StatementAdapter.evaluate(StatementAdapter.java:36)
	at com.carrotsearch.randomizedtesting.rules.SystemPropertiesRestoreRule$1.evaluate(SystemPropertiesRestoreRule.java:57)
	at org.apache.lucene.util.AbstractBeforeAfterRule$1.evaluate(AbstractBeforeAfterRule.java:45)
	at com.carrotsearch.randomizedtesting.rules.StatementAdapter.evaluate(StatementAdapter.java:36)
	at org.apache.lucene.util.TestRuleStoreClassName$1.evaluate(TestRuleStoreClassName.java:41)
	at com.carrotsearch.randomizedtesting.rules.NoShadowingOrOverridesOnMethodsRule$1.evaluate(NoShadowingOrOverridesOnMethodsRule.java:40)
	at com.carrotsearch.randomizedtesting.rules.NoShadowingOrOverridesOnMethodsRule$1.evaluate(NoShadowingOrOverridesOnMethodsRule.java:40)
	at com.carrotsearch.randomizedtesting.rules.StatementAdapter.evaluate(StatementAdapter.java:36)
	at com.carrotsearch.randomizedtesting.rules.StatementAdapter.evaluate(StatementAdapter.java:36)
	at org.apache.lucene.util.TestRuleAssertionsRequired$1.evaluate(TestRuleAssertionsRequired.java:53)
	at org.apache.lucene.util.TestRuleMarkFailure$1.evaluate(TestRuleMarkFailure.java:47)
	at org.apache.lucene.util.TestRuleIgnoreAfterMaxFailures$1.evaluate(TestRuleIgnoreAfterMaxFailures.java:64)
	at org.apache.lucene.util.TestRuleIgnoreTestSuites$1.evaluate(TestRuleIgnoreTestSuites.java:54)
	at com.carrotsearch.randomizedtesting.rules.StatementAdapter.evaluate(StatementAdapter.java:36)
	at com.carrotsearch.randomizedtesting.ThreadLeakControl$StatementRunner.run(ThreadLeakControl.java:368)
	at java.base/java.lang.Thread.run(Thread.java:844)




Build Log:
[...truncated 1797 lines...]
   [junit4] JVM J0: stderr was not empty, see: /Users/jenkins/workspace/Lucene-Solr-master-MacOSX/lucene/build/core/test/temp/junit4-J0-20171226_153428_34512237054897417882295.syserr
   [junit4] >>> JVM J0 emitted unexpected output (verbatim) ----
   [junit4] Java HotSpot(TM) 64-Bit Server VM warning: Option UseConcMarkSweepGC was deprecated in version 9.0 and will likely be removed in a future release.
   [junit4] <<< JVM J0: EOF ----

[...truncated 3 lines...]
   [junit4] JVM J1: stderr was not empty, see: /Users/jenkins/workspace/Lucene-Solr-master-MacOSX/lucene/build/core/test/temp/junit4-J1-20171226_153428_3456954733059319528175.syserr
   [junit4] >>> JVM J1 emitted unexpected output (verbatim) ----
   [junit4] Java HotSpot(TM) 64-Bit Server VM warning: Option UseConcMarkSweepGC was deprecated in version 9.0 and will likely be removed in a future release.
   [junit4] <<< JVM J1: EOF ----

[...truncated 288 lines...]
   [junit4] JVM J0: stderr was not empty, see: /Users/jenkins/workspace/Lucene-Solr-master-MacOSX/lucene/build/test-framework/test/temp/junit4-J0-20171226_154237_8266782653092202293712.syserr
   [junit4] >>> JVM J0 emitted unexpected output (verbatim) ----
   [junit4] Java HotSpot(TM) 64-Bit Server VM warning: Option UseConcMarkSweepGC was deprecated in version 9.0 and will likely be removed in a future release.
   [junit4] <<< JVM J0: EOF ----

[...truncated 3 lines...]
   [junit4] JVM J1: stderr was not empty, see: /Users/jenkins/workspace/Lucene-Solr-master-MacOSX/lucene/build/test-framework/test/temp/junit4-J1-20171226_154237_8262740885416730694309.syserr
   [junit4] >>> JVM J1 emitted unexpected output (verbatim) ----
   [junit4] Java HotSpot(TM) 64-Bit Server VM warning: Option UseConcMarkSweepGC was deprecated in version 9.0 and will likely be removed in a future release.
   [junit4] <<< JVM J1: EOF ----

[...truncated 1057 lines...]
   [junit4] JVM J1: stderr was not empty, see: /Users/jenkins/workspace/Lucene-Solr-master-MacOSX/lucene/build/analysis/common/test/temp/junit4-J1-20171226_154346_2437642237444706803292.syserr
   [junit4] >>> JVM J1 emitted unexpected output (verbatim) ----
   [junit4] Java HotSpot(TM) 64-Bit Server VM warning: Option UseConcMarkSweepGC was deprecated in version 9.0 and will likely be removed in a future release.
   [junit4] <<< JVM J1: EOF ----

[...truncated 3 lines...]
   [junit4] JVM J0: stderr was not empty, see: /Users/jenkins/workspace/Lucene-Solr-master-MacOSX/lucene/build/analysis/common/test/temp/junit4-J0-20171226_154346_2437041563321710427838.syserr
   [junit4] >>> JVM J0 emitted unexpected output (verbatim) ----
   [junit4] Java HotSpot(TM) 64-Bit Server VM warning: Option UseConcMarkSweepGC was deprecated in version 9.0 and will likely be removed in a future release.
   [junit4] <<< JVM J0: EOF ----

[...truncated 229 lines...]
   [junit4] JVM J0: stderr was not empty, see: /Users/jenkins/workspace/Lucene-Solr-master-MacOSX/lucene/build/analysis/icu/test/temp/junit4-J0-20171226_154546_68715487106110475921326.syserr
   [junit4] >>> JVM J0 emitted unexpected output (verbatim) ----
   [junit4] Java HotSpot(TM) 64-Bit Server VM warning: Option UseConcMarkSweepGC was deprecated in version 9.0 and will likely be removed in a future release.
   [junit4] <<< JVM J0: EOF ----

   [junit4] JVM J1: stderr was not empty, see: /Users/jenkins/workspace/Lucene-Solr-master-MacOSX/lucene/build/analysis/icu/test/temp/junit4-J1-20171226_154546_687138854330358823102.syserr
   [junit4] >>> JVM J1 emitted unexpected output (verbatim) ----
   [junit4] Java HotSpot(TM) 64-Bit Server VM warning: Option UseConcMarkSweepGC was deprecated in version 9.0 and will likely be removed in a future release.
   [junit4] <<< JVM J1: EOF ----

[...truncated 252 lines...]
   [junit4] JVM J0: stderr was not empty, see: /Users/jenkins/workspace/Lucene-Solr-master-MacOSX/lucene/build/analysis/kuromoji/test/temp/junit4-J0-20171226_154600_05715891328571712200325.syserr
   [junit4] >>> JVM J0 emitted unexpected output (verbatim) ----
   [junit4] Java HotSpot(TM) 64-Bit Server VM warning: Option UseConcMarkSweepGC was deprecated in version 9.0 and will likely be removed in a future release.
   [junit4] <<< JVM J0: EOF ----

   [junit4] JVM J1: stderr was not empty, see: /Users/jenkins/workspace/Lucene-Solr-master-MacOSX/lucene/build/analysis/kuromoji/test/temp/junit4-J1-20171226_154600_05810051128962309528639.syserr
   [junit4] >>> JVM J1 emitted unexpected output (verbatim) ----
   [junit4] Java HotSpot(TM) 64-Bit Server VM warning: Option UseConcMarkSweepGC was deprecated in version 9.0 and will likely be removed in a future release.
   [junit4] <<< JVM J1: EOF ----

[...truncated 154 lines...]
   [junit4] JVM J0: stderr was not empty, see: /Users/jenkins/workspace/Lucene-Solr-master-MacOSX/lucene/build/analysis/morfologik/test/temp/junit4-J0-20171226_154632_9745672911571830161001.syserr
   [junit4] >>> JVM J0 emitted unexpected output (verbatim) ----
   [junit4] Java HotSpot(TM) 64-Bit Server VM warning: Option UseConcMarkSweepGC was deprecated in version 9.0 and will likely be removed in a future release.
   [junit4] <<< JVM J0: EOF ----

[...truncated 3 lines...]
   [junit4] JVM J1: stderr was not empty, see: /Users/jenkins/workspace/Lucene-Solr-master-MacOSX/lucene/build/analysis/morfologik/test/temp/junit4-J1-20171226_154632_9742197025436287535298.syserr
   [junit4] >>> JVM J1 emitted unexpected output (verbatim) ----
   [junit4] Java HotSpot(TM) 64-Bit Server VM warning: Option UseConcMarkSweepGC was deprecated in version 9.0 and will likely be removed in a future release.
   [junit4] <<< JVM J1: EOF ----

[...truncated 161 lines...]
   [junit4] JVM J0: stderr was not empty, see: /Users/jenkins/workspace/Lucene-Solr-master-MacOSX/lucene/build/analysis/opennlp/test/temp/junit4-J0-20171226_154637_77411207011604043689006.syserr
   [junit4] >>> JVM J0 emitted unexpected output (verbatim) ----
   [junit4] Java HotSpot(TM) 64-Bit Server VM warning: Option UseConcMarkSweepGC was deprecated in version 9.0 and will likely be removed in a future release.
   [junit4] <<< JVM J0: EOF ----

   [junit4] JVM J1: stderr was not empty, see: /Users/jenkins/workspace/Lucene-Solr-master-MacOSX/lucene/build/analysis/opennlp/test/temp/junit4-J1-20171226_154637_7748108819824052669252.syserr
   [junit4] >>> JVM J1 emitted unexpected output (verbatim) ----
   [junit4] Java HotSpot(TM) 64-Bit Server VM warning: Option UseConcMarkSweepGC was deprecated in version 9.0 and will likely be removed in a future release.
   [junit4] <<< JVM J1: EOF ----

[...truncated 168 lines...]
   [junit4] JVM J1: stderr was not empty, see: /Users/jenkins/workspace/Lucene-Solr-master-MacOSX/lucene/build/analysis/phonetic/test/temp/junit4-J1-20171226_154641_90212703790296921605093.syserr
   [junit4] >>> JVM J1 emitted unexpected output (verbatim) ----
   [junit4] Java HotSpot(TM) 64-Bit Server VM warning: Option UseConcMarkSweepGC was deprecated in version 9.0 and will likely be removed in a future release.
   [junit4] <<< JVM J1: EOF ----

[...truncated 3 lines...]
   [junit4] JVM J0: stderr was not empty, see: /Users/jenkins/workspace/Lucene-Solr-master-MacOSX/lucene/build/analysis/phonetic/test/temp/junit4-J0-20171226_154641_9025819042979040694802.syserr
   [junit4] >>> JVM J0 emitted unexpected output (verbatim) ----
   [junit4] Java HotSpot(TM) 64-Bit Server VM warning: Option UseConcMarkSweepGC was deprecated in version 9.0 and will likely be removed in a future release.
   [junit4] <<< JVM J0: EOF ----

[...truncated 151 lines...]
   [junit4] JVM J0: stderr was not empty, see: /Users/jenkins/workspace/Lucene-Solr-master-MacOSX/lucene/build/analysis/smartcn/test/temp/junit4-J0-20171226_154651_75513456449529744208718.syserr
   [junit4] >>> JVM J0 emitted unexpected output (verbatim) ----
   [junit4] Java HotSpot(TM) 64-Bit Server VM warning: Option UseConcMarkSweepGC was deprecated in version 9.0 and will likely be removed in a future release.
   [junit4] <<< JVM J0: EOF ----

[...truncated 3 lines...]
   [junit4] JVM J1: stderr was not empty, see: /Users/jenkins/workspace/Lucene-Solr-master-MacOSX/lucene/build/analysis/smartcn/test/temp/junit4-J1-20171226_154651_7554785251718317176278.syserr
   [junit4] >>> JVM J1 emitted unexpected output (verbatim) ----
   [junit4] Java HotSpot(TM) 64-Bit Server VM warning: Option UseConcMarkSweepGC was deprecated in version 9.0 and will likely be removed in a future release.
   [junit4] <<< JVM J1: EOF ----

[...truncated 156 lines...]
   [junit4] JVM J1: stderr was not empty, see: /Users/jenkins/workspace/Lucene-Solr-master-MacOSX/lucene/build/analysis/stempel/test/temp/junit4-J1-20171226_154702_19614775537216767328289.syserr
   [junit4] >>> JVM J1 emitted unexpected output (verbatim) ----
   [junit4] Java HotSpot(TM) 64-Bit Server VM warning: Option UseConcMarkSweepGC was deprecated in version 9.0 and will likely be removed in a future release.
   [junit4] <<< JVM J1: EOF ----

[...truncated 3 lines...]
   [junit4] JVM J0: stderr was not empty, see: /Users/jenkins/workspace/Lucene-Solr-master-MacOSX/lucene/build/analysis/stempel/test/temp/junit4-J0-20171226_154702_19616398821749815486660.syserr
   [junit4] >>> JVM J0 emitted unexpected output (verbatim) ----
   [junit4] Java HotSpot(TM) 64-Bit Server VM warning: Option UseConcMarkSweepGC was deprecated in version 9.0 and will likely be removed in a future release.
   [junit4] <<< JVM J0: EOF ----

[...truncated 167 lines...]
   [junit4] JVM J0: stderr was not empty, see: /Users/jenkins/workspace/Lucene-Solr-master-MacOSX/lucene/build/analysis/uima/test/temp/junit4-J0-20171226_154706_9455239138020977345398.syserr
   [junit4] >>> JVM J0 emitted unexpected output (verbatim) ----
   [junit4] Java HotSpot(TM) 64-Bit Server VM warning: Option UseConcMarkSweepGC was deprecated in version 9.0 and will likely be removed in a future release.
   [junit4] <<< JVM J0: EOF ----

[...truncated 152 lines...]
   [junit4] JVM J1: stderr was not empty, see: /Users/jenkins/workspace/Lucene-Solr-master-MacOSX/lucene/build/backward-codecs/test/temp/junit4-J1-20171226_154723_32410090971095040083056.syserr
   [junit4] >>> JVM J1 emitted unexpected output (verbatim) ----
   [junit4] Java HotSpot(TM) 64-Bit Server VM warning: Option UseConcMarkSweepGC was deprecated in version 9.0 and will likely be removed in a future release.
   [junit4] <<< JVM J1: EOF ----

[...truncated 19 lines...]
   [junit4] JVM J0: stderr was not empty, see: /Users/jenkins/workspace/Lucene-Solr-master-MacOSX/lucene/build/backward-codecs/test/temp/junit4-J0-20171226_154723_3223185227151508281158.syserr
   [junit4] >>> JVM J0 emitted unexpected output (verbatim) ----
   [junit4] Java HotSpot(TM) 64-Bit Server VM warning: Option UseConcMarkSweepGC was deprecated in version 9.0 and will likely be removed in a future release.
   [junit4] <<< JVM J0: EOF ----

[...truncated 1304 lines...]
   [junit4] JVM J1: stderr was not empty, see: /Users/jenkins/workspace/Lucene-Solr-master-MacOSX/lucene/build/benchmark/test/temp/junit4-J1-20171226_154749_10712805732096962964850.syserr
   [junit4] >>> JVM J1 emitted unexpected output (verbatim) ----
   [junit4] Java HotSpot(TM) 64-Bit Server VM warning: Option UseConcMarkSweepGC was deprecated in version 9.0 and will likely be removed in a future release.
   [junit4] <<< JVM J1: EOF ----

   [junit4] JVM J0: stderr was not empty, see: /Users/jenkins/workspace/Lucene-Solr-master-MacOSX/lucene/build/benchmark/test/temp/junit4-J0-20171226_154749_10711533041424351927808.syserr
   [junit4] >>> JVM J0 emitted unexpected output (verbatim) ----
   [junit4] Java HotSpot(TM) 64-Bit Server VM warning: Option UseConcMarkSweepGC was deprecated in version 9.0 and will likely be removed in a future release.
   [junit4] <<< JVM J0: EOF ----

[...truncated 231 lines...]
   [junit4] JVM J1: stderr was not empty, see: /Users/jenkins/workspace/Lucene-Solr-master-MacOSX/lucene/build/classification/test/temp/junit4-J1-20171226_154801_03714064216055843012063.syserr
   [junit4] >>> JVM J1 emitted unexpected output (verbatim) ----
   [junit4] Java HotSpot(TM) 64-Bit Server VM warning: Option UseConcMarkSweepGC was deprecated in version 9.0 and will likely be removed in a future release.
   [junit4] <<< JVM J1: EOF ----

[...truncated 3 lines...]
   [junit4] JVM J0: stderr was not empty, see: /Users/jenkins/workspace/Lucene-Solr-master-MacOSX/lucene/build/classification/test/temp/junit4-J0-20171226_154801_03712849682951248271112.syserr
   [junit4] >>> JVM J0 emitted unexpected output (verbatim) ----
   [junit4] Java HotSpot(TM) 64-Bit Server VM warning: Option UseConcMarkSweepGC was deprecated in version 9.0 and will likely be removed in a future release.
   [junit4] <<< JVM J0: EOF ----

[...truncated 255 lines...]
   [junit4] JVM J1: stderr was not empty, see: /Users/jenkins/workspace/Lucene-Solr-master-MacOSX/lucene/build/codecs/test/temp/junit4-J1-20171226_154822_5637494537621304744801.syserr
   [junit4] >>> JVM J1 emitted unexpected output (verbatim) ----
   [junit4] Java HotSpot(TM) 64-Bit Server VM warning: Option UseConcMarkSweepGC was deprecated in version 9.0 and will likely be removed in a future release.
   [junit4] <<< JVM J1: EOF ----

[...truncated 7 lines...]
   [junit4] JVM J0: stderr was not empty, see: /Users/jenkins/workspace/Lucene-Solr-master-MacOSX/lucene/build/codecs/test/temp/junit4-J0-20171226_154822_5638168044364645127670.syserr
   [junit4] >>> JVM J0 emitted unexpected output (verbatim) ----
   [junit4] Java HotSpot(TM) 64-Bit Server VM warning: Option UseConcMarkSweepGC was deprecated in version 9.0 and will likely be removed in a future release.
   [junit4] <<< JVM J0: EOF ----

[...truncated 212 lines...]
   [junit4] JVM J1: stderr was not empty, see: /Users/jenkins/workspace/Lucene-Solr-master-MacOSX/lucene/build/demo/test/temp/junit4-J1-20171226_155004_9658531611846557794614.syserr
   [junit4] >>> JVM J1 emitted unexpected output (verbatim) ----
   [junit4] Java HotSpot(TM) 64-Bit Server VM warning: Option UseConcMarkSweepGC was deprecated in version 9.0 and will likely be removed in a future release.
   [junit4] <<< JVM J1: EOF ----

   [junit4] JVM J0: stderr was not empty, see: /Users/jenkins/workspace/Lucene-Solr-master-MacOSX/lucene/build/demo/test/temp/junit4-J0-20171226_155004_96512634883524337405142.syserr
   [junit4] >>> JVM J0 emitted unexpected output (verbatim) ----
   [junit4] Java HotSpot(TM) 64-Bit Server VM warning: Option UseConcMarkSweepGC was deprecated in version 9.0 and will likely be removed in a future release.
   [junit4] <<< JVM J0: EOF ----

[...truncated 167 lines...]
   [junit4] JVM J0: stderr was not empty, see: /Users/jenkins/workspace/Lucene-Solr-master-MacOSX/lucene/build/expressions/test/temp/junit4-J0-20171226_155009_44615838722245619228502.syserr
   [junit4] >>> JVM J0 emitted unexpected output (verbatim) ----
   [junit4] Java HotSpot(TM) 64-Bit Server VM warning: Option UseConcMarkSweepGC was deprecated in version 9.0 and will likely be removed in a future release.
   [junit4] <<< JVM J0: EOF ----

[...truncated 6 lines...]
   [junit4] JVM J1: stderr was not empty, see: /Users/jenkins/workspace/Lucene-Solr-master-MacOSX/lucene/build/expressions/test/temp/junit4-J1-20171226_155009_44613280481147256400120.syserr
   [junit4] >>> JVM J1 emitted unexpected output (verbatim) ----
   [junit4] Java HotSpot(TM) 64-Bit Server VM warning: Option UseConcMarkSweepGC was deprecated in version 9.0 and will likely be removed in a future release.
   [junit4] <<< JVM J1: EOF ----

[...truncated 226 lines...]
   [junit4] JVM J0: stderr was not empty, see: /Users/jenkins/workspace/Lucene-Solr-master-MacOSX/lucene/build/facet/test/temp/junit4-J0-20171226_155015_52917401772859694205392.syserr
   [junit4] >>> JVM J0 emitted unexpected output (verbatim) ----
   [junit4] Java HotSpot(TM) 64-Bit Server VM warning: Option UseConcMarkSweepGC was deprecated in version 9.0 and will likely be removed in a future release.
   [junit4] <<< JVM J0: EOF ----

[...truncated 3 lines...]
   [junit4] JVM J1: stderr was not empty, see: /Users/jenkins/workspace/Lucene-Solr-master-MacOSX/lucene/build/facet/test/temp/junit4-J1-20171226_155015_53016973763657962599606.syserr
   [junit4] >>> JVM J1 emitted unexpected output (verbatim) ----
   [junit4] Java HotSpot(TM) 64-Bit Server VM warning: Option UseConcMarkSweepGC was deprecated in version 9.0 and will likely be removed in a future release.
   [junit4] <<< JVM J1: EOF ----

[...truncated 182 lines...]
   [junit4] JVM J0: stderr was not empty, see: /Users/jenkins/workspace/Lucene-Solr-master-MacOSX/lucene/build/grouping/test/temp/junit4-J0-20171226_155044_27111219581204269449223.syserr
   [junit4] >>> JVM J0 emitted unexpected output (verbatim) ----
   [junit4] Java HotSpot(TM) 64-Bit Server VM warning: Option UseConcMarkSweepGC was deprecated in version 9.0 and will likely be removed in a future release.
   [junit4] <<< JVM J0: EOF ----

   [junit4] JVM J1: stderr was not empty, see: /Users/jenkins/workspace/Lucene-Solr-master-MacOSX/lucene/build/grouping/test/temp/junit4-J1-20171226_155044_27115753833808658109274.syserr
   [junit4] >>> JVM J1 emitted unexpected output (verbatim) ----
   [junit4] Java HotSpot(TM) 64-Bit Server VM warning: Option UseConcMarkSweepGC was deprecated in version 9.0 and will likely be removed in a future release.
   [junit4] <<< JVM J1: EOF ----

[...truncated 243 lines...]
   [junit4] JVM J0: stderr was not empty, see: /Users/jenkins/workspace/Lucene-Solr-master-MacOSX/lucene/build/highlighter/test/temp/junit4-J0-20171226_155050_95915225900111369093601.syserr
   [junit4] >>> JVM J0 emitted unexpected output (verbatim) ----
   [junit4] Java HotSpot(TM) 64-Bit Server VM warning: Option UseConcMarkSweepGC was deprecated in version 9.0 and will likely be removed in a future release.
   [junit4] <<< JVM J0: EOF ----

[...truncated 3 lines...]
   [junit4] JVM J1: stderr was not empty, see: /Users/jenkins/workspace/Lucene-Solr-master-MacOSX/lucene/build/highlighter/test/temp/junit4-J1-20171226_155050_9595963744410753742014.syserr
   [junit4] >>> JVM J1 emitted unexpected output (verbatim) ----
   [junit4] Java HotSpot(TM) 64-Bit Server VM warning: Option UseConcMarkSweepGC was deprecated in version 9.0 and will likely be removed in a future release.
   [junit4] <<< JVM J1: EOF ----

[...truncated 166 lines...]
   [junit4] JVM J1: stderr was not empty, see: /Users/jenkins/workspace/Lucene-Solr-master-MacOSX/lucene/build/join/test/temp/junit4-J1-20171226_155113_2225246393690024704920.syserr
   [junit4] >>> JVM J1 emitted unexpected output (verbatim) ----
   [junit4] Java HotSpot(TM) 64-Bit Server VM warning: Option UseConcMarkSweepGC was deprecated in version 9.0 and will likely be removed in a future release.
   [junit4] <<< JVM J1: EOF ----

   [junit4] JVM J0: stderr was not empty, see: /Users/jenkins/workspace/Lucene-Solr-master-MacOSX/lucene/build/join/test/temp/junit4-J0-20171226_155113_22213337090149386057636.syserr
   [junit4] >>> JVM J0 emitted unexpected output (verbatim) ----
   [junit4] Java HotSpot(TM) 64-Bit Server VM warning: Option UseConcMarkSweepGC was deprecated in version 9.0 and will likely be removed in a future release.
   [junit4] <<< JVM J0: EOF ----

[...truncated 147 lines...]
   [junit4] JVM J0: stderr was not empty, see: /Users/jenkins/workspace/Lucene-Solr-master-MacOSX/lucene/build/memory/test/temp/junit4-J0-20171226_155123_9743140901379715901522.syserr
   [junit4] >>> JVM J0 emitted unexpected output (verbatim) ----
   [junit4] Java HotSpot(TM) 64-Bit Server VM warning: Option UseConcMarkSweepGC was deprecated in version 9.0 and will likely be removed in a future release.
   [junit4] <<< JVM J0: EOF ----

[...truncated 3 lines...]
   [junit4] JVM J1: stderr was not empty, see: /Users/jenkins/workspace/Lucene-Solr-master-MacOSX/lucene/build/memory/test/temp/junit4-J1-20171226_155123_9753050335539874484201.syserr
   [junit4] >>> JVM J1 emitted unexpected output (verbatim) ----
   [junit4] Java HotSpot(TM) 64-Bit Server VM warning: Option UseConcMarkSweepGC was deprecated in version 9.0 and will likely be removed in a future release.
   [junit4] <<< JVM J1: EOF ----

[...truncated 180 lines...]
   [junit4] JVM J1: stderr was not empty, see: /Users/jenkins/workspace/Lucene-Solr-master-MacOSX/lucene/build/misc/test/temp/junit4-J1-20171226_155131_9309052968974558602586.syserr
   [junit4] >>> JVM J1 emitted unexpected output (verbatim) ----
   [junit4] Java HotSpot(TM) 64-Bit Server VM warning: Option UseConcMarkSweepGC was deprecated in version 9.0 and will likely be removed in a future release.
   [junit4] <<< JVM J1: EOF ----

[...truncated 5 lines...]
   [junit4] JVM J0: stderr was not empty, see: /Users/jenkins/workspace/Lucene-Solr-master-MacOSX/lucene/build/misc/test/temp/junit4-J0-20171226_155131_93014522044517530000756.syserr
   [junit4] >>> JVM J0 emitted unexpected output (verbatim) ----
   [junit4] Java HotSpot(TM) 64-Bit Server VM warning: Option UseConcMarkSweepGC was deprecated in version 9.0 and will likely be removed in a future release.
   [junit4] <<< JVM J0: EOF ----

[...truncated 298 lines...]
   [junit4] JVM J0: stderr was not empty, see: /Users/jenkins/workspace/Lucene-Solr-master-MacOSX/lucene/build/queries/test/temp/junit4-J0-20171226_155156_94914348710419836789184.syserr
   [junit4] >>> JVM J0 emitted unexpected output (verbatim) ----
   [junit4] Java HotSpot(TM) 64-Bit Server VM warning: Option UseConcMarkSweepGC was deprecated in version 9.0 and will likely be removed in a future release.
   [junit4] <<< JVM J0: EOF ----

   [junit4] JVM J1: stderr was not empty, see: /Users/jenkins/workspace/Lucene-Solr-master-MacOSX/lucene/build/queries/test/temp/junit4-J1-20171226_155156_9492466973953875326655.syserr
   [junit4] >>> JVM J1 emitted unexpected output (verbatim) ----
   [junit4] Java HotSpot(TM) 64-Bit Server VM warning: Option UseConcMarkSweepGC was deprecated in version 9.0 and will likely be removed in a future release.
   [junit4] <<< JVM J1: EOF ----

[...truncated 227 lines...]
   [junit4] JVM J1: stderr was not empty, see: /Users/jenkins/workspace/Lucene-Solr-master-MacOSX/lucene/build/queryparser/test/temp/junit4-J1-20171226_155207_32812827451159718210219.syserr
   [junit4] >>> JVM J1 emitted unexpected output (verbatim) ----
   [junit4] Java HotSpot(TM) 64-Bit Server VM warning: Option UseConcMarkSweepGC was deprecated in version 9.0 and will likely be removed in a future release.
   [junit4] <<< JVM J1: EOF ----

   [junit4] JVM J0: stderr was not empty, see: /Users/jenkins/workspace/Lucene-Solr-master-MacOSX/lucene/build/queryparser/test/temp/junit4-J0-20171226_155207_3281763560221560576630.syserr
   [junit4] >>> JVM J0 emitted unexpected output (verbatim) ----
   [junit4] Java HotSpot(TM) 64-Bit Server VM warning: Option UseConcMarkSweepGC was deprecated in version 9.0 and will likely be removed in a future release.
   [junit4] <<< JVM J0: EOF ----

[...truncated 210 lines...]
   [junit4] JVM J1: stderr was not empty, see: /Users/jenkins/workspace/Lucene-Solr-master-MacOSX/lucene/build/replicator/test/temp/junit4-J1-20171226_155218_20917762041898457746122.syserr
   [junit4] >>> JVM J1 emitted unexpected output (verbatim) ----
   [junit4] Java HotSpot(TM) 64-Bit Server VM warning: Option UseConcMarkSweepGC was deprecated in version 9.0 and will likely be removed in a future release.
   [junit4] <<< JVM J1: EOF ----

   [junit4] JVM J0: stderr was not empty, see: /Users/jenkins/workspace/Lucene-Solr-master-MacOSX/lucene/build/replicator/test/temp/junit4-J0-20171226_155218_20910278343104610473757.syserr
   [junit4] >>> JVM J0 emitted unexpected output (verbatim) ----
   [junit4] Java HotSpot(TM) 64-Bit Server VM warning: Option UseConcMarkSweepGC was deprecated in version 9.0 and will likely be removed in a future release.
   [junit4] <<< JVM J0: EOF ----

[...truncated 223 lines...]
   [junit4] JVM J1: stderr was not empty, see: /Users/jenkins/workspace/Lucene-Solr-master-MacOSX/lucene/build/sandbox/test/temp/junit4-J1-20171226_155232_0299923301321747424611.syserr
   [junit4] >>> JVM J1 emitted unexpected output (verbatim) ----
   [junit4] Java HotSpot(TM) 64-Bit Server VM warning: Option UseConcMarkSweepGC was deprecated in version 9.0 and will likely be removed in a future release.
   [junit4] JVM J0: stderr was not empty, see: /Users/jenkins/workspace/Lucene-Solr-master-MacOSX/lucene/build/sandbox/test/temp/junit4-J0-20171226_155232_0284008216427659248911.syserr
   [junit4] <<< JVM J1: EOF ----

[...truncated 320 lines...]
   [junit4] JVM J1: stderr was not empty, see: /Users/jenkins/workspace/Lucene-Solr-master-MacOSX/lucene/build/spatial-extras/test/temp/junit4-J1-20171226_155313_8936464714873271605130.syserr
   [junit4] >>> JVM J1 emitted unexpected output (verbatim) ----
   [junit4] Java HotSpot(TM) 64-Bit Server VM warning: Option UseConcMarkSweepGC was deprecated in version 9.0 and will likely be removed in a future release.
   [junit4] <<< JVM J1: EOF ----

[...truncated 3 lines...]
   [junit4] JVM J0: stderr was not empty, see: /Users/jenkins/workspace/Lucene-Solr-master-MacOSX/lucene/build/spatial-extras/test/temp/junit4-J0-20171226_155313_8938292525425393775449.syserr
   [junit4] >>> JVM J0 emitted unexpected output (verbatim) ----
   [junit4] Java HotSpot(TM) 64-Bit Server VM warning: Option UseConcMarkSweepGC was deprecated in version 9.0 and will likely be removed in a future release.
   [junit4] <<< JVM J0: EOF ----

[...truncated 146 lines...]
   [junit4] JVM J0: stderr was not empty, see: /Users/jenkins/workspace/Lucene-Solr-master-MacOSX/lucene/build/spatial/test/temp/junit4-J0-20171226_155334_51212099801552240864957.syserr
   [junit4] >>> JVM J0 emitted unexpected output (verbatim) ----
   [junit4] Java HotSpot(TM) 64-Bit Server VM warning: Option UseConcMarkSweepGC was deprecated in version 9.0 and will likely be removed in a future release.
   [junit4] <<< JVM J0: EOF ----

[...truncated 179 lines...]
   [junit4] JVM J0: stderr was not empty, see: /Users/jenkins/workspace/Lucene-Solr-master-MacOSX/lucene/build/spatial3d/test/temp/junit4-J0-20171226_155337_70913045775111996699412.syserr
   [junit4] >>> JVM J0 emitted unexpected output (verbatim) ----
   [junit4] Java HotSpot(TM) 64-Bit Server VM warning: Option UseConcMarkSweepGC was deprecated in version 9.0 and will likely be removed in a future release.
   [junit4] <<< JVM J0: EOF ----

[...truncated 6 lines...]
   [junit4] JVM J1: stderr was not empty, see: /Users/jenkins/workspace/Lucene-Solr-master-MacOSX/lucene/build/spatial3d/test/temp/junit4-J1-20171226_155337_70917701570560452073315.syserr
   [junit4] >>> JVM J1 emitted unexpected output (verbatim) ----
   [junit4] Java HotSpot(TM) 64-Bit Server VM warning: Option UseConcMarkSweepGC was deprecated in version 9.0 and will likely be removed in a future release.
   [junit4] <<< JVM J1: EOF ----

[...truncated 250 lines...]
   [junit4] JVM J0: stderr was not empty, see: /Users/jenkins/workspace/Lucene-Solr-master-MacOSX/lucene/build/suggest/test/temp/junit4-J0-20171226_155655_7365101517642337710475.syserr
   [junit4] >>> JVM J0 emitted unexpected output (verbatim) ----
   [junit4] Java HotSpot(TM) 64-Bit Server VM warning: Option UseConcMarkSweepGC was deprecated in version 9.0 and will likely be removed in a future release.
   [junit4] <<< JVM J0: EOF ----

[...truncated 3 lines...]
   [junit4] JVM J1: stderr was not empty, see: /Users/jenkins/workspace/Lucene-Solr-master-MacOSX/lucene/build/suggest/test/temp/junit4-J1-20171226_155655_7367179057148858874091.syserr
   [junit4] >>> JVM J1 emitted unexpected output (verbatim) ----
   [junit4] Java HotSpot(TM) 64-Bit Server VM warning: Option UseConcMarkSweepGC was deprecated in version 9.0 and will likely be removed in a future release.
   [junit4] <<< JVM J1: EOF ----

[...truncated 3489 lines...]
   [junit4] Suite: org.apache.solr.cloud.autoscaling.sim.TestDistribStateManager
   [junit4]   2> Creating dataDir: /Users/jenkins/workspace/Lucene-Solr-master-MacOSX/solr/build/solr-core/test/J1/temp/solr.cloud.autoscaling.sim.TestDistribStateManager_1488A915ED83084-001/init-core-data-001
   [junit4]   2> 3481182 WARN  (SUITE-TestDistribStateManager-seed#[1488A915ED83084]-worker) [    ] o.a.s.SolrTestCaseJ4 startTrackingSearchers: numOpens=8 numCloses=8
   [junit4]   2> 3481182 INFO  (SUITE-TestDistribStateManager-seed#[1488A915ED83084]-worker) [    ] o.a.s.SolrTestCaseJ4 Using PointFields (NUMERIC_POINTS_SYSPROP=true) w/NUMERIC_DOCVALUES_SYSPROP=true
   [junit4]   2> 3481182 INFO  (SUITE-TestDistribStateManager-seed#[1488A915ED83084]-worker) [    ] o.a.s.SolrTestCaseJ4 Randomized ssl (false) and clientAuth (false) via: @org.apache.solr.util.RandomizeSSL(reason="", value=0.0/0.0, ssl=0.0/0.0, clientAuth=0.0/0.0) w/ MAC_OS_X supressed clientAuth
   [junit4]   2> 3481182 INFO  (SUITE-TestDistribStateManager-seed#[1488A915ED83084]-worker) [    ] o.a.s.SolrTestCaseJ4 SecureRandom sanity checks: test.solr.allowed.securerandom=null & java.security.egd=file:/dev/./urandom
   [junit4]   2> 3481187 INFO  (TEST-TestDistribStateManager.testCreateMode-seed#[1488A915ED83084]) [    ] o.a.s.SolrTestCaseJ4 ###Starting testCreateMode
   [junit4]   2> 3481187 INFO  (TEST-TestDistribStateManager.testCreateMode-seed#[1488A915ED83084]) [    ] o.a.s.c.ZkTestServer STARTING ZK TEST SERVER
   [junit4]   2> 3481188 INFO  (Thread-5582) [    ] o.a.s.c.ZkTestServer client port:0.0.0.0/0.0.0.0:0
   [junit4]   2> 3481188 INFO  (Thread-5582) [    ] o.a.s.c.ZkTestServer Starting server
   [junit4]   2> 3481190 ERROR (Thread-5582) [    ] o.a.z.s.ZooKeeperServer ZKShutdownHandler is not registered, so ZooKeeper server won't take any action on ERROR or SHUTDOWN server state changes
   [junit4]   2> 3481293 INFO  (TEST-TestDistribStateManager.testCreateMode-seed#[1488A915ED83084]) [    ] o.a.s.c.ZkTestServer start zk server on port:64361
   [junit4]   2> 3481312 INFO  (zkConnectionManagerCallback-7770-thread-1) [    ] o.a.s.c.c.ConnectionManager zkClient has connected
   [junit4]   2> 3481312 INFO  (TEST-TestDistribStateManager.testCreateMode-seed#[1488A915ED83084]) [    ] o.a.s.c.a.s.TestDistribStateManager Using org.apache.solr.client.solrj.impl.ZkDistribStateManager
   [junit4]   2> 3481335 INFO  (zkConnectionManagerCallback-7772-thread-1) [    ] o.a.s.c.c.ConnectionManager zkClient has connected
   [junit4]   2> 3481336 INFO  (TEST-TestDistribStateManager.testCreateMode-seed#[1488A915ED83084]) [    ] o.a.s.c.a.s.TestDistribStateManager Using org.apache.solr.client.solrj.impl.ZkDistribStateManager
   [junit4]   2> 3481342 ERROR (TEST-TestDistribStateManager.testCreateMode-seed#[1488A915ED83084]) [    ] o.a.z.s.ZooKeeperServer ZKShutdownHandler is not registered, so ZooKeeper server won't take any action on ERROR or SHUTDOWN server state changes
   [junit4]   2> 3481343 INFO  (TEST-TestDistribStateManager.testCreateMode-seed#[1488A915ED83084]) [    ] o.a.s.c.ZkTestServer connecting to 127.0.0.1:64361 64361
   [junit4]   2> 3481386 INFO  (Thread-5582) [    ] o.a.s.c.ZkTestServer connecting to 127.0.0.1:64361 64361
   [junit4]   2> 3481584 INFO  (TEST-TestDistribStateManager.testCreateMode-seed#[1488A915ED83084]) [    ] o.a.s.SolrTestCaseJ4 ###Ending testCreateMode
   [junit4]   2> 3481585 INFO  (TEST-TestDistribStateManager.testMulti-seed#[1488A915ED83084]) [    ] o.a.s.SolrTestCaseJ4 ###Starting testMulti
   [junit4]   2> 3481586 INFO  (TEST-TestDistribStateManager.testMulti-seed#[1488A915ED83084]) [    ] o.a.s.c.a.s.TestDistribStateManager Using org.apache.solr.cloud.autoscaling.sim.SimDistribStateManager
   [junit4]   2> 3481586 INFO  (TEST-TestDistribStateManager.testMulti-seed#[1488A915ED83084]) [    ] o.a.s.SolrTestCaseJ4 ###Ending testMulti
   [junit4]   2> 3481587 INFO  (TEST-TestDistribStateManager.testGetSetRemoveData-seed#[1488A915ED83084]) [    ] o.a.s.SolrTestCaseJ4 ###Starting testGetSetRemoveData
   [junit4]   2> 3481587 INFO  (TEST-TestDistribStateManager.testGetSetRemoveData-seed#[1488A915ED83084]) [    ] o.a.s.c.ZkTestServer STARTING ZK TEST SERVER
   [junit4]   2> 3481587 INFO  (Thread-5583) [    ] o.a.s.c.ZkTestServer client port:0.0.0.0/0.0.0.0:0
   [junit4]   2> 3481587 INFO  (Thread-5583) [    ] o.a.s.c.ZkTestServer Starting server
   [junit4]   2> 3481589 ERROR (Thread-5583) [    ] o.a.z.s.ZooKeeperServer ZKShutdownHandler is not registered, so ZooKeeper server won't take any action on ERROR or SHUTDOWN server state changes
   [junit4]   2> 3481688 INFO  (TEST-TestDistribStateManager.testGetSetRemoveData-seed#[1488A915ED83084]) [    ] o.a.s.c.ZkTestServer start zk server on port:64364
   [junit4]   2> 3481702 INFO  (zkConnectionManagerCallback-7774-thread-1) [    ] o.a.s.c.c.ConnectionManager zkClient has connected
   [junit4]   2> 3481702 INFO  (TEST-TestDistribStateManager.testGetSetRemoveData-seed#[1488A915ED83084]) [    ] o.a.s.c.a.s.TestDistribStateManager Using org.apache.solr.client.solrj.impl.ZkDistribStateManager
   [junit4]   2> 3481712 INFO  (zkConnectionManagerCallback-7776-thread-1) [    ] o.a.s.c.c.ConnectionManager zkClient has connected
   [junit4]   2> 3481712 INFO  (TEST-TestDistribStateManager.testGetSetRemoveData-seed#[1488A915ED83084]) [    ] o.a.s.c.a.s.TestDistribStateManager Using org.apache.solr.client.solrj.impl.ZkDistribStateManager
   [junit4]   2> 3486717 ERROR (TEST-TestDistribStateManager.testGetSetRemoveData-seed#[1488A915ED83084]) [    ] o.a.z.s.ZooKeeperServer ZKShutdownHandler is not registered, so ZooKeeper server won't take any action on ERROR or SHUTDOWN server state changes
   [junit4]   2> 3486718 INFO  (TEST-TestDistribStateManager.testGetSetRemoveData-seed#[1488A915ED83084]) [    ] o.a.s.c.ZkTestServer connecting to 127.0.0.1:64364 64364
   [junit4]   2> 3486725 INFO  (Thread-5583) [    ] o.a.s.c.ZkTestServer connecting to 127.0.0.1:64364 64364
   [junit4]   2> 3487115 INFO  (TEST-TestDistribStateManager.testGetSetRemoveData-seed#[1488A915ED83084]) [    ] o.a.s.SolrTestCaseJ4 ###Ending testGetSetRemoveData
   [junit4]   2> NOTE: reproduce with: ant test  -Dtestcase=TestDistribStateManager -Dtests.method=testGetSetRemoveData -Dtests.seed=1488A915ED83084 -Dtests.slow=true -Dtests.locale=th-TH-u-nu-thai-x-lvariant-TH -Dtests.timezone=Europe/Busingen -Dtests.asserts=true -Dtests.file.encoding=UTF-8
   [junit4] FAILURE 5.54s J1 | TestDistribStateManager.testGetSetRemoveData <<<
   [junit4]    > Throwable #1: java.lang.AssertionError: Node watch should have fired!
   [junit4]    > 	at __randomizedtesting.SeedInfo.seed([1488A915ED83084:27D865C30A56F68E]:0)
   [junit4]    > 	at org.apache.solr.cloud.autoscaling.sim.TestDistribStateManager.testGetSetRemoveData(TestDistribStateManager.java:256)
   [junit4]    > 	at java.base/jdk.internal.reflect.NativeMethodAccessorImpl.invoke0(Native Method)
   [junit4]    > 	at java.base/jdk.internal.reflect.NativeMethodAccessorImpl.invoke(NativeMethodAccessorImpl.java:62)
   [junit4]    > 	at java.base/jdk.internal.reflect.DelegatingMethodAccessorImpl.invoke(DelegatingMethodAccessorImpl.java:43)
   [junit4]    > 	at java.base/java.lang.reflect.Method.invoke(Method.java:564)
   [junit4]    > 	at java.base/java.lang.Thread.run(Thread.java:844)
   [junit4]   2> 3487123 INFO  (TEST-TestDistribStateManager.testListData-seed#[1488A915ED83084]) [    ] o.a.s.SolrTestCaseJ4 ###Starting testListData
   [junit4]   2> 3487123 INFO  (TEST-TestDistribStateManager.testListData-seed#[1488A915ED83084]) [    ] o.a.s.c.ZkTestServer STARTING ZK TEST SERVER
   [junit4]   2> 3487123 INFO  (Thread-5584) [    ] o.a.s.c.ZkTestServer client port:0.0.0.0/0.0.0.0:0
   [junit4]   2> 3487124 INFO  (Thread-5584) [    ] o.a.s.c.ZkTestServer Starting server
   [junit4]   2> 3487125 ERROR (Thread-5584) [    ] o.a.z.s.ZooKeeperServer ZKShutdownHandler is not registered, so ZooKeeper server won't take any action on ERROR or SHUTDOWN server state changes
   [junit4]   2> 3487233 INFO  (TEST-TestDistribStateManager.testListData-seed#[1488A915ED83084]) [    ] o.a.s.c.ZkTestServer start zk server on port:64367
   [junit4]   2> 3487250 INFO  (zkConnectionManagerCallback-7778-thread-1) [    ] o.a.s.c.c.ConnectionManager zkClient has connected
   [junit4]   2> 3487251 INFO  (TEST-TestDistribStateManager.testListData-seed#[1488A915ED83084]) [    ] o.a.s.c.a.s.TestDistribStateManager Using org.apache.solr.client.solrj.impl.ZkDistribStateManager
   [junit4]   2> 3487259 ERROR (TEST-TestDistribStateManager.testListData-seed#[1488A915ED83084]) [    ] o.a.z.s.ZooKeeperServer ZKShutdownHandler is not registered, so ZooKeeper server won't take any action on ERROR or SHUTDOWN server state changes
   [junit4]   2> 3487260 INFO  (TEST-TestDistribStateManager.testListData-seed#[1488A915ED83084]) [    ] o.a.s.c.ZkTestServer connecting to 127.0.0.1:64367 64367
   [junit4]   2> 3487292 INFO  (Thread-5584) [    ] o.a.s.c.ZkTestServer connecting to 127.0.0.1:64367 64367
   [junit4]   2> 3488440 INFO  (TEST-TestDistribStateManager.testListData-seed#[1488A915ED83084]) [    ] o.a.s.SolrTestCaseJ4 ###Ending testListData
   [junit4]   2> 3488442 INFO  (TEST-TestDistribStateManager.testHasData-seed#[1488A915ED83084]) [    ] o.a.s.SolrTestCaseJ4 ###Starting testHasData
   [junit4]   2> 3488442 INFO  (TEST-TestDistribStateManager.testHasData-seed#[1488A915ED83084]) [    ] o.a.s.c.a.s.TestDistribStateManager Using org.apache.solr.cloud.autoscaling.sim.SimDistribStateManager
   [junit4]   2> 3488442 INFO  (TEST-TestDistribStateManager.testHasData-seed#[1488A915ED83084]) [    ] o.a.s.SolrTestCaseJ4 ###Ending testHasData
   [junit4]   2> NOTE: leaving temporary files on disk at: /Users/jenkins/workspace/Lucene-Solr-master-MacOSX/solr/build/solr-core/test/J1/temp/solr.cloud.autoscaling.sim.TestDistribStateManager_1488A915ED83084-001
   [junit4]   2> NOTE: test params are: codec=Asserting(Lucene70): {}, docValues:{}, maxPointsInLeafNode=449, maxMBSortInHeap=5.475206067668207, sim=Asserting(org.apache.lucene.search.similarities.AssertingSimilarity@5554d8ac), locale=th-TH-u-nu-thai-x-lvariant-TH, timezone=Europe/Busingen
   [junit4]   2> NOTE: Mac OS X 10.11.6 x86_64/Oracle Corporation 9 (64-bit)/cpus=3,threads=1,free=172522720,total=468713472
   [junit4]   2> NOTE: All tests run in this JVM: [ZkSolrClientTest, DocValuesNotIndexedTest, ExecutePlanActionTest, HealthCheckHandlerTest, TestSizeLimitedDistributedMap, TestFilteredDocIdSet, TestSubQueryTransformer, TestSortByMinMaxFunction, TestSolrJ, SolrShardReporterTest, SpellPossibilityIteratorTest, HttpSolrCallGetCoreTest, TestDistributedMissingSort, TestZkChroot, SynonymTokenizerTest, TestSolrQueryParser, NodeMutatorTest, TermsComponentTest, TestBinaryResponseWriter, PolyFieldTest, TestNumericRangeQuery32, DOMUtilTest, UUIDUpdateProcessorFallbackTest, TestAddFieldRealTimeGet, SaslZkACLProviderTest, ActionThrottleTest, ShardRoutingCustomTest, StressHdfsTest, SolrMetricReporterTest, TestConfigReload, SoftAutoCommitTest, ChaosMonkeySafeLeaderTest, HdfsRestartWhileUpdatingTest, TestCloudJSONFacetJoinDomain, MoveReplicaHDFSFailoverTest, TestLuceneIndexBackCompat, TestCoreContainer, TestCSVLoader, TestFileDictionaryLookup, RollingRestartTest, TestLRUCache, HdfsCollectionsAPIDistributedZkTest, JSONWriterTest, SimpleMLTQParserTest, TestSegmentSorting, SimplePostToolTest, SolrIndexConfigTest, TestUseDocValuesAsStored2, TestDynamicFieldCollectionResource, TestWordDelimiterFilterFactory, TestDefaultStatsCache, TestStressLucene, TestCrossCoreJoin, TestLRUStatsCache, FullHLLTest, DistributedExpandComponentTest, TestMacroExpander, TestSerializedLuceneMatchVersion, SchemaVersionSpecificBehaviorTest, TestExportWriter, CdcrBidirectionalTest, TestFieldCollectionResource, MoveReplicaTest, CustomCollectionTest, TestPointFields, DistributedQueryComponentOptimizationTest, TestSQLHandler, NumberUtilsTest, LoggingHandlerTest, TestMiniSolrCloudClusterSSL, MoreLikeThisHandlerTest, LeaderInitiatedRecoveryOnShardRestartTest, TestRequestStatusCollectionAPI, OverseerStatusTest, CollectionsAPIDistributedZkTest, TestFieldCacheWithThreads, RankQueryTest, BadComponentTest, ManagedSchemaRoundRobinCloudTest, TestRawTransformer, TemplateUpdateProcessorTest, TestFieldCacheReopen, PingRequestHandlerTest, SuggestComponentTest, OpenCloseCoreStressTest, CacheHeaderTest, VMParamsZkACLAndCredentialsProvidersTest, CoreMergeIndexesAdminHandlerTest, TestQueryTypes, TestImplicitCoreProperties, TestExpandComponent, TermVectorComponentDistributedTest, SubstringBytesRefFilterTest, TestSchemaNameResource, HdfsBasicDistributedZk2Test, TestPivotHelperCode, BlockJoinFacetDistribTest, TestSolrCLIRunExample, TestRuleBasedAuthorizationPlugin, FieldMutatingUpdateProcessorTest, TestLegacyFieldReuse, TestSolrQueryResponse, TestCloudNestedDocsSort, DistribDocExpirationUpdateProcessorTest, TestClusterStateProvider, TestDistributedGrouping, TestAnalyzeInfixSuggestions, TestCoreAdminApis, SolrXmlInZkTest, CopyFieldTest, TestXmlQParserPlugin, DocValuesMultiTest, TestRandomRequestDistribution, HLLUtilTest, DirectSolrSpellCheckerTest, TestRandomFaceting, TlogReplayBufferedWhileIndexingTest, TestLeaderElectionZkExpiry, TestConfig, UpdateParamsTest, TestSuggestSpellingConverter, AnalysisAfterCoreReloadTest, LeaderElectionIntegrationTest, DistributedFacetPivotLargeTest, CloudExitableDirectoryReaderTest, TestManagedResourceStorage, SolrIndexMetricsTest, TestPerFieldSimilarityWithDefaultOverride, SystemInfoHandlerTest, TestCloudSchemaless, TestFastOutputStream, TestCloudPseudoReturnFields, DocValuesMissingTest, TestGraphMLResponseWriter, DeleteReplicaTest, DistributedFacetPivotSmallAdvancedTest, ReplicationFactorTest, TestExtendedDismaxParser, EchoParamsTest, TestHdfsBackupRestoreCore, SecurityConfHandlerTest, ReplicaListTransformerTest, TestDocSet, TestSystemCollAutoCreate, ExternalFileFieldSortTest, TestStandardQParsers, DebugComponentTest, TestInPlaceUpdatesDistrib, BasicAuthStandaloneTest, TestNodeAddedTrigger, SampleTest, LeaderElectionContextKeyTest, TestConfigSetsAPI, HttpTriggerListenerTest, CollectionStateFormat2Test, NodeAddedTriggerTest, PreAnalyzedUpdateProcessorTest, MigrateRouteKeyTest, PreAnalyzedFieldTest, TestMergePolicyConfig, TestPayloadCheckQParserPlugin, HdfsThreadLeakTest, TestConfigSets, ConnectionManagerTest, TestExceedMaxTermLength, OverseerModifyCollectionTest, BlockJoinFacetSimpleTest, BooleanFieldTest, DirectoryFactoryTest, SolrGangliaReporterTest, TestConfigSetImmutable, BitVectorTest, TestNoOpRegenerator, AssignTest, DocumentBuilderTest, TestCloudDeleteByQuery, SolrIndexSplitterTest, HdfsUnloadDistributedZkTest, TestCollectionAPIs, TestUninvertingReader, TermVectorComponentTest, TestDeleteCollectionOnDownNodes, TestLMJelinekMercerSimilarityFactory, JavabinLoaderTest, TestFunctionQuery, TestHighFrequencyDictionaryFactory, BasicDistributedZk2Test, SyncSliceTest, ShardRoutingTest, BasicZkTest, RecoveryZkTest, FullSolrCloudDistribCmdsTest, TestReplicationHandler, ClusterStateUpdateTest, TestFaceting, TestRecovery, TestHashPartitioner, DistributedSpellCheckComponentTest, ZkControllerTest, TestStressReorder, TestReload, TestStressVersions, DistributedTermsComponentTest, TestRangeQuery, SimpleFacetsTest, TestSolr4Spatial, SolrCoreTest, TestGroupingSearch, QueryElevationComponentTest, PeerSyncTest, ConvertedLegacyTest, TestSort, BasicFunctionalityTest, TestLazyCores, TestBadConfig, TestIndexSearcher, HighlighterTest, ShowFileRequestHandlerTest, DistributedQueryElevationComponentTest, TestCoreDiscovery, SignatureUpdateProcessorFactoryTest, SpellCheckCollatorTest, CoreAdminHandlerTest, SolrRequestParserTest, TestFoldingMultitermQuery, DocValuesTest, SuggesterTest, TestTrie, SuggesterWFSTTest, NoCacheHeaderTest, WordBreakSolrSpellCheckerTest, SolrCoreCheckLockOnStartupTest, TestPseudoReturnFields, TestUpdate, TestAtomicUpdateErrorCases, QueryEqualityTest, DirectUpdateHandlerOptimizeTest, DefaultValueUpdateProcessorTest, StatelessScriptUpdateProcessorFactoryTest, TestRemoteStreaming, DistanceFunctionTest, TestSolrDeletionPolicy1, XsltUpdateRequestHandlerTest, IndexBasedSpellCheckerTest, LukeRequestHandlerTest, TestQueryUtils, TestWriterPerf, DocumentAnalysisRequestHandlerTest, PrimitiveFieldTypeTest, TestOmitPositions, FileBasedSpellCheckerTest, XmlUpdateRequestHandlerTest, TestValueSourceCache, RequiredFieldsTest, FieldAnalysisRequestHandlerTest, FastVectorHighlighterTest, IndexSchemaRuntimeFieldTest, RegexBoostProcessorTest, SolrPluginUtilsTest, IndexSchemaTest, TestJmxIntegration, TestCollationField, ReturnFieldsTest, UpdateRequestProcessorFactoryTest, TestCSVResponseWriter, MBeansHandlerTest, TimeZoneUtilsTest, PluginInfoTest, DateMathParserTest, TestSystemIdResolver, PrimUtilsTest, SpellingQueryConverterTest, TestUtils, TestDocumentBuilder, ZkNodePropsTest, FileUtilsTest, DistributedMLTComponentTest, TestRTGBase, DistributedIntervalFacetingTest, SolrTestCaseJ4Test, TestHighlightDedupGrouping, TestSimpleTrackingShardHandler, TestTolerantSearch, TestEmbeddedSolrServerConstructors, TestJettySolrRunner, AddReplicaTest, AliasIntegrationTest, ChaosMonkeyNothingIsSafeWithPullReplicasTest, ConcurrentDeleteAndCreateCollectionTest, ConfigSetsAPITest, CreateCollectionCleanupTest, DeleteInactiveReplicaTest, DeleteLastCustomShardedReplicaTest, DeleteNodeTest, DeleteStatusTest, DistributedQueueTest, DistributedVersionInfoTest, LeaderFailoverAfterPartitionTest, LeaderFailureAfterFreshStartTest, MultiThreadedOCPTest, RemoteQueryErrorTest, ShardSplitTest, TestTolerantUpdateProcessorRandomCloud, TestUtilizeNode, AutoAddReplicasIntegrationTest, MetricTriggerTest, SearchRateTriggerTest, TestDistribStateManager]
   [junit4] Completed [580/765 (1!)] on J1 in 7.27s, 5 tests, 1 failure <<< FAILURES!

[...truncated 709 lines...]
   [junit4] JVM J1: stderr was not empty, see: /Users/jenkins/workspace/Lucene-Solr-master-MacOSX/solr/build/solr-core/test/temp/junit4-J1-20171226_155802_3617557995235361719183.syserr
   [junit4] >>> JVM J1 emitted unexpected output (verbatim) ----
   [junit4] Java HotSpot(TM) 64-Bit Server VM warning: Option UseConcMarkSweepGC was deprecated in version 9.0 and will likely be removed in a future release.
   [junit4] <<< JVM J1: EOF ----

   [junit4] JVM J0: stderr was not empty, see: /Users/jenkins/workspace/Lucene-Solr-master-MacOSX/solr/build/solr-core/test/temp/junit4-J0-20171226_155802_3616240232118026651637.syserr
   [junit4] >>> JVM J0 emitted unexpected output (verbatim) ----
   [junit4] Java HotSpot(TM) 64-Bit Server VM warning: Option UseConcMarkSweepGC was deprecated in version 9.0 and will likely be removed in a future release.
   [junit4] <<< JVM J0: EOF ----

[...truncated 879 lines...]
   [junit4] JVM J0: stderr was not empty, see: /Users/jenkins/workspace/Lucene-Solr-master-MacOSX/solr/build/solr-solrj/test/temp/junit4-J0-20171226_170219_62118082441179953792138.syserr
   [junit4] >>> JVM J0 emitted unexpected output (verbatim) ----
   [junit4] Java HotSpot(TM) 64-Bit Server VM warning: Option UseConcMarkSweepGC was deprecated in version 9.0 and will likely be removed in a future release.
   [junit4] <<< JVM J0: EOF ----

[...truncated 15 lines...]
   [junit4] JVM J1: stderr was not empty, see: /Users/jenkins/workspace/Lucene-Solr-master-MacOSX/solr/build/solr-solrj/test/temp/junit4-J1-20171226_170219_6217844039434530433208.syserr
   [junit4] >>> JVM J1 emitted unexpected output (verbatim) ----
   [junit4] Java HotSpot(TM) 64-Bit Server VM warning: Option UseConcMarkSweepGC was deprecated in version 9.0 and will likely be removed in a future release.
   [junit4] <<< JVM J1: EOF ----

[...truncated 1460 lines...]
   [junit4] JVM J0: stderr was not empty, see: /Users/jenkins/workspace/Lucene-Solr-master-MacOSX/solr/build/contrib/solr-analysis-extras/test/temp/junit4-J0-20171226_170553_8091844767476560370902.syserr
   [junit4] >>> JVM J0 emitted unexpected output (verbatim) ----
   [junit4] Java HotSpot(TM) 64-Bit Server VM warning: Option UseConcMarkSweepGC was deprecated in version 9.0 and will likely be removed in a future release.
   [junit4] <<< JVM J0: EOF ----

[...truncated 3 lines...]
   [junit4] JVM J1: stderr was not empty, see: /Users/jenkins/workspace/Lucene-Solr-master-MacOSX/solr/build/contrib/solr-analysis-extras/test/temp/junit4-J1-20171226_170553_80942162675391216177.syserr
   [junit4] >>> JVM J1 emitted unexpected output (verbatim) ----
   [junit4] Java HotSpot(TM) 64-Bit Server VM warning: Option UseConcMarkSweepGC was deprecated in version 9.0 and will likely be removed in a future release.
   [junit4] <<< JVM J1: EOF ----

[...truncated 782 lines...]
   [junit4] JVM J0: stderr was not empty, see: /Users/jenkins/workspace/Lucene-Solr-master-MacOSX/solr/build/contrib/solr-analytics/test/temp/junit4-J0-20171226_170608_90411875955926361440946.syserr
   [junit4] >>> JVM J0 emitted unexpected output (verbatim) ----
   [junit4] Java HotSpot(TM) 64-Bit Server VM warning: Option UseConcMarkSweepGC was deprecated in version 9.0 and will likely be removed in a future release.
   [junit4] <<< JVM J0: EOF ----

[...truncated 3 lines...]
   [junit4] JVM J1: stderr was not empty, see: /Users/jenkins/workspace/Lucene-Solr-master-MacOSX/solr/build/contrib/solr-analytics/test/temp/junit4-J1-20171226_170608_90414473773885683167009.syserr
   [junit4] >>> JVM J1 emitted unexpected output (verbatim) ----
   [junit4] Java HotSpot(TM) 64-Bit Server VM warning: Option UseConcMarkSweepGC was deprecated in version 9.0 and will likely be removed in a future release.
   [junit4] <<< JVM J1: EOF ----

[...truncated 553 lines...]
   [junit4] JVM J1: stderr was not empty, see: /Users/jenkins/workspace/Lucene-Solr-master-MacOSX/solr/build/contrib/solr-clustering/test/temp/junit4-J1-20171226_170723_9526962936571576585016.syserr
   [junit4] >>> JVM J1 emitted unexpected output (verbatim) ----
   [junit4] Java HotSpot(TM) 64-Bit Server VM warning: Option UseConcMarkSweepGC was deprecated in version 9.0 and will likely be removed in a future release.
   [junit4] <<< JVM J1: EOF ----

[...truncated 3 lines...]
   [junit4] JVM J0: stderr was not empty, see: /Users/jenkins/workspace/Lucene-Solr-master-MacOSX/solr/build/contrib/solr-clustering/test/temp/junit4-J0-20171226_170723_9526409429268673284225.syserr
   [junit4] >>> JVM J0 emitted unexpected output (verbatim) ----
   [junit4] Java HotSpot(TM) 64-Bit Server VM warning: Option UseConcMarkSweepGC was deprecated in version 9.0 and will likely be removed in a future release.
   [junit4] <<< JVM J0: EOF ----

[...truncated 1258 lines...]
   [junit4] JVM J1: stderr was not empty, see: /Users/jenkins/workspace/Lucene-Solr-master-MacOSX/solr/build/contrib/solr-dataimporthandler-extras/test/temp/junit4-J1-20171226_170747_4337299854614871756494.syserr
   [junit4] >>> JVM J1 emitted unexpected output (verbatim) ----
   [junit4] Java HotSpot(TM) 64-Bit Server VM warning: Option UseConcMarkSweepGC was deprecated in version 9.0 and will likely be removed in a future release.
   [junit4] <<< JVM J1: EOF ----

[...truncated 3 lines...]
   [junit4] JVM J0: stderr was not empty, see: /Users/jenkins/workspace/Lucene-Solr-master-MacOSX/solr/build/contrib/solr-dataimporthandler-extras/test/temp/junit4-J0-20171226_170747_43318442684759933571188.syserr
   [junit4] >>> JVM J0 emitted unexpected output (verbatim) ----
   [junit4] Java HotSpot(TM) 64-Bit Server VM warning: Option UseConcMarkSweepGC was deprecated in version 9.0 and will likely be removed in a future release.
   [junit4] <<< JVM J0: EOF ----

[...truncated 649 lines...]
   [junit4] JVM J0: stderr was not empty, see: /Users/jenkins/workspace/Lucene-Solr-master-MacOSX/solr/build/contrib/solr-dataimporthandler/test/temp/junit4-J0-20171226_170801_2855904071873484409437.syserr
   [junit4] >>> JVM J0 emitted unexpected output (verbatim) ----
   [junit4] Java HotSpot(TM) 64-Bit Server VM warning: Option UseConcMarkSweepGC was deprecated in version 9.0 and will likely be removed in a future release.
   [junit4] <<< JVM J0: EOF ----

   [junit4] JVM J1: stderr was not empty, see: /Users/jenkins/workspace/Lucene-Solr-master-MacOSX/solr/build/contrib/solr-dataimporthandler/test/temp/junit4-J1-20171226_170801_28513127385396735052709.syserr
   [junit4] >>> JVM J1 emitted unexpected output (verbatim) ----
   [junit4] Java HotSpot(TM) 64-Bit Server VM warning: Option UseConcMarkSweepGC was deprecated in version 9.0 and will likely be removed in a future release.
   [junit4] <<< JVM J1: EOF ----

[...truncated 558 lines...]
   [junit4] JVM J0: stderr was not empty, see: /Users/jenkins/workspace/Lucene-Solr-master-MacOSX/solr/build/contrib/solr-cell/test/temp/junit4-J0-20171226_170831_5766447537858838257632.syserr
   [junit4] >>> JVM J0 emitted unexpected output (verbatim) ----
   [junit4] Java HotSpot(TM) 64-Bit Server VM warning: Option UseConcMarkSweepGC was deprecated in version 9.0 and will likely be removed in a future release.
   [junit4] <<< JVM J0: EOF ----

[...truncated 3 lines...]
   [junit4] JVM J1: stderr was not empty, see: /Users/jenkins/workspace/Lucene-Solr-master-MacOSX/solr/build/contrib/solr-cell/test/temp/junit4-J1-20171226_170831_57612195408349133529949.syserr
   [junit4] >>> JVM J1 emitted unexpected output (verbatim) ----
   [junit4] Java HotSpot(TM) 64-Bit Server VM warning: Option UseConcMarkSweepGC was deprecated in version 9.0 and will likely be removed in a future release.
   [junit4] <<< JVM J1: EOF ----

[...truncated 561 lines...]
   [junit4] JVM J0: stderr was not empty, see: /Users/jenkins/workspace/Lucene-Solr-master-MacOSX/solr/build/contrib/solr-langid/test/temp/junit4-J0-20171226_170852_7278093362930028056321.syserr
   [junit4] >>> JVM J0 emitted unexpected output (verbatim) ----
   [junit4] JVM J1: stderr was not empty, see: /Users/jenkins/workspace/Lucene-Solr-master-MacOSX/solr/build/contrib/solr-langid/test/temp/junit4-J1-20171226_170852_7287227198661860127200.syserr
   [junit4] Java HotSpot(TM) 64-Bit Server VM warning: Option UseConcMarkSweepGC was deprecated in version 9.0 and will likely be removed in a future release.
   [junit4] <<< JVM J0: EOF ----

[...truncated 657 lines...]
   [junit4] JVM J1: stderr was not empty, see: /Users/jenkins/workspace/Lucene-Solr-master-MacOSX/solr/build/contrib/solr-ltr/test/temp/junit4-J1-20171226_170905_7147762697517595854727.syserr
   [junit4] >>> JVM J1 emitted unexpected output (verbatim) ----
   [junit4] Java HotSpot(TM) 64-Bit Server VM warning: Option UseConcMarkSweepGC was deprecated in version 9.0 and will likely be removed in a future release.
   [junit4] <<< JVM J1: EOF ----

[...truncated 3 lines...]
   [junit4] JVM J0: stderr was not empty, see: /Users/jenkins/workspace/Lucene-Solr-master-MacOSX/solr/build/contrib/solr-ltr/test/temp/junit4-J0-20171226_170905_71416860457219127778523.syserr
   [junit4] >>> JVM J0 emitted unexpected output (verbatim) ----
   [junit4] Java HotSpot(TM) 64-Bit Server VM warning: Option UseConcMarkSweepGC was deprecated in version 9.0 and will likely be removed in a future release.
   [junit4] <<< JVM J0: EOF ----

[...truncated 595 lines...]
   [junit4] JVM J1: stderr was not empty, see: /Users/jenkins/workspace/Lucene-Solr-master-MacOSX/solr/build/contrib/solr-uima/test/temp/junit4-J1-20171226_170944_47915614510482164614242.syserr
   [junit4] >>> JVM J1 emitted unexpected output (verbatim) ----
   [junit4] Java HotSpot(TM) 64-Bit Server VM warning: Option UseConcMarkSweepGC was deprecated in version 9.0 and will likely be removed in a future release.
   [junit4] <<< JVM J1: EOF ----

[...truncated 3 lines...]
   [junit4] JVM J0: stderr was not empty, see: /Users/jenkins/workspace/Lucene-Solr-master-MacOSX/solr/build/contrib/solr-uima/test/temp/junit4-J0-20171226_170944_4799565328585076024823.syserr
   [junit4] >>> JVM J0 emitted unexpected output (verbatim) ----
   [junit4] Java HotSpot(TM) 64-Bit Server VM warning: Option UseConcMarkSweepGC was deprecated in version 9.0 and will likely be removed in a future release.
   [junit4] <<< JVM J0: EOF ----

[...truncated 548 lines...]
   [junit4] JVM J0: stderr was not empty, see: /Users/jenkins/workspace/Lucene-Solr-master-MacOSX/solr/build/contrib/solr-velocity/test/temp/junit4-J0-20171226_171003_591130230169646850410.syserr
   [junit4] >>> JVM J0 emitted unexpected output (verbatim) ----
   [junit4] Java HotSpot(TM) 64-Bit Server VM warning: Option UseConcMarkSweepGC was deprecated in version 9.0 and will likely be removed in a future release.
   [junit4] <<< JVM J0: EOF ----

[...truncated 32213 lines...]

Mime
View raw message