lucene-dev mailing list archives

Site index · List index
Message view « Date » · « Thread »
Top « Date » · « Thread »
From Policeman Jenkins Server <jenk...@thetaphi.de>
Subject [JENKINS] Lucene-Solr-master-MacOSX (64bit/jdk-9) - Build # 4411 - Still Unstable!
Date Sat, 27 Jan 2018 12:05:56 GMT
Build: https://jenkins.thetaphi.de/job/Lucene-Solr-master-MacOSX/4411/
Java: 64bit/jdk-9 -XX:+UseCompressedOops -XX:+UseParallelGC

4 tests failed.
FAILED:  org.apache.solr.cloud.FullSolrCloudDistribCmdsTest.test

Error Message:
Could not find collection:collection2

Stack Trace:
java.lang.AssertionError: Could not find collection:collection2
	at __randomizedtesting.SeedInfo.seed([2B150420ABF229A6:A3413BFA050E445E]:0)
	at org.junit.Assert.fail(Assert.java:93)
	at org.junit.Assert.assertTrue(Assert.java:43)
	at org.junit.Assert.assertNotNull(Assert.java:526)
	at org.apache.solr.cloud.AbstractDistribZkTestBase.waitForRecoveriesToFinish(AbstractDistribZkTestBase.java:155)
	at org.apache.solr.cloud.AbstractDistribZkTestBase.waitForRecoveriesToFinish(AbstractDistribZkTestBase.java:140)
	at org.apache.solr.cloud.AbstractDistribZkTestBase.waitForRecoveriesToFinish(AbstractDistribZkTestBase.java:135)
	at org.apache.solr.cloud.AbstractFullDistribZkTestBase.waitForRecoveriesToFinish(AbstractFullDistribZkTestBase.java:915)
	at org.apache.solr.cloud.FullSolrCloudDistribCmdsTest.testIndexingBatchPerRequestWithHttpSolrClient(FullSolrCloudDistribCmdsTest.java:612)
	at org.apache.solr.cloud.FullSolrCloudDistribCmdsTest.test(FullSolrCloudDistribCmdsTest.java:152)
	at java.base/jdk.internal.reflect.NativeMethodAccessorImpl.invoke0(Native Method)
	at java.base/jdk.internal.reflect.NativeMethodAccessorImpl.invoke(NativeMethodAccessorImpl.java:62)
	at java.base/jdk.internal.reflect.DelegatingMethodAccessorImpl.invoke(DelegatingMethodAccessorImpl.java:43)
	at java.base/java.lang.reflect.Method.invoke(Method.java:564)
	at com.carrotsearch.randomizedtesting.RandomizedRunner.invoke(RandomizedRunner.java:1737)
	at com.carrotsearch.randomizedtesting.RandomizedRunner$8.evaluate(RandomizedRunner.java:934)
	at com.carrotsearch.randomizedtesting.RandomizedRunner$9.evaluate(RandomizedRunner.java:970)
	at com.carrotsearch.randomizedtesting.RandomizedRunner$10.evaluate(RandomizedRunner.java:984)
	at org.apache.solr.BaseDistributedSearchTestCase$ShardsRepeatRule$ShardsFixedStatement.callStatement(BaseDistributedSearchTestCase.java:993)
	at org.apache.solr.BaseDistributedSearchTestCase$ShardsRepeatRule$ShardsStatement.evaluate(BaseDistributedSearchTestCase.java:968)
	at com.carrotsearch.randomizedtesting.rules.SystemPropertiesRestoreRule$1.evaluate(SystemPropertiesRestoreRule.java:57)
	at org.apache.lucene.util.TestRuleSetupTeardownChained$1.evaluate(TestRuleSetupTeardownChained.java:49)
	at org.apache.lucene.util.AbstractBeforeAfterRule$1.evaluate(AbstractBeforeAfterRule.java:45)
	at org.apache.lucene.util.TestRuleThreadAndTestName$1.evaluate(TestRuleThreadAndTestName.java:48)
	at org.apache.lucene.util.TestRuleIgnoreAfterMaxFailures$1.evaluate(TestRuleIgnoreAfterMaxFailures.java:64)
	at org.apache.lucene.util.TestRuleMarkFailure$1.evaluate(TestRuleMarkFailure.java:47)
	at com.carrotsearch.randomizedtesting.rules.StatementAdapter.evaluate(StatementAdapter.java:36)
	at com.carrotsearch.randomizedtesting.ThreadLeakControl$StatementRunner.run(ThreadLeakControl.java:368)
	at com.carrotsearch.randomizedtesting.ThreadLeakControl.forkTimeoutingTask(ThreadLeakControl.java:817)
	at com.carrotsearch.randomizedtesting.ThreadLeakControl$3.evaluate(ThreadLeakControl.java:468)
	at com.carrotsearch.randomizedtesting.RandomizedRunner.runSingleTest(RandomizedRunner.java:943)
	at com.carrotsearch.randomizedtesting.RandomizedRunner$5.evaluate(RandomizedRunner.java:829)
	at com.carrotsearch.randomizedtesting.RandomizedRunner$6.evaluate(RandomizedRunner.java:879)
	at com.carrotsearch.randomizedtesting.RandomizedRunner$7.evaluate(RandomizedRunner.java:890)
	at com.carrotsearch.randomizedtesting.rules.StatementAdapter.evaluate(StatementAdapter.java:36)
	at com.carrotsearch.randomizedtesting.rules.SystemPropertiesRestoreRule$1.evaluate(SystemPropertiesRestoreRule.java:57)
	at org.apache.lucene.util.AbstractBeforeAfterRule$1.evaluate(AbstractBeforeAfterRule.java:45)
	at com.carrotsearch.randomizedtesting.rules.StatementAdapter.evaluate(StatementAdapter.java:36)
	at org.apache.lucene.util.TestRuleStoreClassName$1.evaluate(TestRuleStoreClassName.java:41)
	at com.carrotsearch.randomizedtesting.rules.NoShadowingOrOverridesOnMethodsRule$1.evaluate(NoShadowingOrOverridesOnMethodsRule.java:40)
	at com.carrotsearch.randomizedtesting.rules.NoShadowingOrOverridesOnMethodsRule$1.evaluate(NoShadowingOrOverridesOnMethodsRule.java:40)
	at com.carrotsearch.randomizedtesting.rules.StatementAdapter.evaluate(StatementAdapter.java:36)
	at com.carrotsearch.randomizedtesting.rules.StatementAdapter.evaluate(StatementAdapter.java:36)
	at org.apache.lucene.util.TestRuleAssertionsRequired$1.evaluate(TestRuleAssertionsRequired.java:53)
	at org.apache.lucene.util.TestRuleMarkFailure$1.evaluate(TestRuleMarkFailure.java:47)
	at org.apache.lucene.util.TestRuleIgnoreAfterMaxFailures$1.evaluate(TestRuleIgnoreAfterMaxFailures.java:64)
	at org.apache.lucene.util.TestRuleIgnoreTestSuites$1.evaluate(TestRuleIgnoreTestSuites.java:54)
	at com.carrotsearch.randomizedtesting.rules.StatementAdapter.evaluate(StatementAdapter.java:36)
	at com.carrotsearch.randomizedtesting.ThreadLeakControl$StatementRunner.run(ThreadLeakControl.java:368)
	at java.base/java.lang.Thread.run(Thread.java:844)


FAILED:  org.apache.solr.cloud.autoscaling.AutoAddReplicasPlanActionTest.testSimple

Error Message:
IOException occured when talking to server at: http://127.0.0.1:53621/solr

Stack Trace:
org.apache.solr.client.solrj.SolrServerException: IOException occured when talking to server at: http://127.0.0.1:53621/solr
	at __randomizedtesting.SeedInfo.seed([2B150420ABF229A6:13A620DE8C01FD77]:0)
	at org.apache.solr.client.solrj.impl.HttpSolrClient.executeMethod(HttpSolrClient.java:657)
	at org.apache.solr.client.solrj.impl.HttpSolrClient.request(HttpSolrClient.java:255)
	at org.apache.solr.client.solrj.impl.HttpSolrClient.request(HttpSolrClient.java:244)
	at org.apache.solr.client.solrj.impl.LBHttpSolrClient.doRequest(LBHttpSolrClient.java:483)
	at org.apache.solr.client.solrj.impl.LBHttpSolrClient.request(LBHttpSolrClient.java:413)
	at org.apache.solr.client.solrj.impl.CloudSolrClient.sendRequest(CloudSolrClient.java:1104)
	at org.apache.solr.client.solrj.impl.CloudSolrClient.requestWithRetryOnStaleState(CloudSolrClient.java:884)
	at org.apache.solr.client.solrj.impl.CloudSolrClient.request(CloudSolrClient.java:817)
	at org.apache.solr.client.solrj.SolrClient.request(SolrClient.java:1219)
	at org.apache.solr.cloud.autoscaling.AutoAddReplicasPlanActionTest.testSimple(AutoAddReplicasPlanActionTest.java:110)
	at java.base/jdk.internal.reflect.NativeMethodAccessorImpl.invoke0(Native Method)
	at java.base/jdk.internal.reflect.NativeMethodAccessorImpl.invoke(NativeMethodAccessorImpl.java:62)
	at java.base/jdk.internal.reflect.DelegatingMethodAccessorImpl.invoke(DelegatingMethodAccessorImpl.java:43)
	at java.base/java.lang.reflect.Method.invoke(Method.java:564)
	at com.carrotsearch.randomizedtesting.RandomizedRunner.invoke(RandomizedRunner.java:1737)
	at com.carrotsearch.randomizedtesting.RandomizedRunner$8.evaluate(RandomizedRunner.java:934)
	at com.carrotsearch.randomizedtesting.RandomizedRunner$9.evaluate(RandomizedRunner.java:970)
	at com.carrotsearch.randomizedtesting.RandomizedRunner$10.evaluate(RandomizedRunner.java:984)
	at com.carrotsearch.randomizedtesting.rules.SystemPropertiesRestoreRule$1.evaluate(SystemPropertiesRestoreRule.java:57)
	at org.apache.lucene.util.TestRuleSetupTeardownChained$1.evaluate(TestRuleSetupTeardownChained.java:49)
	at org.apache.lucene.util.AbstractBeforeAfterRule$1.evaluate(AbstractBeforeAfterRule.java:45)
	at org.apache.lucene.util.TestRuleThreadAndTestName$1.evaluate(TestRuleThreadAndTestName.java:48)
	at org.apache.lucene.util.TestRuleIgnoreAfterMaxFailures$1.evaluate(TestRuleIgnoreAfterMaxFailures.java:64)
	at org.apache.lucene.util.TestRuleMarkFailure$1.evaluate(TestRuleMarkFailure.java:47)
	at com.carrotsearch.randomizedtesting.rules.StatementAdapter.evaluate(StatementAdapter.java:36)
	at com.carrotsearch.randomizedtesting.ThreadLeakControl$StatementRunner.run(ThreadLeakControl.java:368)
	at com.carrotsearch.randomizedtesting.ThreadLeakControl.forkTimeoutingTask(ThreadLeakControl.java:817)
	at com.carrotsearch.randomizedtesting.ThreadLeakControl$3.evaluate(ThreadLeakControl.java:468)
	at com.carrotsearch.randomizedtesting.RandomizedRunner.runSingleTest(RandomizedRunner.java:943)
	at com.carrotsearch.randomizedtesting.RandomizedRunner$5.evaluate(RandomizedRunner.java:829)
	at com.carrotsearch.randomizedtesting.RandomizedRunner$6.evaluate(RandomizedRunner.java:879)
	at com.carrotsearch.randomizedtesting.RandomizedRunner$7.evaluate(RandomizedRunner.java:890)
	at com.carrotsearch.randomizedtesting.rules.StatementAdapter.evaluate(StatementAdapter.java:36)
	at com.carrotsearch.randomizedtesting.rules.SystemPropertiesRestoreRule$1.evaluate(SystemPropertiesRestoreRule.java:57)
	at org.apache.lucene.util.AbstractBeforeAfterRule$1.evaluate(AbstractBeforeAfterRule.java:45)
	at com.carrotsearch.randomizedtesting.rules.StatementAdapter.evaluate(StatementAdapter.java:36)
	at org.apache.lucene.util.TestRuleStoreClassName$1.evaluate(TestRuleStoreClassName.java:41)
	at com.carrotsearch.randomizedtesting.rules.NoShadowingOrOverridesOnMethodsRule$1.evaluate(NoShadowingOrOverridesOnMethodsRule.java:40)
	at com.carrotsearch.randomizedtesting.rules.NoShadowingOrOverridesOnMethodsRule$1.evaluate(NoShadowingOrOverridesOnMethodsRule.java:40)
	at com.carrotsearch.randomizedtesting.rules.StatementAdapter.evaluate(StatementAdapter.java:36)
	at com.carrotsearch.randomizedtesting.rules.StatementAdapter.evaluate(StatementAdapter.java:36)
	at org.apache.lucene.util.TestRuleAssertionsRequired$1.evaluate(TestRuleAssertionsRequired.java:53)
	at org.apache.lucene.util.TestRuleMarkFailure$1.evaluate(TestRuleMarkFailure.java:47)
	at org.apache.lucene.util.TestRuleIgnoreAfterMaxFailures$1.evaluate(TestRuleIgnoreAfterMaxFailures.java:64)
	at org.apache.lucene.util.TestRuleIgnoreTestSuites$1.evaluate(TestRuleIgnoreTestSuites.java:54)
	at com.carrotsearch.randomizedtesting.rules.StatementAdapter.evaluate(StatementAdapter.java:36)
	at com.carrotsearch.randomizedtesting.ThreadLeakControl$StatementRunner.run(ThreadLeakControl.java:368)
	at java.base/java.lang.Thread.run(Thread.java:844)
Caused by: java.net.SocketException: Connection reset
	at java.base/java.net.SocketInputStream.read(SocketInputStream.java:210)
	at java.base/java.net.SocketInputStream.read(SocketInputStream.java:141)
	at org.apache.http.impl.io.SessionInputBufferImpl.streamRead(SessionInputBufferImpl.java:137)
	at org.apache.http.impl.io.SessionInputBufferImpl.fillBuffer(SessionInputBufferImpl.java:153)
	at org.apache.http.impl.io.SessionInputBufferImpl.readLine(SessionInputBufferImpl.java:282)
	at org.apache.http.impl.conn.DefaultHttpResponseParser.parseHead(DefaultHttpResponseParser.java:138)
	at org.apache.http.impl.conn.DefaultHttpResponseParser.parseHead(DefaultHttpResponseParser.java:56)
	at org.apache.http.impl.io.AbstractMessageParser.parse(AbstractMessageParser.java:259)
	at org.apache.http.impl.DefaultBHttpClientConnection.receiveResponseHeader(DefaultBHttpClientConnection.java:163)
	at org.apache.http.impl.conn.CPoolProxy.receiveResponseHeader(CPoolProxy.java:165)
	at org.apache.http.protocol.HttpRequestExecutor.doReceiveResponse(HttpRequestExecutor.java:273)
	at org.apache.http.protocol.HttpRequestExecutor.execute(HttpRequestExecutor.java:125)
	at org.apache.http.impl.execchain.MainClientExec.execute(MainClientExec.java:272)
	at org.apache.http.impl.execchain.ProtocolExec.execute(ProtocolExec.java:185)
	at org.apache.http.impl.execchain.RetryExec.execute(RetryExec.java:89)
	at org.apache.http.impl.execchain.RedirectExec.execute(RedirectExec.java:111)
	at org.apache.http.impl.client.InternalHttpClient.doExecute(InternalHttpClient.java:185)
	at org.apache.http.impl.client.CloseableHttpClient.execute(CloseableHttpClient.java:83)
	at org.apache.http.impl.client.CloseableHttpClient.execute(CloseableHttpClient.java:56)
	at org.apache.solr.client.solrj.impl.HttpSolrClient.executeMethod(HttpSolrClient.java:542)
	... 47 more


FAILED:  org.apache.solr.cloud.autoscaling.TriggerIntegrationTest.testListeners

Error Message:


Stack Trace:
java.lang.AssertionError
	at __randomizedtesting.SeedInfo.seed([2B150420ABF229A6:C6D59330169EB47F]:0)
	at org.junit.Assert.fail(Assert.java:92)
	at org.junit.Assert.assertTrue(Assert.java:43)
	at org.junit.Assert.assertTrue(Assert.java:54)
	at org.apache.solr.cloud.autoscaling.TriggerIntegrationTest.testListeners(TriggerIntegrationTest.java:1053)
	at java.base/jdk.internal.reflect.NativeMethodAccessorImpl.invoke0(Native Method)
	at java.base/jdk.internal.reflect.NativeMethodAccessorImpl.invoke(NativeMethodAccessorImpl.java:62)
	at java.base/jdk.internal.reflect.DelegatingMethodAccessorImpl.invoke(DelegatingMethodAccessorImpl.java:43)
	at java.base/java.lang.reflect.Method.invoke(Method.java:564)
	at com.carrotsearch.randomizedtesting.RandomizedRunner.invoke(RandomizedRunner.java:1737)
	at com.carrotsearch.randomizedtesting.RandomizedRunner$8.evaluate(RandomizedRunner.java:934)
	at com.carrotsearch.randomizedtesting.RandomizedRunner$9.evaluate(RandomizedRunner.java:970)
	at com.carrotsearch.randomizedtesting.RandomizedRunner$10.evaluate(RandomizedRunner.java:984)
	at com.carrotsearch.randomizedtesting.rules.SystemPropertiesRestoreRule$1.evaluate(SystemPropertiesRestoreRule.java:57)
	at org.apache.lucene.util.TestRuleSetupTeardownChained$1.evaluate(TestRuleSetupTeardownChained.java:49)
	at org.apache.lucene.util.AbstractBeforeAfterRule$1.evaluate(AbstractBeforeAfterRule.java:45)
	at org.apache.lucene.util.TestRuleThreadAndTestName$1.evaluate(TestRuleThreadAndTestName.java:48)
	at org.apache.lucene.util.TestRuleIgnoreAfterMaxFailures$1.evaluate(TestRuleIgnoreAfterMaxFailures.java:64)
	at org.apache.lucene.util.TestRuleMarkFailure$1.evaluate(TestRuleMarkFailure.java:47)
	at com.carrotsearch.randomizedtesting.rules.StatementAdapter.evaluate(StatementAdapter.java:36)
	at com.carrotsearch.randomizedtesting.ThreadLeakControl$StatementRunner.run(ThreadLeakControl.java:368)
	at com.carrotsearch.randomizedtesting.ThreadLeakControl.forkTimeoutingTask(ThreadLeakControl.java:817)
	at com.carrotsearch.randomizedtesting.ThreadLeakControl$3.evaluate(ThreadLeakControl.java:468)
	at com.carrotsearch.randomizedtesting.RandomizedRunner.runSingleTest(RandomizedRunner.java:943)
	at com.carrotsearch.randomizedtesting.RandomizedRunner$5.evaluate(RandomizedRunner.java:829)
	at com.carrotsearch.randomizedtesting.RandomizedRunner$6.evaluate(RandomizedRunner.java:879)
	at com.carrotsearch.randomizedtesting.RandomizedRunner$7.evaluate(RandomizedRunner.java:890)
	at com.carrotsearch.randomizedtesting.rules.StatementAdapter.evaluate(StatementAdapter.java:36)
	at com.carrotsearch.randomizedtesting.rules.SystemPropertiesRestoreRule$1.evaluate(SystemPropertiesRestoreRule.java:57)
	at org.apache.lucene.util.AbstractBeforeAfterRule$1.evaluate(AbstractBeforeAfterRule.java:45)
	at com.carrotsearch.randomizedtesting.rules.StatementAdapter.evaluate(StatementAdapter.java:36)
	at org.apache.lucene.util.TestRuleStoreClassName$1.evaluate(TestRuleStoreClassName.java:41)
	at com.carrotsearch.randomizedtesting.rules.NoShadowingOrOverridesOnMethodsRule$1.evaluate(NoShadowingOrOverridesOnMethodsRule.java:40)
	at com.carrotsearch.randomizedtesting.rules.NoShadowingOrOverridesOnMethodsRule$1.evaluate(NoShadowingOrOverridesOnMethodsRule.java:40)
	at com.carrotsearch.randomizedtesting.rules.StatementAdapter.evaluate(StatementAdapter.java:36)
	at com.carrotsearch.randomizedtesting.rules.StatementAdapter.evaluate(StatementAdapter.java:36)
	at org.apache.lucene.util.TestRuleAssertionsRequired$1.evaluate(TestRuleAssertionsRequired.java:53)
	at org.apache.lucene.util.TestRuleMarkFailure$1.evaluate(TestRuleMarkFailure.java:47)
	at org.apache.lucene.util.TestRuleIgnoreAfterMaxFailures$1.evaluate(TestRuleIgnoreAfterMaxFailures.java:64)
	at org.apache.lucene.util.TestRuleIgnoreTestSuites$1.evaluate(TestRuleIgnoreTestSuites.java:54)
	at com.carrotsearch.randomizedtesting.rules.StatementAdapter.evaluate(StatementAdapter.java:36)
	at com.carrotsearch.randomizedtesting.ThreadLeakControl$StatementRunner.run(ThreadLeakControl.java:368)
	at java.base/java.lang.Thread.run(Thread.java:844)


FAILED:  org.apache.solr.cloud.autoscaling.TriggerIntegrationTest.testMetricTrigger

Error Message:


Stack Trace:
java.lang.AssertionError
	at __randomizedtesting.SeedInfo.seed([2B150420ABF229A6:911933AFF41AFFE9]:0)
	at org.junit.Assert.fail(Assert.java:92)
	at org.junit.Assert.assertTrue(Assert.java:43)
	at org.junit.Assert.assertNull(Assert.java:551)
	at org.junit.Assert.assertNull(Assert.java:562)
	at org.apache.solr.cloud.autoscaling.TriggerIntegrationTest.testMetricTrigger(TriggerIntegrationTest.java:1575)
	at java.base/jdk.internal.reflect.NativeMethodAccessorImpl.invoke0(Native Method)
	at java.base/jdk.internal.reflect.NativeMethodAccessorImpl.invoke(NativeMethodAccessorImpl.java:62)
	at java.base/jdk.internal.reflect.DelegatingMethodAccessorImpl.invoke(DelegatingMethodAccessorImpl.java:43)
	at java.base/java.lang.reflect.Method.invoke(Method.java:564)
	at com.carrotsearch.randomizedtesting.RandomizedRunner.invoke(RandomizedRunner.java:1737)
	at com.carrotsearch.randomizedtesting.RandomizedRunner$8.evaluate(RandomizedRunner.java:934)
	at com.carrotsearch.randomizedtesting.RandomizedRunner$9.evaluate(RandomizedRunner.java:970)
	at com.carrotsearch.randomizedtesting.RandomizedRunner$10.evaluate(RandomizedRunner.java:984)
	at com.carrotsearch.randomizedtesting.rules.SystemPropertiesRestoreRule$1.evaluate(SystemPropertiesRestoreRule.java:57)
	at org.apache.lucene.util.TestRuleSetupTeardownChained$1.evaluate(TestRuleSetupTeardownChained.java:49)
	at org.apache.lucene.util.AbstractBeforeAfterRule$1.evaluate(AbstractBeforeAfterRule.java:45)
	at org.apache.lucene.util.TestRuleThreadAndTestName$1.evaluate(TestRuleThreadAndTestName.java:48)
	at org.apache.lucene.util.TestRuleIgnoreAfterMaxFailures$1.evaluate(TestRuleIgnoreAfterMaxFailures.java:64)
	at org.apache.lucene.util.TestRuleMarkFailure$1.evaluate(TestRuleMarkFailure.java:47)
	at com.carrotsearch.randomizedtesting.rules.StatementAdapter.evaluate(StatementAdapter.java:36)
	at com.carrotsearch.randomizedtesting.ThreadLeakControl$StatementRunner.run(ThreadLeakControl.java:368)
	at com.carrotsearch.randomizedtesting.ThreadLeakControl.forkTimeoutingTask(ThreadLeakControl.java:817)
	at com.carrotsearch.randomizedtesting.ThreadLeakControl$3.evaluate(ThreadLeakControl.java:468)
	at com.carrotsearch.randomizedtesting.RandomizedRunner.runSingleTest(RandomizedRunner.java:943)
	at com.carrotsearch.randomizedtesting.RandomizedRunner$5.evaluate(RandomizedRunner.java:829)
	at com.carrotsearch.randomizedtesting.RandomizedRunner$6.evaluate(RandomizedRunner.java:879)
	at com.carrotsearch.randomizedtesting.RandomizedRunner$7.evaluate(RandomizedRunner.java:890)
	at com.carrotsearch.randomizedtesting.rules.StatementAdapter.evaluate(StatementAdapter.java:36)
	at com.carrotsearch.randomizedtesting.rules.SystemPropertiesRestoreRule$1.evaluate(SystemPropertiesRestoreRule.java:57)
	at org.apache.lucene.util.AbstractBeforeAfterRule$1.evaluate(AbstractBeforeAfterRule.java:45)
	at com.carrotsearch.randomizedtesting.rules.StatementAdapter.evaluate(StatementAdapter.java:36)
	at org.apache.lucene.util.TestRuleStoreClassName$1.evaluate(TestRuleStoreClassName.java:41)
	at com.carrotsearch.randomizedtesting.rules.NoShadowingOrOverridesOnMethodsRule$1.evaluate(NoShadowingOrOverridesOnMethodsRule.java:40)
	at com.carrotsearch.randomizedtesting.rules.NoShadowingOrOverridesOnMethodsRule$1.evaluate(NoShadowingOrOverridesOnMethodsRule.java:40)
	at com.carrotsearch.randomizedtesting.rules.StatementAdapter.evaluate(StatementAdapter.java:36)
	at com.carrotsearch.randomizedtesting.rules.StatementAdapter.evaluate(StatementAdapter.java:36)
	at org.apache.lucene.util.TestRuleAssertionsRequired$1.evaluate(TestRuleAssertionsRequired.java:53)
	at org.apache.lucene.util.TestRuleMarkFailure$1.evaluate(TestRuleMarkFailure.java:47)
	at org.apache.lucene.util.TestRuleIgnoreAfterMaxFailures$1.evaluate(TestRuleIgnoreAfterMaxFailures.java:64)
	at org.apache.lucene.util.TestRuleIgnoreTestSuites$1.evaluate(TestRuleIgnoreTestSuites.java:54)
	at com.carrotsearch.randomizedtesting.rules.StatementAdapter.evaluate(StatementAdapter.java:36)
	at com.carrotsearch.randomizedtesting.ThreadLeakControl$StatementRunner.run(ThreadLeakControl.java:368)
	at java.base/java.lang.Thread.run(Thread.java:844)




Build Log:
[...truncated 12572 lines...]
   [junit4] Suite: org.apache.solr.cloud.FullSolrCloudDistribCmdsTest
   [junit4]   2> 1528557 INFO  (SUITE-FullSolrCloudDistribCmdsTest-seed#[2B150420ABF229A6]-worker) [    ] o.a.s.SolrTestCaseJ4 SecureRandom sanity checks: test.solr.allowed.securerandom=null & java.security.egd=file:/dev/./urandom
   [junit4]   2> Creating dataDir: /Users/jenkins/workspace/Lucene-Solr-master-MacOSX/solr/build/solr-core/test/J1/temp/solr.cloud.FullSolrCloudDistribCmdsTest_2B150420ABF229A6-001/init-core-data-001
   [junit4]   2> 1528558 WARN  (SUITE-FullSolrCloudDistribCmdsTest-seed#[2B150420ABF229A6]-worker) [    ] o.a.s.SolrTestCaseJ4 startTrackingSearchers: numOpens=2 numCloses=2
   [junit4]   2> 1528558 INFO  (SUITE-FullSolrCloudDistribCmdsTest-seed#[2B150420ABF229A6]-worker) [    ] o.a.s.SolrTestCaseJ4 Using PointFields (NUMERIC_POINTS_SYSPROP=true) w/NUMERIC_DOCVALUES_SYSPROP=false
   [junit4]   2> 1528558 INFO  (SUITE-FullSolrCloudDistribCmdsTest-seed#[2B150420ABF229A6]-worker) [    ] o.a.s.SolrTestCaseJ4 Randomized ssl (false) and clientAuth (false) via: @org.apache.solr.SolrTestCaseJ4$SuppressSSL(bugUrl="https://issues.apache.org/jira/browse/SOLR-5776") w/ MAC_OS_X supressed clientAuth
   [junit4]   2> 1528558 INFO  (SUITE-FullSolrCloudDistribCmdsTest-seed#[2B150420ABF229A6]-worker) [    ] o.a.s.BaseDistributedSearchTestCase Setting hostContext system property: /_ta/
   [junit4]   2> 1528559 INFO  (TEST-FullSolrCloudDistribCmdsTest.test-seed#[2B150420ABF229A6]) [    ] o.a.s.c.ZkTestServer STARTING ZK TEST SERVER
   [junit4]   2> 1528560 INFO  (Thread-1669) [    ] o.a.s.c.ZkTestServer client port:0.0.0.0/0.0.0.0:0
   [junit4]   2> 1528560 INFO  (Thread-1669) [    ] o.a.s.c.ZkTestServer Starting server
   [junit4]   2> 1528562 ERROR (Thread-1669) [    ] o.a.z.s.ZooKeeperServer ZKShutdownHandler is not registered, so ZooKeeper server won't take any action on ERROR or SHUTDOWN server state changes
   [junit4]   2> 1528666 INFO  (TEST-FullSolrCloudDistribCmdsTest.test-seed#[2B150420ABF229A6]) [    ] o.a.s.c.ZkTestServer start zk server on port:61747
   [junit4]   2> 1528676 INFO  (zkConnectionManagerCallback-1987-thread-1) [    ] o.a.s.c.c.ConnectionManager zkClient has connected
   [junit4]   2> 1528680 INFO  (zkConnectionManagerCallback-1989-thread-1) [    ] o.a.s.c.c.ConnectionManager zkClient has connected
   [junit4]   2> 1528688 INFO  (TEST-FullSolrCloudDistribCmdsTest.test-seed#[2B150420ABF229A6]) [    ] o.a.s.c.AbstractZkTestCase put /Users/jenkins/workspace/Lucene-Solr-master-MacOSX/solr/core/src/test-files/solr/collection1/conf/solrconfig-tlog.xml to /configs/conf1/solrconfig.xml
   [junit4]   2> 1528691 INFO  (TEST-FullSolrCloudDistribCmdsTest.test-seed#[2B150420ABF229A6]) [    ] o.a.s.c.AbstractZkTestCase put /Users/jenkins/workspace/Lucene-Solr-master-MacOSX/solr/core/src/test-files/solr/collection1/conf/schema15.xml to /configs/conf1/schema.xml
   [junit4]   2> 1528693 INFO  (TEST-FullSolrCloudDistribCmdsTest.test-seed#[2B150420ABF229A6]) [    ] o.a.s.c.AbstractZkTestCase put /Users/jenkins/workspace/Lucene-Solr-master-MacOSX/solr/core/src/test-files/solr/collection1/conf/solrconfig.snippet.randomindexconfig.xml to /configs/conf1/solrconfig.snippet.randomindexconfig.xml
   [junit4]   2> 1528695 INFO  (TEST-FullSolrCloudDistribCmdsTest.test-seed#[2B150420ABF229A6]) [    ] o.a.s.c.AbstractZkTestCase put /Users/jenkins/workspace/Lucene-Solr-master-MacOSX/solr/core/src/test-files/solr/collection1/conf/stopwords.txt to /configs/conf1/stopwords.txt
   [junit4]   2> 1528697 INFO  (TEST-FullSolrCloudDistribCmdsTest.test-seed#[2B150420ABF229A6]) [    ] o.a.s.c.AbstractZkTestCase put /Users/jenkins/workspace/Lucene-Solr-master-MacOSX/solr/core/src/test-files/solr/collection1/conf/protwords.txt to /configs/conf1/protwords.txt
   [junit4]   2> 1528699 INFO  (TEST-FullSolrCloudDistribCmdsTest.test-seed#[2B150420ABF229A6]) [    ] o.a.s.c.AbstractZkTestCase put /Users/jenkins/workspace/Lucene-Solr-master-MacOSX/solr/core/src/test-files/solr/collection1/conf/currency.xml to /configs/conf1/currency.xml
   [junit4]   2> 1528701 INFO  (TEST-FullSolrCloudDistribCmdsTest.test-seed#[2B150420ABF229A6]) [    ] o.a.s.c.AbstractZkTestCase put /Users/jenkins/workspace/Lucene-Solr-master-MacOSX/solr/core/src/test-files/solr/collection1/conf/enumsConfig.xml to /configs/conf1/enumsConfig.xml
   [junit4]   2> 1528703 INFO  (TEST-FullSolrCloudDistribCmdsTest.test-seed#[2B150420ABF229A6]) [    ] o.a.s.c.AbstractZkTestCase put /Users/jenkins/workspace/Lucene-Solr-master-MacOSX/solr/core/src/test-files/solr/collection1/conf/open-exchange-rates.json to /configs/conf1/open-exchange-rates.json
   [junit4]   2> 1528705 INFO  (TEST-FullSolrCloudDistribCmdsTest.test-seed#[2B150420ABF229A6]) [    ] o.a.s.c.AbstractZkTestCase put /Users/jenkins/workspace/Lucene-Solr-master-MacOSX/solr/core/src/test-files/solr/collection1/conf/mapping-ISOLatin1Accent.txt to /configs/conf1/mapping-ISOLatin1Accent.txt
   [junit4]   2> 1528707 INFO  (TEST-FullSolrCloudDistribCmdsTest.test-seed#[2B150420ABF229A6]) [    ] o.a.s.c.AbstractZkTestCase put /Users/jenkins/workspace/Lucene-Solr-master-MacOSX/solr/core/src/test-files/solr/collection1/conf/old_synonyms.txt to /configs/conf1/old_synonyms.txt
   [junit4]   2> 1528709 INFO  (TEST-FullSolrCloudDistribCmdsTest.test-seed#[2B150420ABF229A6]) [    ] o.a.s.c.AbstractZkTestCase put /Users/jenkins/workspace/Lucene-Solr-master-MacOSX/solr/core/src/test-files/solr/collection1/conf/synonyms.txt to /configs/conf1/synonyms.txt
   [junit4]   2> 1528712 INFO  (TEST-FullSolrCloudDistribCmdsTest.test-seed#[2B150420ABF229A6]) [    ] o.a.s.c.AbstractFullDistribZkTestBase Will use NRT replicas unless explicitly asked otherwise
   [junit4]   2> 1528992 INFO  (TEST-FullSolrCloudDistribCmdsTest.test-seed#[2B150420ABF229A6]) [    ] o.e.j.s.Server jetty-9.4.8.v20171121, build timestamp: 2017-11-22T11:27:37+14:00, git hash: 82b8fb23f757335bb3329d540ce37a2a2615f0a8
   [junit4]   2> 1528993 INFO  (TEST-FullSolrCloudDistribCmdsTest.test-seed#[2B150420ABF229A6]) [    ] o.e.j.s.session DefaultSessionIdManager workerName=node0
   [junit4]   2> 1528993 INFO  (TEST-FullSolrCloudDistribCmdsTest.test-seed#[2B150420ABF229A6]) [    ] o.e.j.s.session No SessionScavenger set, using defaults
   [junit4]   2> 1528993 INFO  (TEST-FullSolrCloudDistribCmdsTest.test-seed#[2B150420ABF229A6]) [    ] o.e.j.s.session Scavenging every 660000ms
   [junit4]   2> 1528993 INFO  (TEST-FullSolrCloudDistribCmdsTest.test-seed#[2B150420ABF229A6]) [    ] o.e.j.s.h.ContextHandler Started o.e.j.s.ServletContextHandler@12b4d29e{/_ta,null,AVAILABLE}
   [junit4]   2> 1528993 INFO  (TEST-FullSolrCloudDistribCmdsTest.test-seed#[2B150420ABF229A6]) [    ] o.e.j.s.AbstractConnector Started ServerConnector@1e4cb569{HTTP/1.1,[http/1.1]}{127.0.0.1:61753}
   [junit4]   2> 1528993 INFO  (TEST-FullSolrCloudDistribCmdsTest.test-seed#[2B150420ABF229A6]) [    ] o.e.j.s.Server Started @1530976ms
   [junit4]   2> 1528993 INFO  (TEST-FullSolrCloudDistribCmdsTest.test-seed#[2B150420ABF229A6]) [    ] o.a.s.c.s.e.JettySolrRunner Jetty properties: {hostContext=/_ta, solr.data.dir=/Users/jenkins/workspace/Lucene-Solr-master-MacOSX/solr/build/solr-core/test/J1/temp/solr.cloud.FullSolrCloudDistribCmdsTest_2B150420ABF229A6-001/tempDir-001/control/data, hostPort=61753, coreRootDirectory=/Users/jenkins/workspace/Lucene-Solr-master-MacOSX/solr/build/solr-core/test/J1/../../../../../../../../../Users/jenkins/workspace/Lucene-Solr-master-MacOSX/solr/build/solr-core/test/J1/temp/solr.cloud.FullSolrCloudDistribCmdsTest_2B150420ABF229A6-001/control-001/cores}
   [junit4]   2> 1528993 ERROR (TEST-FullSolrCloudDistribCmdsTest.test-seed#[2B150420ABF229A6]) [    ] o.a.s.u.StartupLoggingUtils Missing Java Option solr.log.dir. Logging may be missing or incomplete.
   [junit4]   2> 1528993 INFO  (TEST-FullSolrCloudDistribCmdsTest.test-seed#[2B150420ABF229A6]) [    ] o.a.s.s.SolrDispatchFilter  ___      _       Welcome to Apache Solr™ version 8.0.0
   [junit4]   2> 1528993 INFO  (TEST-FullSolrCloudDistribCmdsTest.test-seed#[2B150420ABF229A6]) [    ] o.a.s.s.SolrDispatchFilter / __| ___| |_ _   Starting in cloud mode on port null
   [junit4]   2> 1528993 INFO  (TEST-FullSolrCloudDistribCmdsTest.test-seed#[2B150420ABF229A6]) [    ] o.a.s.s.SolrDispatchFilter \__ \/ _ \ | '_|  Install dir: null
   [junit4]   2> 1528993 INFO  (TEST-FullSolrCloudDistribCmdsTest.test-seed#[2B150420ABF229A6]) [    ] o.a.s.s.SolrDispatchFilter |___/\___/_|_|    Start time: 2018-01-27T11:09:00.092661Z
   [junit4]   2> 1528998 INFO  (zkConnectionManagerCallback-1991-thread-1) [    ] o.a.s.c.c.ConnectionManager zkClient has connected
   [junit4]   2> 1528999 INFO  (TEST-FullSolrCloudDistribCmdsTest.test-seed#[2B150420ABF229A6]) [    ] o.a.s.s.SolrDispatchFilter Loading solr.xml from SolrHome (not found in ZooKeeper)
   [junit4]   2> 1528999 INFO  (TEST-FullSolrCloudDistribCmdsTest.test-seed#[2B150420ABF229A6]) [    ] o.a.s.c.SolrXmlConfig Loading container configuration from /Users/jenkins/workspace/Lucene-Solr-master-MacOSX/solr/build/solr-core/test/J1/temp/solr.cloud.FullSolrCloudDistribCmdsTest_2B150420ABF229A6-001/control-001/solr.xml
   [junit4]   2> 1529000 INFO  (TEST-FullSolrCloudDistribCmdsTest.test-seed#[2B150420ABF229A6]) [    ] o.a.s.c.SolrXmlConfig Configuration parameter autoReplicaFailoverWorkLoopDelay is ignored
   [junit4]   2> 1529001 INFO  (TEST-FullSolrCloudDistribCmdsTest.test-seed#[2B150420ABF229A6]) [    ] o.a.s.c.SolrXmlConfig Configuration parameter autoReplicaFailoverBadNodeExpiration is ignored
   [junit4]   2> 1529001 INFO  (TEST-FullSolrCloudDistribCmdsTest.test-seed#[2B150420ABF229A6]) [    ] o.a.s.c.SolrXmlConfig MBean server found: com.sun.jmx.mbeanserver.JmxMBeanServer@cb64a06, but no JMX reporters were configured - adding default JMX reporter.
   [junit4]   2> 1529005 INFO  (TEST-FullSolrCloudDistribCmdsTest.test-seed#[2B150420ABF229A6]) [    ] o.a.s.c.ZkContainer Zookeeper client=127.0.0.1:61747/solr
   [junit4]   2> 1529006 INFO  (zkConnectionManagerCallback-1995-thread-1) [    ] o.a.s.c.c.ConnectionManager zkClient has connected
   [junit4]   2> 1529010 INFO  (zkConnectionManagerCallback-1997-thread-1-processing-n:127.0.0.1:61753__ta) [n:127.0.0.1:61753__ta    ] o.a.s.c.c.ConnectionManager zkClient has connected
   [junit4]   2> 1529164 INFO  (TEST-FullSolrCloudDistribCmdsTest.test-seed#[2B150420ABF229A6]) [n:127.0.0.1:61753__ta    ] o.a.s.c.Overseer Overseer (id=null) closing
   [junit4]   2> 1529165 INFO  (TEST-FullSolrCloudDistribCmdsTest.test-seed#[2B150420ABF229A6]) [n:127.0.0.1:61753__ta    ] o.a.s.c.OverseerElectionContext I am going to be the leader 127.0.0.1:61753__ta
   [junit4]   2> 1529166 INFO  (TEST-FullSolrCloudDistribCmdsTest.test-seed#[2B150420ABF229A6]) [n:127.0.0.1:61753__ta    ] o.a.s.c.Overseer Overseer (id=99421476596023300-127.0.0.1:61753__ta-n_0000000000) starting
   [junit4]   2> 1529175 INFO  (TEST-FullSolrCloudDistribCmdsTest.test-seed#[2B150420ABF229A6]) [n:127.0.0.1:61753__ta    ] o.a.s.c.ZkController Register node as live in ZooKeeper:/live_nodes/127.0.0.1:61753__ta
   [junit4]   2> 1529177 INFO  (zkCallback-1996-thread-1-processing-n:127.0.0.1:61753__ta) [n:127.0.0.1:61753__ta    ] o.a.s.c.c.ZkStateReader Updated live nodes from ZooKeeper... (0) -> (1)
   [junit4]   2> 1529244 INFO  (TEST-FullSolrCloudDistribCmdsTest.test-seed#[2B150420ABF229A6]) [n:127.0.0.1:61753__ta    ] o.a.s.m.r.SolrJmxReporter JMX monitoring for 'solr.node' (registry 'solr.node') enabled at server: com.sun.jmx.mbeanserver.JmxMBeanServer@cb64a06
   [junit4]   2> 1529253 INFO  (TEST-FullSolrCloudDistribCmdsTest.test-seed#[2B150420ABF229A6]) [n:127.0.0.1:61753__ta    ] o.a.s.m.r.SolrJmxReporter JMX monitoring for 'solr.jvm' (registry 'solr.jvm') enabled at server: com.sun.jmx.mbeanserver.JmxMBeanServer@cb64a06
   [junit4]   2> 1529253 INFO  (TEST-FullSolrCloudDistribCmdsTest.test-seed#[2B150420ABF229A6]) [n:127.0.0.1:61753__ta    ] o.a.s.m.r.SolrJmxReporter JMX monitoring for 'solr.jetty' (registry 'solr.jetty') enabled at server: com.sun.jmx.mbeanserver.JmxMBeanServer@cb64a06
   [junit4]   2> 1529255 INFO  (TEST-FullSolrCloudDistribCmdsTest.test-seed#[2B150420ABF229A6]) [n:127.0.0.1:61753__ta    ] o.a.s.c.CorePropertiesLocator Found 0 core definitions underneath /Users/jenkins/workspace/Lucene-Solr-master-MacOSX/solr/build/solr-core/test/J1/../../../../../../../../../Users/jenkins/workspace/Lucene-Solr-master-MacOSX/solr/build/solr-core/test/J1/temp/solr.cloud.FullSolrCloudDistribCmdsTest_2B150420ABF229A6-001/control-001/cores
   [junit4]   2> 1529269 INFO  (zkConnectionManagerCallback-2003-thread-1) [    ] o.a.s.c.c.ConnectionManager zkClient has connected
   [junit4]   2> 1529270 INFO  (TEST-FullSolrCloudDistribCmdsTest.test-seed#[2B150420ABF229A6]) [    ] o.a.s.c.c.ZkStateReader Updated live nodes from ZooKeeper... (0) -> (1)
   [junit4]   2> 1529272 INFO  (TEST-FullSolrCloudDistribCmdsTest.test-seed#[2B150420ABF229A6]) [    ] o.a.s.c.s.i.ZkClientClusterStateProvider Cluster at 127.0.0.1:61747/solr ready
   [junit4]   2> 1529274 INFO  (qtp1696281420-11001) [n:127.0.0.1:61753__ta    ] o.a.s.h.a.CollectionsHandler Invoked Collection Action :create with params replicationFactor=1&collection.configName=conf1&name=control_collection&nrtReplicas=1&action=CREATE&numShards=1&createNodeSet=127.0.0.1:61753__ta&wt=javabin&version=2 and sendToOCPQueue=true
   [junit4]   2> 1529277 INFO  (OverseerThreadFactory-3973-thread-1-processing-n:127.0.0.1:61753__ta) [n:127.0.0.1:61753__ta    ] o.a.s.c.a.c.CreateCollectionCmd Create collection control_collection
   [junit4]   2> 1529386 INFO  (qtp1696281420-11005) [n:127.0.0.1:61753__ta    ] o.a.s.h.a.CoreAdminOperation core create command qt=/admin/cores&collection.configName=conf1&newCollection=true&name=control_collection_shard1_replica_n1&action=CREATE&numShards=1&collection=control_collection&shard=shard1&wt=javabin&version=2&replicaType=NRT
   [junit4]   2> 1529387 INFO  (qtp1696281420-11005) [n:127.0.0.1:61753__ta    ] o.a.s.c.TransientSolrCoreCacheDefault Allocating transient cache for 4 transient cores
   [junit4]   2> 1529493 INFO  (zkCallback-1996-thread-1-processing-n:127.0.0.1:61753__ta) [n:127.0.0.1:61753__ta    ] o.a.s.c.c.ZkStateReader A cluster state change: [WatchedEvent state:SyncConnected type:NodeDataChanged path:/collections/control_collection/state.json] for collection [control_collection] has occurred - updating... (live nodes size: [1])
   [junit4]   2> 1530405 INFO  (qtp1696281420-11005) [n:127.0.0.1:61753__ta c:control_collection s:shard1  x:control_collection_shard1_replica_n1] o.a.s.c.SolrConfig Using Lucene MatchVersion: 8.0.0
   [junit4]   2> 1530412 INFO  (qtp1696281420-11005) [n:127.0.0.1:61753__ta c:control_collection s:shard1  x:control_collection_shard1_replica_n1] o.a.s.s.IndexSchema [control_collection_shard1_replica_n1] Schema name=test
   [junit4]   2> 1530464 INFO  (qtp1696281420-11005) [n:127.0.0.1:61753__ta c:control_collection s:shard1  x:control_collection_shard1_replica_n1] o.a.s.s.IndexSchema Loaded schema test/1.6 with uniqueid field id
   [junit4]   2> 1530483 INFO  (qtp1696281420-11005) [n:127.0.0.1:61753__ta c:control_collection s:shard1  x:control_collection_shard1_replica_n1] o.a.s.c.CoreContainer Creating SolrCore 'control_collection_shard1_replica_n1' using configuration from collection control_collection, trusted=true
   [junit4]   2> 1530484 INFO  (qtp1696281420-11005) [n:127.0.0.1:61753__ta c:control_collection s:shard1  x:control_collection_shard1_replica_n1] o.a.s.m.r.SolrJmxReporter JMX monitoring for 'solr.core.control_collection.shard1.replica_n1' (registry 'solr.core.control_collection.shard1.replica_n1') enabled at server: com.sun.jmx.mbeanserver.JmxMBeanServer@cb64a06
   [junit4]   2> 1530484 INFO  (qtp1696281420-11005) [n:127.0.0.1:61753__ta c:control_collection s:shard1  x:control_collection_shard1_replica_n1] o.a.s.c.SolrCore solr.RecoveryStrategy.Builder
   [junit4]   2> 1530484 INFO  (qtp1696281420-11005) [n:127.0.0.1:61753__ta c:control_collection s:shard1  x:control_collection_shard1_replica_n1] o.a.s.c.SolrCore [[control_collection_shard1_replica_n1] ] Opening new SolrCore at [/Users/jenkins/workspace/Lucene-Solr-master-MacOSX/solr/build/solr-core/test/J1/temp/solr.cloud.FullSolrCloudDistribCmdsTest_2B150420ABF229A6-001/control-001/cores/control_collection_shard1_replica_n1], dataDir=[/Users/jenkins/workspace/Lucene-Solr-master-MacOSX/solr/build/solr-core/test/J1/../../../../../../../../../Users/jenkins/workspace/Lucene-Solr-master-MacOSX/solr/build/solr-core/test/J1/temp/solr.cloud.FullSolrCloudDistribCmdsTest_2B150420ABF229A6-001/control-001/cores/control_collection_shard1_replica_n1/data/]
   [junit4]   2> 1530486 INFO  (qtp1696281420-11005) [n:127.0.0.1:61753__ta c:control_collection s:shard1  x:control_collection_shard1_replica_n1] o.a.s.u.RandomMergePolicy RandomMergePolicy wrapping class org.apache.lucene.index.TieredMergePolicy: [TieredMergePolicy: maxMergeAtOnce=17, maxMergeAtOnceExplicit=46, maxMergedSegmentMB=44.90625, floorSegmentMB=2.1748046875, forceMergeDeletesPctAllowed=17.118262385358864, segmentsPerTier=39.0, maxCFSSegmentSizeMB=8.796093022207999E12, noCFSRatio=0.41266757696283385
   [junit4]   2> 1530488 WARN  (qtp1696281420-11005) [n:127.0.0.1:61753__ta c:control_collection s:shard1  x:control_collection_shard1_replica_n1] o.a.s.c.RequestHandlers INVALID paramSet a in requestHandler {type = requestHandler,name = /dump,class = DumpRequestHandler,attributes = {initParams=a, name=/dump, class=DumpRequestHandler},args = {defaults={a=A,b=B}}}
   [junit4]   2> 1530521 INFO  (qtp1696281420-11005) [n:127.0.0.1:61753__ta c:control_collection s:shard1  x:control_collection_shard1_replica_n1] o.a.s.u.UpdateHandler Using UpdateLog implementation: org.apache.solr.update.UpdateLog
   [junit4]   2> 1530521 INFO  (qtp1696281420-11005) [n:127.0.0.1:61753__ta c:control_collection s:shard1  x:control_collection_shard1_replica_n1] o.a.s.u.UpdateLog Initializing UpdateLog: dataDir= defaultSyncLevel=FLUSH numRecordsToKeep=100 maxNumLogsToKeep=10 numVersionBuckets=65536
   [junit4]   2> 1530522 INFO  (qtp1696281420-11005) [n:127.0.0.1:61753__ta c:control_collection s:shard1  x:control_collection_shard1_replica_n1] o.a.s.u.CommitTracker Hard AutoCommit: disabled
   [junit4]   2> 1530522 INFO  (qtp1696281420-11005) [n:127.0.0.1:61753__ta c:control_collection s:shard1  x:control_collection_shard1_replica_n1] o.a.s.u.CommitTracker Soft AutoCommit: disabled
   [junit4]   2> 1530523 INFO  (qtp1696281420-11005) [n:127.0.0.1:61753__ta c:control_collection s:shard1  x:control_collection_shard1_replica_n1] o.a.s.u.RandomMergePolicy RandomMergePolicy wrapping class org.apache.lucene.index.TieredMergePolicy: [TieredMergePolicy: maxMergeAtOnce=26, maxMergeAtOnceExplicit=23, maxMergedSegmentMB=96.369140625, floorSegmentMB=2.1884765625, forceMergeDeletesPctAllowed=29.25245235511709, segmentsPerTier=42.0, maxCFSSegmentSizeMB=8.796093022207999E12, noCFSRatio=0.24394702053507686
   [junit4]   2> 1530523 INFO  (qtp1696281420-11005) [n:127.0.0.1:61753__ta c:control_collection s:shard1  x:control_collection_shard1_replica_n1] o.a.s.s.SolrIndexSearcher Opening [Searcher@69a43077[control_collection_shard1_replica_n1] main]
   [junit4]   2> 1530524 INFO  (qtp1696281420-11005) [n:127.0.0.1:61753__ta c:control_collection s:shard1  x:control_collection_shard1_replica_n1] o.a.s.r.ManagedResourceStorage Configured ZooKeeperStorageIO with znodeBase: /configs/conf1
   [junit4]   2> 1530525 INFO  (qtp1696281420-11005) [n:127.0.0.1:61753__ta c:control_collection s:shard1  x:control_collection_shard1_replica_n1] o.a.s.r.ManagedResourceStorage Loaded null at path _rest_managed.json using ZooKeeperStorageIO:path=/configs/conf1
   [junit4]   2> 1530525 INFO  (qtp1696281420-11005) [n:127.0.0.1:61753__ta c:control_collection s:shard1  x:control_collection_shard1_replica_n1] o.a.s.h.ReplicationHandler Commits will be reserved for 10000ms.
   [junit4]   2> 1530526 INFO  (qtp1696281420-11005) [n:127.0.0.1:61753__ta c:control_collection s:shard1  x:control_collection_shard1_replica_n1] o.a.s.u.UpdateLog Could not find max version in index or recent updates, using new clock 1590743627595776000
   [junit4]   2> 1530526 INFO  (searcherExecutor-3976-thread-1-processing-n:127.0.0.1:61753__ta x:control_collection_shard1_replica_n1 s:shard1 c:control_collection) [n:127.0.0.1:61753__ta c:control_collection s:shard1  x:control_collection_shard1_replica_n1] o.a.s.c.SolrCore [control_collection_shard1_replica_n1] Registered new searcher Searcher@69a43077[control_collection_shard1_replica_n1] main{ExitableDirectoryReader(UninvertingDirectoryReader())}
   [junit4]   2> 1530531 INFO  (qtp1696281420-11005) [n:127.0.0.1:61753__ta c:control_collection s:shard1  x:control_collection_shard1_replica_n1] o.a.s.c.ShardLeaderElectionContext Enough replicas found to continue.
   [junit4]   2> 1530531 INFO  (qtp1696281420-11005) [n:127.0.0.1:61753__ta c:control_collection s:shard1  x:control_collection_shard1_replica_n1] o.a.s.c.ShardLeaderElectionContext I may be the new leader - try and sync
   [junit4]   2> 1530531 INFO  (qtp1696281420-11005) [n:127.0.0.1:61753__ta c:control_collection s:shard1  x:control_collection_shard1_replica_n1] o.a.s.c.SyncStrategy Sync replicas to http://127.0.0.1:61753/_ta/control_collection_shard1_replica_n1/
   [junit4]   2> 1530531 INFO  (qtp1696281420-11005) [n:127.0.0.1:61753__ta c:control_collection s:shard1  x:control_collection_shard1_replica_n1] o.a.s.c.SyncStrategy Sync Success - now sync replicas to me
   [junit4]   2> 1530531 INFO  (qtp1696281420-11005) [n:127.0.0.1:61753__ta c:control_collection s:shard1  x:control_collection_shard1_replica_n1] o.a.s.c.SyncStrategy http://127.0.0.1:61753/_ta/control_collection_shard1_replica_n1/ has no replicas
   [junit4]   2> 1530531 INFO  (qtp1696281420-11005) [n:127.0.0.1:61753__ta c:control_collection s:shard1  x:control_collection_shard1_replica_n1] o.a.s.c.ShardLeaderElectionContext Found all replicas participating in election, clear LIR
   [junit4]   2> 1530536 INFO  (qtp1696281420-11005) [n:127.0.0.1:61753__ta c:control_collection s:shard1  x:control_collection_shard1_replica_n1] o.a.s.c.ShardLeaderElectionContext I am the new leader: http://127.0.0.1:61753/_ta/control_collection_shard1_replica_n1/ shard1
   [junit4]   2> 1530643 INFO  (zkCallback-1996-thread-1-processing-n:127.0.0.1:61753__ta) [n:127.0.0.1:61753__ta    ] o.a.s.c.c.ZkStateReader A cluster state change: [WatchedEvent state:SyncConnected type:NodeDataChanged path:/collections/control_collection/state.json] for collection [control_collection] has occurred - updating... (live nodes size: [1])
   [junit4]   2> 1530644 INFO  (qtp1696281420-11005) [n:127.0.0.1:61753__ta c:control_collection s:shard1  x:control_collection_shard1_replica_n1] o.a.s.c.ZkController I am the leader, no recovery necessary
   [junit4]   2> 1530646 INFO  (qtp1696281420-11005) [n:127.0.0.1:61753__ta c:control_collection s:shard1  x:control_collection_shard1_replica_n1] o.a.s.s.HttpSolrCall [admin] webapp=null path=/admin/cores params={qt=/admin/cores&collection.configName=conf1&newCollection=true&name=control_collection_shard1_replica_n1&action=CREATE&numShards=1&collection=control_collection&shard=shard1&wt=javabin&version=2&replicaType=NRT} status=0 QTime=1259
   [junit4]   2> 1530649 INFO  (qtp1696281420-11001) [n:127.0.0.1:61753__ta    ] o.a.s.h.a.CollectionsHandler Wait for new collection to be active for at most 30 seconds. Check all shard replicas
   [junit4]   2> 1530755 INFO  (zkCallback-1996-thread-1-processing-n:127.0.0.1:61753__ta) [n:127.0.0.1:61753__ta    ] o.a.s.c.c.ZkStateReader A cluster state change: [WatchedEvent state:SyncConnected type:NodeDataChanged path:/collections/control_collection/state.json] for collection [control_collection] has occurred - updating... (live nodes size: [1])
   [junit4]   2> 1531285 INFO  (OverseerCollectionConfigSetProcessor-99421476596023300-127.0.0.1:61753__ta-n_0000000000) [n:127.0.0.1:61753__ta    ] o.a.s.c.OverseerTaskQueue Response ZK path: /overseer/collection-queue-work/qnr-0000000000 doesn't exist.  Requestor may have disconnected from ZooKeeper
   [junit4]   2> 1531651 INFO  (qtp1696281420-11001) [n:127.0.0.1:61753__ta    ] o.a.s.s.HttpSolrCall [admin] webapp=null path=/admin/collections params={replicationFactor=1&collection.configName=conf1&name=control_collection&nrtReplicas=1&action=CREATE&numShards=1&createNodeSet=127.0.0.1:61753__ta&wt=javabin&version=2} status=0 QTime=2377
   [junit4]   2> 1531655 INFO  (zkConnectionManagerCallback-2007-thread-1) [    ] o.a.s.c.c.ConnectionManager zkClient has connected
   [junit4]   2> 1531656 INFO  (TEST-FullSolrCloudDistribCmdsTest.test-seed#[2B150420ABF229A6]) [    ] o.a.s.c.c.ZkStateReader Updated live nodes from ZooKeeper... (0) -> (1)
   [junit4]   2> 1531658 INFO  (TEST-FullSolrCloudDistribCmdsTest.test-seed#[2B150420ABF229A6]) [    ] o.a.s.c.s.i.ZkClientClusterStateProvider Cluster at 127.0.0.1:61747/solr ready
   [junit4]   2> 1531658 INFO  (TEST-FullSolrCloudDistribCmdsTest.test-seed#[2B150420ABF229A6]) [    ] o.a.s.c.ChaosMonkey monkey: init - expire sessions:false cause connection loss:false
   [junit4]   2> 1531659 INFO  (qtp1696281420-11005) [n:127.0.0.1:61753__ta    ] o.a.s.h.a.CollectionsHandler Invoked Collection Action :create with params replicationFactor=1&collection.configName=conf1&name=collection1&nrtReplicas=1&action=CREATE&numShards=3&createNodeSet=&stateFormat=1&wt=javabin&version=2 and sendToOCPQueue=true
   [junit4]   2> 1531662 INFO  (OverseerThreadFactory-3973-thread-2-processing-n:127.0.0.1:61753__ta) [n:127.0.0.1:61753__ta    ] o.a.s.c.a.c.CreateCollectionCmd Create collection collection1
   [junit4]   2> 1531663 WARN  (OverseerThreadFactory-3973-thread-2-processing-n:127.0.0.1:61753__ta) [n:127.0.0.1:61753__ta    ] o.a.s.c.a.c.CreateCollectionCmd It is unusual to create a collection (collection1) without cores.
   [junit4]   2> 1531878 INFO  (qtp1696281420-11005) [n:127.0.0.1:61753__ta    ] o.a.s.h.a.CollectionsHandler Wait for new collection to be active for at most 30 seconds. Check all shard replicas
   [junit4]   2> 1531878 INFO  (qtp1696281420-11005) [n:127.0.0.1:61753__ta    ] o.a.s.s.HttpSolrCall [admin] webapp=null path=/admin/collections params={replicationFactor=1&collection.configName=conf1&name=collection1&nrtReplicas=1&action=CREATE&numShards=3&createNodeSet=&stateFormat=1&wt=javabin&version=2} status=0 QTime=219
   [junit4]   2> 1532078 INFO  (TEST-FullSolrCloudDistribCmdsTest.test-seed#[2B150420ABF229A6]) [    ] o.a.s.c.AbstractFullDistribZkTestBase create jetty 1 in directory /Users/jenkins/workspace/Lucene-Solr-master-MacOSX/solr/build/solr-core/test/J1/temp/solr.cloud.FullSolrCloudDistribCmdsTest_2B150420ABF229A6-001/shard-1-001 of type NRT
   [junit4]   2> 1532078 INFO  (TEST-FullSolrCloudDistribCmdsTest.test-seed#[2B150420ABF229A6]) [    ] o.e.j.s.Server jetty-9.4.8.v20171121, build timestamp: 2017-11-22T11:27:37+14:00, git hash: 82b8fb23f757335bb3329d540ce37a2a2615f0a8
   [junit4]   2> 1532080 INFO  (TEST-FullSolrCloudDistribCmdsTest.test-seed#[2B150420ABF229A6]) [    ] o.e.j.s.session DefaultSessionIdManager workerName=node0
   [junit4]   2> 1532080 INFO  (TEST-FullSolrCloudDistribCmdsTest.test-seed#[2B150420ABF229A6]) [    ] o.e.j.s.session No SessionScavenger set, using defaults
   [junit4]   2> 1532080 INFO  (TEST-FullSolrCloudDistribCmdsTest.test-seed#[2B150420ABF229A6]) [    ] o.e.j.s.session Scavenging every 600000ms
   [junit4]   2> 1532080 INFO  (TEST-FullSolrCloudDistribCmdsTest.test-seed#[2B150420ABF229A6]) [    ] o.e.j.s.h.ContextHandler Started o.e.j.s.ServletContextHandler@69f78a31{/_ta,null,AVAILABLE}
   [junit4]   2> 1532080 INFO  (TEST-FullSolrCloudDistribCmdsTest.test-seed#[2B150420ABF229A6]) [    ] o.e.j.s.AbstractConnector Started ServerConnector@16faa8aa{HTTP/1.1,[http/1.1]}{127.0.0.1:61773}
   [junit4]   2> 1532080 INFO  (TEST-FullSolrCloudDistribCmdsTest.test-seed#[2B150420ABF229A6]) [    ] o.e.j.s.Server Started @1534063ms
   [junit4]   2> 1532080 INFO  (TEST-FullSolrCloudDistribCmdsTest.test-seed#[2B150420ABF229A6]) [    ] o.a.s.c.s.e.JettySolrRunner Jetty properties: {hostContext=/_ta, solrconfig=solrconfig.xml, solr.data.dir=/Users/jenkins/workspace/Lucene-Solr-master-MacOSX/solr/build/solr-core/test/J1/temp/solr.cloud.FullSolrCloudDistribCmdsTest_2B150420ABF229A6-001/tempDir-001/jetty1, hostPort=61773, coreRootDirectory=/Users/jenkins/workspace/Lucene-Solr-master-MacOSX/solr/build/solr-core/test/J1/temp/solr.cloud.FullSolrCloudDistribCmdsTest_2B150420ABF229A6-001/shard-1-001/cores, replicaType=NRT}
   [junit4]   2> 1532080 ERROR (TEST-FullSolrCloudDistribCmdsTest.test-seed#[2B150420ABF229A6]) [    ] o.a.s.u.StartupLoggingUtils Missing Java Option solr.log.dir. Logging may be missing or incomplete.
   [junit4]   2> 1532081 INFO  (TEST-FullSolrCloudDistribCmdsTest.test-seed#[2B150420ABF229A6]) [    ] o.a.s.s.SolrDispatchFilter  ___      _       Welcome to Apache Solr™ version 8.0.0
   [junit4]   2> 1532081 INFO  (TEST-FullSolrCloudDistribCmdsTest.test-seed#[2B150420ABF229A6]) [    ] o.a.s.s.SolrDispatchFilter / __| ___| |_ _   Starting in cloud mode on port null
   [junit4]   2> 1532081 INFO  (TEST-FullSolrCloudDistribCmdsTest.test-seed#[2B150420ABF229A6]) [    ] o.a.s.s.SolrDispatchFilter \__ \/ _ \ | '_|  Install dir: null
   [junit4]   2> 1532081 INFO  (TEST-FullSolrCloudDistribCmdsTest.test-seed#[2B150420ABF229A6]) [    ] o.a.s.s.SolrDispatchFilter |___/\___/_|_|    Start time: 2018-01-27T11:09:03.180187Z
   [junit4]   2> 1532082 INFO  (zkConnectionManagerCallback-2009-thread-1) [    ] o.a.s.c.c.ConnectionManager zkClient has connected
   [junit4]   2> 1532083 INFO  (TEST-FullSolrCloudDistribCmdsTest.test-seed#[2B150420ABF229A6]) [    ] o.a.s.s.SolrDispatchFilter Loading solr.xml from SolrHome (not found in ZooKeeper)
   [junit4]   2> 1532083 INFO  (TEST-FullSolrCloudDistribCmdsTest.test-seed#[2B150420ABF229A6]) [    ] o.a.s.c.SolrXmlConfig Loading container configuration from /Users/jenkins/workspace/Lucene-Solr-master-MacOSX/solr/build/solr-core/test/J1/temp/solr.cloud.FullSolrCloudDistribCmdsTest_2B150420ABF229A6-001/shard-1-001/solr.xml
   [junit4]   2> 1532085 INFO  (TEST-FullSolrCloudDistribCmdsTest.test-seed#[2B150420ABF229A6]) [    ] o.a.s.c.SolrXmlConfig Configuration parameter autoReplicaFailoverWorkLoopDelay is ignored
   [junit4]   2> 1532085 INFO  (TEST-FullSolrCloudDistribCmdsTest.test-seed#[2B150420ABF229A6]) [    ] o.a.s.c.SolrXmlConfig Configuration parameter autoReplicaFailoverBadNodeExpiration is ignored
   [junit4]   2> 1532092 INFO  (TEST-FullSolrCloudDistribCmdsTest.test-seed#[2B150420ABF229A6]) [    ] o.a.s.c.SolrXmlConfig MBean server found: com.sun.jmx.mbeanserver.JmxMBeanServer@cb64a06, but no JMX reporters were configured - adding default JMX reporter.
   [junit4]   2> 1532094 INFO  (TEST-FullSolrCloudDistribCmdsTest.test-seed#[2B150420ABF229A6]) [    ] o.a.s.c.ZkContainer Zookeeper client=127.0.0.1:61747/solr
   [junit4]   2> 1532095 INFO  (zkConnectionManagerCallback-2013-thread-1) [    ] o.a.s.c.c.ConnectionManager zkClient has connected
   [junit4]   2> 1532098 INFO  (zkConnectionManagerCallback-2015-thread-1-processing-n:127.0.0.1:61773__ta) [n:127.0.0.1:61773__ta    ] o.a.s.c.c.ConnectionManager zkClient has connected
   [junit4]   2> 1532107 INFO  (TEST-FullSolrCloudDistribCmdsTest.test-seed#[2B150420ABF229A6]) [n:127.0.0.1:61773__ta    ] o.a.s.c.c.ZkStateReader Updated live nodes from ZooKeeper... (0) -> (1)
   [junit4]   2> 1532110 INFO  (TEST-FullSolrCloudDistribCmdsTest.test-seed#[2B150420ABF229A6]) [n:127.0.0.1:61773__ta    ] o.a.s.c.Overseer Overseer (id=null) closing
   [junit4]   2> 1532114 INFO  (TEST-FullSolrCloudDistribCmdsTest.test-seed#[2B150420ABF229A6]) [n:127.0.0.1:61773__ta    ] o.a.s.c.ZkController Register node as live in ZooKeeper:/live_nodes/127.0.0.1:61773__ta
   [junit4]   2> 1532115 INFO  (zkCallback-1996-thread-1-processing-n:127.0.0.1:61753__ta) [n:127.0.0.1:61753__ta    ] o.a.s.c.c.ZkStateReader Updated live nodes from ZooKeeper... (1) -> (2)
   [junit4]   2> 1532115 INFO  (zkCallback-2006-thread-1) [    ] o.a.s.c.c.ZkStateReader Updated live nodes from ZooKeeper... (1) -> (2)
   [junit4]   2> 1532116 INFO  (zkCallback-2014-thread-1-processing-n:127.0.0.1:61773__ta) [n:127.0.0.1:61773__ta    ] o.a.s.c.c.ZkStateReader Updated live nodes from ZooKeeper... (1) -> (2)
   [junit4]   2> 1532146 INFO  (TEST-FullSolrCloudDistribCmdsTest.test-seed#[2B150420ABF229A6]) [n:127.0.0.1:61773__ta    ] o.a.s.m.r.SolrJmxReporter JMX monitoring for 'solr.node' (registry 'solr.node') enabled at server: com.sun.jmx.mbeanserver.JmxMBeanServer@cb64a06
   [junit4]   2> 1532156 INFO  (TEST-FullSolrCloudDistribCmdsTest.test-seed#[2B150420ABF229A6]) [n:127.0.0.1:61773__ta    ] o.a.s.m.r.SolrJmxReporter JMX monitoring for 'solr.jvm' (registry 'solr.jvm') enabled at server: com.sun.jmx.mbeanserver.JmxMBeanServer@cb64a06
   [junit4]   2> 1532156 INFO  (TEST-FullSolrCloudDistribCmdsTest.test-seed#[2B150420ABF229A6]) [n:127.0.0.1:61773__ta    ] o.a.s.m.r.SolrJmxReporter JMX monitoring for 'solr.jetty' (registry 'solr.jetty') enabled at server: com.sun.jmx.mbeanserver.JmxMBeanServer@cb64a06
   [junit4]   2> 1532158 INFO  (TEST-FullSolrCloudDistribCmdsTest.test-seed#[2B150420ABF229A6]) [n:127.0.0.1:61773__ta    ] o.a.s.c.CorePropertiesLocator Found 0 core definitions underneath /Users/jenkins/workspace/Lucene-Solr-master-MacOSX/solr/build/solr-core/test/J1/temp/solr.cloud.FullSolrCloudDistribCmdsTest_2B150420ABF229A6-001/shard-1-001/cores
   [junit4]   2> 1532179 INFO  (qtp1696281420-11003) [n:127.0.0.1:61753__ta    ] o.a.s.h.a.CollectionsHandler Invoked Collection Action :addreplica with params node=127.0.0.1:61773__ta&action=ADDREPLICA&collection=collection1&shard=shard2&type=NRT&wt=javabin&version=2 and sendToOCPQueue=true
   [junit4]   2> 1532182 INFO  (OverseerCollectionConfigSetProcessor-99421476596023300-127.0.0.1:61753__ta-n_0000000000) [n:127.0.0.1:61753__ta    ] o.a.s.c.OverseerTaskQueue Response ZK path: /overseer/collection-queue-work/qnr-0000000002 doesn't exist.  Requestor may have disconnected from ZooKeeper
   [junit4]   2> 1532183 INFO  (OverseerThreadFactory-3973-thread-3-processing-n:127.0.0.1:61753__ta) [n:127.0.0.1:61753__ta    ] o.a.s.c.a.c.AddReplicaCmd Node Identified 127.0.0.1:61773__ta for creating new replica
   [junit4]   2> 1532187 INFO  (qtp953194595-11050) [n:127.0.0.1:61773__ta    ] o.a.s.h.a.CoreAdminOperation core create command qt=/admin/cores&collection.configName=conf1&name=collection1_shard2_replica_n61&action=CREATE&collection=collection1&shard=shard2&wt=javabin&version=2&replicaType=NRT
   [junit4]   2> 1532188 INFO  (qtp953194595-11050) [n:127.0.0.1:61773__ta    ] o.a.s.c.TransientSolrCoreCacheDefault Allocating transient cache for 4 transient cores
   [junit4]   2> 1533210 INFO  (qtp953194595-11050) [n:127.0.0.1:61773__ta c:collection1 s:shard2  x:collection1_shard2_replica_n61] o.a.s.c.SolrConfig Using Lucene MatchVersion: 8.0.0
   [junit4]   2> 1533220 INFO  (qtp953194595-11050) [n:127.0.0.1:61773__ta c:collection1 s:shard2  x:collection1_shard2_replica_n61] o.a.s.s.IndexSchema [collection1_shard2_replica_n61] Schema name=test
   [junit4]   2> 1533283 INFO  (qtp953194595-11050) [n:127.0.0.1:61773__ta c:collection1 s:shard2  x:collection1_shard2_replica_n61] o.a.s.s.IndexSchema Loaded schema test/1.6 with uniqueid field id
   [junit4]   2> 1533305 INFO  (qtp953194595-11050) [n:127.0.0.1:61773__ta c:collection1 s:shard2  x:collection1_shard2_replica_n61] o.a.s.c.CoreContainer Creating SolrCore 'collection1_shard2_replica_n61' using configuration from collection collection1, trusted=true
   [junit4]   2> 1533306 INFO  (qtp953194595-11050) [n:127.0.0.1:61773__ta c:collection1 s:shard2  x:collection1_shard2_replica_n61] o.a.s.m.r.SolrJmxReporter JMX monitoring for 'solr.core.collection1.shard2.replica_n61' (registry 'solr.core.collection1.shard2.replica_n61') enabled at server: com.sun.jmx.mbeanserver.JmxMBeanServer@cb64a06
   [junit4]   2> 1533306 INFO  (qtp953194595-11050) [n:127.0.0.1:61773__ta c:collection1 s:shard2  x:collection1_shard2_replica_n61] o.a.s.c.SolrCore solr.RecoveryStrategy.Builder
   [junit4]   2> 1533306 INFO  (qtp953194595-11050) [n:127.0.0.1:61773__ta c:collection1 s:shard2  x:collection1_shard2_replica_n61] o.a.s.c.SolrCore [[collection1_shard2_replica_n61] ] Opening new SolrCore at [/Users/jenkins/workspace/Lucene-Solr-master-MacOSX/solr/build/solr-core/test/J1/temp/solr.cloud.FullSolrCloudDistribCmdsTest_2B150420ABF229A6-001/shard-1-001/cores/collection1_shard2_replica_n61], dataDir=[/Users/jenkins/workspace/Lucene-Solr-master-MacOSX/solr/build/solr-core/test/J1/temp/solr.cloud.FullSolrCloudDistribCmdsTest_2B150420ABF229A6-001/shard-1-001/cores/collection1_shard2_replica_n61/data/]
   [junit4]   2> 1533308 INFO  (qtp953194595-11050) [n:127.0.0.1:61773__ta c:collection1 s:shard2  x:collection1_shard2_replica_n61] o.a.s.u.RandomMergePolicy RandomMergePolicy wrapping class org.apache.lucene.index.TieredMergePolicy: [TieredMergePolicy: maxMergeAtOnce=17, maxMergeAtOnceExplicit=46, maxMergedSegmentMB=44.90625, floorSegmentMB=2.1748046875, forceMergeDeletesPctAllowed=17.118262385358864, segmentsPerTier=39.0, maxCFSSegmentSizeMB=8.796093022207999E12, noCFSRatio=0.41266757696283385
   [junit4]   2> 1533310 WARN  (qtp953194595-11050) [n:127.0.0.1:61773__ta c:collection1 s:shard2  x:collection1_shard2_replica_n61] o.a.s.c.RequestHandlers INVALID paramSet a in requestHandler {type = requestHandler,name = /dump,class = DumpRequestHandler,attributes = {initParams=a, name=/dump, class=DumpRequestHandler},args = {defaults={a=A,b=B}}}
   [junit4]   2> 1533351 INFO  (qtp953194595-11050) [n:127.0.0.1:61773__ta c:collection1 s:shard2  x:collection1_shard2_replica_n61] o.a.s.u.UpdateHandler Using UpdateLog implementation: org.apache.solr.update.UpdateLog
   [junit4]   2> 1533351 INFO  (qtp953194595-11050) [n:127.0.0.1:61773__ta c:collection1 s:shard2  x:collection1_shard2_replica_n61] o.a.s.u.UpdateLog Initializing UpdateLog: dataDir= defaultSyncLevel=FLUSH numRecordsToKeep=100 maxNumLogsToKeep=10 numVersionBuckets=65536
   [junit4]   2> 1533353 INFO  (qtp953194595-11050) [n:127.0.0.1:61773__ta c:collection1 s:shard2  x:collection1_shard2_replica_n61] o.a.s.u.CommitTracker Hard AutoCommit: disabled
   [junit4]   2> 1533353 INFO  (qtp953194595-11050) [n:127.0.0.1:61773__ta c:collection1 s:shard2  x:collection1_shard2_replica_n61] o.a.s.u.CommitTracker Soft AutoCommit: disabled
   [junit4]   2> 1533354 INFO  (qtp953194595-11050) [n:127.0.0.1:61773__ta c:collection1 s:shard2  x:collection1_shard2_replica_n61] o.a.s.u.RandomMergePolicy RandomMergePolicy wrapping class org.apache.lucene.index.TieredMergePolicy: [TieredMergePolicy: maxMergeAtOnce=26, maxMergeAtOnceExplicit=23, maxMergedSegmentMB=96.369140625, floorSegmentMB=2.1884765625, forceMergeDeletesPctAllowed=29.25245235511709, segmentsPerTier=42.0, maxCFSSegmentSizeMB=8.796093022207999E12, noCFSRatio=0.24394702053507686
   [junit4]   2> 1533354 INFO  (qtp953194595-11050) [n:127.0.0.1:61773__ta c:collection1 s:shard2  x:collection1_shard2_replica_n61] o.a.s.s.SolrIndexSearcher Opening [Searcher@ee54b57[collection1_shard2_replica_n61] main]
   [junit4]   2> 1533355 INFO  (qtp953194595-11050) [n:127.0.0.1:61773__ta c:collection1 s:shard2  x:collection1_shard2_replica_n61] o.a.s.r.ManagedResourceStorage Configured ZooKeeperStorageIO with znodeBase: /configs/conf1
   [junit4]   2> 1533356 INFO  (qtp953194595-11050) [n:127.0.0.1:61773__ta c:collection1 s:shard2  x:collection1_shard2_replica_n61] o.a.s.r.ManagedResourceStorage Loaded null at path _rest_managed.json using ZooKeeperStorageIO:path=/configs/conf1
   [junit4]   2> 1533357 INFO  (qtp953194595-11050) [n:127.0.0.1:61773__ta c:collection1 s:shard2  x:collection1_shard2_replica_n61] o.a.s.h.ReplicationHandler Commits will be reserved for 10000ms.
   [junit4]   2> 1533357 INFO  (qtp953194595-11050) [n:127.0.0.1:61773__ta c:collection1 s:shard2  x:collection1_shard2_replica_n61] o.a.s.u.UpdateLog Could not find max version in index or recent updates, using new clock 1590743630564294656
   [junit4]   2> 1533357 INFO  (searcherExecutor-3987-thread-1-processing-n:127.0.0.1:61773__ta x:collection1_shard2_replica_n61 s:shard2 c:collection1) [n:127.0.0.1:61773__ta c:collection1 s:shard2  x:collection1_shard2_replica_n61] o.a.s.c.SolrCore [collection1_shard2_replica_n61] Registered new searcher Searcher@ee54b57[collection1_shard2_replica_n61] main{ExitableDirectoryReader(UninvertingDirectoryReader())}
   [junit4]   2> 1533363 INFO  (qtp953194595-11050) [n:127.0.0.1:61773__ta c:collection1 s:shard2  x:collection1_shard2_replica_n61] o.a.s.c.ShardLeaderElectionContext Enough replicas found to continue.
   [junit4]   2> 1533363 INFO  (qtp953194595-11050) [n:127.0.0.1:61773__ta c:collection1 s:shard2  x:collection1_shard2_replica_n61] o.a.s.c.ShardLeaderElectionContext I may be the new leader - try and sync
   [junit4]   2> 1533363 INFO  (qtp953194595-11050) [n:127.0.0.1:61773__ta c:collection1 s:shard2  x:collection1_shard2_replica_n61] o.a.s.c.SyncStrategy Sync replicas to http://127.0.0.1:61773/_ta/collection1_shard2_replica_n61/
   [junit4]   2> 1533363 INFO  (qtp953194595-11050) [n:127.0.0.1:61773__ta c:collection1 s:shard2  x:collection1_shard2_replica_n61] o.a.s.c.SyncStrategy Sync Success - now sync replicas to me
   [junit4]   2> 1533363 INFO  (qtp953194595-11050) [n:127.0.0.1:61773__ta c:collection1 s:shard2  x:collection1_shard2_replica_n61] o.a.s.c.SyncStrategy http://127.0.0.1:61773/_ta/collection1_shard2_replica_n61/ has no replicas
   [junit4]   2> 1533363 INFO  (qtp953194595-11050) [n:127.0.0.1:61773__ta c:collection1 s:shard2  x:collection1_shard2_replica_n61] o.a.s.c.ShardLeaderElectionContext Found all replicas participating in election, clear LIR
   [junit4]   2> 1533368 INFO  (qtp953194595-11050) [n:127.0.0.1:61773__ta c:collection1 s:shard2  x:collection1_shard2_replica_n61] o.a.s.c.ShardLeaderElectionContext I am the new leader: http://127.0.0.1:61773/_ta/collection1_shard2_replica_n61/ shard2
   [junit4]   2> 1533523 INFO  (qtp953194595-11050) [n:127.0.0.1:61773__ta c:collection1 s:shard2  x:collection1_shard2_replica_n61] o.a.s.c.ZkController I am the leader, no recovery necessary
   [junit4]   2> 1533525 INFO  (qtp953194595-11050) [n:127.0.0.1:61773__ta c:collection1 s:shard2  x:collection1_shard2_replica_n61] o.a.s.s.HttpSolrCall [admin] webapp=null path=/admin/cores params={qt=/admin/cores&collection.configName=conf1&name=collection1_shard2_replica_n61&action=CREATE&collection=collection1&shard=shard2&wt=javabin&version=2&replicaType=NRT} status=0 QTime=1338
   [junit4]   2> 1533528 INFO  (qtp1696281420-11003) [n:127.0.0.1:61753__ta    ] o.a.s.s.HttpSolrCall [admin] webapp=null path=/admin/collections params={node=127.0.0.1:61773__ta&action=ADDREPLICA&collection=collection1&shard=shard2&type=NRT&wt=javabin&version=2} status=0 QTime=1349
   [junit4]   2> 1533792 INFO  (TEST-FullSolrCloudDistribCmdsTest.test-seed#[2B150420ABF229A6]) [    ] o.a.s.c.AbstractFullDistribZkTestBase create jetty 2 in directory /Users/jenkins/workspace/Lucene-Solr-master-MacOSX/solr/build/solr-core/test/J1/temp/solr.cloud.FullSolrCloudDistribCmdsTest_2B150420ABF229A6-001/shard-2-001 of type NRT
   [junit4]   2> 1533792 INFO  (TEST-FullSolrCloudDistribCmdsTest.test-seed#[2B150420ABF229A6]) [    ] o.e.j.s.Server jetty-9.4.8.v20171121, build timestamp: 2017-11-22T11:27:37+14:00, git hash: 82b8fb23f757335bb3329d540ce37a2a2615f0a8
   [junit4]   2> 1533794 INFO  (TEST-FullSolrCloudDistribCmdsTest.test-seed#[2B150420ABF229A6]) [    ] o.e.j.s.session DefaultSessionIdManager workerName=node0
   [junit4]   2> 1533794 INFO  (TEST-FullSolrCloudDistribCmdsTest.test-seed#[2B150420ABF229A6]) [    ] o.e.j.s.session No SessionScavenger set, using defaults
   [junit4]   2> 1533794 INFO  (TEST-FullSolrCloudDistribCmdsTest.test-seed#[2B150420ABF229A6]) [    ] o.e.j.s.session Scavenging every 600000ms
   [junit4]   2> 1533794 INFO  (TEST-FullSolrCloudDistribCmdsTest.test-seed#[2B150420ABF229A6]) [    ] o.e.j.s.h.ContextHandler Started o.e.j.s.ServletContextHandler@562dc4a6{/_ta,null,AVAILABLE}
   [junit4]   2> 1533794 INFO  (TEST-FullSolrCloudDistribCmdsTest.test-seed#[2B150420ABF229A6]) [    ] o.e.j.s.AbstractConnector Started ServerConnector@63ea17e3{HTTP/1.1,[http/1.1]}{127.0.0.1:61784}
   [junit4]   2> 1533794 INFO  (TEST-FullSolrCloudDistribCmdsTest.test-seed#[2B150420ABF229A6]) [    ] o.e.j.s.Server Started @1535777ms
   [junit4]   2> 1533794 INFO  (TEST-FullSolrCloudDistribCmdsTest.test-seed#[2B150420ABF229A6]) [    ] o.a.s.c.s.e.JettySolrRunner Jetty properties: {hostContext=/_ta, solrconfig=solrconfig.xml, solr.data.dir=/Users/jenkins/workspace/Lucene-Solr-master-MacOSX/solr/build/solr-core/test/J1/temp/solr.cloud.FullSolrCloudDistribCmdsTest_2B150420ABF229A6-001/tempDir-001/jetty2, hostPort=61784, coreRootDirectory=/Users/jenkins/workspace/Lucene-Solr-master-MacOSX/solr/build/solr-core/test/J1/../../../../../../../../../Users/jenkins/workspace/Lucene-Solr-master-MacOSX/solr/build/solr-core/test/J1/temp/solr.cloud.FullSolrCloudDistribCmdsTest_2B150420ABF229A6-001/shard-2-001/cores, replicaType=NRT}
   [junit4]   2> 1533795 ERROR (TEST-FullSolrCloudDistribCmdsTest.test-seed#[2B150420ABF229A6]) [    ] o.a.s.u.StartupLoggingUtils Missing Java Option solr.log.dir. Logging may be missing or incomplete.
   [junit4]   2> 1533795 INFO  (TEST-FullSolrCloudDistribCmdsTest.test-seed#[2B150420ABF229A6]) [    ] o.a.s.s.SolrDispatchFilter  ___      _       Welcome to Apache Solr™ version 8.0.0
   [junit4]   2> 1533795 INFO  (TEST-FullSolrCloudDistribCmdsTest.test-seed#[2B150420ABF229A6]) [    ] o.a.s.s.SolrDispatchFilter / __| ___| |_ _   Starting in cloud mode on port null
   [junit4]   2> 1533795 INFO  (TEST-FullSolrCloudDistribCmdsTest.test-seed#[2B150420ABF229A6]) [    ] o.a.s.s.SolrDispatchFilter \__ \/ _ \ | '_|  Install dir: null
   [junit4]   2> 1533795 INFO  (TEST-FullSolrCloudDistribCmdsTest.test-seed#[2B150420ABF229A6]) [    ] o.a.s.s.SolrDispatchFilter |___/\___/_|_|    Start time: 2018-01-27T11:09:04.894359Z
   [junit4]   2> 1533797 INFO  (zkConnectionManagerCallback-2019-thread-1) [    ] o.a.s.c.c.ConnectionManager zkClient has connected
   [junit4]   2> 1533799 INFO  (TEST-FullSolrCloudDistribCmdsTest.test-seed#[2B150420ABF229A6]) [    ] o.a.s.s.SolrDispatchFilter Loading solr.xml from SolrHome (not found in ZooKeeper)
   [junit4]   2> 1533799 INFO  (TEST-FullSolrCloudDistribCmdsTest.test-seed#[2B150420ABF229A6]) [    ] o.a.s.c.SolrXmlConfig Loading container configuration from /Users/jenkins/workspace/Lucene-Solr-master-MacOSX/solr/build/solr-core/test/J1/temp/solr.cloud.FullSolrCloudDistribCmdsTest_2B150420ABF229A6-001/shard-2-001/solr.xml
   [junit4]   2> 1533802 INFO  (TEST-FullSolrCloudDistribCmdsTest.test-seed#[2B150420ABF229A6]) [    ] o.a.s.c.SolrXmlConfig Configuration parameter autoReplicaFailoverWorkLoopDelay is ignored
   [junit4]   2> 1533802 INFO  (TEST-FullSolrCloudDistribCmdsTest.test-seed#[2B150420ABF229A6]) [    ] o.a.s.c.SolrXmlConfig Configuration parameter autoReplicaFailoverBadNodeExpiration is ignored
   [junit4]   2> 1533802 INFO  (TEST-FullSolrCloudDistribCmdsTest.test-seed#[2B150420ABF229A6]) [    ] o.a.s.c.SolrXmlConfig MBean server found: com.sun.jmx.mbeanserver.JmxMBeanServer@cb64a06, but no JMX reporters were configured - adding default JMX reporter.
   [junit4]   2> 1533805 INFO  (TEST-FullSolrCloudDistribCmdsTest.test-seed#[2B150420ABF229A6]) [    ] o.a.s.c.ZkContainer Zookeeper client=127.0.0.1:61747/solr
   [junit4]   2> 1533806 INFO  (zkConnectionManagerCallback-2023-thread-1) [    ] o.a.s.c.c.ConnectionManager zkClient has connected
   [junit4]   2> 1533809 INFO  (zkConnectionManagerCallback-2025-thread-1-processing-n:127.0.0.1:61784__ta) [n:127.0.0.1:61784__ta    ] o.a.s.c.c.ConnectionManager zkClient has connected
   [junit4]   2> 1533821 INFO  (TEST-FullSolrCloudDistribCmdsTest.test-seed#[2B150420ABF229A6]) [n:127.0.0.1:61784__ta    ] o.a.s.c.c.ZkStateReader Updated live nodes from ZooKeeper... (0) -> (2)
   [junit4]   2> 1533825 INFO  (TEST-FullSolrCloudDistribCmdsTest.test-seed#[2B150420ABF229A6]) [n:127.0.0.1:61784__ta    ] o.a.s.c.Overseer Overseer (id=null) closing
   [junit4]   2> 1533828 INFO  (TEST-FullSolrCloudDistribCmdsTest.test-seed#[2B150420ABF229A6]) [n:127.0.0.1:61784__ta    ] o.a.s.c.ZkController Register node as live in ZooKeeper:/live_nodes/127.0.0.1:61784__ta
   [junit4]   2> 1533831 INFO  (zkCallback-1996-thread-2-processing-n:127.0.0.1:61753__ta) [n:127.0.0.1:61753__ta    ] o.a.s.c.c.ZkStateReader Updated live nodes from ZooKeeper... (2) -> (3)
   [junit4]   2> 1533831 INFO  (zkCallback-2014-thread-1-processing-n:127.0.0.1:61773__ta) [n:127.0.0.1:61773__ta    ] o.a.s.c.c.ZkStateReader Updated live nodes from ZooKeeper... (2) -> (3)
   [junit4]   2> 1533831 INFO  (zkCallback-2006-thread-1) [    ] o.a.s.c.c.ZkStateReader Updated live nodes from ZooKeeper... (2) -> (3)
   [junit4]   2> 1533832 INFO  (zkCallback-2024-thread-1-processing-n:127.0.0.1:61784__ta) [n:127.0.0.1:61784__ta    ] o.a.s.c.c.ZkStateReader Updated live nodes from ZooKeeper... (2) -> (3)
   [junit4]   2> 1533878 INFO  (TEST-FullSolrCloudDistribCmdsTest.test-seed#[2B150420ABF229A6]) [n:127.0.0.1:61784__ta    ] o.a.s.m.r.SolrJmxReporter JMX monitoring for 'solr.node' (registry 'solr.node') enabled at server: com.sun.jmx.mbeanserver.JmxMBeanServer@cb64a06
   [junit4]   2> 1533890 INFO  (TEST-FullSolrCloudDistribCmdsTest.test-seed#[2B150420ABF229A6]) [n:127.0.0.1:61784__ta    ] o.a.s.m.r.SolrJmxReporter JMX monitoring for 'solr.jvm' (registry 'solr.jvm') enabled at server: com.sun.jmx.mbeanserver.JmxMBeanServer@cb64a06
   [junit4]   2> 1533891 INFO  (TEST-FullSolrCloudDistribCmdsTest.test-seed#[2B150420ABF229A6]) [n:127.0.0.1:61784__ta    ] o.a.s.m.r.SolrJmxReporter JMX monitoring for 'solr.jetty' (registry 'solr.jetty') enabled at server: com.sun.jmx.mbeanserver.JmxMBeanServer@cb64a06
   [junit4]   2> 1533892 INFO  (TEST-FullSolrCloudDistribCmdsTest.test-seed#[2B150420ABF229A6]) [n:127.0.0.1:61784__ta    ] o.a.s.c.CorePropertiesLocator Found 0 core definitions underneath /Users/jenkins/workspace/Lucene-Solr-master-MacOSX/solr/build/solr-core/test/J1/../../../../../../../../../Users/jenkins/workspace/Lucene-Solr-master-MacOSX/solr/build/solr-core/test/J1/temp/solr.cloud.FullSolrCloudDistribCmdsTest_2B150420ABF229A6-001/shard-2-001/cores
   [junit4]   2> 1533924 INFO  (qtp1696281420-11005) [n:127.0.0.1:61753__ta    ] o.a.s.h.a.CollectionsHandler Invoked Collection Action :addreplica with params node=127.0.0.1:61784__ta&action=ADDREPLICA&collection=collection1&shard=shard3&type=NRT&wt=javabin&version=2 and sendToOCPQueue=true
   [junit4]   2> 1533930 INFO  (OverseerCollectionConfigSetProcessor-99421476596023300-127.0.0.1:61753__ta-n_0000000000) [n:127.0.0.1:61753__ta    ] o.a.s.c.OverseerTaskQueue Response ZK path: /overseer/collection-queue-work/qnr-0000000004 doesn't exist.  Requestor may have disconnected from ZooKeeper
   [junit4]   2> 1533930 INFO  (OverseerThreadFactory-3973-thread-4-processing-n:127.0.0.1:61753__ta) [n:127.0.0.1:61753__ta    ] o.a.s.c.a.c.AddReplicaCmd Node Identified 127.0.0.1:61784__ta for creating new replica
   [junit4]   2> 1533937 INFO  (qtp1424787760-11081) [n:127.0.0.1:61784__ta    ] o.a.s.h.a.CoreAdminOperation core create command qt=/admin/cores&collection.configName=conf1&name=collection1_shard3_replica_n63&action=CREATE&collection=collection1&shard=shard3&wt=javabin&version=2&replicaType=NRT
   [junit4]   2> 1533938 INFO  (qtp1424787760-11081) [n:127.0.0.1:61784__ta    ] o.a.s.c.TransientSolrCoreCacheDefault Allocating transient cache for 4 transient cores
   [junit4]   2> 1534990 INFO  (qtp1424787760-11081) [n:127.0.0.1:61784__ta c:collection1 s:shard3  x:collection1_shard3_replica_n63] o.a.s.c.SolrConfig Using Lucene MatchVersion: 8.0.0
   [junit4]   2> 1535035 INFO  (qtp1424787760-11081) [n:127.0.0.1:61784__ta c:collection1 s:shard3  x:collection1_shard3_replica_n63] o.a.s.s.IndexSchema [collection1_shard3_replica_n63] Schema name=test
   [junit4]   2> 1535201 INFO  (qtp1424787760-11081) [n:127.0.0.1:61784__ta c:collection1 s:shard3  x:collection1_shard3_replica_n63] o.a.s.s.IndexSchema Loaded schema test/1.6 with uniqueid field id
   [junit4]   2> 1535228 INFO  (qtp1424787760-11081) [n:127.0.0.1:61784__ta c:collection1 s:shard3  x:collection1_shard3_replica_n63] o.a.s.c.CoreContainer Creating SolrCore 'collection1_shard3_replica_n63' using configuration from collection collection1, trusted=true
   [junit4]   2> 1535230 INFO  (qtp1424787760-11081) [n:127.0.0.1:61784__ta c:collection1 s:shard3  x:collection1_shard3_replica_n63] o.a.s.m.r.SolrJmxReporter JMX monitoring for 'solr.core.collection1.shard3.replica_n63' (registry 'solr.core.collection1.shard3.replica_n63') enabled at server: com.sun.jmx.mbeanserver.JmxMBeanServer@cb64a06
   [junit4]   2> 1535230 INFO  (qtp1424787760-11081) [n:127.0.0.1:61784__ta c:collection1 s:shard3  x:collection1_shard3_replica_n63] o.a.s.c.SolrCore solr.RecoveryStrategy.Builder
   [junit4]   2> 1535230 INFO  (qtp1424787760-11081) [n:127.0.0.1:61784__ta c:collection1 s:shard3  x:collection1_shard3_replica_n63] o.a.s.c.SolrCore [[collection1_shard3_replica_n63] ] Opening new SolrCore at [/Users/jenkins/workspace/Lucene-Solr-master-MacOSX/solr/build/solr-core/test/J1/temp/solr.cloud.FullSolrCloudDistribCmdsTest_2B150420ABF229A6-001/shard-2-001/cores/collection1_shard3_replica_n63], dataDir=[/Users/jenkins/workspace/Lucene-Solr-master-MacOSX/solr/build/solr-core/test/J1/../../../../../../../../../Users/jenkins/workspace/Lucene-Solr-master-MacOSX/solr/build/solr-core/test/J1/temp/solr.cloud.FullSolrCloudDistribCmdsTest_2B150420ABF229A6-001/shard-2-001/cores/collection1_shard3_replica_n63/data/]
   [junit4]   2> 1535234 INFO  (qtp1424787760-11081) [n:127.0.0.1:61784__ta c:collection1 s:shard3  x:collection1_shard3_replica_n63] o.a.s.u.RandomMergePolicy RandomMergePolicy wrapping class org.apache.lucene.index.TieredMergePolicy: [TieredMergePolicy: maxMergeAtOnce=17, maxMergeAtOnceExplicit=46, maxMergedSegmentMB=44.90625, floorSegmentMB=2.1748046875, forceMergeDeletesPctAllowed=17.118262385358864, segmentsPerTier=39.0, maxCFSSegmentSizeMB=8.796093022207999E12, noCFSRatio=0.41266757696283385
   [junit4]   2> 1535241 WARN  (qtp1424787760-11081) [n:127.0.0.1:61784__ta c:collection1 s:shard3  x:collection1_shard3_replica_n63] o.a.s.c.RequestHandlers INVALID paramSet a in requestHandler {type = requestHandler,name = /dump,class = DumpRequestHandler,attributes = {initParams=a, name=/dump, class=DumpRequestHandler},args = {defaults={a=A,b=B}}}
   [junit4]   2> 1535282 INFO  (qtp1424787760-11081) [n:127.0.0.1:61784__ta c:collection1 s:shard3  x:collection1_shard3_replica_n63] o.a.s.u.UpdateHandler Using UpdateLog implementation: org.apache.solr.update.UpdateLog
   [junit4]   2> 1535282 INFO  (qtp1424787760-11081) [n:127.0.0.1:61784__ta c:collection1 s:shard3  x:collection1_shard3_replica_n63] o.a.s.u.UpdateLog Initializing UpdateLog: dataDir= defaultSyncLevel=FLUSH numRecordsToKeep=100 maxNumLogsToKeep=10 numVersionBuckets=65536
   [junit4]   2> 1535284 INFO  (qtp1424787760-11081) [n:127.0.0.1:61784__ta c:collection1 s:shard3  x:collection1_shard3_replica_n63] o.a.s.u.CommitTracker Hard AutoCommit: disabled
   [junit4]   2> 1535284 INFO  (qtp1424787760-11081) [n:127.0.0.1:61784__ta c:collection1 s:shard3  x:collection1_shard3_replica_n63] o.a.s.u.CommitTracker Soft AutoCommit: disabled
   [junit4]   2> 1535285 INFO  (qtp1424787760-11081) [n:127.0.0.1:61784__ta c:collection1 s:shard3  x:collection1_shard3_replica_n63] o.a.s.u.RandomMergePolicy RandomMergePolicy wrapping class org.apache.lucene.index.TieredMergePolicy: [TieredMergePolicy: maxMergeAtOnce=26, maxMergeAtOnceExplicit=23, maxMergedSegmentMB=96.369140625, floorSegmentMB=2.1884765625, forceMergeDeletesPctAllowed=29.25245235511709, segmentsPerTier=42.0, maxCFSSegmentSizeMB=8.796093022207999E12, noCFSRatio=0.24394702053507686
   [junit4]   2> 1535286 INFO  (qtp1424787760-11081) [n:127.0.0.1:61784__ta c:collection1 s:shard3  x:collection1_shard3_replica_n63] o.a.s.s.SolrIndexSearcher Opening [Searcher@5a046d89[collection1_shard3_replica_n63] main]
   [junit4]   2> 1535288 INFO  (qtp1424787760-11081) [n:127.0.0.1:61784__ta c:collection1 s:shard3  x:collection1_shard3_replica_n63] o.a.s.r.ManagedResourceStorage Configured ZooKeeperStorageIO with znodeBase: /configs/conf1
   [junit4]   2> 1535289 INFO  (qtp1424787760-11081) [n:127.0.0.1:61784__ta c:collection1 s:shard3  x:collection1_shard3_replica_n63] o.a.s.r.ManagedResourceStorage Loaded null at path _rest_managed.json using ZooKeeperStorageIO:path=/configs/conf1
   [junit4]   2> 1535289 INFO  (qtp1424787760-11081) [n:127.0.0.1:61784__ta c:collection1 s:shard3  x:collection1_shard3_replica_n63] o.a.s.h.ReplicationHandler Commits will be reserved for 10000ms.
   [junit4]   2> 1535290 INFO  (qtp1424787760-11081) [n:127.0.0.1:61784__ta c:collection1 s:shard3  x:collection1_shard3_replica_n63] o.a.s.u.UpdateLog Could not find max version in index or recent updates, using new clock 1590743632591192064
   [junit4]   2> 1535291 INFO  (searcherExecutor-3998-thread-1-processing-n:127.0.0.1:61784__ta x:collection1_shard3_replica_n63 s:shard3 c:collection1) [n:127.0.0.1:61784__ta c:collection1 s:shard3  x:collection1_shard3_replica_n63] o.a.s.c.SolrCore [collection1_shard3_replica_n63] Registered new searcher Searcher@5a046d89[collection1_shard3_replica_n63] main{ExitableDirectoryReader(UninvertingDirectoryReader())}
   [junit4]   2> 1535296 INFO  (qtp1424787760-11081) [n:127.0.0.1:61784__ta c:collection1 s:shard3  x:collection1_shard3_replica_n63] o.a.s.c.ShardLeaderElectionContext Enough replicas found to continue.
   [junit4]   2> 1535296 INFO  (qtp1424787760-11081) [n:127.0.0.1:61784__ta c:collection1 s:shard3  x:collection1_shard3_replica_n63] o.a.s.c.ShardLeaderElectionContext I may be the new leader - try and sync
   [junit4]   2> 1535296 INFO  (qtp1424787760-11081) [n:127.0.0.1:61784__ta c:collection1 s:shard3  x:collection1_shard3_replica_n63] o.a.s.c.SyncStrategy Sync replicas to http://127.0.0.1:61784/_ta/collection1_shard3_replica_n63/
   [junit4]   2> 1535296 INFO  (qtp1424787760-11081) [n:127.0.0.1:61784__ta c:collection1 s:shard3  x:collection1_shard3_replica_n63] o.a.s.c.SyncStrategy Sync Success - now sync replicas to me
   [junit4]   2> 1535296 INFO  (qtp1424787760-11081) [n:127.0.0.1:61784__ta c:collection1 s:shard3  x:collection1_shard3_replica_n63] o.a.s.c.SyncStrategy http://127.0.0.1:61784/_ta/collection1_shard3_replica_n63/ has no replicas
   [junit4]   2> 1535296 INFO  (qtp1424787760-11081) [n:127.0.0.1:61784__ta c:collection1 s:shard3  x:collection1_shard3_replica_n63] o.a.s.c.ShardLeaderElectionContext Found all replicas participating in election, clear LIR
   [junit4]   2> 1535301 INFO  (qtp1424787760-11081) [n:127.0.0.1:61784__ta c:collection1 s:shard3  x:collection1_shard3_replica_n63] o.a.s.c.ShardLeaderElectionContext I am the new leader: http://127.0.0.1:61784/_ta/collection1_shard3_replica_n63/ shard3
   [junit4]   2> 1535414 INFO  (qtp1424787760-11081) [n:127.0.0.1:61784__ta c:collection1 s:shard3  x:collection1_shard3_replica_n63] o.a.s.c.ZkController I am the leader, no recovery necessary
   [junit4]   2> 1535417 INFO  (qtp1424787760-11081) [n:127.0.0.1:61784__ta c:collection1 s:shard3  x:collection1_shard3_replica_n63] o.a.s.s.HttpSolrCall [admin] webapp=null path=/admin/cores params={qt=/admin/cores&collection.configName=conf1&name=collection1_shard3_replica_n63&action=CREATE&collection=collection1&shard=shard3&wt=javabin&version=2&replicaType=NRT} status=0 QTime=1479
   [junit4]   2> 1535420 INFO  (qtp1696281420-11005) [n:127.0.0.1:61753__ta    ] o.a.s.s.HttpSolrCall [admin] webapp=null path=/admin/collections params={node=127.0.0.1:61784__ta&action=ADDREPLICA&collection=collection1&shard=shard3&type=NRT&wt=javabin&version=2} status=0 QTime=1496
   [junit4]   2> 1535661 INFO  (TEST-FullSolrCloudDistribCmdsTest.test-seed#[2B150420ABF229A6]) [    ] o.a.s.c.AbstractFullDistribZkTestBase create jetty 3 in directory /Users/jenkins/workspace/Lucene-Solr-master-MacOSX/solr/build/solr-core/test/J1/temp/solr.cloud.FullSolrCloudDistribCmdsTest_2B150420ABF229A6-001/shard-3-001 of type NRT
   [junit4]   2> 1535662 INFO  (TEST-FullSolrCloudDistribCmdsTest.test-seed#[2B150420ABF229A6]) [    ] o.e.j.s.Server jetty-9.4.8.v20171121, build timestamp: 2017-11-22T11:27:37+14:00, git hash: 82b8fb23f757335bb3329d540ce37a2a2615f0a8
   [junit4]   2> 1535663 INFO  (TEST-FullSolrCloudDistribCmdsTest.test-seed#[2B150420ABF229A6]) [    ] o.e.j.s.session DefaultSessionIdManager workerName=node0
   [junit4]   2> 1535663 INFO  (TEST-FullSolrCloudDistribCmdsTest.test-seed#[2B150420ABF229A6]) [    ] o.e.j.s.session No SessionScavenger set, using defaults
   [junit4]   2> 1535663 INFO  (TEST-FullSolrCloudDistribCmdsTest.test-seed#[2B150420ABF229A6]) [    ] o.e.j.s.session Scavenging every 660000ms
   [junit4]   2> 1535663 INFO  (TEST-FullSolrCloudDistribCmdsTest.test-seed#[2B150420ABF229A6]) [    ] o.e.j.s.h.ContextHandler Started o.e.j.s.ServletContextHandler@24a7c81d{/_ta,null,AVAILABLE}
   [junit4]   2> 1535664 INFO  (TEST-FullSolrCloudDistribCmdsTest.test-seed#[2B150420ABF229A6]) [    ] o.e.j.s.AbstractConnector Started ServerConnector@4a477614{HTTP/1.1,[http/1.1]}{127.0.0.1:61796}
   [junit4]   2> 1535665 INFO  (TEST-FullSolrCloudDistribCmdsTest.test-seed#[2B150420ABF229A6]) [    ] o.e.j.s.Server Started @1537648ms
   [junit4]   2> 1535665 INFO  (TEST-FullSolrCloudDistribCmdsTest.test-seed#[2B150420ABF229A6]) [    ] o.a.s.c.s.e.JettySolrRunner Jetty properties: {hostContext=/_ta, solrconfig=solrconfig.xml, solr.data.dir=/Users/jenkins/workspace/Lucene-Solr-master-MacOSX/solr/build/solr-core/test/J1/temp/solr.cloud.FullSolrCloudDistribCmdsTest_2B150420ABF229A6-001/tempDir-001/jetty3, hostPort=61796, coreRootDirectory=/Users/jenkins/workspace/Lucene-Solr-master-MacOSX/solr/build/solr-core/test/J1/../../../../../../../../../Users/jenkins/workspace/Lucene-Solr-master-MacOSX/solr/build/solr-core/test/J1/temp/solr.cloud.FullSolrCloudDistribCmdsTest_2B150420ABF229A6-001/shard-3-001/cores, replicaType=NRT}
   [junit4]   2> 1535665 ERROR (TEST-FullSolrCloudDistribCmdsTest.test-seed#[2B150420ABF229A6]) [    ] o.a.s.u.StartupLoggingUtils Missing Java Option solr.log.dir. Logging may be missing or incomplete.
   [junit4]   2> 1535665 INFO  (TEST-FullSolrCloudDistribCmdsTest.test-seed#[2B150420ABF229A6]) [    ] o.a.s.s.SolrDispatchFilter  ___      _       Welcome to Apache Solr™ version 8.0.0
   [junit4]   2> 1535665 INFO  (TEST-FullSolrCloudDistribCmdsTest.test-seed#[2B150420ABF229A6]) [    ] o.a.s.s.SolrDispatchFilter / __| ___| |_ _   Starting in cloud mode on port null
   [junit4]   2> 1535665 INFO  (TEST-FullSolrCloudDistribCmdsTest.test-seed#[2B150420ABF229A6]) [    ] o.a.s.s.SolrDispatchFilter \__ \/ _ \ | '_|  Install dir: null
   [junit4]   2> 1535665 INFO  (TEST-FullSolrCloudDistribCmdsTest.test-seed#[2B150420ABF229A6]) [    ] o.a.s.s.SolrDispatchFilter |___/\___/_|_|    Start time: 2018-01-27T11:09:06.764666Z
   [junit4]   2> 1535667 INFO  (zkConnectionManagerCallback-2029-thread-1) [    ] o.a.s.c.c.ConnectionManager zkClient has connected
   [junit4]   2> 1535668 INFO  (TEST-FullSolrCloudDistribCmdsTest.test-seed#[2B150420ABF229A6]) [    ] o.a.s.s.SolrDispatchFilter Loading solr.xml from SolrHome (not found in ZooKeeper)
   [junit4]   2> 1535669 INFO  (TEST-FullSolrCloudDistribCmdsTest.test-seed#[2B150420ABF229A6]) [    ] o.a.s.c.SolrXmlConfig Loading container configuration from /Users/jenkins/workspace/Lucene-Solr-master-MacOSX/solr/build/solr-core/test/J1/temp/solr.cloud.FullSolrCloudDistribCmdsTest_2B150420ABF229A6-001/shard-3-001/solr.xml
   [junit4]   2> 1535670 INFO  (TEST-FullSolrCloudDistribCmdsTest.test-seed#[2B150420ABF229A6]) [    ] o.a.s.c.SolrXmlConfig Configuration parameter autoReplicaFailoverWorkLoopDelay is ignored
   [junit4]   2> 1535670 INFO  (TEST-FullSolrCloudDistribCmdsTest.test-seed#[2B150420ABF229A6]) [    ] o.a.s.c.SolrXmlConfig Configuration parameter autoReplicaFailoverBadNodeExpiration is ignored
   [junit4]   2> 1535671 INFO  (TEST-FullSolrCloudDistribCmdsTest.test-seed#[2B150420ABF229A6]) [    ] o.a.s.c.SolrXmlConfig MBean server found: com.sun.jmx.mbeanserver.JmxMBeanServer@cb64a06, but no JMX reporters were configured - adding default JMX reporter.
   [junit4]   2> 1535674 INFO  (TEST-FullSolrCloudDistribCmdsTest.test-seed#[2B150420ABF229A6]) [    ] o.a.s.c.ZkContainer Zookeeper client=127.0.0.1:61747/solr
   [junit4]   2> 1535675 INFO  (zkConnectionManagerCallback-2033-thread-1) [    ] o.a.s.c.c.ConnectionManager zkClient has connected
   [junit4]   2> 1535677 INFO  (zkConnectionManagerCallback-2035-thread-1-processing-n:127.0.0.1:61796__ta) [n:127.0.0.1:61796__ta    ] o.a.s.c.c.ConnectionManager zkClient has connected
   [junit4]   2> 1535687 INFO  (TEST-FullSolrCloudDistribCmdsTest.test-seed#[2B150420ABF229A6]) [n:127.0.0.1:61796__ta    ] o.a.s.c.c.ZkStateReader Updated live nodes from ZooKeeper... (0) -> (3)
   [junit4]   2> 1535690 INFO  (TEST-FullSolrCloudDistribCmdsTest.test-seed#[2B150420ABF229A6]) [n:127.0.0.1:61796__ta    ] o.a.s.c.Overseer Overseer (id=null) closing
   [junit4]   2> 1535693 INFO  (TEST-FullSolrCloudDistribCmdsTest.test-seed#[2B150420ABF229A6]) [n:127.0.0.1:61796__ta    ] o.a.s.c.ZkController Register node as live in ZooKeeper:/live_nodes/127.0.0.1:61796__ta
   [junit4]   2> 1535695 INFO  (zkCallback-1996-thread-1-processing-n:127.0.0.1:61753__ta) [n:127.0.0.1:61753__ta    ] o.a.s.c.c.ZkStateReader Updated live nodes from ZooKeeper... (3) -> (4)
   [junit4]   2> 1535695 INFO  (zkCallback-2014-thread-1-processing-n:127.0.0.1:61773__ta) [n:127.0.0.1:61773__ta    ] o.a.s.c.c.ZkStateReader Updated live nodes from ZooKeeper... (3) -> (4)
   [junit4]   2> 1535696 INFO  (zkCallback-2006-thread-1) [    ] o.a.s.c.c.ZkStateReader Updated live nodes from ZooKeeper... (3) -> (4)
   [junit4]   2> 1535696 INFO  (zkCallback-2024-thread-1-processing-n:127.0.0.1:61784__ta) [n:127.0.0.1:61784__ta    ] o.a.s.c.c.ZkStateReader Updated live nodes from ZooKeeper... (3) -> (4)
   [junit4]   2> 1535696 INFO  (zkCallback-2034-thread-1-processing-n:127.0.0.1:61796__ta) [n:127.0.0.1:61796__ta    ] o.a.s.c.c.ZkStateReader Updated live nodes from ZooKeeper... (3) -> (4)
   [junit4]   2> 1535732 INFO  (TEST-FullSolrCloudDistribCmdsTest.test-seed#[2B150420ABF229A6]) [n:127.0.0.1:61796__ta    ] o.a.s.m.r.SolrJmxReporter JMX monitoring for 'solr.node' (registry 'solr.node') enabled at server: com.sun.jmx.mbeanserver.JmxMBeanServer@cb64a06
   [junit4]   2> 1535741 INFO  (TEST-FullSolrCloudDistribCmdsTest.test-seed#[2B150420ABF229A6]) [n:127.0.0.1:61796__ta    ] o.a.s.m.r.SolrJmxReporter JMX monitoring for 'solr.jvm' (registry 'solr.jvm') enabled at server: com.sun.jmx.mbeanserver.JmxMBeanServer@cb64a06
   [junit4]   2> 1535741 INFO  (TEST-FullSolrCloudDistribCmdsTest.test-seed#[2B150420ABF229A6]) [n:127.0.0.1:61796__ta    ] o.a.s.m.r.SolrJmxReporter JMX monitoring for 'solr.jetty' (registry 'solr.jetty') enabled at server: com.sun.jmx.mbeanserver.JmxMBeanServer@cb64a06
   [junit4]   2> 1535743 INFO  (TEST-FullSolrCloudDistribCmdsTest.test-seed#[2B150420ABF229A6]) [n:127.0.0.1:61796__ta    ] o.a.s.c.CorePropertiesLocator Found 0 core definitions underneath /Users/jenkins/workspace/Lucene-Solr-master-MacOSX/solr/build/solr-core/test/J1/../../../../../../../../../Users/jenkins/workspace/Lucene-Solr-master-MacOSX/solr/build/solr-core/test/J1/temp/solr.cloud.FullSolrCloudDistribCmdsTest_2B150420ABF229A6-001/shard-3-001/cores
   [junit4]   2> 1535783 INFO  (qtp1696281420-11003) [n:127.0.0.1:61753__ta    ] o.a.s.h.a.CollectionsHandler Invoked Collection Action :addreplica with params node=127.0.0.1:61796__ta&action=ADDREPLICA&collection=collection1&shard=shard1&type=NRT&wt=javabin&version=2 and sendToOCPQueue=true
   [junit4]   2> 1535786 INFO  (OverseerCollectionConfigSetProcessor-99421476596023300-127.0.0.1:61753__ta-n_0000000000) [n:127.0.0.1:61753__ta    ] o.a.s.c.OverseerTaskQueue Response ZK path: /overseer/collection-queue-work/qnr-0000000006 doesn't exist.  Requestor may have disconnected from ZooKeeper
   [junit4]   2> 1535786 INFO  (OverseerThreadFactory-3973-thread-5-processing-n:127.0.0.1:61753__ta) [n:127.0.0.1:61753__ta    ] o.a.s.c.a.c.AddReplicaCmd Node Identified 127.0.0.1:61796__ta for creating new replica
   [junit4]   2> 1535790 INFO  (qtp2120368932-11112) [n:127.0.0.1:61796__ta    ] o.a.s.h.a.CoreAdminOperation core create command qt=/admin/cores&collection.configName=conf1&name=collection1_shard1_replica_n65&action=CREATE&collection=collection1&shard=shard1&wt=javabin&version=2&replicaType=NRT
   [junit4]   2> 1535791 INFO  (qtp2120368932-11112) [n:127.0.0.1:61796__ta    ] o.a.s.c.TransientSolrCoreCacheDefault Allocating transient cache for 4 transient cores
   [junit4]   2> 1536813 INFO  (qtp2120368932-11112) [n:127.0.0.1:6179

[...truncated too long message...]

  [junit4]   2> 
   [junit4]   2> 	149	/solr/collections/collection1/state.json
   [junit4]   2> 	21	/solr/clusterstate.json
   [junit4]   2> 	13	/solr/collections/testMetricTrigger/state.json
   [junit4]   2> 	6	/solr/autoscaling.json
   [junit4]   2> 	5	/solr/overseer_elect/election/99421602739912739-127.0.0.1:54033_solr-n_0000000010
   [junit4]   2> 	3	/solr/overseer_elect/election/99421602739912733-127.0.0.1:54025_solr-n_0000000008
   [junit4]   2> 	3	/solr/collections/collection1/leader_elect/shard1/election/99421602739912724-core_node6-n_0000000002
   [junit4]   2> 	2	/solr/overseer_elect/election/99421602739912751-127.0.0.1:54308_solr-n_0000000014
   [junit4]   2> 	2	/solr/collections/collection1/leader_elect/shard1/election/99421602739912730-core_node3-n_0000000000
   [junit4]   2> 	2	/solr/collections/collection1/leader_elect/shard1/election/99421602739912733-core_node10-n_0000000004
   [junit4]   2> 	2	/solr/overseer_elect/election/99421602739912727-127.0.0.1:53965_solr-n_0000000006
   [junit4]   2> 	2	/solr/overseer_elect/election/99421602739912730-127.0.0.1:54003_solr-n_0000000007
   [junit4]   2> 
   [junit4]   2> Maximum concurrent children watches above limit:
   [junit4]   2> 
   [junit4]   2> 	21	/solr/live_nodes
   [junit4]   2> 	21	/solr/collections
   [junit4]   2> 	6	/solr/overseer/queue-work
   [junit4]   2> 	6	/solr/autoscaling/events/.auto_add_replicas
   [junit4]   2> 	6	/solr/overseer/queue
   [junit4]   2> 	6	/solr/overseer/collection-queue-work
   [junit4]   2> 	2	/solr/autoscaling/events/node_lost_triggerMR
   [junit4]   2> 	2	/solr/autoscaling/events/node_added_triggerCTOOR
   [junit4]   2> 
   [junit4]   2> NOTE: leaving temporary files on disk at: /Users/jenkins/workspace/Lucene-Solr-master-MacOSX/solr/build/solr-core/test/J1/temp/solr.cloud.autoscaling.TriggerIntegrationTest_2B150420ABF229A6-001
   [junit4]   2> NOTE: test params are: codec=Asserting(Lucene70), sim=Asserting(org.apache.lucene.search.similarities.AssertingSimilarity@13ac42b1), locale=mas-TZ, timezone=Asia/Novosibirsk
   [junit4]   2> NOTE: Mac OS X 10.11.6 x86_64/Oracle Corporation 9 (64-bit)/cpus=3,threads=1,free=229951592,total=514850816
   [junit4]   2> NOTE: All tests run in this JVM: [ClusterStateUpdateTest, HdfsDirectoryTest, TestSchemaNameResource, TestRandomDVFaceting, TestUninvertingReader, ClassificationUpdateProcessorIntegrationTest, TestLRUCache, TestHashPartitioner, TestDownShardTolerantSearch, SpellCheckCollatorTest, DeleteStatusTest, SortByFunctionTest, TestManagedResourceStorage, ClusterStateTest, HttpTriggerListenerTest, TestAuthorizationFramework, RollingRestartTest, CdcrReplicationDistributedZkTest, TestEmbeddedSolrServerConstructors, SegmentsInfoRequestHandlerTest, TestCodecSupport, TestNumericRangeQuery32, UUIDFieldTest, JvmMetricsTest, RequestLoggingTest, FileBasedSpellCheckerTest, JsonLoaderTest, TestRecoveryHdfs, ReturnFieldsTest, TestFieldCacheSortRandom, ReplicaListTransformerTest, UpdateRequestProcessorFactoryTest, TestPerFieldSimilarityWithDefaultOverride, CSVRequestHandlerTest, TestFastWriter, CachingDirectoryFactoryTest, TestSolrDeletionPolicy2, PeerSyncReplicationTest, TestDistributedMissingSort, TestHdfsCloudBackupRestore, TestWordDelimiterFilterFactory, SubstringBytesRefFilterTest, BadComponentTest, QueryParsingTest, TestBlobHandler, AnalysisErrorHandlingTest, BlockJoinFacetSimpleTest, JavabinLoaderTest, AssignTest, DirectUpdateHandlerTest, CollectionTooManyReplicasTest, UninvertDocValuesMergePolicyTest, TestInPlaceUpdatesDistrib, SolrSlf4jReporterTest, ShardRoutingTest, CurrencyRangeFacetCloudTest, TestQueryWrapperFilter, TestCloudSearcherWarming, NodeAddedTriggerTest, OverseerStatusTest, ManagedSchemaRoundRobinCloudTest, TestTlogReplica, TestDeleteCollectionOnDownNodes, TestAnalyzedSuggestions, TestClusterStateProvider, TestSmileRequest, TestSort, TestConfigSetsAPIZkFailure, TestManagedSchemaThreadSafety, TestClusterStateMutator, DistribDocExpirationUpdateProcessorTest, ShardSplitTest, TestSolrQueryResponse, RegexBoostProcessorTest, TemplateUpdateProcessorTest, ShowFileRequestHandlerTest, TestPolicyCloud, DistributedQueueTest, IndexSchemaTest, TestHighFrequencyDictionaryFactory, SolrCoreCheckLockOnStartupTest, TestLRUStatsCache, TestSolrCloudWithDelegationTokens, PreAnalyzedUpdateProcessorTest, TestStressReorder, TestComponentsName, TestObjectReleaseTracker, TestLegacyTerms, TestUseDocValuesAsStored, DebugComponentTest, SolrJmxReporterCloudTest, TestJsonFacetRefinement, TestPivotHelperCode, TestCSVLoader, TestPHPSerializedResponseWriter, TestStressLucene, TestReplicaProperties, BooleanFieldTest, SimpleMLTQParserTest, HdfsChaosMonkeyNothingIsSafeTest, DocValuesMultiTest, TestQuerySenderListener, FullSolrCloudDistribCmdsTest, TestMissingGroups, RequestHandlersTest, DisMaxRequestHandlerTest, ExternalFileFieldSortTest, SimpleFacetsTest, PropertiesRequestHandlerTest, BlobRepositoryCloudTest, TestTriggerIntegration, TestCloudManagedSchema, TestLMDirichletSimilarityFactory, TestSolrCLIRunExample, MinimalSchemaTest, SliceStateTest, TestSolrCloudSnapshots, TestCorePropertiesReload, TestNumericTokenStream, TestNumericTerms32, ExecutePlanActionTest, TestValueSourceCache, HealthCheckHandlerTest, TestSolrQueryParser, SimplePostToolTest, CoreAdminHandlerTest, TestUnifiedSolrHighlighter, MoveReplicaHDFSFailoverTest, HLLUtilTest, AnalyticsMergeStrategyTest, XsltUpdateRequestHandlerTest, AutoscalingHistoryHandlerTest, DistributedQueryComponentOptimizationTest, QueryResultKeyTest, LeaderElectionContextKeyTest, CleanupOldIndexTest, UpdateParamsTest, TestShardHandlerFactory, TestDistribStateManager, TestLuceneMatchVersion, TestSolrIndexConfig, TestReplicationHandlerBackup, TestConfigOverlay, TestSimpleTrackingShardHandler, TestStandardQParsers, TestFieldCacheReopen, TestPayloadCheckQParserPlugin, OverseerModifyCollectionTest, URLClassifyProcessorTest, ZkStateWriterTest, BigEndianAscendingWordDeserializerTest, TestSolrConfigHandler, SaslZkACLProviderTest, TestDFRSimilarityFactory, AtomicUpdatesTest, TestSizeLimitedDistributedMap, TestSerializedLuceneMatchVersion, TestGenericDistributedQueue, SyncSliceTest, TestMacroExpander, TestSubQueryTransformer, IndexBasedSpellCheckerTest, CoreAdminRequestStatusTest, NodeMutatorTest, ChaosMonkeySafeLeaderTest, TestDynamicFieldCollectionResource, PrimUtilsTest, AddSchemaFieldsUpdateProcessorFactoryTest, CurrencyFieldTypeTest, TestExceedMaxTermLength, CheckHdfsIndexTest, CustomHighlightComponentTest, TestCollationFieldDocValues, TestDelegationWithHadoopAuth, TestLegacyFieldReuse, TestSearchPerf, PeerSyncTest, TestDocTermOrds, TestMinMaxOnMultiValuedField, TimeRoutedAliasUpdateProcessorTest, SystemInfoHandlerTest, TestFileDictionaryLookup, InfoHandlerTest, SolrXmlInZkTest, BitVectorTest, RuleEngineTest, TestJsonRequest, TestCloudPseudoReturnFields, MigrateRouteKeyTest, TestDistributedGrouping, ZkControllerTest, TestStressVersions, DistributedTermsComponentTest, StatsComponentTest, QueryElevationComponentTest, BasicFunctionalityTest, TestLazyCores, DistributedQueryElevationComponentTest, SolrIndexSplitterTest, TestCoreDiscovery, AnalysisAfterCoreReloadTest, TestExtendedDismaxParser, SolrRequestParserTest, TestFoldingMultitermQuery, DocValuesTest, SuggesterTSTTest, SuggesterTest, SpatialFilterTest, SuggesterWFSTTest, PolyFieldTest, NoCacheHeaderTest, WordBreakSolrSpellCheckerTest, SchemaVersionSpecificBehaviorTest, TestPseudoReturnFields, TestUpdate, FieldMutatingUpdateProcessorTest, TestAtomicUpdateErrorCases, DirectUpdateHandlerOptimizeTest, DefaultValueUpdateProcessorTest, TestRemoteStreaming, DistanceFunctionTest, SolrInfoBeanTest, TestQueryUtils, TestWriterPerf, DirectSolrSpellCheckerTest, TestReversedWildcardFilterFactory, DocumentAnalysisRequestHandlerTest, PrimitiveFieldTypeTest, TermsComponentTest, XmlUpdateRequestHandlerTest, DocumentBuilderTest, PathHierarchyTokenizerFactoryTest, TermVectorComponentTest, TestIndexingPerformance, MoreLikeThisHandlerTest, RequiredFieldsTest, FieldAnalysisRequestHandlerTest, FastVectorHighlighterTest, LoggingHandlerTest, TestCSVResponseWriter, PingRequestHandlerTest, HighlighterConfigTest, AlternateDirectoryTest, TestQuerySenderNoQuery, ResponseLogComponentTest, TestStressRecovery, TestMergePolicyConfig, TestDocSet, TestBinaryField, TestElisionMultitermQuery, TestConfig, OutputWriterTest, TestFuzzyAnalyzedSuggestions, TestSolrCoreProperties, NotRequiredUniqueKeyTest, SpellPossibilityIteratorTest, EchoParamsTest, TestPerFieldSimilarity, TestLMJelinekMercerSimilarityFactory, TimeZoneUtilsTest, ResourceLoaderTest, ScriptEngineTest, OpenExchangeRatesOrgProviderTest, TestFastLRUCache, DateMathParserTest, ChaosMonkeyNothingIsSafeTest, AssignBackwardCompatibilityTest, ChaosMonkeyNothingIsSafeWithPullReplicasTest, CloudExitableDirectoryReaderTest, CollectionStateFormat2Test, ConcurrentCreateRoutedAliasTest, ConfigSetsAPITest, ConnectionManagerTest, CreateRoutedAliasTest, DeleteLastCustomShardedReplicaTest, DeleteReplicaTest, DeleteShardTest, DistribCursorPagingTest, DistribJoinFromCollectionTest, DistributedVersionInfoTest, HttpPartitionTest, LeaderInitiatedRecoveryOnCommitTest, MultiThreadedOCPTest, TestCloudDeleteByQuery, TestCloudJSONFacetJoinDomain, TestDistribDocBasedVersion, TestExclusionRuleCollectionAccess, TestLeaderElectionWithEmptyReplica, TestLeaderInitiatedRecoveryThread, TestOnReconnectListenerSupport, TestPullReplicaErrorHandling, TestRandomRequestDistribution, TestShortCircuitedRequests, TestSolrCloudWithKerberosAlt, TestSolrCloudWithSecureImpersonation, TestStressInPlaceUpdates, CollectionReloadTest, CollectionsAPIAsyncDistributedZkTest, ConcurrentDeleteAndCreateCollectionTest, CustomCollectionTest, HdfsCollectionsAPIDistributedZkTest, SimpleCollectionCreateDeleteTest, TestCollectionAPI, TestRequestStatusCollectionAPI, AutoAddReplicasIntegrationTest, SystemLogListenerTest, TriggerIntegrationTest]
   [junit4] Completed [621/770 (3!)] on J1 in 190.62s, 14 tests, 2 failures <<< FAILURES!

[...truncated 41308 lines...]

Mime
View raw message