lucene-dev mailing list archives

Site index · List index
Message view « Date » · « Thread »
Top « Date » · « Thread »
From Policeman Jenkins Server <jenk...@thetaphi.de>
Subject [JENKINS] Lucene-Solr-7.x-Solaris (64bit/jdk1.8.0) - Build # 369 - Still Unstable!
Date Tue, 02 Jan 2018 18:40:07 GMT
Build: https://jenkins.thetaphi.de/job/Lucene-Solr-7.x-Solaris/369/
Java: 64bit/jdk1.8.0 -XX:-UseCompressedOops -XX:+UseSerialGC

1 tests failed.
FAILED:  junit.framework.TestSuite.org.apache.solr.cloud.TestSolrCloudWithSecureImpersonation

Error Message:
1 thread leaked from SUITE scope at org.apache.solr.cloud.TestSolrCloudWithSecureImpersonation:     1) Thread[id=32124, name=jetty-launcher-8334-thread-1-EventThread, state=TIMED_WAITING, group=TGRP-TestSolrCloudWithSecureImpersonation]         at sun.misc.Unsafe.park(Native Method)         at java.util.concurrent.locks.LockSupport.parkNanos(LockSupport.java:215)         at java.util.concurrent.locks.AbstractQueuedSynchronizer.doAcquireSharedNanos(AbstractQueuedSynchronizer.java:1037)         at java.util.concurrent.locks.AbstractQueuedSynchronizer.tryAcquireSharedNanos(AbstractQueuedSynchronizer.java:1328)         at java.util.concurrent.CountDownLatch.await(CountDownLatch.java:277)         at org.apache.curator.CuratorZookeeperClient.internalBlockUntilConnectedOrTimedOut(CuratorZookeeperClient.java:323)         at org.apache.curator.RetryLoop.callWithRetry(RetryLoop.java:105)         at org.apache.curator.framework.imps.GetDataBuilderImpl.pathInForeground(GetDataBuilderImpl.java:288)         at org.apache.curator.framework.imps.GetDataBuilderImpl.forPath(GetDataBuilderImpl.java:279)         at org.apache.curator.framework.imps.GetDataBuilderImpl.forPath(GetDataBuilderImpl.java:41)         at org.apache.curator.framework.recipes.shared.SharedValue.readValue(SharedValue.java:244)         at org.apache.curator.framework.recipes.shared.SharedValue.access$100(SharedValue.java:44)         at org.apache.curator.framework.recipes.shared.SharedValue$1.process(SharedValue.java:61)         at org.apache.curator.framework.imps.NamespaceWatcher.process(NamespaceWatcher.java:67)         at org.apache.zookeeper.ClientCnxn$EventThread.processEvent(ClientCnxn.java:530)         at org.apache.zookeeper.ClientCnxn$EventThread.run(ClientCnxn.java:505)

Stack Trace:
com.carrotsearch.randomizedtesting.ThreadLeakError: 1 thread leaked from SUITE scope at org.apache.solr.cloud.TestSolrCloudWithSecureImpersonation: 
   1) Thread[id=32124, name=jetty-launcher-8334-thread-1-EventThread, state=TIMED_WAITING, group=TGRP-TestSolrCloudWithSecureImpersonation]
        at sun.misc.Unsafe.park(Native Method)
        at java.util.concurrent.locks.LockSupport.parkNanos(LockSupport.java:215)
        at java.util.concurrent.locks.AbstractQueuedSynchronizer.doAcquireSharedNanos(AbstractQueuedSynchronizer.java:1037)
        at java.util.concurrent.locks.AbstractQueuedSynchronizer.tryAcquireSharedNanos(AbstractQueuedSynchronizer.java:1328)
        at java.util.concurrent.CountDownLatch.await(CountDownLatch.java:277)
        at org.apache.curator.CuratorZookeeperClient.internalBlockUntilConnectedOrTimedOut(CuratorZookeeperClient.java:323)
        at org.apache.curator.RetryLoop.callWithRetry(RetryLoop.java:105)
        at org.apache.curator.framework.imps.GetDataBuilderImpl.pathInForeground(GetDataBuilderImpl.java:288)
        at org.apache.curator.framework.imps.GetDataBuilderImpl.forPath(GetDataBuilderImpl.java:279)
        at org.apache.curator.framework.imps.GetDataBuilderImpl.forPath(GetDataBuilderImpl.java:41)
        at org.apache.curator.framework.recipes.shared.SharedValue.readValue(SharedValue.java:244)
        at org.apache.curator.framework.recipes.shared.SharedValue.access$100(SharedValue.java:44)
        at org.apache.curator.framework.recipes.shared.SharedValue$1.process(SharedValue.java:61)
        at org.apache.curator.framework.imps.NamespaceWatcher.process(NamespaceWatcher.java:67)
        at org.apache.zookeeper.ClientCnxn$EventThread.processEvent(ClientCnxn.java:530)
        at org.apache.zookeeper.ClientCnxn$EventThread.run(ClientCnxn.java:505)
	at __randomizedtesting.SeedInfo.seed([9FDD6D638E5433F9]:0)




Build Log:
[...truncated 13461 lines...]
   [junit4] Suite: org.apache.solr.cloud.TestSolrCloudWithSecureImpersonation
   [junit4]   2> 3230640 INFO  (SUITE-TestSolrCloudWithSecureImpersonation-seed#[9FDD6D638E5433F9]-worker) [    ] o.a.s.SolrTestCaseJ4 SecureRandom sanity checks: test.solr.allowed.securerandom=null & java.security.egd=file:/dev/./urandom
   [junit4]   2> Creating dataDir: /export/home/jenkins/workspace/Lucene-Solr-7.x-Solaris/solr/build/solr-core/test/J0/temp/solr.cloud.TestSolrCloudWithSecureImpersonation_9FDD6D638E5433F9-001/init-core-data-001
   [junit4]   2> 3230640 WARN  (SUITE-TestSolrCloudWithSecureImpersonation-seed#[9FDD6D638E5433F9]-worker) [    ] o.a.s.SolrTestCaseJ4 startTrackingSearchers: numOpens=12 numCloses=12
   [junit4]   2> 3230641 INFO  (SUITE-TestSolrCloudWithSecureImpersonation-seed#[9FDD6D638E5433F9]-worker) [    ] o.a.s.SolrTestCaseJ4 Using TrieFields (NUMERIC_POINTS_SYSPROP=false) w/NUMERIC_DOCVALUES_SYSPROP=true
   [junit4]   2> 3230642 INFO  (SUITE-TestSolrCloudWithSecureImpersonation-seed#[9FDD6D638E5433F9]-worker) [    ] o.a.s.SolrTestCaseJ4 Randomized ssl (false) and clientAuth (false) via: @org.apache.solr.util.RandomizeSSL(reason=, value=NaN, ssl=NaN, clientAuth=NaN)
   [junit4]   2> 3230667 INFO  (SUITE-TestSolrCloudWithSecureImpersonation-seed#[9FDD6D638E5433F9]-worker) [    ] o.a.s.c.MiniSolrCloudCluster Starting cluster of 2 servers in /export/home/jenkins/workspace/Lucene-Solr-7.x-Solaris/solr/build/solr-core/test/J0/temp/solr.cloud.TestSolrCloudWithSecureImpersonation_9FDD6D638E5433F9-001/tempDir-001
   [junit4]   2> 3230667 INFO  (SUITE-TestSolrCloudWithSecureImpersonation-seed#[9FDD6D638E5433F9]-worker) [    ] o.a.s.c.ZkTestServer STARTING ZK TEST SERVER
   [junit4]   2> 3230667 INFO  (Thread-7269) [    ] o.a.s.c.ZkTestServer client port:0.0.0.0/0.0.0.0:0
   [junit4]   2> 3230667 INFO  (Thread-7269) [    ] o.a.s.c.ZkTestServer Starting server
   [junit4]   2> 3230669 ERROR (Thread-7269) [    ] o.a.z.s.ZooKeeperServer ZKShutdownHandler is not registered, so ZooKeeper server won't take any action on ERROR or SHUTDOWN server state changes
   [junit4]   2> 3230767 INFO  (SUITE-TestSolrCloudWithSecureImpersonation-seed#[9FDD6D638E5433F9]-worker) [    ] o.a.s.c.ZkTestServer start zk server on port:60386
   [junit4]   2> 3230771 INFO  (zkConnectionManagerCallback-8337-thread-1) [    ] o.a.s.c.c.ConnectionManager zkClient has connected
   [junit4]   2> 3230781 INFO  (jetty-launcher-8334-thread-2) [    ] o.e.j.s.Server jetty-9.3.20.v20170531
   [junit4]   2> 3230781 INFO  (jetty-launcher-8334-thread-1) [    ] o.e.j.s.Server jetty-9.3.20.v20170531
   [junit4]   2> 3230783 INFO  (jetty-launcher-8334-thread-2) [    ] o.e.j.s.h.ContextHandler Started o.e.j.s.ServletContextHandler@17384aa4{/solr,null,AVAILABLE}
   [junit4]   2> 3230811 INFO  (jetty-launcher-8334-thread-1) [    ] o.e.j.s.h.ContextHandler Started o.e.j.s.ServletContextHandler@3220d869{/solr,null,AVAILABLE}
   [junit4]   2> 3230811 INFO  (jetty-launcher-8334-thread-2) [    ] o.e.j.s.AbstractConnector Started ServerConnector@1021e432{HTTP/1.1,[http/1.1]}{127.0.0.1:44728}
   [junit4]   2> 3230812 INFO  (jetty-launcher-8334-thread-2) [    ] o.e.j.s.Server Started @3235378ms
   [junit4]   2> 3230812 INFO  (jetty-launcher-8334-thread-2) [    ] o.a.s.c.s.e.JettySolrRunner Jetty properties: {hostContext=/solr, hostPort=44728}
   [junit4]   2> 3230812 ERROR (jetty-launcher-8334-thread-2) [    ] o.a.s.u.StartupLoggingUtils Missing Java Option solr.log.dir. Logging may be missing or incomplete.
   [junit4]   2> 3230812 INFO  (jetty-launcher-8334-thread-2) [    ] o.a.s.s.SolrDispatchFilter  ___      _       Welcome to Apache Solr? version 7.3.0
   [junit4]   2> 3230812 INFO  (jetty-launcher-8334-thread-2) [    ] o.a.s.s.SolrDispatchFilter / __| ___| |_ _   Starting in cloud mode on port null
   [junit4]   2> 3230812 INFO  (jetty-launcher-8334-thread-2) [    ] o.a.s.s.SolrDispatchFilter \__ \/ _ \ | '_|  Install dir: null
   [junit4]   2> 3230812 INFO  (jetty-launcher-8334-thread-2) [    ] o.a.s.s.SolrDispatchFilter |___/\___/_|_|    Start time: 2018-01-02T18:06:32.529Z
   [junit4]   2> 3230813 INFO  (jetty-launcher-8334-thread-1) [    ] o.e.j.s.AbstractConnector Started ServerConnector@2898f7d0{HTTP/1.1,[http/1.1]}{127.0.0.1:38021}
   [junit4]   2> 3230813 INFO  (jetty-launcher-8334-thread-1) [    ] o.e.j.s.Server Started @3235379ms
   [junit4]   2> 3230813 INFO  (jetty-launcher-8334-thread-1) [    ] o.a.s.c.s.e.JettySolrRunner Jetty properties: {hostContext=/solr, hostPort=38021}
   [junit4]   2> 3230813 ERROR (jetty-launcher-8334-thread-1) [    ] o.a.s.u.StartupLoggingUtils Missing Java Option solr.log.dir. Logging may be missing or incomplete.
   [junit4]   2> 3230813 INFO  (jetty-launcher-8334-thread-1) [    ] o.a.s.s.SolrDispatchFilter  ___      _       Welcome to Apache Solr? version 7.3.0
   [junit4]   2> 3230813 INFO  (jetty-launcher-8334-thread-1) [    ] o.a.s.s.SolrDispatchFilter / __| ___| |_ _   Starting in cloud mode on port null
   [junit4]   2> 3230813 INFO  (jetty-launcher-8334-thread-1) [    ] o.a.s.s.SolrDispatchFilter \__ \/ _ \ | '_|  Install dir: null
   [junit4]   2> 3230813 INFO  (jetty-launcher-8334-thread-1) [    ] o.a.s.s.SolrDispatchFilter |___/\___/_|_|    Start time: 2018-01-02T18:06:32.530Z
   [junit4]   2> 3230817 INFO  (zkConnectionManagerCallback-8341-thread-1) [    ] o.a.s.c.c.ConnectionManager zkClient has connected
   [junit4]   2> 3230817 INFO  (jetty-launcher-8334-thread-1) [    ] o.a.s.s.SolrDispatchFilter solr.xml found in ZooKeeper. Loading...
   [junit4]   2> 3230820 INFO  (zkConnectionManagerCallback-8339-thread-1) [    ] o.a.s.c.c.ConnectionManager zkClient has connected
   [junit4]   2> 3230821 INFO  (jetty-launcher-8334-thread-2) [    ] o.a.s.s.SolrDispatchFilter solr.xml found in ZooKeeper. Loading...
   [junit4]   2> 3230826 INFO  (jetty-launcher-8334-thread-1) [    ] o.a.s.c.ZkContainer Zookeeper client=127.0.0.1:60386/solr
   [junit4]   2> 3230828 INFO  (zkConnectionManagerCallback-8345-thread-1) [    ] o.a.s.c.c.ConnectionManager zkClient has connected
   [junit4]   2> 3230828 INFO  (jetty-launcher-8334-thread-2) [    ] o.a.s.c.ZkContainer Zookeeper client=127.0.0.1:60386/solr
   [junit4]   2> 3230829 INFO  (zkConnectionManagerCallback-8349-thread-1) [    ] o.a.s.c.c.ConnectionManager zkClient has connected
   [junit4]   2> 3230831 INFO  (zkConnectionManagerCallback-8351-thread-1-processing-n:127.0.0.1:38021_solr) [n:127.0.0.1:38021_solr    ] o.a.s.c.c.ConnectionManager zkClient has connected
   [junit4]   2> 3230832 INFO  (zkConnectionManagerCallback-8353-thread-1-processing-n:127.0.0.1:44728_solr) [n:127.0.0.1:44728_solr    ] o.a.s.c.c.ConnectionManager zkClient has connected
   [junit4]   2> 3230965 INFO  (jetty-launcher-8334-thread-1) [n:127.0.0.1:38021_solr    ] o.a.s.c.Overseer Overseer (id=null) closing
   [junit4]   2> 3230966 INFO  (jetty-launcher-8334-thread-1) [n:127.0.0.1:38021_solr    ] o.a.s.c.OverseerElectionContext I am going to be the leader 127.0.0.1:38021_solr
   [junit4]   2> 3230966 INFO  (jetty-launcher-8334-thread-2) [n:127.0.0.1:44728_solr    ] o.a.s.c.Overseer Overseer (id=null) closing
   [junit4]   2> 3230967 INFO  (jetty-launcher-8334-thread-1) [n:127.0.0.1:38021_solr    ] o.a.s.c.Overseer Overseer (id=99281560691343365-127.0.0.1:38021_solr-n_0000000000) starting
   [junit4]   2> 3230968 INFO  (jetty-launcher-8334-thread-2) [n:127.0.0.1:44728_solr    ] o.a.s.c.ZkController Register node as live in ZooKeeper:/live_nodes/127.0.0.1:44728_solr
   [junit4]   2> 3230969 INFO  (zkCallback-8352-thread-1-processing-n:127.0.0.1:44728_solr) [n:127.0.0.1:44728_solr    ] o.a.s.c.c.ZkStateReader Updated live nodes from ZooKeeper... (0) -> (1)
   [junit4]   2> 3230970 INFO  (zkCallback-8350-thread-1-processing-n:127.0.0.1:38021_solr) [n:127.0.0.1:38021_solr    ] o.a.s.c.c.ZkStateReader Updated live nodes from ZooKeeper... (0) -> (1)
   [junit4]   2> 3230979 INFO  (jetty-launcher-8334-thread-1) [n:127.0.0.1:38021_solr    ] o.a.s.c.ZkController Register node as live in ZooKeeper:/live_nodes/127.0.0.1:38021_solr
   [junit4]   2> 3230980 INFO  (zkCallback-8352-thread-1-processing-n:127.0.0.1:44728_solr) [n:127.0.0.1:44728_solr    ] o.a.s.c.c.ZkStateReader Updated live nodes from ZooKeeper... (1) -> (2)
   [junit4]   2> 3230981 INFO  (zkCallback-8350-thread-1-processing-n:127.0.0.1:38021_solr) [n:127.0.0.1:38021_solr    ] o.a.s.c.c.ZkStateReader Updated live nodes from ZooKeeper... (1) -> (2)
   [junit4]   2> 3231041 INFO  (jetty-launcher-8334-thread-1) [n:127.0.0.1:38021_solr    ] o.a.s.c.CoreContainer Initializing authentication plugin: org.apache.solr.security.HttpParamDelegationTokenPlugin
   [junit4]   2> 3231041 WARN  (jetty-launcher-8334-thread-1) [n:127.0.0.1:38021_solr    ] o.a.s.c.s.i.Krb5HttpClientBuilder org.apache.solr.client.solrj.impl.Krb5HttpClientBuilder is configured without specifying system property 'java.security.auth.login.config'
   [junit4]   2> 3231041 INFO  (jetty-launcher-8334-thread-1) [n:127.0.0.1:38021_solr    ] o.a.s.s.KerberosPlugin Params: {solr.kerberos.impersonator.user.noGroups.hosts=*, solr.kerberos.impersonator.user.bogusGroup.groups=__some_bogus_group, token.valid=30, cookie.domain=127.0.0.1, solr.kerberos.impersonator.user.anyHostAnyUser.groups=*, solr.kerberos.impersonator.user.bogusGroup.hosts=*, solr.kerberos.impersonator.user.anyHostAnyUser.hosts=*, token.validity=36000, solr.kerberos.impersonator.user.noHosts.groups=*, type=kerberos, solr.kerberos.impersonator.user.localHostAnyGroup.groups=*, delegation-token.token-kind=solr-dt, solr.kerberos.impersonator.user.wrongHost.hosts=1.1.1.1.1.1, cookie.path=/, zk-dt-secret-manager.znodeWorkingPath=solr/security/zkdtsm, solr.kerberos.impersonator.user.localHostAnyGroup.hosts=serv1-vm3,localhost,127.0.0.1, signer.secret.provider.zookeeper.path=/token, solr.kerberos.impersonator.user.anyHostUsersGroup.groups=staff, zk-dt-secret-manager.enable=true, solr.kerberos.impersonator.user.wrongHost.groups=*, kerberos.name.rules=DEFAULT, signer.secret.provider=zookeeper, solr.kerberos.impersonator.user.anyHostUsersGroup.hosts=*}
   [junit4]   2> 3231043 INFO  (jetty-launcher-8334-thread-1) [n:127.0.0.1:38021_solr    ] o.a.c.f.i.CuratorFrameworkImpl Starting
   [junit4]   2> 3231047 INFO  (jetty-launcher-8334-thread-1-EventThread) [n:127.0.0.1:38021_solr    ] o.a.c.f.s.ConnectionStateManager State change: CONNECTED
   [junit4]   2> 3231053 INFO  (jetty-launcher-8334-thread-2) [n:127.0.0.1:44728_solr    ] o.a.s.c.CoreContainer Initializing authentication plugin: org.apache.solr.security.HttpParamDelegationTokenPlugin
   [junit4]   2> 3231053 WARN  (jetty-launcher-8334-thread-2) [n:127.0.0.1:44728_solr    ] o.a.s.c.s.i.Krb5HttpClientBuilder org.apache.solr.client.solrj.impl.Krb5HttpClientBuilder is configured without specifying system property 'java.security.auth.login.config'
   [junit4]   2> 3231053 INFO  (jetty-launcher-8334-thread-2) [n:127.0.0.1:44728_solr    ] o.a.s.s.KerberosPlugin Params: {solr.kerberos.impersonator.user.noGroups.hosts=*, solr.kerberos.impersonator.user.bogusGroup.groups=__some_bogus_group, token.valid=30, cookie.domain=127.0.0.1, solr.kerberos.impersonator.user.anyHostAnyUser.groups=*, solr.kerberos.impersonator.user.bogusGroup.hosts=*, solr.kerberos.impersonator.user.anyHostAnyUser.hosts=*, token.validity=36000, solr.kerberos.impersonator.user.noHosts.groups=*, type=kerberos, solr.kerberos.impersonator.user.localHostAnyGroup.groups=*, delegation-token.token-kind=solr-dt, solr.kerberos.impersonator.user.wrongHost.hosts=1.1.1.1.1.1, cookie.path=/, zk-dt-secret-manager.znodeWorkingPath=solr/security/zkdtsm, solr.kerberos.impersonator.user.localHostAnyGroup.hosts=serv1-vm3,localhost,127.0.0.1, signer.secret.provider.zookeeper.path=/token, solr.kerberos.impersonator.user.anyHostUsersGroup.groups=staff, zk-dt-secret-manager.enable=true, solr.kerberos.impersonator.user.wrongHost.groups=*, kerberos.name.rules=DEFAULT, signer.secret.provider=zookeeper, solr.kerberos.impersonator.user.anyHostUsersGroup.hosts=*}
   [junit4]   2> 3231054 INFO  (jetty-launcher-8334-thread-2) [n:127.0.0.1:44728_solr    ] o.a.c.f.i.CuratorFrameworkImpl Starting
   [junit4]   2> 3231057 INFO  (jetty-launcher-8334-thread-2-EventThread) [n:127.0.0.1:44728_solr    ] o.a.c.f.s.ConnectionStateManager State change: CONNECTED
   [junit4]   2> 3231070 WARN  (jetty-launcher-8334-thread-1) [n:127.0.0.1:38021_solr    ] o.a.s.c.s.i.Krb5HttpClientBuilder org.apache.solr.client.solrj.impl.Krb5HttpClientBuilder is configured without specifying system property 'java.security.auth.login.config'
   [junit4]   2> 3231079 WARN  (jetty-launcher-8334-thread-2) [n:127.0.0.1:44728_solr    ] o.a.s.c.s.i.Krb5HttpClientBuilder org.apache.solr.client.solrj.impl.Krb5HttpClientBuilder is configured without specifying system property 'java.security.auth.login.config'
   [junit4]   2> 3231114 INFO  (jetty-launcher-8334-thread-1) [n:127.0.0.1:38021_solr    ] o.a.s.m.r.SolrJmxReporter JMX monitoring for 'solr_38021.solr.node' (registry 'solr.node') enabled at server: com.sun.jmx.mbeanserver.JmxMBeanServer@aada5dd
   [junit4]   2> 3231114 INFO  (jetty-launcher-8334-thread-2) [n:127.0.0.1:44728_solr    ] o.a.s.m.r.SolrJmxReporter JMX monitoring for 'solr_44728.solr.node' (registry 'solr.node') enabled at server: com.sun.jmx.mbeanserver.JmxMBeanServer@aada5dd
   [junit4]   2> 3231120 INFO  (jetty-launcher-8334-thread-1) [n:127.0.0.1:38021_solr    ] o.a.s.m.r.SolrJmxReporter JMX monitoring for 'solr_38021.solr.jvm' (registry 'solr.jvm') enabled at server: com.sun.jmx.mbeanserver.JmxMBeanServer@aada5dd
   [junit4]   2> 3231120 INFO  (jetty-launcher-8334-thread-2) [n:127.0.0.1:44728_solr    ] o.a.s.m.r.SolrJmxReporter JMX monitoring for 'solr_44728.solr.jvm' (registry 'solr.jvm') enabled at server: com.sun.jmx.mbeanserver.JmxMBeanServer@aada5dd
   [junit4]   2> 3231120 INFO  (jetty-launcher-8334-thread-1) [n:127.0.0.1:38021_solr    ] o.a.s.m.r.SolrJmxReporter JMX monitoring for 'solr_38021.solr.jetty' (registry 'solr.jetty') enabled at server: com.sun.jmx.mbeanserver.JmxMBeanServer@aada5dd
   [junit4]   2> 3231120 INFO  (jetty-launcher-8334-thread-2) [n:127.0.0.1:44728_solr    ] o.a.s.m.r.SolrJmxReporter JMX monitoring for 'solr_44728.solr.jetty' (registry 'solr.jetty') enabled at server: com.sun.jmx.mbeanserver.JmxMBeanServer@aada5dd
   [junit4]   2> 3231121 INFO  (jetty-launcher-8334-thread-1) [n:127.0.0.1:38021_solr    ] o.a.s.c.CorePropertiesLocator Found 0 core definitions underneath /export/home/jenkins/workspace/Lucene-Solr-7.x-Solaris/solr/build/solr-core/test/J0/temp/solr.cloud.TestSolrCloudWithSecureImpersonation_9FDD6D638E5433F9-001/tempDir-001/node1/.
   [junit4]   2> 3231121 INFO  (jetty-launcher-8334-thread-2) [n:127.0.0.1:44728_solr    ] o.a.s.c.CorePropertiesLocator Found 0 core definitions underneath /export/home/jenkins/workspace/Lucene-Solr-7.x-Solaris/solr/build/solr-core/test/J0/temp/solr.cloud.TestSolrCloudWithSecureImpersonation_9FDD6D638E5433F9-001/tempDir-001/node2/.
   [junit4]   2> 3231149 INFO  (zkConnectionManagerCallback-8359-thread-1) [    ] o.a.s.c.c.ConnectionManager zkClient has connected
   [junit4]   2> 3231169 INFO  (TEST-TestSolrCloudWithSecureImpersonation.testProxyWrongHost-seed#[9FDD6D638E5433F9]) [    ] o.a.s.SolrTestCaseJ4 ###Starting testProxyWrongHost
   [junit4]   2> 3235996 INFO  (TEST-TestSolrCloudWithSecureImpersonation.testProxyWrongHost-seed#[9FDD6D638E5433F9]) [    ] o.a.s.SolrTestCaseJ4 ###Ending testProxyWrongHost
   [junit4]   2> 3236036 INFO  (TEST-TestSolrCloudWithSecureImpersonation.testForwarding-seed#[9FDD6D638E5433F9]) [    ] o.a.s.SolrTestCaseJ4 ###Starting testForwarding
   [junit4]   2> 3236039 INFO  (zkConnectionManagerCallback-8362-thread-1) [    ] o.a.s.c.c.ConnectionManager zkClient has connected
   [junit4]   2> 3237108 WARN  (NIOServerCxn.Factory:0.0.0.0/0.0.0.0:0) [    ] o.a.z.s.NIOServerCnxn caught end of stream exception
   [junit4]   2> EndOfStreamException: Unable to read additional data from client sessionid 0x160b80dadc1000a, likely client has closed socket
   [junit4]   2> 	at org.apache.zookeeper.server.NIOServerCnxn.doIO(NIOServerCnxn.java:239)
   [junit4]   2> 	at org.apache.zookeeper.server.NIOServerCnxnFactory.run(NIOServerCnxnFactory.java:203)
   [junit4]   2> 	at java.lang.Thread.run(Thread.java:748)
   [junit4]   2> 3237110 INFO  (zkConnectionManagerCallback-8365-thread-1) [    ] o.a.s.c.c.ConnectionManager zkClient has connected
   [junit4]   2> 3237112 INFO  (TEST-TestSolrCloudWithSecureImpersonation.testForwarding-seed#[9FDD6D638E5433F9]) [    ] o.a.s.c.c.ZkStateReader Updated live nodes from ZooKeeper... (0) -> (2)
   [junit4]   2> 3237118 INFO  (TEST-TestSolrCloudWithSecureImpersonation.testForwarding-seed#[9FDD6D638E5433F9]) [    ] o.a.s.c.s.i.ZkClientClusterStateProvider Cluster at 127.0.0.1:60386/solr ready
   [junit4]   2> 3237123 INFO  (qtp87471674-32076) [n:127.0.0.1:44728_solr    ] o.a.s.h.a.CollectionsHandler Invoked Collection Action :create with params pullReplicas=0&replicationFactor=1&collection.configName=conf1&maxShardsPerNode=1&name=forwardingCollection&nrtReplicas=1&action=CREATE&numShards=1&tlogReplicas=0&wt=javabin&version=2 and sendToOCPQueue=true
   [junit4]   2> 3237128 INFO  (OverseerThreadFactory-12791-thread-1-processing-n:127.0.0.1:38021_solr) [n:127.0.0.1:38021_solr    ] o.a.s.c.CreateCollectionCmd Create collection forwardingCollection
   [junit4]   2> 3237245 INFO  (OverseerStateUpdate-99281560691343365-127.0.0.1:38021_solr-n_0000000000) [n:127.0.0.1:38021_solr    ] o.a.s.c.o.SliceMutator createReplica() {
   [junit4]   2>   "operation":"ADDREPLICA",
   [junit4]   2>   "collection":"forwardingCollection",
   [junit4]   2>   "shard":"shard1",
   [junit4]   2>   "core":"forwardingCollection_shard1_replica_n1",
   [junit4]   2>   "state":"down",
   [junit4]   2>   "base_url":"http://127.0.0.1:44728/solr",
   [junit4]   2>   "type":"NRT",
   [junit4]   2>   "waitForFinalState":"false"} 
   [junit4]   2> 3237448 INFO  (qtp87471674-32078) [n:127.0.0.1:44728_solr    ] o.a.s.h.a.CoreAdminOperation core create command qt=/admin/cores&coreNodeName=core_node2&collection.configName=conf1&newCollection=true&name=forwardingCollection_shard1_replica_n1&action=CREATE&numShards=1&collection=forwardingCollection&shard=shard1&wt=javabin&version=2&replicaType=NRT
   [junit4]   2> 3237449 INFO  (qtp87471674-32078) [n:127.0.0.1:44728_solr    ] o.a.s.c.TransientSolrCoreCacheDefault Allocating transient cache for 2147483647 transient cores
   [junit4]   2> 3237559 INFO  (zkCallback-8352-thread-1-processing-n:127.0.0.1:44728_solr) [n:127.0.0.1:44728_solr    ] o.a.s.c.c.ZkStateReader A cluster state change: [WatchedEvent state:SyncConnected type:NodeDataChanged path:/collections/forwardingCollection/state.json] for collection [forwardingCollection] has occurred - updating... (live nodes size: [2])
   [junit4]   2> 3237559 INFO  (zkCallback-8352-thread-2-processing-n:127.0.0.1:44728_solr) [n:127.0.0.1:44728_solr    ] o.a.s.c.c.ZkStateReader A cluster state change: [WatchedEvent state:SyncConnected type:NodeDataChanged path:/collections/forwardingCollection/state.json] for collection [forwardingCollection] has occurred - updating... (live nodes size: [2])
   [junit4]   2> 3238482 INFO  (qtp87471674-32078) [n:127.0.0.1:44728_solr c:forwardingCollection s:shard1 r:core_node2 x:forwardingCollection_shard1_replica_n1] o.a.s.c.SolrConfig Using Lucene MatchVersion: 7.3.0
   [junit4]   2> 3238511 INFO  (qtp87471674-32078) [n:127.0.0.1:44728_solr c:forwardingCollection s:shard1 r:core_node2 x:forwardingCollection_shard1_replica_n1] o.a.s.s.IndexSchema [forwardingCollection_shard1_replica_n1] Schema name=test
   [junit4]   2> 3238663 INFO  (qtp87471674-32078) [n:127.0.0.1:44728_solr c:forwardingCollection s:shard1 r:core_node2 x:forwardingCollection_shard1_replica_n1] o.a.s.s.IndexSchema Loaded schema test/1.0 with uniqueid field id
   [junit4]   2> 3238699 INFO  (qtp87471674-32078) [n:127.0.0.1:44728_solr c:forwardingCollection s:shard1 r:core_node2 x:forwardingCollection_shard1_replica_n1] o.a.s.c.CoreContainer Creating SolrCore 'forwardingCollection_shard1_replica_n1' using configuration from collection forwardingCollection, trusted=true
   [junit4]   2> 3238700 INFO  (qtp87471674-32078) [n:127.0.0.1:44728_solr c:forwardingCollection s:shard1 r:core_node2 x:forwardingCollection_shard1_replica_n1] o.a.s.m.r.SolrJmxReporter JMX monitoring for 'solr_44728.solr.core.forwardingCollection.shard1.replica_n1' (registry 'solr.core.forwardingCollection.shard1.replica_n1') enabled at server: com.sun.jmx.mbeanserver.JmxMBeanServer@aada5dd
   [junit4]   2> 3238700 INFO  (qtp87471674-32078) [n:127.0.0.1:44728_solr c:forwardingCollection s:shard1 r:core_node2 x:forwardingCollection_shard1_replica_n1] o.a.s.c.SolrCore solr.RecoveryStrategy.Builder
   [junit4]   2> 3238700 INFO  (qtp87471674-32078) [n:127.0.0.1:44728_solr c:forwardingCollection s:shard1 r:core_node2 x:forwardingCollection_shard1_replica_n1] o.a.s.c.SolrCore [[forwardingCollection_shard1_replica_n1] ] Opening new SolrCore at [/export/home/jenkins/workspace/Lucene-Solr-7.x-Solaris/solr/build/solr-core/test/J0/temp/solr.cloud.TestSolrCloudWithSecureImpersonation_9FDD6D638E5433F9-001/tempDir-001/node2/forwardingCollection_shard1_replica_n1], dataDir=[/export/home/jenkins/workspace/Lucene-Solr-7.x-Solaris/solr/build/solr-core/test/J0/temp/solr.cloud.TestSolrCloudWithSecureImpersonation_9FDD6D638E5433F9-001/tempDir-001/node2/./forwardingCollection_shard1_replica_n1/data/]
   [junit4]   2> 3238704 INFO  (qtp87471674-32078) [n:127.0.0.1:44728_solr c:forwardingCollection s:shard1 r:core_node2 x:forwardingCollection_shard1_replica_n1] o.a.s.u.RandomMergePolicy RandomMergePolicy wrapping class org.apache.lucene.index.TieredMergePolicy: [TieredMergePolicy: maxMergeAtOnce=43, maxMergeAtOnceExplicit=42, maxMergedSegmentMB=89.8515625, floorSegmentMB=0.66796875, forceMergeDeletesPctAllowed=5.527069925304917, segmentsPerTier=13.0, maxCFSSegmentSizeMB=8.796093022207999E12, noCFSRatio=1.0
   [junit4]   2> 3238837 INFO  (qtp87471674-32078) [n:127.0.0.1:44728_solr c:forwardingCollection s:shard1 r:core_node2 x:forwardingCollection_shard1_replica_n1] o.a.s.u.UpdateHandler Using UpdateLog implementation: org.apache.solr.update.UpdateLog
   [junit4]   2> 3238837 INFO  (qtp87471674-32078) [n:127.0.0.1:44728_solr c:forwardingCollection s:shard1 r:core_node2 x:forwardingCollection_shard1_replica_n1] o.a.s.u.UpdateLog Initializing UpdateLog: dataDir= defaultSyncLevel=FLUSH numRecordsToKeep=100 maxNumLogsToKeep=10 numVersionBuckets=65536
   [junit4]   2> 3238839 INFO  (qtp87471674-32078) [n:127.0.0.1:44728_solr c:forwardingCollection s:shard1 r:core_node2 x:forwardingCollection_shard1_replica_n1] o.a.s.u.CommitTracker Hard AutoCommit: disabled
   [junit4]   2> 3238840 INFO  (qtp87471674-32078) [n:127.0.0.1:44728_solr c:forwardingCollection s:shard1 r:core_node2 x:forwardingCollection_shard1_replica_n1] o.a.s.u.CommitTracker Soft AutoCommit: disabled
   [junit4]   2> 3238841 INFO  (qtp87471674-32078) [n:127.0.0.1:44728_solr c:forwardingCollection s:shard1 r:core_node2 x:forwardingCollection_shard1_replica_n1] o.a.s.u.RandomMergePolicy RandomMergePolicy wrapping class org.apache.lucene.index.TieredMergePolicy: [TieredMergePolicy: maxMergeAtOnce=47, maxMergeAtOnceExplicit=44, maxMergedSegmentMB=85.4267578125, floorSegmentMB=0.3056640625, forceMergeDeletesPctAllowed=15.772366293322172, segmentsPerTier=17.0, maxCFSSegmentSizeMB=8.796093022207999E12, noCFSRatio=1.0
   [junit4]   2> 3238842 INFO  (qtp87471674-32078) [n:127.0.0.1:44728_solr c:forwardingCollection s:shard1 r:core_node2 x:forwardingCollection_shard1_replica_n1] o.a.s.s.SolrIndexSearcher Opening [Searcher@7771e4c6[forwardingCollection_shard1_replica_n1] main]
   [junit4]   2> 3238847 INFO  (qtp87471674-32078) [n:127.0.0.1:44728_solr c:forwardingCollection s:shard1 r:core_node2 x:forwardingCollection_shard1_replica_n1] o.a.s.h.c.SpellCheckComponent Initializing spell checkers
   [junit4]   2> 3238856 INFO  (qtp87471674-32078) [n:127.0.0.1:44728_solr c:forwardingCollection s:shard1 r:core_node2 x:forwardingCollection_shard1_replica_n1] o.a.s.s.DirectSolrSpellChecker init: {name=direct,classname=DirectSolrSpellChecker,field=lowerfilt,minQueryLength=3}
   [junit4]   2> 3238892 INFO  (qtp87471674-32078) [n:127.0.0.1:44728_solr c:forwardingCollection s:shard1 r:core_node2 x:forwardingCollection_shard1_replica_n1] o.a.s.h.ReplicationHandler Commits will be reserved for 10000ms.
   [junit4]   2> 3238892 INFO  (searcherExecutor-12796-thread-1-processing-n:127.0.0.1:44728_solr x:forwardingCollection_shard1_replica_n1 s:shard1 c:forwardingCollection r:core_node2) [n:127.0.0.1:44728_solr c:forwardingCollection s:shard1 r:core_node2 x:forwardingCollection_shard1_replica_n1] o.a.s.h.c.SpellCheckComponent Loading spell index for spellchecker: default
   [junit4]   2> 3238892 INFO  (qtp87471674-32078) [n:127.0.0.1:44728_solr c:forwardingCollection s:shard1 r:core_node2 x:forwardingCollection_shard1_replica_n1] o.a.s.u.UpdateLog Could not find max version in index or recent updates, using new clock 1588504979684982784
   [junit4]   2> 3238896 INFO  (searcherExecutor-12796-thread-1-processing-n:127.0.0.1:44728_solr x:forwardingCollection_shard1_replica_n1 s:shard1 c:forwardingCollection r:core_node2) [n:127.0.0.1:44728_solr c:forwardingCollection s:shard1 r:core_node2 x:forwardingCollection_shard1_replica_n1] o.a.s.h.c.SpellCheckComponent Loading spell index for spellchecker: direct
   [junit4]   2> 3238896 INFO  (searcherExecutor-12796-thread-1-processing-n:127.0.0.1:44728_solr x:forwardingCollection_shard1_replica_n1 s:shard1 c:forwardingCollection r:core_node2) [n:127.0.0.1:44728_solr c:forwardingCollection s:shard1 r:core_node2 x:forwardingCollection_shard1_replica_n1] o.a.s.h.c.SpellCheckComponent Loading spell index for spellchecker: wordbreak
   [junit4]   2> 3238897 INFO  (searcherExecutor-12796-thread-1-processing-n:127.0.0.1:44728_solr x:forwardingCollection_shard1_replica_n1 s:shard1 c:forwardingCollection r:core_node2) [n:127.0.0.1:44728_solr c:forwardingCollection s:shard1 r:core_node2 x:forwardingCollection_shard1_replica_n1] o.a.s.h.c.SpellCheckComponent Loading spell index for spellchecker: multipleFields
   [junit4]   2> 3238900 INFO  (searcherExecutor-12796-thread-1-processing-n:127.0.0.1:44728_solr x:forwardingCollection_shard1_replica_n1 s:shard1 c:forwardingCollection r:core_node2) [n:127.0.0.1:44728_solr c:forwardingCollection s:shard1 r:core_node2 x:forwardingCollection_shard1_replica_n1] o.a.s.h.c.SpellCheckComponent Loading spell index for spellchecker: jarowinkler
   [junit4]   2> 3238902 INFO  (searcherExecutor-12796-thread-1-processing-n:127.0.0.1:44728_solr x:forwardingCollection_shard1_replica_n1 s:shard1 c:forwardingCollection r:core_node2) [n:127.0.0.1:44728_solr c:forwardingCollection s:shard1 r:core_node2 x:forwardingCollection_shard1_replica_n1] o.a.s.h.c.SpellCheckComponent Loading spell index for spellchecker: external
   [junit4]   2> 3238903 INFO  (searcherExecutor-12796-thread-1-processing-n:127.0.0.1:44728_solr x:forwardingCollection_shard1_replica_n1 s:shard1 c:forwardingCollection r:core_node2) [n:127.0.0.1:44728_solr c:forwardingCollection s:shard1 r:core_node2 x:forwardingCollection_shard1_replica_n1] o.a.s.h.c.SpellCheckComponent Loading spell index for spellchecker: freq
   [junit4]   2> 3238904 INFO  (searcherExecutor-12796-thread-1-processing-n:127.0.0.1:44728_solr x:forwardingCollection_shard1_replica_n1 s:shard1 c:forwardingCollection r:core_node2) [n:127.0.0.1:44728_solr c:forwardingCollection s:shard1 r:core_node2 x:forwardingCollection_shard1_replica_n1] o.a.s.h.c.SpellCheckComponent Loading spell index for spellchecker: fqcn
   [junit4]   2> 3238905 INFO  (searcherExecutor-12796-thread-1-processing-n:127.0.0.1:44728_solr x:forwardingCollection_shard1_replica_n1 s:shard1 c:forwardingCollection r:core_node2) [n:127.0.0.1:44728_solr c:forwardingCollection s:shard1 r:core_node2 x:forwardingCollection_shard1_replica_n1] o.a.s.h.c.SpellCheckComponent Loading spell index for spellchecker: perDict
   [junit4]   2> 3238908 INFO  (searcherExecutor-12796-thread-1-processing-n:127.0.0.1:44728_solr x:forwardingCollection_shard1_replica_n1 s:shard1 c:forwardingCollection r:core_node2) [n:127.0.0.1:44728_solr c:forwardingCollection s:shard1 r:core_node2 x:forwardingCollection_shard1_replica_n1] o.a.s.c.SolrCore [forwardingCollection_shard1_replica_n1] Registered new searcher Searcher@7771e4c6[forwardingCollection_shard1_replica_n1] main{ExitableDirectoryReader(UninvertingDirectoryReader())}
   [junit4]   2> 3238908 INFO  (qtp87471674-32078) [n:127.0.0.1:44728_solr c:forwardingCollection s:shard1 r:core_node2 x:forwardingCollection_shard1_replica_n1] o.a.s.c.ShardLeaderElectionContext Enough replicas found to continue.
   [junit4]   2> 3238908 INFO  (qtp87471674-32078) [n:127.0.0.1:44728_solr c:forwardingCollection s:shard1 r:core_node2 x:forwardingCollection_shard1_replica_n1] o.a.s.c.ShardLeaderElectionContext I may be the new leader - try and sync
   [junit4]   2> 3238908 INFO  (qtp87471674-32078) [n:127.0.0.1:44728_solr c:forwardingCollection s:shard1 r:core_node2 x:forwardingCollection_shard1_replica_n1] o.a.s.c.SyncStrategy Sync replicas to http://127.0.0.1:44728/solr/forwardingCollection_shard1_replica_n1/
   [junit4]   2> 3238908 INFO  (qtp87471674-32078) [n:127.0.0.1:44728_solr c:forwardingCollection s:shard1 r:core_node2 x:forwardingCollection_shard1_replica_n1] o.a.s.c.SyncStrategy Sync Success - now sync replicas to me
   [junit4]   2> 3238908 INFO  (qtp87471674-32078) [n:127.0.0.1:44728_solr c:forwardingCollection s:shard1 r:core_node2 x:forwardingCollection_shard1_replica_n1] o.a.s.c.SyncStrategy http://127.0.0.1:44728/solr/forwardingCollection_shard1_replica_n1/ has no replicas
   [junit4]   2> 3238908 INFO  (qtp87471674-32078) [n:127.0.0.1:44728_solr c:forwardingCollection s:shard1 r:core_node2 x:forwardingCollection_shard1_replica_n1] o.a.s.c.ShardLeaderElectionContext Found all replicas participating in election, clear LIR
   [junit4]   2> 3238915 INFO  (qtp87471674-32078) [n:127.0.0.1:44728_solr c:forwardingCollection s:shard1 r:core_node2 x:forwardingCollection_shard1_replica_n1] o.a.s.c.ShardLeaderElectionContext I am the new leader: http://127.0.0.1:44728/solr/forwardingCollection_shard1_replica_n1/ shard1
   [junit4]   2> 3239017 INFO  (zkCallback-8352-thread-2-processing-n:127.0.0.1:44728_solr) [n:127.0.0.1:44728_solr    ] o.a.s.c.c.ZkStateReader A cluster state change: [WatchedEvent state:SyncConnected type:NodeDataChanged path:/collections/forwardingCollection/state.json] for collection [forwardingCollection] has occurred - updating... (live nodes size: [2])
   [junit4]   2> 3239017 INFO  (zkCallback-8352-thread-1-processing-n:127.0.0.1:44728_solr) [n:127.0.0.1:44728_solr    ] o.a.s.c.c.ZkStateReader A cluster state change: [WatchedEvent state:SyncConnected type:NodeDataChanged path:/collections/forwardingCollection/state.json] for collection [forwardingCollection] has occurred - updating... (live nodes size: [2])
   [junit4]   2> 3239067 INFO  (qtp87471674-32078) [n:127.0.0.1:44728_solr c:forwardingCollection s:shard1 r:core_node2 x:forwardingCollection_shard1_replica_n1] o.a.s.c.ZkController I am the leader, no recovery necessary
   [junit4]   2> 3239070 INFO  (qtp87471674-32078) [n:127.0.0.1:44728_solr c:forwardingCollection s:shard1 r:core_node2 x:forwardingCollection_shard1_replica_n1] o.a.s.s.HttpSolrCall [admin] webapp=null path=/admin/cores params={qt=/admin/cores&coreNodeName=core_node2&collection.configName=conf1&newCollection=true&name=forwardingCollection_shard1_replica_n1&action=CREATE&numShards=1&collection=forwardingCollection&shard=shard1&wt=javabin&version=2&replicaType=NRT} status=0 QTime=1622
   [junit4]   2> 3239073 INFO  (qtp87471674-32076) [n:127.0.0.1:44728_solr    ] o.a.s.h.a.CollectionsHandler Wait for new collection to be active for at most 30 seconds. Check all shard replicas
   [junit4]   2> 3239130 INFO  (OverseerCollectionConfigSetProcessor-99281560691343365-127.0.0.1:38021_solr-n_0000000000) [n:127.0.0.1:38021_solr    ] o.a.s.c.OverseerTaskQueue Response ZK path: /overseer/collection-queue-work/qnr-0000000000 doesn't exist.  Requestor may have disconnected from ZooKeeper
   [junit4]   2> 3239171 INFO  (zkCallback-8352-thread-1-processing-n:127.0.0.1:44728_solr) [n:127.0.0.1:44728_solr    ] o.a.s.c.c.ZkStateReader A cluster state change: [WatchedEvent state:SyncConnected type:NodeDataChanged path:/collections/forwardingCollection/state.json] for collection [forwardingCollection] has occurred - updating... (live nodes size: [2])
   [junit4]   2> 3239171 INFO  (zkCallback-8352-thread-2-processing-n:127.0.0.1:44728_solr) [n:127.0.0.1:44728_solr    ] o.a.s.c.c.ZkStateReader A cluster state change: [WatchedEvent state:SyncConnected type:NodeDataChanged path:/collections/forwardingCollection/state.json] for collection [forwardingCollection] has occurred - updating... (live nodes size: [2])
   [junit4]   2> 3240075 INFO  (qtp87471674-32076) [n:127.0.0.1:44728_solr    ] o.a.s.s.HttpSolrCall [admin] webapp=null path=/admin/collections params={pullReplicas=0&replicationFactor=1&collection.configName=conf1&maxShardsPerNode=1&name=forwardingCollection&nrtReplicas=1&action=CREATE&numShards=1&tlogReplicas=0&wt=javabin&version=2} status=0 QTime=2952
   [junit4]   2> 3240075 INFO  (TEST-TestSolrCloudWithSecureImpersonation.testForwarding-seed#[9FDD6D638E5433F9]) [    ] o.a.s.c.AbstractDistribZkTestBase Wait for recoveries to finish - collection: forwardingCollection failOnTimeout:true timeout (sec):100
   [junit4]   2> 3240076 INFO  (TEST-TestSolrCloudWithSecureImpersonation.testForwarding-seed#[9FDD6D638E5433F9]) [    ] o.a.s.c.AbstractDistribZkTestBase Recoveries finished - collection: forwardingCollection
   [junit4]   2> 3240079 INFO  (qtp12544346-32087) [n:127.0.0.1:38021_solr    ] o.a.s.c.TransientSolrCoreCacheDefault Allocating transient cache for 2147483647 transient cores
   [junit4]   2> 3240082 INFO  (qtp87471674-32080) [n:127.0.0.1:44728_solr c:forwardingCollection s:shard1 r:core_node2 x:forwardingCollection_shard1_replica_n1] o.a.s.c.S.Request [forwardingCollection_shard1_replica_n1]  webapp=/solr path=/select params={q=*:*&wt=javabin&version=2} hits=0 status=0 QTime=0
   [junit4]   2> 3240085 INFO  (qtp87471674-32074) [n:127.0.0.1:44728_solr c:forwardingCollection s:shard1 r:core_node2 x:forwardingCollection_shard1_replica_n1] o.a.s.c.S.Request [forwardingCollection_shard1_replica_n1]  webapp=/solr path=/select params={q=*:*&wt=javabin&version=2} hits=0 status=0 QTime=0
   [junit4]   2> 3240085 INFO  (TEST-TestSolrCloudWithSecureImpersonation.testForwarding-seed#[9FDD6D638E5433F9]) [    ] o.a.s.SolrTestCaseJ4 ###Ending testForwarding
   [junit4]   2> 3240124 INFO  (TEST-TestSolrCloudWithSecureImpersonation.testProxyInvalidProxyUser-seed#[9FDD6D638E5433F9]) [    ] o.a.s.SolrTestCaseJ4 ###Starting testProxyInvalidProxyUser
   [junit4]   2> 3240130 INFO  (TEST-TestSolrCloudWithSecureImpersonation.testProxyInvalidProxyUser-seed#[9FDD6D638E5433F9]) [    ] o.a.s.SolrTestCaseJ4 ###Ending testProxyInvalidProxyUser
   [junit4]   2> 3240186 INFO  (TEST-TestSolrCloudWithSecureImpersonation.testProxyNoConfigHosts-seed#[9FDD6D638E5433F9]) [    ] o.a.s.SolrTestCaseJ4 ###Starting testProxyNoConfigHosts
   [junit4]   2> 3240191 INFO  (TEST-TestSolrCloudWithSecureImpersonation.testProxyNoConfigHosts-seed#[9FDD6D638E5433F9]) [    ] o.a.s.SolrTestCaseJ4 ###Ending testProxyNoConfigHosts
   [junit4]   2> 3240259 INFO  (TEST-TestSolrCloudWithSecureImpersonation.testProxyValidateAnyHostAnyUser-seed#[9FDD6D638E5433F9]) [    ] o.a.s.SolrTestCaseJ4 ###Starting testProxyValidateAnyHostAnyUser
   [junit4]   2> 3240260 INFO  (qtp12544346-32083) [n:127.0.0.1:38021_solr    ] o.a.s.h.a.CollectionsHandler Invoked Collection Action :list with params doAs=bar&action=LIST&wt=javabin&version=2 and sendToOCPQueue=true
   [junit4]   2> 3240261 INFO  (qtp12544346-32083) [n:127.0.0.1:38021_solr    ] o.a.s.s.HttpSolrCall [admin] webapp=null path=/admin/collections params={doAs=bar&action=LIST&wt=javabin&version=2} status=0 QTime=0
   [junit4]   2> 3240261 INFO  (TEST-TestSolrCloudWithSecureImpersonation.testProxyValidateAnyHostAnyUser-seed#[9FDD6D638E5433F9]) [    ] o.a.s.SolrTestCaseJ4 ###Ending testProxyValidateAnyHostAnyUser
   [junit4]   2> 3240325 INFO  (TEST-TestSolrCloudWithSecureImpersonation.testProxyValidateHost-seed#[9FDD6D638E5433F9]) [    ] o.a.s.SolrTestCaseJ4 ###Starting testProxyValidateHost
   [junit4]   2> 3240325 INFO  (qtp12544346-32085) [n:127.0.0.1:38021_solr    ] o.a.s.h.a.CollectionsHandler Invoked Collection Action :list with params doAs=bar&action=LIST&wt=javabin&version=2 and sendToOCPQueue=true
   [junit4]   2> 3240326 INFO  (qtp12544346-32085) [n:127.0.0.1:38021_solr    ] o.a.s.s.HttpSolrCall [admin] webapp=null path=/admin/collections params={doAs=bar&action=LIST&wt=javabin&version=2} status=0 QTime=0
   [junit4]   2> 3240326 INFO  (TEST-TestSolrCloudWithSecureImpersonation.testProxyValidateHost-seed#[9FDD6D638E5433F9]) [    ] o.a.s.SolrTestCaseJ4 ###Ending testProxyValidateHost
   [junit4]   2> 3240385 INFO  (TEST-TestSolrCloudWithSecureImpersonation.testProxyInvalidRemote-seed#[9FDD6D638E5433F9]) [    ] o.a.s.SolrTestCaseJ4 ###Starting testProxyInvalidRemote
   [junit4]   2> 3240393 INFO  (TEST-TestSolrCloudWithSecureImpersonation.testProxyInvalidRemote-seed#[9FDD6D638E5433F9]) [    ] o.a.s.SolrTestCaseJ4 ###Ending testProxyInvalidRemote
   [junit4]   2> 3240452 INFO  (TEST-TestSolrCloudWithSecureImpersonation.testProxyValidateGroup-seed#[9FDD6D638E5433F9]) [    ] o.a.s.SolrTestCaseJ4 ###Starting testProxyValidateGroup
   [junit4]   2> 3240480 INFO  (qtp12544346-32087) [n:127.0.0.1:38021_solr    ] o.a.s.h.a.CollectionsHandler Invoked Collection Action :list with params doAs=jenkins&action=LIST&wt=javabin&version=2 and sendToOCPQueue=true
   [junit4]   2> 3240481 INFO  (qtp12544346-32087) [n:127.0.0.1:38021_solr    ] o.a.s.s.HttpSolrCall [admin] webapp=null path=/admin/collections params={doAs=jenkins&action=LIST&wt=javabin&version=2} status=0 QTime=0
   [junit4]   2> 3240481 INFO  (TEST-TestSolrCloudWithSecureImpersonation.testProxyValidateGroup-seed#[9FDD6D638E5433F9]) [    ] o.a.s.SolrTestCaseJ4 ###Ending testProxyValidateGroup
   [junit4]   2> 3240538 INFO  (TEST-TestSolrCloudWithSecureImpersonation.testProxyNoConfigGroups-seed#[9FDD6D638E5433F9]) [    ] o.a.s.SolrTestCaseJ4 ###Starting testProxyNoConfigGroups
   [junit4]   2> 3240540 INFO  (TEST-TestSolrCloudWithSecureImpersonation.testProxyNoConfigGroups-seed#[9FDD6D638E5433F9]) [    ] o.a.s.SolrTestCaseJ4 ###Ending testProxyNoConfigGroups
   [junit4]   2> 3240597 INFO  (TEST-TestSolrCloudWithSecureImpersonation.testProxyInvalidGroup-seed#[9FDD6D638E5433F9]) [    ] o.a.s.SolrTestCaseJ4 ###Starting testProxyInvalidGroup
   [junit4]   2> 3240621 WARN  (qtp12544346-32088) [    ] o.a.h.s.ShellBasedUnixGroupsMapping got exception trying to get groups for user bar: id: invalid user name: "bar"
   [junit4]   2> id: invalid user name: "bar"
   [junit4]   2> 
   [junit4]   2> 3240623 INFO  (TEST-TestSolrCloudWithSecureImpersonation.testProxyInvalidGroup-seed#[9FDD6D638E5433F9]) [    ] o.a.s.SolrTestCaseJ4 ###Ending testProxyInvalidGroup
   [junit4]   2> 3240655 INFO  (TEST-TestSolrCloudWithSecureImpersonation.testProxyUnknownRemote-seed#[9FDD6D638E5433F9]) [    ] o.a.s.SolrTestCaseJ4 ###Starting testProxyUnknownRemote
   [junit4]   2> 3253977 WARN  (jetty-launcher-8334-thread-1-SendThread(127.0.0.1:60386)) [n:127.0.0.1:38021_solr    ] o.a.z.ClientCnxn Client session timed out, have not heard from server in 16226ms for sessionid 0x160b80dadc10007
   [junit4]   2> 3253977 WARN  (jetty-launcher-8334-thread-1-SendThread(127.0.0.1:60386)) [n:127.0.0.1:38021_solr    ] o.a.z.ClientCnxn Client session timed out, have not heard from server in 13496ms for sessionid 0x160b80dadc10005
   [junit4]   2> 3253977 WARN  (NIOServerCxn.Factory:0.0.0.0/0.0.0.0:0) [    ] o.a.z.s.NIOServerCnxn caught end of stream exception
   [junit4]   2> EndOfStreamException: Unable to read additional data from client sessionid 0x160b80dadc10007, likely client has closed socket
   [junit4]   2> 	at org.apache.zookeeper.server.NIOServerCnxn.doIO(NIOServerCnxn.java:239)
   [junit4]   2> 	at org.apache.zookeeper.server.NIOServerCnxnFactory.run(NIOServerCnxnFactory.java:203)
   [junit4]   2> 	at java.lang.Thread.run(Thread.java:748)
   [junit4]   2> 3253977 WARN  (jetty-launcher-8334-thread-2-SendThread(127.0.0.1:60386)) [n:127.0.0.1:44728_solr    ] o.a.z.ClientCnxn Client session timed out, have not heard from server in 16226ms for sessionid 0x160b80dadc10008
   [junit4]   2> 3253978 WARN  (NIOServerCxn.Factory:0.0.0.0/0.0.0.0:0) [    ] o.a.z.s.NIOServerCnxn caught end of stream exception
   [junit4]   2> EndOfStreamException: Unable to read additional data from client sessionid 0x160b80dadc10005, likely client has closed socket
   [junit4]   2> 	at org.apache.zookeeper.server.NIOServerCnxn.doIO(NIOServerCnxn.java:239)
   [junit4]   2> 	at org.apache.zookeeper.server.NIOServerCnxnFactory.run(NIOServerCnxnFactory.java:203)
   [junit4]   2> 	at java.lang.Thread.run(Thread.java:748)
   [junit4]   2> 3253978 WARN  (jetty-launcher-8334-thread-2-SendThread(127.0.0.1:60386)) [n:127.0.0.1:44728_solr    ] o.a.z.ClientCnxn Client session timed out, have not heard from server in 14806ms for sessionid 0x160b80dadc10006
   [junit4]   2> 3253978 INFO  (TEST-TestSolrCloudWithSecureImpersonation.testProxyUnknownRemote-seed#[9FDD6D638E5433F9]) [    ] o.a.s.SolrTestCaseJ4 ###Ending testProxyUnknownRemote
   [junit4]   2> 3253978 WARN  (NIOServerCxn.Factory:0.0.0.0/0.0.0.0:0) [    ] o.a.z.s.NIOServerCnxn caught end of stream exception
   [junit4]   2> EndOfStreamException: Unable to read additional data from client sessionid 0x160b80dadc10008, likely client has closed socket
   [junit4]   2> 	at org.apache.zookeeper.server.NIOServerCnxn.doIO(NIOServerCnxn.java:239)
   [junit4]   2> 	at org.apache.zookeeper.server.NIOServerCnxnFactory.run(NIOServerCnxnFactory.java:203)
   [junit4]   2> 	at java.lang.Thread.run(Thread.java:748)
   [junit4]   2> 3253978 WARN  (NIOServerCxn.Factory:0.0.0.0/0.0.0.0:0) [    ] o.a.z.s.NIOServerCnxn caught end of stream exception
   [junit4]   2> EndOfStreamException: Unable to read additional data from client sessionid 0x160b80dadc10006, likely client has closed socket
   [junit4]   2> 	at org.apache.zookeeper.server.NIOServerCnxn.doIO(NIOServerCnxn.java:239)
   [junit4]   2> 	at org.apache.zookeeper.server.NIOServerCnxnFactory.run(NIOServerCnxnFactory.java:203)
   [junit4]   2> 	at java.lang.Thread.run(Thread.java:748)
   [junit4]   2> 3254008 INFO  (TEST-TestSolrCloudWithSecureImpersonation.testProxyNullProxyUser-seed#[9FDD6D638E5433F9]) [    ] o.a.s.SolrTestCaseJ4 ###Starting testProxyNullProxyUser
   [junit4]   2> 3254009 INFO  (qtp12544346-32083) [n:127.0.0.1:38021_solr    ] o.a.s.s.SolrDispatchFilter Error authenticating
   [junit4]   2> java.lang.IllegalArgumentException: userName is NULL, empty or contains a '&'
   [junit4]   2> 	at org.apache.hadoop.security.authentication.util.AuthToken.checkForIllegalArgument(AuthToken.java:87)
   [junit4]   2> 	at org.apache.hadoop.security.authentication.util.AuthToken.<init>(AuthToken.java:70)
   [junit4]   2> 	at org.apache.hadoop.security.authentication.server.AuthenticationToken.<init>(AuthenticationToken.java:58)
   [junit4]   2> 	at org.apache.solr.security.HttpParamDelegationTokenPlugin$HttpParamDelegationTokenAuthenticationHandler$HttpParamAuthenticationHandler.authenticate(HttpParamDelegationTokenPlugin.java:213)
   [junit4]   2> 	at org.apache.hadoop.security.token.delegation.web.DelegationTokenAuthenticationHandler.authenticate(DelegationTokenAuthenticationHandler.java:348)
   [junit4]   2> 	at org.apache.solr.security.RequestContinuesRecorderAuthenticationHandler.authenticate(RequestContinuesRecorderAuthenticationHandler.java:69)
   [junit4]   2> 	at org.apache.hadoop.security.authentication.server.AuthenticationFilter.doFilter(AuthenticationFilter.java:518)
   [junit4]   2> 	at org.apache.solr.security.DelegationTokenKerberosFilter.doFilter(DelegationTokenKerberosFilter.java:134)
   [junit4]   2> 	at org.apache.solr.security.HttpParamDelegationTokenPlugin$HttpParamToRequestFilter.doFilter(HttpParamDelegationTokenPlugin.java:245)
   [junit4]   2> 	at org.apache.solr.security.KerberosPlugin.doAuthenticate(KerberosPlugin.java:243)
   [junit4]   2> 	at org.apache.solr.servlet.SolrDispatchFilter.authenticateRequest(SolrDispatchFilter.java:451)
   [junit4]   2> 	at org.apache.solr.servlet.SolrDispatchFilter.doFilter(SolrDispatchFilter.java:347)
   [junit4]   2> 	at org.apache.solr.servlet.SolrDispatchFilter.doFilter(SolrDispatchFilter.java:326)
   [junit4]   2> 	at org.eclipse.jetty.servlet.ServletHandler$CachedChain.doFilter(ServletHandler.java:1759)
   [junit4]   2> 	at org.apache.solr.client.solrj.embedded.JettySolrRunner$DebugFilter.doFilter(JettySolrRunner.java:139)
   [junit4]   2> 	at org.eclipse.jetty.servlet.ServletHandler$CachedChain.doFilter(ServletHandler.java:1759)
   [junit4]   2> 	at org.eclipse.jetty.servlet.ServletHandler.doHandle(ServletHandler.java:582)
   [junit4]   2> 	at org.eclipse.jetty.server.session.SessionHandler.doHandle(SessionHandler.java:224)
   [junit4]   2> 	at org.eclipse.jetty.server.handler.ContextHandler.doHandle(ContextHandler.java:1180)
   [junit4]   2> 	at org.eclipse.jetty.servlet.ServletHandler.doScope(ServletHandler.java:512)
   [junit4]   2> 	at org.eclipse.jetty.server.session.SessionHandler.doScope(SessionHandler.java:185)
   [junit4]   2> 	at org.eclipse.jetty.server.handler.ContextHandler.doScope(ContextHandler.java:1112)
   [junit4]   2> 	at org.eclipse.jetty.server.handler.ScopedHandler.handle(ScopedHandler.java:141)
   [junit4]   2> 	at org.eclipse.jetty.server.handler.gzip.GzipHandler.handle(GzipHandler.java:493)
   [junit4]   2> 	at org.eclipse.jetty.server.handler.HandlerWrapper.handle(HandlerWrapper.java:134)
   [junit4]   2> 	at org.eclipse.jetty.server.Server.handle(Server.java:534)
   [junit4]   2> 	at org.eclipse.jetty.server.HttpChannel.handle(HttpChannel.java:320)
   [junit4]   2> 	at org.eclipse.jetty.server.HttpConnection.onFillable(HttpConnection.java:251)
   [junit4]   2> 	at org.eclipse.jetty.io.AbstractConnection$ReadCallback.succeeded(AbstractConnection.java:283)
   [junit4]   2> 	at org.eclipse.jetty.io.FillInterest.fillable(FillInterest.java:108)
   [junit4]   2> 	at org.eclipse.jetty.io.SelectChannelEndPoint$2.run(SelectChannelEndPoint.java:93)
   [junit4]   2> 	at org.eclipse.jetty.util.thread.strategy.ExecuteProduceConsume.executeProduceConsume(ExecuteProduceConsume.java:303)
   [junit4]   2> 	at org.eclipse.jetty.util.thread.strategy.ExecuteProduceConsume.produceConsume(ExecuteProduceConsume.java:148)
   [junit4]   2> 	at org.eclipse.jetty.util.thread.strategy.ExecuteProduceConsume.run(ExecuteProduceConsume.java:136)
   [junit4]   2> 	at org.eclipse.jetty.util.thread.QueuedThreadPool.runJob(QueuedThreadPool.java:671)
   [junit4]   2> 	at org.eclipse.jetty.util.thread.QueuedThreadPool$2.run(QueuedThreadPool.java:589)
   [junit4]   2> 	at java.lang.Thread.run(Thread.java:748)
   [junit4]   2> 3254010 WARN  (qtp12544346-32083) [n:127.0.0.1:38021_solr    ] o.e.j.s.ServletHandler /solr/admin/collections
   [junit4]   2> org.apache.solr.common.SolrException: Error during request authentication, 
   [junit4]   2> 	at org.apache.solr.servlet.SolrDispatchFilter.authenticateRequest(SolrDispatchFilter.java:457)
   [junit4]   2> 	at org.apache.solr.servlet.SolrDispatchFilter.doFilter(SolrDispatchFilter.java:347)
   [junit4]   2> 	at org.apache.solr.servlet.SolrDispatchFilter.doFilter(SolrDispatchFilter.java:326)
   [junit4]   2> 	at org.eclipse.jetty.servlet.ServletHandler$CachedChain.doFilter(ServletHandler.java:1759)
   [junit4]   2> 	at org.apache.solr.client.solrj.embedded.JettySolrRunner$DebugFilter.doFilter(JettySolrRunner.java:139)
   [junit4]   2> 	at org.eclipse.jetty.servlet.ServletHandler$CachedChain.doFilter(ServletHandler.java:1759)
   [junit4]   2> 	at org.eclipse.jetty.servlet.ServletHandler.doHandle(ServletHandler.java:582)
   [junit4]   2> 	at org.eclipse.jetty.server.session.SessionHandler.doHandle(SessionHandler.java:224)
   [junit4]   2> 	at org.eclipse.jetty.server.handler.ContextHandler.doHandle(ContextHandler.java:1180)
   [junit4]   2> 	at org.eclipse.jetty.servlet.ServletHandler.doScope(ServletHandler.java:512)
   [junit4]   2> 	at org.eclipse.jetty.server.session.SessionHandler.doScope(SessionHandler.java:185)
   [junit4]   2> 	at org.eclipse.jetty.server.handler.ContextHandler.doScope(ContextHandler.java:1112)
   [junit4]   2> 	at org.eclipse.jetty.server.handler.ScopedHandler.handle(ScopedHandler.java:141)
   [junit4]   2> 	at org.eclipse.jetty.server.handler.gzip.GzipHandler.handle(GzipHandler.java:493)
   [junit4]   2> 	at org.eclipse.jetty.server.handler.HandlerWrapper.handle(HandlerWrapper.java:134)
   [junit4]   2> 	at org.eclipse.jetty.server.Server.handle(Server.java:534)
   [junit4]   2> 	at org.eclipse.jetty.server.HttpChannel.handle(HttpChannel.java:320)
   [junit4]   2> 	at org.eclipse.jetty.server.HttpConnection.onFillable(HttpConnection.java:251)
   [junit4]   2> 	at org.eclipse.jetty.io.AbstractConnection$ReadCallback.succeeded(AbstractConnection.java:283)
   [junit4]   2> 	at org.eclipse.jetty.io.FillInterest.fillable(FillInterest.java:108)
   [junit4]   2> 	at org.eclipse.jetty.io.SelectChannelEndPoint$2.run(SelectChannelEndPoint.java:93)
   [junit4]   2> 	at org.eclipse.jetty.util.thread.strategy.ExecuteProduceConsume.executeProduceConsume(ExecuteProduceConsume.java:303)
   [junit4]   2> 	at org.eclipse.jetty.util.thread.strategy.ExecuteProduceConsume.produceConsume(ExecuteProduceConsume.java:148)
   [junit4]   2> 	at org.eclipse.jetty.util.thread.strategy.ExecuteProduceConsume.run(ExecuteProduceConsume.java:136)
   [junit4]   2> 	at org.eclipse.jetty.util.thread.QueuedThreadPool.runJob(QueuedThreadPool.java:671)
   [junit4]   2> 	at org.eclipse.jetty.util.thread.QueuedThreadPool$2.run(QueuedThreadPool.java:589)
   [junit4]   2> 	at java.lang.Thread.run(Thread.java:748)
   [junit4]   2> Caused by: java.lang.IllegalArgumentException: userName is NULL, empty or contains a '&'
   [junit4]   2> 	at org.apache.hadoop.security.authentication.util.AuthToken.checkForIllegalArgument(AuthToken.java:87)
   [junit4]   2> 	at org.apache.hadoop.security.authentication.util.AuthToken.<init>(AuthToken.java:70)
   [junit4]   2> 	at org.apache.hadoop.security.authentication.server.AuthenticationToken.<init>(AuthenticationToken.java:58)
   [junit4]   2> 	at org.apache.solr.security.HttpParamDelegationTokenPlugin$HttpParamDelegationTokenAuthenticationHandler$HttpParamAuthenticationHandler.authenticate(HttpParamDelegationTokenPlugin.java:213)
   [junit4]   2> 	at org.apache.hadoop.security.token.delegation.web.DelegationTokenAuthenticationHandler.authenticate(DelegationTokenAuthenticationHandler.java:348)
   [junit4]   2> 	at org.apache.solr.security.RequestContinuesRecorderAuthenticationHandler.authenticate(RequestContinuesRecorderAuthenticationHandler.java:69)
   [junit4]   2> 	at org.apache.hadoop.security.authentication.server.AuthenticationFilter.doFilter(AuthenticationFilter.java:518)
   [junit4]   2> 	at org.apache.solr.security.DelegationTokenKerberosFilter.doFilter(DelegationTokenKerberosFilter.java:134)
   [junit4]   2> 	at org.apache.solr.security.HttpParamDelegationTokenPlugin$HttpParamToRequestFilter.doFilter(HttpParamDelegationTokenPlugin.java:245)
   [junit4]   2> 	at org.apache.solr.security.KerberosPlugin.doAuthenticate(KerberosPlugin.java:243)
   [junit4]   2> 	at org.apache.solr.servlet.SolrDispatchFilter.authenticateRequest(SolrDispatchFilter.java:451)
   [junit4]   2> 	... 26 more
   [junit4]   2> 3254011 INFO  (TEST-TestSolrCloudWithSecureImpersonation.testProxyNullProxyUser-seed#[9FDD6D638E5433F9]) [    ] o.a.s.SolrTestCaseJ4 ###Ending testProxyNullProxyUser
   [junit4]   2> 3254077 INFO  (jetty-launcher-8334-thread-1-EventThread) [n:127.0.0.1:38021_solr    ] o.a.c.f.s.ConnectionStateManager State change: SUSPENDED
   [junit4]   2> 3254081 INFO  (jetty-closer-8335-thread-1) [    ] o.e.j.s.AbstractConnector Stopped ServerConnector@2898f7d0{HTTP/1.1,[http/1.1]}{127.0.0.1:0}
   [junit4]   2> 3254083 WARN  (zkConnectionManagerCallback-8353-thread-1-processing-n:127.0.0.1:44728_solr) [n:127.0.0.1:44728_solr    ] o.a.s.c.c.ConnectionManager Watcher org.apache.solr.common.cloud.ConnectionManager@2f429ab9 name: ZooKeeperConnection Watcher:127.0.0.1:60386/solr got event WatchedEvent state:Disconnected type:None path:null path: null type: None
   [junit4]   2> 3254084 WARN  (zkConnectionManagerCallback-8353-thread-1-processing-n:127.0.0.1:44728_solr) [n:127.0.0.1:44728_solr    ] o.a.s.c.c.ConnectionManager zkClient has disconnected
   [junit4]   2> 3254085 INFO  (jetty-closer-8335-thread-2) [    ] o.e.j.s.AbstractConnector Stopped ServerConnector@1021e432{HTTP/1.1,[http/1.1]}{127.0.0.1:0}
   [junit4]   2> 3254082 WARN  (zkConnectionManagerCallback-8351-thread-1-processing-n:127.0.0.1:38021_solr) [n:127.0.0.1:38021_solr    ] o.a.s.c.c.ConnectionManager Watcher org.apache.solr.common.cloud.ConnectionManager@6d92e408 name: ZooKeeperConnection Watcher:127.0.0.1:60386/solr got event WatchedEvent state:Disconnected type:None path:null path: null type: None
   [junit4]   2> 3254086 WARN  (zkConnectionManagerCallback-8351-thread-1-processing-n:127.0.0.1:38021_solr) [n:127.0.0.1:38021_solr    ] o.a.s.c.c.ConnectionManager zkClient has disconnected
   [junit4]   2> 3254085 INFO  (jetty-closer-8335-thread-2) [    ] o.a.s.c.CoreContainer Shutting down CoreContainer instance=1472774338
   [junit4]   2> 3254085 INFO  (jetty-closer-8335-thread-1) [    ] o.a.s.c.CoreContainer Shutting down CoreContainer instance=1715794336
   [junit4]   2> 3254087 INFO  (jetty-closer-8335-thread-2) [    ] o.a.s.m.SolrMetricManager Closing metric reporters for registry=solr.node, tag=null
   [junit4]   2> 3254087 INFO  (jetty-closer-8335-thread-2) [    ] o.a.s.m.r.SolrJmxReporter Closing reporter [org.apache.solr.metrics.reporters.SolrJmxReporter@2a13af3: rootName = solr_44728, domain = solr.node, service url = null, agent id = null] for registry solr.node / com.codahale.metrics.MetricRegistry@8eca091
   [junit4]   2> 3254087 INFO  (jetty-closer-8335-thread-1) [    ] o.a.s.m.SolrMetricManager Closing metric reporters for registry=solr.node, tag=null
   [junit4]   2> 3254087 INFO  (jetty-closer-8335-thread-1) [    ] o.a.s.m.r.SolrJmxReporter Closing reporter [org.apache.solr.metrics.reporters.SolrJmxReporter@36d74d05: rootName = solr_38021, domain = solr.node, service url = null, agent id = null] for registry solr.node / com.codahale.metrics.MetricRegistry@66d5b95b
   [junit4]   2> 3254092 INFO  (jetty-closer-8335-thread-1) [    ] o.a.s.m.SolrMetricManager Closing metric reporters for registry=solr.jvm, tag=null
   [junit4]   2> 3254092 INFO  (jetty-closer-8335-thread-1) [    ] o.a.s.m.r.SolrJmxReporter Closing reporter [org.apache.solr.metrics.reporters.SolrJmxReporter@55c87fca: rootName = solr_38021, domain = solr.jvm, service url = null, agent id = null] for registry solr.jvm / com.codahale.metrics.MetricRegistry@3e1f0d55
   [junit4]   2> 3254097 INFO  (jetty-closer-8335-thread-2) [    ] o.a.s.m.SolrMetricManager Closing metric reporters for registry=solr.jvm, tag=null
   [junit4]   2> 3254097 INFO  (jetty-closer-8335-thread-2) [    ] o.a.s.m.r.SolrJmxReporter Closing reporter [org.apache.solr.metrics.reporters.SolrJmxReporter@47c42458: rootName = solr_44728, domain = solr.jvm, service url = null, agent id = null] for registry solr.jvm / com.codahale.metrics.MetricRegistry@3e1f0d55
   [junit4]   2> 3254099 INFO  (jetty-closer-8335-thread-1) [    ] o.a.s.m.SolrMetricManager Closing metric reporters for registry=solr.jetty, tag=null
   [junit4]   2> 3254099 INFO  (jetty-closer-8335-thread-1) [    ] o.a.s.m.r.SolrJmxReporter Closing reporter [org.apache.solr.metrics.reporters.SolrJmxReporter@4b8e2695: rootName = solr_38021, domain = solr.jetty, service url = null, agent id = null] for registry solr.jetty / com.codahale.metrics.MetricRegistry@309e66e9
   [junit4]   2> 3254101 INFO  (jetty-closer-8335-thread-2) [    ] o.a.s.m.SolrMetricManager Closing metric reporters for registry=solr.jetty, tag=null
   [junit4]   2> 3254101 INFO  (jetty-closer-8335-thread-2) [    ] o.a.s.m.r.SolrJmxReporter Closing reporter [org.apache.solr.metrics.reporters.SolrJmxReporter@3ede6ab4: rootName = solr_44728, domain = solr.jetty, service url = null, agent id = null] for registry solr.jetty / com.codahale.metrics.MetricRegistry@309e66e9
   [junit4]   2> 3255203 INFO  (zkConnectionManagerCallback-8353-thread-1-processing-n:127.0.0.1:44728_solr) [n:127.0.0.1:44728_solr    ] o.a.s.c.c.ConnectionManager zkClient has connected
   [junit4]   2> 3255205 INFO  (jetty-closer-8335-thread-2) [    ] o.a.s.c.ZkController Remove node as live in ZooKeeper:/live_nodes/127.0.0.1:44728_solr
   [junit4]   2> 3255206 INFO  (jetty-closer-8335-thread-2) [    ] o.a.s.m.SolrMetricManager Closing metric reporters for registry=solr.cluster, tag=null
   [junit4]   2> 3255207 INFO  (zkCallback-8352-thread-8-processing-n:127.0.0.1:44728_solr) [n:127.0.0.1:44728_solr    ] o.a.s.c.c.ZkStateReader Updated live nodes from ZooKeeper... (2) -> (1)
   [junit4]   2> 3255207 INFO  (coreCloseExecutor-12801-thread-1) [n:127.0.0.1:44728_solr c:forwardingCollection s:shard1 r:core_node2 x:forwardingCollection_shard1_replica_n1] o.a.s.c.SolrCore [forwardingCollection_shard1_replica_n1]  CLOSING SolrCore org.apache.solr.core.SolrCore@560fe85f
   [junit4]   2> 3255207 INFO  (coreCloseExecutor-12801-thread-1) [n:127.0.0.1:44728_solr c:forwardingCollection s:shard1 r:core_node2 x:forwardingCollection_shard1_replica_n1] o.a.s.m.SolrMetricManager Closing metric reporters for registry=solr.core.forwardingCollection.shard1.replica_n1, tag=1443883103
   [junit4]   2> 3255207 INFO  (coreCloseExecutor-12801-thread-1) [n:127.0.0.1:44728_solr c:forwardingCollection s:shard1 r:core_node2 x:forwardingCollection_shard1_replica_n1] o.a.s.m.r.SolrJmxReporter Closing reporter [org.apache.solr.metrics.reporters.SolrJmxReporter@7438e352: rootName = solr_44728, domain = solr.core.forwardingCollection.shard1.replica_n1, service url = null, agent id = null] for registry solr.core.forwardingCollection.shard1.replica_n1 / com.codahale.metrics.MetricRegistry@3230dc68
   [junit4]   2> 3255215 INFO  (coreCloseExecutor-12801-thread-1) [n:127.0.0.1:44728_solr c:forwardingCollection s:shard1 r:core_node2 x:forwardingCollection_shard1_replica_n1] o.a.s.m.SolrMetricManager Closing metric reporters for registry=solr.collection.forwardingCollection.shard1.leader, tag=1443883103
   [junit4]   2> 3255218 ERROR (Thread[Thread-7288,5,TGRP-TestSolrCloudWithSecureImpersonation]) [n:127.0.0.1:44728_solr    ] o.a.h.s.t.d.AbstractDelegationTokenSecretManager ExpiredTokenRemover received java.lang.InterruptedException: sleep interrupted
   [junit4]   2> 3255232 INFO  (zkConnectionManagerCallback-8351-thread-1-processing-n:127.0.0.1:38021_solr) [n:127.0.0.1:38021_solr    ] o.a.s.c.c.ConnectionManager zkClient has connected
   [junit4]   2> 3255232 INFO  (zkCallback-8350-thread-6-processing-n:127.0.0.1:38021_solr) [n:127.0.0.1:38021_solr    ] o.a.s.c.c.ZkStateReader Updated live nodes from ZooKeeper... (2) -> (1)
   [junit4]   2> 3255233 INFO  (jetty-closer-8335-thread-1) [    ] o.a.s.c.ZkController Remove node as live in ZooKeeper:/live_nodes/127.0.0.1:38021_solr
   [junit4]   2> 3255235 INFO  (jetty-closer-8335-thread-1) [    ] o.a.s.m.SolrMetricManager Closing metric reporters for registry=solr.cluster, tag=null
   [junit4]   2> 3255235 INFO  (zkCallback-8350-thread-6-processing-n:127.0.0.1:38021_solr) [n:127.0.0.1:38021_solr    ] o.a.s.c.c.ZkStateReader Updated live nodes from ZooKeeper... (1) -> (0)
   [junit4]   2> 3255235 INFO  (jetty-closer-8335-thread-1) [    ] o.a.s.c.Overseer Overseer (id=99281560691343365-127.0.0.1:38021_solr-n_0000000000) closing
   [junit4]   2> 3255235 INFO  (OverseerStateUpdate-99281560691343365-127.0.0.1:38021_solr-n_0000000000) [n:127.0.0.1:38021_solr    ] o.a.s.c.Overseer Overseer Loop exiting : 127.0.0.1:38021_solr
   [junit4]   2> 3255235 WARN  (OverseerAutoScalingTriggerThread-99281560691343365-127.0.0.1:38021_solr-n_0000000000) [n:127.0.0.1:38021_solr    ] o.a.s.c.a.OverseerTriggerThread OverseerTriggerThread woken up but we are closed, exiting.
   [junit4]   2> 3255235 INFO  (OverseerCollectionConfigSetProcessor-99281560691343365-127.0.0.1:38021_solr-n_0000000000) [n:127.0.0.1:38021_solr    ] o.a.s.c.OverseerTaskProcessor According to ZK I (id=99281560691343365-127.0.0.1:38021_solr-n_0000000000) am no longer a leader.
   [junit4]   2> 3255241 ERROR (Thread[Thread-7286,5,TGRP-TestSolrCloudWithSecureImpersonation]) [n:127.0.0.1:38021_solr    ] o.a.h.s.t.d.AbstractDelegationTokenSecretManager ExpiredTokenRemover received java.lang.InterruptedException: sleep interrupted
   [junit4]   2> 3255446 INFO  (jetty-closer-8335-thread-2) [    ] o.e.j.s.h.ContextHandler Stopped o.e.j.s.ServletContextHandler@17384aa4{/solr,null,UNAVAILABLE}
   [junit4]   2> 3255774 INFO  (jetty-closer-8335-thread-1) [    ] o.e.j.s.h.ContextHandler Stopped o.e.j.s.ServletContextHandler@3220d869{/solr,null,UNAVAILABLE}
   [junit4]   2> 3255776 ERROR (SUITE-TestSolrCloudWithSecureImpersonation-seed#[9FDD6D638E5433F9]-worker) [    ] o.a.z.s.ZooKeeperServer ZKShutdownHandler is not registered, so ZooKeeper server won't take any action on ERROR or SHUTDOWN server state changes
   [junit4]   2> 3255777 INFO  (SUITE-TestSolrCloudWithSecureImpersonation-seed#[9FDD6D638E5433F9]-worker) [    ] o.a.s.c.ZkTestServer connecting to 127.0.0.1:60386 60386
   [junit4]   2> 3256248 INFO  (Thread-7269) [    ] o.a.s.c.ZkTestServer connecting to 127.0.0.1:60386 60386
   [junit4]   2> 3256250 WARN  (Thread-7269) [    ] o.a.s.c.ZkTestServer Watch limit violations: 
   [junit4]   2> Maximum concurrent create/delete watches above limit:
   [junit4]   2> 
   [junit4]   2> 	3	/solr/aliases.json
   [junit4]   2> 	3	/solr/clusterprops.json
   [junit4]   2> 	2	/solr/security.json
   [junit4]   2> 
   [junit4]   2> Maximum concurrent data watches above limit:
   [junit4]   2> 
   [junit4]   2> 	5	/solr/collections/forwardingCollection/state.json
   [junit4]   2> 	3	/solr/security/zkdtsm/ZKDTSMRoot/ZKDTSMKeyIdRoot
   [junit4]   2> 	3	/solr/clusterstate.json
   [junit4]   2> 	2	/solr/security/zkdtsm/ZKDTSMRoot/ZKDTSMMasterKeyRoot/DK_1
   [junit4]   2> 	2	/solr/security/zkdtsm/ZKDTSMRoot/ZKDTSMMasterKeyRoot/DK_3
   [junit4]   2> 	2	/solr/security/zkdtsm/ZKDTSMRoot/ZKDTSMMasterKeyRoot/DK_2
   [junit4]   2> 	2	/solr/security/zkdtsm/ZKDTSMRoot/ZKDTSMMasterKeyRoot/DK_4
   [junit4]   2> 	2	/solr/security/zkdtsm/ZKDTSMRoot/ZKDTSMSeqNumRoot
   [junit4]   2> 
   [junit4]   2> Maximum concurrent children watches above limit:
   [junit4]   2> 
   [junit4]   2> 	3	/solr/live_nodes
   [junit4]   2> 	3	/solr/collections
   [junit4]   2> 	3	/solr/security/zkdtsm/ZKDTSMRoot/ZKDTSMMasterKeyRoot
   [junit4]   2> 	3	/solr/security/zkdtsm/ZKDTSMRoot/ZKDTSMTokensRoot
   [junit4]   2> 
   [junit4]   2> 3256286 INFO  (SUITE-TestSolrCloudWithSecureImpersonation-seed#[9FDD6D638E5433F9]-worker) [    ] o.a.s.SolrTestCaseJ4 ------------------------------------------------------- Done waiting for tracked resources to be released
   [junit4]   2> Jan 02, 2018 6:06:58 PM com.carrotsearch.randomizedtesting.ThreadLeakControl checkThreadLeaks
   [junit4]   2> WARNING: Will linger awaiting termination of 1 leaked thread(s).
   [junit4]   2> Jan 02, 2018 6:07:18 PM com.carrotsearch.randomizedtesting.ThreadLeakControl checkThreadLeaks
   [junit4]   2> SEVERE: 1 thread leaked from SUITE scope at org.apache.solr.cloud.TestSolrCloudWithSecureImpersonation: 
   [junit4]   2>    1) Thread[id=32124, name=jetty-launcher-8334-thread-1-EventThread, state=TIMED_WAITING, group=TGRP-TestSolrCloudWithSecureImpersonation]
   [junit4]   2>         at sun.misc.Unsafe.park(Native Method)
   [junit4]   2>         at java.util.concurrent.locks.LockSupport.parkNanos(LockSupport.java:215)
   [junit4]   2>         at java.util.concurrent.locks.AbstractQueuedSynchronizer.doAcquireSharedNanos(AbstractQueuedSynchronizer.java:1037)
   [junit4]   2>         at java.util.concurrent.locks.AbstractQueuedSynchronizer.tryAcquireSharedNanos(AbstractQueuedSynchronizer.java:1328)
   [junit4]   2>         at java.util.concurrent.CountDownLatch.await(CountDownLatch.java:277)
   [junit4]   2>         at org.apache.curator.CuratorZookeeperClient.internalBlockUntilConnectedOrTimedOut(CuratorZookeeperClient.java:323)
   [junit4]   2>         at org.apache.curator.RetryLoop.callWithRetry(RetryLoop.java:105)
   [junit4]   2>         at org.apache.curator.framework.imps.GetDataBuilderImpl.pathInForeground(GetDataBuilderImpl.java:288)
   [junit4]   2>         at org.apache.curator.framework.imps.GetDataBuilderImpl.forPath(GetDataBuilderImpl.java:279)
   [junit4]   2>         at org.apache.curator.framework.imps.GetDataBuilderImpl.forPath(GetDataBuilderImpl.java:41)
   [junit4]   2>         at org.apache.curator.framework.recipes.shared.SharedValue.readValue(SharedValue.java:244)
   [junit4]   2>         at org.apache.curator.framework.recipes.shared.SharedValue.access$100(SharedValue.java:44)
   [junit4]   2>         at org.apache.curator.framework.recipes.shared.SharedValue$1.process(SharedValue.java:61)
   [junit4]   2>         at org.apache.curator.framework.imps.NamespaceWatcher.process(NamespaceWatcher.java:67)
   [junit4]   2>         at org.apache.zookeeper.ClientCnxn$EventThread.processEvent(ClientCnxn.java:530)
   [junit4]   2>         at org.apache.zookeeper.ClientCnxn$EventThread.run(ClientCnxn.java:505)
   [junit4]   2> Jan 02, 2018 6:07:18 PM com.carrotsearch.randomizedtesting.ThreadLeakControl tryToInterruptAll
   [junit4]   2> INFO: Starting to interrupt leaked threads:
   [junit4]   2>    1) Thread[id=32124, name=jetty-launcher-8334-thread-1-EventThread, state=TIMED_WAITING, group=TGRP-TestSolrCloudWithSecureImpersonation]
   [junit4]   2> 3276303 ERROR (jetty-launcher-8334-thread-1-EventThread) [n:127.0.0.1:38021_solr    ] o.a.c.f.i.CuratorFrameworkImpl Watcher exception
   [junit4]   2> java.lang.InterruptedException
   [junit4]   2> 	at java.util.concurrent.locks.AbstractQueuedSynchronizer.doAcquireSharedNanos(AbstractQueuedSynchronizer.java:1039)
   [junit4]   2> 	at java.util.concurrent.locks.AbstractQueuedSynchronizer.tryAcquireSharedNanos(AbstractQueuedSynchronizer.java:1328)
   [junit4]   2> 	at java.util.concurrent.CountDownLatch.await(CountDownLatch.java:277)
   [junit4]   2> 	at org.apache.curator.CuratorZookeeperClient.internalBlockUntilConnectedOrTimedOut(CuratorZookeeperClient.java:323)
   [junit4]   2> 	at org.apache.curator.RetryLoop.callWithRetry(RetryLoop.java:105)
   [junit4]   2> 	at org.apache.curator.framework.imps.GetDataBuilderImpl.pathInForeground(GetDataBuilderImpl.java:288)
   [junit4]   2> 	at org.apache.curator.framework.imps.GetDataBuilderImpl.forPath(GetDataBuilderImpl.java:279)
   [junit4]   2> 	at org.apache.curator.framework.imps.GetDataBuilderImpl.forPath(GetDataBuilderImpl.java:41)
   [junit4]   2> 	at org.apache.curator.framework.recipes.shared.SharedValue.readValue(SharedValue.java:244)
   [junit4]   2> 	at org.apache.curator.framework.recipes.shared.SharedValue.access$100(SharedValue.java:44)
   [junit4]   2> 	at org.apache.curator.framework.recipes.shared.SharedValue$1.process(SharedValue.java:61)
   [junit4]   2> 	at org.apache.curator.framework.imps.NamespaceWatcher.process(NamespaceWatcher.java:67)
   [junit4]   2> 	at org.apache.zookeeper.ClientCnxn$EventThread.processEvent(ClientCnxn.java:530)
   [junit4]   2> 	at org.apache.zookeeper.ClientCnxn$EventThread.run(ClientCnxn.java:505)
   [junit4]   2> Jan 02, 2018 6:07:18 PM com.carrotsearch.randomizedtesting.ThreadLeakControl tryToInterruptAll
   [junit4]   2> INFO: All leaked threads terminated.
   [junit4]   2> NOTE: test params are: codec=Asserting(Lucene70): {}, docValues:{}, maxPointsInLeafNode=341, maxMBSortInHeap=7.24087785540723, sim=RandomSimilarity(queryNorm=true): {}, locale=ko, timezone=Etc/GMT+0
   [junit4]   2> NOTE: SunOS 5.11 amd64/Oracle Corporation 1.8.0_152 (64-bit)/cpus=3,threads=1,free=211670920,total=518979584
   [junit4]   2> NOTE: All tests run in this JVM: [TestManagedSynonymGraphFilterFactory, TestStressRecovery, OverseerStatusTest, DateFieldTest, ConvertedLegacyTest, IndexBasedSpellCheckerTest, TestOmitPositions, DeleteInactiveReplicaTest, SpellCheckCollatorTest, FieldAnalysisRequestHandlerTest, TestSmileRequest, TestPrepRecovery, HttpSolrCallGetCoreTest, UniqFieldsUpdateProcessorFactoryTest, StatsReloadRaceTest, TestSQLHandler, TestCustomStream, TestConfigSetsAPIZkFailure, SyncSliceTest, RemoteQueryErrorTest, TestSolrCoreParser, TestLRUStatsCache, AddReplicaTest, XmlUpdateRequestHandlerTest, HdfsDirectoryFactoryTest, ConjunctionSolrSpellCheckerTest, AsyncCallRequestStatusResponseTest, TestLocalFSCloudBackupRestore, SuggesterTSTTest, TestSolrCloudWithHadoopAuthPlugin, RequestHandlersTest, ScriptEngineTest, TestPolicyCloud, SolrSlf4jReporterTest, TestCursorMarkWithoutUniqueKey, TestBulkSchemaConcurrent, BooleanFieldTest, MinimalSchemaTest, TestDeleteCollectionOnDownNodes, ConfigureRecoveryStrategyTest, TestTrieFacet, TestTolerantUpdateProcessorRandomCloud, TestNoOpRegenerator, HdfsRestartWhileUpdatingTest, DistributedQueryComponentOptimizationTest, TestRequestStatusCollectionAPI, TestMiniSolrCloudClusterSSL, TestReplicationHandler, AtomicUpdatesTest, SolrGangliaReporterTest, SolrRequestParserTest, DefaultValueUpdateProcessorTest, WordBreakSolrSpellCheckerTest, TestExpandComponent, TestJsonRequest, MetricsHandlerTest, HttpTriggerListenerTest, SolrCmdDistributorTest, ShardRoutingTest, TestPointFields, HdfsDirectoryTest, DisMaxRequestHandlerTest, OverriddenZkACLAndCredentialsProvidersTest, URLClassifyProcessorTest, TestSimpleTextCodec, UtilsToolTest, HdfsCollectionsAPIDistributedZkTest, TestCloudNestedDocsSort, SolrCLIZkUtilsTest, TestConfigReload, NotRequiredUniqueKeyTest, TestStandardQParsers, TestNumericRangeQuery32, FullHLLTest, MigrateRouteKeyTest, TestRawTransformer, TestLegacyFieldReuse, ForceLeaderTest, ReturnFieldsTest, BasicAuthStandaloneTest, LeaderFailureAfterFreshStartTest, ChaosMonkeyNothingIsSafeTest, TestCloudSchemaless, TestXmlQParserPlugin, AnalyticsQueryTest, TestXIncludeConfig, DistribCursorPagingTest, TestRandomRequestDistribution, DateMathParserTest, SubstringBytesRefFilterTest, HdfsThreadLeakTest, TestLazyCores, TestAtomicUpdateErrorCases, CdcrRequestHandlerTest, ImplicitSnitchTest, SuggesterTest, NodeAddedTriggerTest, ClusterStateTest, TestSurroundQueryParser, DistributedVersionInfoTest, RankQueryTest, TestHdfsBackupRestoreCore, RequiredFieldsTest, TestSolrDeletionPolicy2, TestAddFieldRealTimeGet, DistanceFunctionTest, TimeRoutedAliasUpdateProcessorTest, ResourceLoaderTest, TestGenericDistributedQueue, SimpleMLTQParserTest, HdfsBasicDistributedZk2Test, TestBulkSchemaAPI, TestConfigSetsAPI, TestSolrCLIRunExample, SharedFSAutoReplicaFailoverTest, SolrMetricReporterTest, BlockDirectoryTest, SolrTestCaseJ4Test, TestIBSimilarityFactory, MetricUtilsTest, TestObjectReleaseTracker, SuggesterWFSTTest, TestQueryWrapperFilter, DirectSolrConnectionTest, TestConfigSets, CircularListTest, TestCloudJSONFacetJoinDomain, JvmMetricsTest, TestNumericTokenStream, TestRangeQuery, TestTriggerIntegration, TestAnalyzeInfixSuggestions, PeerSyncReplicationTest, HdfsUnloadDistributedZkTest, RecoveryZkTest, QueryParsingTest, DirectUpdateHandlerOptimizeTest, RegexBoostProcessorTest, ChaosMonkeySafeLeaderWithPullReplicasTest, DocValuesMissingTest, TestSchemalessBufferedUpdates, TestPivotHelperCode, TlogReplayBufferedWhileIndexingTest, NumericFieldsTest, TestReqParamsAPI, TestSchemaSimilarityResource, ShowFileRequestHandlerTest, TestSolrCloudWithDelegationTokens, LargeFieldTest, TestStressInPlaceUpdates, TestPayloadCheckQParserPlugin, CSVRequestHandlerTest, TestDownShardTolerantSearch, TestSubQueryTransformerDistrib, OutputWriterTest, UUIDUpdateProcessorFallbackTest, CdcrBidirectionalTest, TestCustomSort, DistributedTermsComponentTest, TestExactSharedStatsCache, NoCacheHeaderTest, TestDelegationWithHadoopAuth, TestPolicyCloud, TestComplexPhraseLeadingWildcard, HdfsChaosMonkeyNothingIsSafeTest, DeleteNodeTest, TestQuerySenderListener, TestExceedMaxTermLength, BlockJoinFacetSimpleTest, CoreAdminCreateDiscoverTest, TestCoreDiscovery, TestFieldCollectionResource, TemplateUpdateProcessorTest, TestFilteredDocIdSet, DirectUpdateHandlerTest, TestHighlightDedupGrouping, SolrJmxReporterCloudTest, TestUnifiedSolrHighlighter, TestLFUCache, TestHdfsCloudBackupRestore, UninvertDocValuesMergePolicyTest, TestFieldTypeCollectionResource, TestPHPSerializedResponseWriter, TestSortByMinMaxFunction, TestFieldCacheSortRandom, BasicDistributedZkTest, ChaosMonkeySafeLeaderTest, BasicDistributedZk2Test, CollectionsAPIDistributedZkTest, FullSolrCloudDistribCmdsTest, TestRandomFaceting, ZkSolrClientTest, ShardRoutingCustomTest, TestDistributedSearch, TestFaceting, TestRecovery, DistributedSpellCheckComponentTest, TermVectorComponentDistributedTest, ZkControllerTest, TestRealTimeGet, TestJoin, TestSolr4Spatial, SpellCheckComponentTest, QueryElevationComponentTest, BadIndexSchemaTest, TestSort, BasicFunctionalityTest, TestBadConfig, HighlighterTest, DistributedQueryElevationComponentTest, SignatureUpdateProcessorFactoryTest, SuggesterFSTTest, CoreAdminHandlerTest, TestFoldingMultitermQuery, TestStressLucene, TestTrie, SpatialFilterTest, TestCSVLoader, TestPseudoReturnFields, TestUpdate, FieldMutatingUpdateProcessorTest, TestWordDelimiterFilterFactory, SortByFunctionTest, TestRemoteStreaming, DocValuesMultiTest, TestSolrDeletionPolicy1, SolrInfoBeanTest, XsltUpdateRequestHandlerTest, DebugComponentTest, LukeRequestHandlerTest, TestQueryUtils, TestWriterPerf, DirectSolrSpellCheckerTest, TestReversedWildcardFilterFactory, DocumentAnalysisRequestHandlerTest, TestQueryTypes, PrimitiveFieldTypeTest, TestValueSourceCache, PathHierarchyTokenizerFactoryTest, TestIndexingPerformance, MoreLikeThisHandlerTest, FastVectorHighlighterTest, IndexSchemaRuntimeFieldTest, SolrPluginUtilsTest, IndexSchemaTest, TestJmxIntegration, TestCSVResponseWriter, TestAnalyzedSuggestions, BinaryUpdateRequestHandlerTest, PingRequestHandlerTest, TestComponentsName, SearchHandlerTest, HighlighterConfigTest, SOLR749Test, UpdateParamsTest, AlternateDirectoryTest, TestQuerySenderNoQuery, CopyFieldTest, ResponseLogComponentTest, BadComponentTest, TestMergePolicyConfig, MultiTermTest, TestBinaryField, TestConfig, TestFuzzyAnalyzedSuggestions, ExternalFileFieldSortTest, TestSolrCoreProperties, TestLuceneMatchVersion, TestPhraseSuggestions, TestCharFilters, TestCodecSupport, SynonymTokenizerTest, TestSweetSpotSimilarityFactory, TestDFRSimilarityFactory, TestPerFieldSimilarity, TestLMDirichletSimilarityFactory, TestBM25SimilarityFactory, TimeZoneUtilsTest, TestFastOutputStream, OpenExchangeRatesOrgProviderTest, PluginInfoTest, PreAnalyzedFieldTest, TestSystemIdResolver, PrimUtilsTest, TestSuggestSpellingConverter, RAMDirectoryFactoryTest, TestUtils, TestDocumentBuilder, ZkNodePropsTest, SliceStateTest, UUIDFieldTest, DistributedMLTComponentTest, TestRTGBase, CursorPagingTest, TestCrossCoreJoin, TestSimpleTrackingShardHandler, TestTolerantSearch, TestLuceneIndexBackCompat, TestEmbeddedSolrServerAdminHandler, TestEmbeddedSolrServerConstructors, TestEmbeddedSolrServerSchemaAPI, TestJettySolrRunner, ConnectionReuseTest, AliasIntegrationTest, CleanupOldIndexTest, CloudExitableDirectoryReaderTest, CollectionReloadTest, CollectionTooManyReplicasTest, CollectionsAPISolrJTest, DeleteShardTest, DistribDocExpirationUpdateProcessorTest, LeaderElectionContextKeyTest, LeaderFailoverAfterPartitionTest, LeaderInitiatedRecoveryOnShardRestartTest, LegacyCloudClusterPropTest, MoveReplicaHDFSFailoverTest, MoveReplicaTest, OutOfBoxZkACLAndCredentialsProvidersTest, ReplicationFactorTest, RestartWhileUpdatingTest, RollingRestartTest, SolrCloudExampleTest, TestCloudSearcherWarming, TestCollectionsAPIViaSolrCloudCluster, TestLeaderElectionZkExpiry, TestLockTree, TestPullReplicaErrorHandling, TestSegmentSorting, TestSkipOverseerOperations, TestSolrCloudWithSecureImpersonation]
   [junit4]   2> NOTE: reproduce with: ant test  -Dtestcase=TestSolrCloudWithSecureImpersonation -Dtests.seed=9FDD6D638E5433F9 -Dtests.slow=true -Dtests.locale=ko -Dtests.timezone=Etc/GMT+0 -Dtests.asserts=true -Dtests.file.encoding=ISO-8859-1
   [junit4] ERROR   0.00s J0 | TestSolrCloudWithSecureImpersonation (suite) <<<
   [junit4]    > Throwable #1: com.carrotsearch.randomizedtesting.ThreadLeakError: 1 thread leaked from SUITE scope at org.apache.solr.cloud.TestSolrCloudWithSecureImpersonation: 
   [junit4]    >    1) Thread[id=32124, name=jetty-launcher-8334-thread-1-EventThread, state=TIMED_WAITING, group=TGRP-TestSolrCloudWithSecureImpersonation]
   [junit4]    >         at sun.misc.Unsafe.park(Native Method)
   [junit4]    >         at java.util.concurrent.locks.LockSupport.parkNanos(LockSupport.java:215)
   [junit4]    >         at java.util.concurrent.locks.AbstractQueuedSynchronizer.doAcquireSharedNanos(AbstractQueuedSynchronizer.java:1037)
   [junit4]    >         at java.util.concurrent.locks.AbstractQueuedSynchronizer.tryAcquireSharedNanos(AbstractQueuedSynchronizer.java:1328)
   [junit4]    >         at java.util.concurrent.CountDownLatch.await(CountDownLatch.java:277)
   [junit4]    >         at org.apache.curator.CuratorZookeeperClient.internalBlockUntilConnectedOrTimedOut(CuratorZookeeperClient.java:323)
   [junit4]    >         at org.apache.curator.RetryLoop.callWithRetry(RetryLoop.java:105)
   [junit4]    >         at org.apache.curator.framework.imps.GetDataBuilderImpl.pathInForeground(GetDataBuilderImpl.java:288)
   [junit4]    >         at org.apache.curator.framework.imps.GetDataBuilderImpl.forPath(GetDataBuilderImpl.java:279)
   [junit4]    >         at org.apache.curator.framework.imps.GetDataBuilderImpl.forPath(GetDataBuilderImpl.java:41)
   [junit4]    >         at org.apache.curator.framework.recipes.shared.SharedValue.readValue(SharedValue.java:244)
   [junit4]    >         at org.apache.curator.framework.recipes.shared.SharedValue.access$100(SharedValue.java:44)
   [junit4]    >         at org.apache.curator.framework.recipes.shared.SharedValue$1.process(SharedValue.java:61)
   [junit4]    >         at org.apache.curator.framework.imps.NamespaceWatcher.process(NamespaceWatcher.java:67)
   [junit4]    >         at org.apache.zookeeper.ClientCnxn$EventThread.processEvent(ClientCnxn.java:530)
   [junit4]    >         at org.apache.zookeeper.ClientCnxn$EventThread.run(ClientCnxn.java:505)
   [junit4]    > 	at __randomizedtesting.SeedInfo.seed([9FDD6D638E5433F9]:0)
   [junit4] Completed [571/764 (1!)] on J0 in 45.67s, 12 tests, 1 error <<< FAILURES!

[...truncated 48852 lines...]

Mime
View raw message