lucene-dev mailing list archives

Site index · List index
Message view « Date » · « Thread »
Top « Date » · « Thread »
From Policeman Jenkins Server <jenk...@thetaphi.de>
Subject [JENKINS] Lucene-Solr-7.x-Solaris (64bit/jdk1.8.0) - Build # 372 - Unstable!
Date Thu, 04 Jan 2018 04:50:34 GMT
Build: https://jenkins.thetaphi.de/job/Lucene-Solr-7.x-Solaris/372/
Java: 64bit/jdk1.8.0 -XX:+UseCompressedOops -XX:+UseSerialGC

2 tests failed.
FAILED:  junit.framework.TestSuite.org.apache.solr.cloud.TestSolrCloudWithSecureImpersonation

Error Message:
1 thread leaked from SUITE scope at org.apache.solr.cloud.TestSolrCloudWithSecureImpersonation:     1) Thread[id=29835, name=jetty-launcher-5491-thread-2-EventThread, state=TIMED_WAITING, group=TGRP-TestSolrCloudWithSecureImpersonation]         at sun.misc.Unsafe.park(Native Method)         at java.util.concurrent.locks.LockSupport.parkNanos(LockSupport.java:215)         at java.util.concurrent.locks.AbstractQueuedSynchronizer.doAcquireSharedNanos(AbstractQueuedSynchronizer.java:1037)         at java.util.concurrent.locks.AbstractQueuedSynchronizer.tryAcquireSharedNanos(AbstractQueuedSynchronizer.java:1328)         at java.util.concurrent.CountDownLatch.await(CountDownLatch.java:277)         at org.apache.curator.CuratorZookeeperClient.internalBlockUntilConnectedOrTimedOut(CuratorZookeeperClient.java:323)         at org.apache.curator.RetryLoop.callWithRetry(RetryLoop.java:105)         at org.apache.curator.framework.imps.GetDataBuilderImpl.pathInForeground(GetDataBuilderImpl.java:288)         at org.apache.curator.framework.imps.GetDataBuilderImpl.forPath(GetDataBuilderImpl.java:279)         at org.apache.curator.framework.imps.GetDataBuilderImpl.forPath(GetDataBuilderImpl.java:41)         at org.apache.curator.framework.recipes.shared.SharedValue.readValue(SharedValue.java:244)         at org.apache.curator.framework.recipes.shared.SharedValue.access$100(SharedValue.java:44)         at org.apache.curator.framework.recipes.shared.SharedValue$1.process(SharedValue.java:61)         at org.apache.curator.framework.imps.NamespaceWatcher.process(NamespaceWatcher.java:67)         at org.apache.zookeeper.ClientCnxn$EventThread.processEvent(ClientCnxn.java:530)         at org.apache.zookeeper.ClientCnxn$EventThread.run(ClientCnxn.java:505)

Stack Trace:
com.carrotsearch.randomizedtesting.ThreadLeakError: 1 thread leaked from SUITE scope at org.apache.solr.cloud.TestSolrCloudWithSecureImpersonation: 
   1) Thread[id=29835, name=jetty-launcher-5491-thread-2-EventThread, state=TIMED_WAITING, group=TGRP-TestSolrCloudWithSecureImpersonation]
        at sun.misc.Unsafe.park(Native Method)
        at java.util.concurrent.locks.LockSupport.parkNanos(LockSupport.java:215)
        at java.util.concurrent.locks.AbstractQueuedSynchronizer.doAcquireSharedNanos(AbstractQueuedSynchronizer.java:1037)
        at java.util.concurrent.locks.AbstractQueuedSynchronizer.tryAcquireSharedNanos(AbstractQueuedSynchronizer.java:1328)
        at java.util.concurrent.CountDownLatch.await(CountDownLatch.java:277)
        at org.apache.curator.CuratorZookeeperClient.internalBlockUntilConnectedOrTimedOut(CuratorZookeeperClient.java:323)
        at org.apache.curator.RetryLoop.callWithRetry(RetryLoop.java:105)
        at org.apache.curator.framework.imps.GetDataBuilderImpl.pathInForeground(GetDataBuilderImpl.java:288)
        at org.apache.curator.framework.imps.GetDataBuilderImpl.forPath(GetDataBuilderImpl.java:279)
        at org.apache.curator.framework.imps.GetDataBuilderImpl.forPath(GetDataBuilderImpl.java:41)
        at org.apache.curator.framework.recipes.shared.SharedValue.readValue(SharedValue.java:244)
        at org.apache.curator.framework.recipes.shared.SharedValue.access$100(SharedValue.java:44)
        at org.apache.curator.framework.recipes.shared.SharedValue$1.process(SharedValue.java:61)
        at org.apache.curator.framework.imps.NamespaceWatcher.process(NamespaceWatcher.java:67)
        at org.apache.zookeeper.ClientCnxn$EventThread.processEvent(ClientCnxn.java:530)
        at org.apache.zookeeper.ClientCnxn$EventThread.run(ClientCnxn.java:505)
	at __randomizedtesting.SeedInfo.seed([BF073CDCBB54C00B]:0)


FAILED:  org.apache.solr.cloud.autoscaling.sim.TestDistribStateManager.testGetSetRemoveData

Error Message:
Node watch should have fired!

Stack Trace:
java.lang.AssertionError: Node watch should have fired!
	at __randomizedtesting.SeedInfo.seed([BF073CDCBB54C00B:9997D38EEFDA0601]:0)
	at org.junit.Assert.fail(Assert.java:93)
	at org.apache.solr.cloud.autoscaling.sim.TestDistribStateManager.testGetSetRemoveData(TestDistribStateManager.java:256)
	at sun.reflect.NativeMethodAccessorImpl.invoke0(Native Method)
	at sun.reflect.NativeMethodAccessorImpl.invoke(NativeMethodAccessorImpl.java:62)
	at sun.reflect.DelegatingMethodAccessorImpl.invoke(DelegatingMethodAccessorImpl.java:43)
	at java.lang.reflect.Method.invoke(Method.java:498)
	at com.carrotsearch.randomizedtesting.RandomizedRunner.invoke(RandomizedRunner.java:1737)
	at com.carrotsearch.randomizedtesting.RandomizedRunner$8.evaluate(RandomizedRunner.java:934)
	at com.carrotsearch.randomizedtesting.RandomizedRunner$9.evaluate(RandomizedRunner.java:970)
	at com.carrotsearch.randomizedtesting.RandomizedRunner$10.evaluate(RandomizedRunner.java:984)
	at com.carrotsearch.randomizedtesting.rules.SystemPropertiesRestoreRule$1.evaluate(SystemPropertiesRestoreRule.java:57)
	at org.apache.lucene.util.TestRuleSetupTeardownChained$1.evaluate(TestRuleSetupTeardownChained.java:49)
	at org.apache.lucene.util.AbstractBeforeAfterRule$1.evaluate(AbstractBeforeAfterRule.java:45)
	at org.apache.lucene.util.TestRuleThreadAndTestName$1.evaluate(TestRuleThreadAndTestName.java:48)
	at org.apache.lucene.util.TestRuleIgnoreAfterMaxFailures$1.evaluate(TestRuleIgnoreAfterMaxFailures.java:64)
	at org.apache.lucene.util.TestRuleMarkFailure$1.evaluate(TestRuleMarkFailure.java:47)
	at com.carrotsearch.randomizedtesting.rules.StatementAdapter.evaluate(StatementAdapter.java:36)
	at com.carrotsearch.randomizedtesting.ThreadLeakControl$StatementRunner.run(ThreadLeakControl.java:368)
	at com.carrotsearch.randomizedtesting.ThreadLeakControl.forkTimeoutingTask(ThreadLeakControl.java:817)
	at com.carrotsearch.randomizedtesting.ThreadLeakControl$3.evaluate(ThreadLeakControl.java:468)
	at com.carrotsearch.randomizedtesting.RandomizedRunner.runSingleTest(RandomizedRunner.java:943)
	at com.carrotsearch.randomizedtesting.RandomizedRunner$5.evaluate(RandomizedRunner.java:829)
	at com.carrotsearch.randomizedtesting.RandomizedRunner$6.evaluate(RandomizedRunner.java:879)
	at com.carrotsearch.randomizedtesting.RandomizedRunner$7.evaluate(RandomizedRunner.java:890)
	at com.carrotsearch.randomizedtesting.rules.StatementAdapter.evaluate(StatementAdapter.java:36)
	at com.carrotsearch.randomizedtesting.rules.SystemPropertiesRestoreRule$1.evaluate(SystemPropertiesRestoreRule.java:57)
	at org.apache.lucene.util.AbstractBeforeAfterRule$1.evaluate(AbstractBeforeAfterRule.java:45)
	at com.carrotsearch.randomizedtesting.rules.StatementAdapter.evaluate(StatementAdapter.java:36)
	at org.apache.lucene.util.TestRuleStoreClassName$1.evaluate(TestRuleStoreClassName.java:41)
	at com.carrotsearch.randomizedtesting.rules.NoShadowingOrOverridesOnMethodsRule$1.evaluate(NoShadowingOrOverridesOnMethodsRule.java:40)
	at com.carrotsearch.randomizedtesting.rules.NoShadowingOrOverridesOnMethodsRule$1.evaluate(NoShadowingOrOverridesOnMethodsRule.java:40)
	at com.carrotsearch.randomizedtesting.rules.StatementAdapter.evaluate(StatementAdapter.java:36)
	at com.carrotsearch.randomizedtesting.rules.StatementAdapter.evaluate(StatementAdapter.java:36)
	at com.carrotsearch.randomizedtesting.rules.StatementAdapter.evaluate(StatementAdapter.java:36)
	at org.apache.lucene.util.TestRuleAssertionsRequired$1.evaluate(TestRuleAssertionsRequired.java:53)
	at org.apache.lucene.util.TestRuleMarkFailure$1.evaluate(TestRuleMarkFailure.java:47)
	at org.apache.lucene.util.TestRuleIgnoreAfterMaxFailures$1.evaluate(TestRuleIgnoreAfterMaxFailures.java:64)
	at org.apache.lucene.util.TestRuleIgnoreTestSuites$1.evaluate(TestRuleIgnoreTestSuites.java:54)
	at com.carrotsearch.randomizedtesting.rules.StatementAdapter.evaluate(StatementAdapter.java:36)
	at com.carrotsearch.randomizedtesting.ThreadLeakControl$StatementRunner.run(ThreadLeakControl.java:368)
	at java.lang.Thread.run(Thread.java:748)




Build Log:
[...truncated 12562 lines...]
   [junit4] Suite: org.apache.solr.cloud.autoscaling.sim.TestDistribStateManager
   [junit4]   2> 1420100 INFO  (SUITE-TestDistribStateManager-seed#[BF073CDCBB54C00B]-worker) [    ] o.a.s.SolrTestCaseJ4 SecureRandom sanity checks: test.solr.allowed.securerandom=null & java.security.egd=file:/dev/./urandom
   [junit4]   2> Creating dataDir: /export/home/jenkins/workspace/Lucene-Solr-7.x-Solaris/solr/build/solr-core/test/J0/temp/solr.cloud.autoscaling.sim.TestDistribStateManager_BF073CDCBB54C00B-001/init-core-data-001
   [junit4]   2> 1420101 WARN  (SUITE-TestDistribStateManager-seed#[BF073CDCBB54C00B]-worker) [    ] o.a.s.SolrTestCaseJ4 startTrackingSearchers: numOpens=1 numCloses=1
   [junit4]   2> 1420101 INFO  (SUITE-TestDistribStateManager-seed#[BF073CDCBB54C00B]-worker) [    ] o.a.s.SolrTestCaseJ4 Using PointFields (NUMERIC_POINTS_SYSPROP=true) w/NUMERIC_DOCVALUES_SYSPROP=false
   [junit4]   2> 1420102 INFO  (SUITE-TestDistribStateManager-seed#[BF073CDCBB54C00B]-worker) [    ] o.a.s.SolrTestCaseJ4 Randomized ssl (true) and clientAuth (false) via: @org.apache.solr.util.RandomizeSSL(reason=, value=NaN, ssl=NaN, clientAuth=NaN)
   [junit4]   2> 1420104 INFO  (TEST-TestDistribStateManager.testListData-seed#[BF073CDCBB54C00B]) [    ] o.a.s.SolrTestCaseJ4 ###Starting testListData
   [junit4]   2> 1420104 INFO  (TEST-TestDistribStateManager.testListData-seed#[BF073CDCBB54C00B]) [    ] o.a.s.c.a.s.TestDistribStateManager Using org.apache.solr.cloud.autoscaling.sim.SimDistribStateManager
   [junit4]   2> 1420104 INFO  (TEST-TestDistribStateManager.testListData-seed#[BF073CDCBB54C00B]) [    ] o.a.s.SolrTestCaseJ4 ###Ending testListData
   [junit4]   2> 1420106 INFO  (TEST-TestDistribStateManager.testCreateMode-seed#[BF073CDCBB54C00B]) [    ] o.a.s.SolrTestCaseJ4 ###Starting testCreateMode
   [junit4]   2> 1420106 INFO  (TEST-TestDistribStateManager.testCreateMode-seed#[BF073CDCBB54C00B]) [    ] o.a.s.c.a.s.TestDistribStateManager Using org.apache.solr.cloud.autoscaling.sim.SimDistribStateManager
   [junit4]   2> 1420107 INFO  (TEST-TestDistribStateManager.testCreateMode-seed#[BF073CDCBB54C00B]) [    ] o.a.s.c.a.s.TestDistribStateManager Using org.apache.solr.cloud.autoscaling.sim.SimDistribStateManager
   [junit4]   2> 1420107 INFO  (TEST-TestDistribStateManager.testCreateMode-seed#[BF073CDCBB54C00B]) [    ] o.a.s.SolrTestCaseJ4 ###Ending testCreateMode
   [junit4]   2> 1420109 INFO  (TEST-TestDistribStateManager.testHasData-seed#[BF073CDCBB54C00B]) [    ] o.a.s.SolrTestCaseJ4 ###Starting testHasData
   [junit4]   2> 1420109 INFO  (TEST-TestDistribStateManager.testHasData-seed#[BF073CDCBB54C00B]) [    ] o.a.s.c.ZkTestServer STARTING ZK TEST SERVER
   [junit4]   2> 1420109 INFO  (Thread-5015) [    ] o.a.s.c.ZkTestServer client port:0.0.0.0/0.0.0.0:0
   [junit4]   2> 1420109 INFO  (Thread-5015) [    ] o.a.s.c.ZkTestServer Starting server
   [junit4]   2> 1420111 ERROR (Thread-5015) [    ] o.a.z.s.ZooKeeperServer ZKShutdownHandler is not registered, so ZooKeeper server won't take any action on ERROR or SHUTDOWN server state changes
   [junit4]   2> 1420212 INFO  (TEST-TestDistribStateManager.testHasData-seed#[BF073CDCBB54C00B]) [    ] o.a.s.c.ZkTestServer start zk server on port:56211
   [junit4]   2> 1420214 INFO  (zkConnectionManagerCallback-3256-thread-1) [    ] o.a.s.c.c.ConnectionManager zkClient has connected
   [junit4]   2> 1420214 INFO  (TEST-TestDistribStateManager.testHasData-seed#[BF073CDCBB54C00B]) [    ] o.a.s.c.a.s.TestDistribStateManager Using org.apache.solr.client.solrj.impl.ZkDistribStateManager
   [junit4]   2> 1420219 ERROR (TEST-TestDistribStateManager.testHasData-seed#[BF073CDCBB54C00B]) [    ] o.a.z.s.ZooKeeperServer ZKShutdownHandler is not registered, so ZooKeeper server won't take any action on ERROR or SHUTDOWN server state changes
   [junit4]   2> 1420220 INFO  (TEST-TestDistribStateManager.testHasData-seed#[BF073CDCBB54C00B]) [    ] o.a.s.c.ZkTestServer connecting to 127.0.0.1:56211 56211
   [junit4]   2> 1420785 INFO  (Thread-5015) [    ] o.a.s.c.ZkTestServer connecting to 127.0.0.1:56211 56211
   [junit4]   2> 1420788 INFO  (TEST-TestDistribStateManager.testHasData-seed#[BF073CDCBB54C00B]) [    ] o.a.s.SolrTestCaseJ4 ###Ending testHasData
   [junit4]   2> 1420792 INFO  (TEST-TestDistribStateManager.testMulti-seed#[BF073CDCBB54C00B]) [    ] o.a.s.SolrTestCaseJ4 ###Starting testMulti
   [junit4]   2> 1420792 INFO  (TEST-TestDistribStateManager.testMulti-seed#[BF073CDCBB54C00B]) [    ] o.a.s.c.a.s.TestDistribStateManager Using org.apache.solr.cloud.autoscaling.sim.SimDistribStateManager
   [junit4]   2> 1420792 INFO  (TEST-TestDistribStateManager.testMulti-seed#[BF073CDCBB54C00B]) [    ] o.a.s.SolrTestCaseJ4 ###Ending testMulti
   [junit4]   2> 1420795 INFO  (TEST-TestDistribStateManager.testGetSetRemoveData-seed#[BF073CDCBB54C00B]) [    ] o.a.s.SolrTestCaseJ4 ###Starting testGetSetRemoveData
   [junit4]   2> 1420796 INFO  (TEST-TestDistribStateManager.testGetSetRemoveData-seed#[BF073CDCBB54C00B]) [    ] o.a.s.c.ZkTestServer STARTING ZK TEST SERVER
   [junit4]   2> 1420796 INFO  (Thread-5016) [    ] o.a.s.c.ZkTestServer client port:0.0.0.0/0.0.0.0:0
   [junit4]   2> 1420796 INFO  (Thread-5016) [    ] o.a.s.c.ZkTestServer Starting server
   [junit4]   2> 1420799 ERROR (Thread-5016) [    ] o.a.z.s.ZooKeeperServer ZKShutdownHandler is not registered, so ZooKeeper server won't take any action on ERROR or SHUTDOWN server state changes
   [junit4]   2> 1420896 INFO  (TEST-TestDistribStateManager.testGetSetRemoveData-seed#[BF073CDCBB54C00B]) [    ] o.a.s.c.ZkTestServer start zk server on port:53196
   [junit4]   2> 1420901 INFO  (zkConnectionManagerCallback-3258-thread-1) [    ] o.a.s.c.c.ConnectionManager zkClient has connected
   [junit4]   2> 1420901 INFO  (TEST-TestDistribStateManager.testGetSetRemoveData-seed#[BF073CDCBB54C00B]) [    ] o.a.s.c.a.s.TestDistribStateManager Using org.apache.solr.client.solrj.impl.ZkDistribStateManager
   [junit4]   2> 1420920 INFO  (zkConnectionManagerCallback-3260-thread-1) [    ] o.a.s.c.c.ConnectionManager zkClient has connected
   [junit4]   2> 1420921 INFO  (TEST-TestDistribStateManager.testGetSetRemoveData-seed#[BF073CDCBB54C00B]) [    ] o.a.s.c.a.s.TestDistribStateManager Using org.apache.solr.client.solrj.impl.ZkDistribStateManager
   [junit4]   2> 1425927 ERROR (TEST-TestDistribStateManager.testGetSetRemoveData-seed#[BF073CDCBB54C00B]) [    ] o.a.z.s.ZooKeeperServer ZKShutdownHandler is not registered, so ZooKeeper server won't take any action on ERROR or SHUTDOWN server state changes
   [junit4]   2> 1425929 INFO  (TEST-TestDistribStateManager.testGetSetRemoveData-seed#[BF073CDCBB54C00B]) [    ] o.a.s.c.ZkTestServer connecting to 127.0.0.1:53196 53196
   [junit4]   2> 1436237 INFO  (Thread-5016) [    ] o.a.s.c.ZkTestServer connecting to 127.0.0.1:53196 53196
   [junit4]   2> 1436239 INFO  (TEST-TestDistribStateManager.testGetSetRemoveData-seed#[BF073CDCBB54C00B]) [    ] o.a.s.SolrTestCaseJ4 ###Ending testGetSetRemoveData
   [junit4]   2> NOTE: reproduce with: ant test  -Dtestcase=TestDistribStateManager -Dtests.method=testGetSetRemoveData -Dtests.seed=BF073CDCBB54C00B -Dtests.slow=true -Dtests.locale=ru -Dtests.timezone=America/Shiprock -Dtests.asserts=true -Dtests.file.encoding=ISO-8859-1
   [junit4] FAILURE 15.4s J0 | TestDistribStateManager.testGetSetRemoveData <<<
   [junit4]    > Throwable #1: java.lang.AssertionError: Node watch should have fired!
   [junit4]    > 	at __randomizedtesting.SeedInfo.seed([BF073CDCBB54C00B:9997D38EEFDA0601]:0)
   [junit4]    > 	at org.apache.solr.cloud.autoscaling.sim.TestDistribStateManager.testGetSetRemoveData(TestDistribStateManager.java:256)
   [junit4]    > 	at java.lang.Thread.run(Thread.java:748)
   [junit4]   2> NOTE: leaving temporary files on disk at: /export/home/jenkins/workspace/Lucene-Solr-7.x-Solaris/solr/build/solr-core/test/J0/temp/solr.cloud.autoscaling.sim.TestDistribStateManager_BF073CDCBB54C00B-001
   [junit4]   2> NOTE: test params are: codec=Asserting(Lucene70): {}, docValues:{}, maxPointsInLeafNode=1052, maxMBSortInHeap=7.005888951251702, sim=RandomSimilarity(queryNorm=true): {}, locale=ru, timezone=America/Shiprock
   [junit4]   2> NOTE: SunOS 5.11 amd64/Oracle Corporation 1.8.0_152 (64-bit)/cpus=3,threads=1,free=159481904,total=387837952
   [junit4]   2> NOTE: All tests run in this JVM: [RecoveryZkTest, TestPhraseSuggestions, ImplicitSnitchTest, TestJoin, FieldAnalysisRequestHandlerTest, HdfsDirectoryTest, TestSolrXml, TestSolrCoreSnapshots, TestStressInPlaceUpdates, TestManagedResourceStorage, FacetPivotSmallTest, ScriptEngineTest, TestScoreJoinQPNoScore, TestObjectReleaseTracker, TestJsonRequest, TestUnifiedSolrHighlighter, DateFieldTest, TestInPlaceUpdatesDistrib, TestBackupRepositoryFactory, BigEndianAscendingWordDeserializerTest, DistributedFacetPivotSmallAdvancedTest, TestConfigSets, JavabinLoaderTest, SuggesterWFSTTest, SolrGangliaReporterTest, SubstringBytesRefFilterTest, TestRawTransformer, TestCursorMarkWithoutUniqueKey, TestTolerantSearch, TestCSVResponseWriter, TestPointFields, TestUtils, DeleteNodeTest, TestDeleteCollectionOnDownNodes, HdfsChaosMonkeyNothingIsSafeTest, TestCollectionAPI, SpatialFilterTest, TestSubQueryTransformer, TestNumericRangeQuery32, TestExportWriter, TestReplicaProperties, DataDrivenBlockJoinTest, TestRealTimeGet, TestSmileRequest, RequiredFieldsTest, AutoScalingHandlerTest, TestHalfAndHalfDocValues, TestPolicyCloud, DistributedSpellCheckComponentTest, HdfsDirectoryFactoryTest, DistribJoinFromCollectionTest, TestSolrCloudWithDelegationTokens, SpellCheckCollatorTest, TestPHPSerializedResponseWriter, VMParamsZkACLAndCredentialsProvidersTest, TestConfigReload, ConfigureRecoveryStrategyTest, TestCloudSearcherWarming, HighlighterConfigTest, HdfsCollectionsAPIDistributedZkTest, TestPseudoReturnFields, TestUpdate, ReplicaListTransformerTest, ResourceLoaderTest, SolrInfoBeanTest, SolrCoreMetricManagerTest, TestPolicyCloud, HdfsUnloadDistributedZkTest, BitVectorTest, RankQueryTest, SpellCheckComponentTest, CdcrReplicationDistributedZkTest, CSVRequestHandlerTest, TestDFISimilarityFactory, TestRandomDVFaceting, HdfsBasicDistributedZk2Test, TimeZoneUtilsTest, TestSolrConfigHandlerCloud, TestRecoveryHdfs, TestGenericDistributedQueue, BlockJoinFacetDistribTest, PathHierarchyTokenizerFactoryTest, DistribCursorPagingTest, TestPrepRecovery, AlternateDirectoryTest, StatsReloadRaceTest, PrimUtilsTest, TestSizeLimitedDistributedMap, TestFieldCacheSortRandom, TestReversedWildcardFilterFactory, TimeRoutedAliasUpdateProcessorTest, TestAddFieldRealTimeGet, HighlighterTest, DateMathParserTest, HdfsRestartWhileUpdatingTest, CursorPagingTest, TestSchemaSimilarityResource, HdfsThreadLeakTest, TestQuerySenderListener, TestSolr4Spatial, TestBinaryField, MoveReplicaTest, AnalyticsQueryTest, JvmMetricsTest, DirectSolrConnectionTest, SyncSliceTest, ZkStateReaderTest, JSONWriterTest, ShardRoutingTest, CircularListTest, DocValuesMissingTest, SolrMetricReporterTest, ZkControllerTest, SuggesterTSTTest, TestDownShardTolerantSearch, TestDefaultStatsCache, DistributedExpandComponentTest, TestSolrDeletionPolicy2, TestSchemalessBufferedUpdates, TestGraphMLResponseWriter, UpdateLogTest, UUIDFieldTest, TestQuerySenderNoQuery, ClassificationUpdateProcessorIntegrationTest, XsltUpdateRequestHandlerTest, NumericFieldsTest, DirectoryFactoryTest, SolrTestCaseJ4Test, TestCodecSupport, RemoteQueryErrorTest, SolrJmxReporterCloudTest, OverseerTest, TestExceedMaxTermLength, MultiTermTest, ReturnFieldsTest, TestClusterStateProvider, TestAuthorizationFramework, TestCloudNestedDocsSort, TestReqParamsAPI, ChaosMonkeySafeLeaderWithPullReplicasTest, TestSolrQueryResponse, TestLFUCache, SolrShardReporterTest, ConnectionReuseTest, RegexBoostProcessorTest, TestDistribStateManager]
   [junit4] Completed [268/764 (1!)] on J0 in 16.17s, 5 tests, 1 failure <<< FAILURES!

[...truncated 1024 lines...]
   [junit4] Suite: org.apache.solr.cloud.TestSolrCloudWithSecureImpersonation
   [junit4]   2> 3730283 INFO  (SUITE-TestSolrCloudWithSecureImpersonation-seed#[BF073CDCBB54C00B]-worker) [    ] o.a.s.SolrTestCaseJ4 SecureRandom sanity checks: test.solr.allowed.securerandom=null & java.security.egd=file:/dev/./urandom
   [junit4]   2> Creating dataDir: /export/home/jenkins/workspace/Lucene-Solr-7.x-Solaris/solr/build/solr-core/test/J1/temp/solr.cloud.TestSolrCloudWithSecureImpersonation_BF073CDCBB54C00B-001/init-core-data-001
   [junit4]   2> 3730283 WARN  (SUITE-TestSolrCloudWithSecureImpersonation-seed#[BF073CDCBB54C00B]-worker) [    ] o.a.s.SolrTestCaseJ4 startTrackingSearchers: numOpens=10 numCloses=10
   [junit4]   2> 3730284 INFO  (SUITE-TestSolrCloudWithSecureImpersonation-seed#[BF073CDCBB54C00B]-worker) [    ] o.a.s.SolrTestCaseJ4 Using PointFields (NUMERIC_POINTS_SYSPROP=true) w/NUMERIC_DOCVALUES_SYSPROP=true
   [junit4]   2> 3730286 INFO  (SUITE-TestSolrCloudWithSecureImpersonation-seed#[BF073CDCBB54C00B]-worker) [    ] o.a.s.SolrTestCaseJ4 Randomized ssl (false) and clientAuth (false) via: @org.apache.solr.util.RandomizeSSL(reason=, value=NaN, ssl=NaN, clientAuth=NaN)
   [junit4]   2> 3730322 INFO  (SUITE-TestSolrCloudWithSecureImpersonation-seed#[BF073CDCBB54C00B]-worker) [    ] o.a.s.c.MiniSolrCloudCluster Starting cluster of 2 servers in /export/home/jenkins/workspace/Lucene-Solr-7.x-Solaris/solr/build/solr-core/test/J1/temp/solr.cloud.TestSolrCloudWithSecureImpersonation_BF073CDCBB54C00B-001/tempDir-001
   [junit4]   2> 3730322 INFO  (SUITE-TestSolrCloudWithSecureImpersonation-seed#[BF073CDCBB54C00B]-worker) [    ] o.a.s.c.ZkTestServer STARTING ZK TEST SERVER
   [junit4]   2> 3730322 INFO  (Thread-7561) [    ] o.a.s.c.ZkTestServer client port:0.0.0.0/0.0.0.0:0
   [junit4]   2> 3730323 INFO  (Thread-7561) [    ] o.a.s.c.ZkTestServer Starting server
   [junit4]   2> 3730324 ERROR (Thread-7561) [    ] o.a.z.s.ZooKeeperServer ZKShutdownHandler is not registered, so ZooKeeper server won't take any action on ERROR or SHUTDOWN server state changes
   [junit4]   2> 3730422 INFO  (SUITE-TestSolrCloudWithSecureImpersonation-seed#[BF073CDCBB54C00B]-worker) [    ] o.a.s.c.ZkTestServer start zk server on port:35273
   [junit4]   2> 3730426 INFO  (zkConnectionManagerCallback-5494-thread-1) [    ] o.a.s.c.c.ConnectionManager zkClient has connected
   [junit4]   2> 3730435 INFO  (jetty-launcher-5491-thread-1) [    ] o.e.j.s.Server jetty-9.3.20.v20170531
   [junit4]   2> 3730436 INFO  (jetty-launcher-5491-thread-2) [    ] o.e.j.s.Server jetty-9.3.20.v20170531
   [junit4]   2> 3730441 INFO  (jetty-launcher-5491-thread-2) [    ] o.e.j.s.h.ContextHandler Started o.e.j.s.ServletContextHandler@47a4c0c4{/solr,null,AVAILABLE}
   [junit4]   2> 3730441 INFO  (jetty-launcher-5491-thread-1) [    ] o.e.j.s.h.ContextHandler Started o.e.j.s.ServletContextHandler@29c8bae0{/solr,null,AVAILABLE}
   [junit4]   2> 3730442 INFO  (jetty-launcher-5491-thread-2) [    ] o.e.j.s.AbstractConnector Started ServerConnector@188878ae{HTTP/1.1,[http/1.1]}{127.0.0.1:46751}
   [junit4]   2> 3730442 INFO  (jetty-launcher-5491-thread-2) [    ] o.e.j.s.Server Started @3734811ms
   [junit4]   2> 3730443 INFO  (jetty-launcher-5491-thread-2) [    ] o.a.s.c.s.e.JettySolrRunner Jetty properties: {hostContext=/solr, hostPort=46751}
   [junit4]   2> 3730443 INFO  (jetty-launcher-5491-thread-1) [    ] o.e.j.s.AbstractConnector Started ServerConnector@3014e0{HTTP/1.1,[http/1.1]}{127.0.0.1:38906}
   [junit4]   2> 3730443 INFO  (jetty-launcher-5491-thread-1) [    ] o.e.j.s.Server Started @3734812ms
   [junit4]   2> 3730443 ERROR (jetty-launcher-5491-thread-2) [    ] o.a.s.u.StartupLoggingUtils Missing Java Option solr.log.dir. Logging may be missing or incomplete.
   [junit4]   2> 3730443 INFO  (jetty-launcher-5491-thread-2) [    ] o.a.s.s.SolrDispatchFilter  ___      _       Welcome to Apache Solr? version 7.3.0
   [junit4]   2> 3730443 INFO  (jetty-launcher-5491-thread-2) [    ] o.a.s.s.SolrDispatchFilter / __| ___| |_ _   Starting in cloud mode on port null
   [junit4]   2> 3730444 INFO  (jetty-launcher-5491-thread-2) [    ] o.a.s.s.SolrDispatchFilter \__ \/ _ \ | '_|  Install dir: null
   [junit4]   2> 3730444 INFO  (jetty-launcher-5491-thread-2) [    ] o.a.s.s.SolrDispatchFilter |___/\___/_|_|    Start time: 2018-01-04T04:11:17.846Z
   [junit4]   2> 3730443 INFO  (jetty-launcher-5491-thread-1) [    ] o.a.s.c.s.e.JettySolrRunner Jetty properties: {hostContext=/solr, hostPort=38906}
   [junit4]   2> 3730447 ERROR (jetty-launcher-5491-thread-1) [    ] o.a.s.u.StartupLoggingUtils Missing Java Option solr.log.dir. Logging may be missing or incomplete.
   [junit4]   2> 3730447 INFO  (jetty-launcher-5491-thread-1) [    ] o.a.s.s.SolrDispatchFilter  ___      _       Welcome to Apache Solr? version 7.3.0
   [junit4]   2> 3730447 INFO  (jetty-launcher-5491-thread-1) [    ] o.a.s.s.SolrDispatchFilter / __| ___| |_ _   Starting in cloud mode on port null
   [junit4]   2> 3730447 INFO  (jetty-launcher-5491-thread-1) [    ] o.a.s.s.SolrDispatchFilter \__ \/ _ \ | '_|  Install dir: null
   [junit4]   2> 3730447 INFO  (jetty-launcher-5491-thread-1) [    ] o.a.s.s.SolrDispatchFilter |___/\___/_|_|    Start time: 2018-01-04T04:11:17.849Z
   [junit4]   2> 3730451 INFO  (zkConnectionManagerCallback-5498-thread-1) [    ] o.a.s.c.c.ConnectionManager zkClient has connected
   [junit4]   2> 3730452 INFO  (jetty-launcher-5491-thread-1) [    ] o.a.s.s.SolrDispatchFilter solr.xml found in ZooKeeper. Loading...
   [junit4]   2> 3730464 INFO  (zkConnectionManagerCallback-5496-thread-1) [    ] o.a.s.c.c.ConnectionManager zkClient has connected
   [junit4]   2> 3730466 INFO  (jetty-launcher-5491-thread-2) [    ] o.a.s.s.SolrDispatchFilter solr.xml found in ZooKeeper. Loading...
   [junit4]   2> 3730477 INFO  (jetty-launcher-5491-thread-1) [    ] o.a.s.c.ZkContainer Zookeeper client=127.0.0.1:35273/solr
   [junit4]   2> 3730481 INFO  (jetty-launcher-5491-thread-2) [    ] o.a.s.c.ZkContainer Zookeeper client=127.0.0.1:35273/solr
   [junit4]   2> 3730483 INFO  (zkConnectionManagerCallback-5506-thread-1) [    ] o.a.s.c.c.ConnectionManager zkClient has connected
   [junit4]   2> 3730490 INFO  (zkConnectionManagerCallback-5502-thread-1) [    ] o.a.s.c.c.ConnectionManager zkClient has connected
   [junit4]   2> 3730491 INFO  (zkConnectionManagerCallback-5508-thread-1-processing-n:127.0.0.1:46751_solr) [n:127.0.0.1:46751_solr    ] o.a.s.c.c.ConnectionManager zkClient has connected
   [junit4]   2> 3730492 INFO  (zkConnectionManagerCallback-5510-thread-1-processing-n:127.0.0.1:38906_solr) [n:127.0.0.1:38906_solr    ] o.a.s.c.c.ConnectionManager zkClient has connected
   [junit4]   2> 3730629 INFO  (jetty-launcher-5491-thread-1) [n:127.0.0.1:38906_solr    ] o.a.s.c.Overseer Overseer (id=null) closing
   [junit4]   2> 3730629 INFO  (jetty-launcher-5491-thread-1) [n:127.0.0.1:38906_solr    ] o.a.s.c.OverseerElectionContext I am going to be the leader 127.0.0.1:38906_solr
   [junit4]   2> 3730630 INFO  (jetty-launcher-5491-thread-2) [n:127.0.0.1:46751_solr    ] o.a.s.c.Overseer Overseer (id=null) closing
   [junit4]   2> 3730631 INFO  (jetty-launcher-5491-thread-1) [n:127.0.0.1:38906_solr    ] o.a.s.c.Overseer Overseer (id=99289600997851142-127.0.0.1:38906_solr-n_0000000000) starting
   [junit4]   2> 3730631 INFO  (jetty-launcher-5491-thread-2) [n:127.0.0.1:46751_solr    ] o.a.s.c.ZkController Register node as live in ZooKeeper:/live_nodes/127.0.0.1:46751_solr
   [junit4]   2> 3730633 INFO  (zkCallback-5507-thread-1-processing-n:127.0.0.1:46751_solr) [n:127.0.0.1:46751_solr    ] o.a.s.c.c.ZkStateReader Updated live nodes from ZooKeeper... (0) -> (1)
   [junit4]   2> 3730633 INFO  (zkCallback-5509-thread-1-processing-n:127.0.0.1:38906_solr) [n:127.0.0.1:38906_solr    ] o.a.s.c.c.ZkStateReader Updated live nodes from ZooKeeper... (0) -> (1)
   [junit4]   2> 3730642 INFO  (jetty-launcher-5491-thread-1) [n:127.0.0.1:38906_solr    ] o.a.s.c.ZkController Register node as live in ZooKeeper:/live_nodes/127.0.0.1:38906_solr
   [junit4]   2> 3730644 INFO  (zkCallback-5507-thread-1-processing-n:127.0.0.1:46751_solr) [n:127.0.0.1:46751_solr    ] o.a.s.c.c.ZkStateReader Updated live nodes from ZooKeeper... (1) -> (2)
   [junit4]   2> 3730644 INFO  (zkCallback-5509-thread-1-processing-n:127.0.0.1:38906_solr) [n:127.0.0.1:38906_solr    ] o.a.s.c.c.ZkStateReader Updated live nodes from ZooKeeper... (1) -> (2)
   [junit4]   2> 3730669 INFO  (jetty-launcher-5491-thread-2) [n:127.0.0.1:46751_solr    ] o.a.s.c.CoreContainer Initializing authentication plugin: org.apache.solr.security.HttpParamDelegationTokenPlugin
   [junit4]   2> 3730670 WARN  (jetty-launcher-5491-thread-2) [n:127.0.0.1:46751_solr    ] o.a.s.c.s.i.Krb5HttpClientBuilder org.apache.solr.client.solrj.impl.Krb5HttpClientBuilder is configured without specifying system property 'java.security.auth.login.config'
   [junit4]   2> 3730670 INFO  (jetty-launcher-5491-thread-2) [n:127.0.0.1:46751_solr    ] o.a.s.s.KerberosPlugin Params: {solr.kerberos.impersonator.user.noGroups.hosts=*, solr.kerberos.impersonator.user.bogusGroup.groups=__some_bogus_group, token.valid=30, cookie.domain=127.0.0.1, solr.kerberos.impersonator.user.anyHostAnyUser.groups=*, solr.kerberos.impersonator.user.bogusGroup.hosts=*, solr.kerberos.impersonator.user.anyHostAnyUser.hosts=*, token.validity=36000, solr.kerberos.impersonator.user.noHosts.groups=*, type=kerberos, solr.kerberos.impersonator.user.localHostAnyGroup.groups=*, delegation-token.token-kind=solr-dt, solr.kerberos.impersonator.user.wrongHost.hosts=1.1.1.1.1.1, cookie.path=/, zk-dt-secret-manager.znodeWorkingPath=solr/security/zkdtsm, solr.kerberos.impersonator.user.localHostAnyGroup.hosts=serv1-vm3,localhost,127.0.0.1, signer.secret.provider.zookeeper.path=/token, solr.kerberos.impersonator.user.anyHostUsersGroup.groups=staff, zk-dt-secret-manager.enable=true, solr.kerberos.impersonator.user.wrongHost.groups=*, kerberos.name.rules=DEFAULT, signer.secret.provider=zookeeper, solr.kerberos.impersonator.user.anyHostUsersGroup.hosts=*}
   [junit4]   2> 3730672 INFO  (jetty-launcher-5491-thread-2) [n:127.0.0.1:46751_solr    ] o.a.c.f.i.CuratorFrameworkImpl Starting
   [junit4]   2> 3730677 INFO  (jetty-launcher-5491-thread-2-EventThread) [n:127.0.0.1:46751_solr    ] o.a.c.f.s.ConnectionStateManager State change: CONNECTED
   [junit4]   2> 3730690 WARN  (jetty-launcher-5491-thread-2) [n:127.0.0.1:46751_solr    ] o.a.s.c.s.i.Krb5HttpClientBuilder org.apache.solr.client.solrj.impl.Krb5HttpClientBuilder is configured without specifying system property 'java.security.auth.login.config'
   [junit4]   2> 3730711 INFO  (jetty-launcher-5491-thread-1) [n:127.0.0.1:38906_solr    ] o.a.s.c.CoreContainer Initializing authentication plugin: org.apache.solr.security.HttpParamDelegationTokenPlugin
   [junit4]   2> 3730711 WARN  (jetty-launcher-5491-thread-1) [n:127.0.0.1:38906_solr    ] o.a.s.c.s.i.Krb5HttpClientBuilder org.apache.solr.client.solrj.impl.Krb5HttpClientBuilder is configured without specifying system property 'java.security.auth.login.config'
   [junit4]   2> 3730712 INFO  (jetty-launcher-5491-thread-1) [n:127.0.0.1:38906_solr    ] o.a.s.s.KerberosPlugin Params: {solr.kerberos.impersonator.user.noGroups.hosts=*, solr.kerberos.impersonator.user.bogusGroup.groups=__some_bogus_group, token.valid=30, cookie.domain=127.0.0.1, solr.kerberos.impersonator.user.anyHostAnyUser.groups=*, solr.kerberos.impersonator.user.bogusGroup.hosts=*, solr.kerberos.impersonator.user.anyHostAnyUser.hosts=*, token.validity=36000, solr.kerberos.impersonator.user.noHosts.groups=*, type=kerberos, solr.kerberos.impersonator.user.localHostAnyGroup.groups=*, delegation-token.token-kind=solr-dt, solr.kerberos.impersonator.user.wrongHost.hosts=1.1.1.1.1.1, cookie.path=/, zk-dt-secret-manager.znodeWorkingPath=solr/security/zkdtsm, solr.kerberos.impersonator.user.localHostAnyGroup.hosts=serv1-vm3,localhost,127.0.0.1, signer.secret.provider.zookeeper.path=/token, solr.kerberos.impersonator.user.anyHostUsersGroup.groups=staff, zk-dt-secret-manager.enable=true, solr.kerberos.impersonator.user.wrongHost.groups=*, kerberos.name.rules=DEFAULT, signer.secret.provider=zookeeper, solr.kerberos.impersonator.user.anyHostUsersGroup.hosts=*}
   [junit4]   2> 3730713 INFO  (jetty-launcher-5491-thread-1) [n:127.0.0.1:38906_solr    ] o.a.c.f.i.CuratorFrameworkImpl Starting
   [junit4]   2> 3730715 INFO  (jetty-launcher-5491-thread-1-EventThread) [n:127.0.0.1:38906_solr    ] o.a.c.f.s.ConnectionStateManager State change: CONNECTED
   [junit4]   2> 3730738 INFO  (jetty-launcher-5491-thread-2) [n:127.0.0.1:46751_solr    ] o.a.s.m.r.SolrJmxReporter JMX monitoring for 'solr_46751.solr.node' (registry 'solr.node') enabled at server: com.sun.jmx.mbeanserver.JmxMBeanServer@7554e26d
   [junit4]   2> 3730742 WARN  (jetty-launcher-5491-thread-1) [n:127.0.0.1:38906_solr    ] o.a.s.c.s.i.Krb5HttpClientBuilder org.apache.solr.client.solrj.impl.Krb5HttpClientBuilder is configured without specifying system property 'java.security.auth.login.config'
   [junit4]   2> 3730744 INFO  (jetty-launcher-5491-thread-2) [n:127.0.0.1:46751_solr    ] o.a.s.m.r.SolrJmxReporter JMX monitoring for 'solr_46751.solr.jvm' (registry 'solr.jvm') enabled at server: com.sun.jmx.mbeanserver.JmxMBeanServer@7554e26d
   [junit4]   2> 3730744 INFO  (jetty-launcher-5491-thread-2) [n:127.0.0.1:46751_solr    ] o.a.s.m.r.SolrJmxReporter JMX monitoring for 'solr_46751.solr.jetty' (registry 'solr.jetty') enabled at server: com.sun.jmx.mbeanserver.JmxMBeanServer@7554e26d
   [junit4]   2> 3730745 INFO  (jetty-launcher-5491-thread-2) [n:127.0.0.1:46751_solr    ] o.a.s.c.CorePropertiesLocator Found 0 core definitions underneath /export/home/jenkins/workspace/Lucene-Solr-7.x-Solaris/solr/build/solr-core/test/J1/temp/solr.cloud.TestSolrCloudWithSecureImpersonation_BF073CDCBB54C00B-001/tempDir-001/node2/.
   [junit4]   2> 3730768 INFO  (jetty-launcher-5491-thread-1) [n:127.0.0.1:38906_solr    ] o.a.s.m.r.SolrJmxReporter JMX monitoring for 'solr_38906.solr.node' (registry 'solr.node') enabled at server: com.sun.jmx.mbeanserver.JmxMBeanServer@7554e26d
   [junit4]   2> 3730774 INFO  (jetty-launcher-5491-thread-1) [n:127.0.0.1:38906_solr    ] o.a.s.m.r.SolrJmxReporter JMX monitoring for 'solr_38906.solr.jvm' (registry 'solr.jvm') enabled at server: com.sun.jmx.mbeanserver.JmxMBeanServer@7554e26d
   [junit4]   2> 3730774 INFO  (jetty-launcher-5491-thread-1) [n:127.0.0.1:38906_solr    ] o.a.s.m.r.SolrJmxReporter JMX monitoring for 'solr_38906.solr.jetty' (registry 'solr.jetty') enabled at server: com.sun.jmx.mbeanserver.JmxMBeanServer@7554e26d
   [junit4]   2> 3730775 INFO  (jetty-launcher-5491-thread-1) [n:127.0.0.1:38906_solr    ] o.a.s.c.CorePropertiesLocator Found 0 core definitions underneath /export/home/jenkins/workspace/Lucene-Solr-7.x-Solaris/solr/build/solr-core/test/J1/temp/solr.cloud.TestSolrCloudWithSecureImpersonation_BF073CDCBB54C00B-001/tempDir-001/node1/.
   [junit4]   2> 3730790 INFO  (zkConnectionManagerCallback-5516-thread-1) [    ] o.a.s.c.c.ConnectionManager zkClient has connected
   [junit4]   2> 3730808 INFO  (TEST-TestSolrCloudWithSecureImpersonation.testProxyInvalidProxyUser-seed#[BF073CDCBB54C00B]) [    ] o.a.s.SolrTestCaseJ4 ###Starting testProxyInvalidProxyUser
   [junit4]   2> 3730813 INFO  (TEST-TestSolrCloudWithSecureImpersonation.testProxyInvalidProxyUser-seed#[BF073CDCBB54C00B]) [    ] o.a.s.SolrTestCaseJ4 ###Ending testProxyInvalidProxyUser
   [junit4]   2> 3730833 INFO  (TEST-TestSolrCloudWithSecureImpersonation.testProxyNullProxyUser-seed#[BF073CDCBB54C00B]) [    ] o.a.s.SolrTestCaseJ4 ###Starting testProxyNullProxyUser
   [junit4]   2> 3730834 INFO  (qtp1513328013-29797) [    ] o.a.s.s.SolrDispatchFilter Error authenticating
   [junit4]   2> java.lang.IllegalArgumentException: userName is NULL, empty or contains a '&'
   [junit4]   2> 	at org.apache.hadoop.security.authentication.util.AuthToken.checkForIllegalArgument(AuthToken.java:87)
   [junit4]   2> 	at org.apache.hadoop.security.authentication.util.AuthToken.<init>(AuthToken.java:70)
   [junit4]   2> 	at org.apache.hadoop.security.authentication.server.AuthenticationToken.<init>(AuthenticationToken.java:58)
   [junit4]   2> 	at org.apache.solr.security.HttpParamDelegationTokenPlugin$HttpParamDelegationTokenAuthenticationHandler$HttpParamAuthenticationHandler.authenticate(HttpParamDelegationTokenPlugin.java:213)
   [junit4]   2> 	at org.apache.hadoop.security.token.delegation.web.DelegationTokenAuthenticationHandler.authenticate(DelegationTokenAuthenticationHandler.java:348)
   [junit4]   2> 	at org.apache.solr.security.RequestContinuesRecorderAuthenticationHandler.authenticate(RequestContinuesRecorderAuthenticationHandler.java:69)
   [junit4]   2> 	at org.apache.hadoop.security.authentication.server.AuthenticationFilter.doFilter(AuthenticationFilter.java:518)
   [junit4]   2> 	at org.apache.solr.security.DelegationTokenKerberosFilter.doFilter(DelegationTokenKerberosFilter.java:134)
   [junit4]   2> 	at org.apache.solr.security.HttpParamDelegationTokenPlugin$HttpParamToRequestFilter.doFilter(HttpParamDelegationTokenPlugin.java:245)
   [junit4]   2> 	at org.apache.solr.security.KerberosPlugin.doAuthenticate(KerberosPlugin.java:243)
   [junit4]   2> 	at org.apache.solr.servlet.SolrDispatchFilter.authenticateRequest(SolrDispatchFilter.java:451)
   [junit4]   2> 	at org.apache.solr.servlet.SolrDispatchFilter.doFilter(SolrDispatchFilter.java:347)
   [junit4]   2> 	at org.apache.solr.servlet.SolrDispatchFilter.doFilter(SolrDispatchFilter.java:326)
   [junit4]   2> 	at org.eclipse.jetty.servlet.ServletHandler$CachedChain.doFilter(ServletHandler.java:1759)
   [junit4]   2> 	at org.apache.solr.client.solrj.embedded.JettySolrRunner$DebugFilter.doFilter(JettySolrRunner.java:139)
   [junit4]   2> 	at org.eclipse.jetty.servlet.ServletHandler$CachedChain.doFilter(ServletHandler.java:1759)
   [junit4]   2> 	at org.eclipse.jetty.servlet.ServletHandler.doHandle(ServletHandler.java:582)
   [junit4]   2> 	at org.eclipse.jetty.server.session.SessionHandler.doHandle(SessionHandler.java:224)
   [junit4]   2> 	at org.eclipse.jetty.server.handler.ContextHandler.doHandle(ContextHandler.java:1180)
   [junit4]   2> 	at org.eclipse.jetty.servlet.ServletHandler.doScope(ServletHandler.java:512)
   [junit4]   2> 	at org.eclipse.jetty.server.session.SessionHandler.doScope(SessionHandler.java:185)
   [junit4]   2> 	at org.eclipse.jetty.server.handler.ContextHandler.doScope(ContextHandler.java:1112)
   [junit4]   2> 	at org.eclipse.jetty.server.handler.ScopedHandler.handle(ScopedHandler.java:141)
   [junit4]   2> 	at org.eclipse.jetty.server.handler.gzip.GzipHandler.handle(GzipHandler.java:493)
   [junit4]   2> 	at org.eclipse.jetty.server.handler.HandlerWrapper.handle(HandlerWrapper.java:134)
   [junit4]   2> 	at org.eclipse.jetty.server.Server.handle(Server.java:534)
   [junit4]   2> 	at org.eclipse.jetty.server.HttpChannel.handle(HttpChannel.java:320)
   [junit4]   2> 	at org.eclipse.jetty.server.HttpConnection.onFillable(HttpConnection.java:251)
   [junit4]   2> 	at org.eclipse.jetty.io.AbstractConnection$ReadCallback.succeeded(AbstractConnection.java:283)
   [junit4]   2> 	at org.eclipse.jetty.io.FillInterest.fillable(FillInterest.java:108)
   [junit4]   2> 	at org.eclipse.jetty.io.SelectChannelEndPoint$2.run(SelectChannelEndPoint.java:93)
   [junit4]   2> 	at org.eclipse.jetty.util.thread.strategy.ExecuteProduceConsume.executeProduceConsume(ExecuteProduceConsume.java:303)
   [junit4]   2> 	at org.eclipse.jetty.util.thread.strategy.ExecuteProduceConsume.produceConsume(ExecuteProduceConsume.java:148)
   [junit4]   2> 	at org.eclipse.jetty.util.thread.strategy.ExecuteProduceConsume.run(ExecuteProduceConsume.java:136)
   [junit4]   2> 	at org.eclipse.jetty.util.thread.QueuedThreadPool.runJob(QueuedThreadPool.java:671)
   [junit4]   2> 	at org.eclipse.jetty.util.thread.QueuedThreadPool$2.run(QueuedThreadPool.java:589)
   [junit4]   2> 	at java.lang.Thread.run(Thread.java:748)
   [junit4]   2> 3730834 WARN  (qtp1513328013-29797) [    ] o.e.j.s.ServletHandler /solr/admin/collections
   [junit4]   2> org.apache.solr.common.SolrException: Error during request authentication, 
   [junit4]   2> 	at org.apache.solr.servlet.SolrDispatchFilter.authenticateRequest(SolrDispatchFilter.java:457)
   [junit4]   2> 	at org.apache.solr.servlet.SolrDispatchFilter.doFilter(SolrDispatchFilter.java:347)
   [junit4]   2> 	at org.apache.solr.servlet.SolrDispatchFilter.doFilter(SolrDispatchFilter.java:326)
   [junit4]   2> 	at org.eclipse.jetty.servlet.ServletHandler$CachedChain.doFilter(ServletHandler.java:1759)
   [junit4]   2> 	at org.apache.solr.client.solrj.embedded.JettySolrRunner$DebugFilter.doFilter(JettySolrRunner.java:139)
   [junit4]   2> 	at org.eclipse.jetty.servlet.ServletHandler$CachedChain.doFilter(ServletHandler.java:1759)
   [junit4]   2> 	at org.eclipse.jetty.servlet.ServletHandler.doHandle(ServletHandler.java:582)
   [junit4]   2> 	at org.eclipse.jetty.server.session.SessionHandler.doHandle(SessionHandler.java:224)
   [junit4]   2> 	at org.eclipse.jetty.server.handler.ContextHandler.doHandle(ContextHandler.java:1180)
   [junit4]   2> 	at org.eclipse.jetty.servlet.ServletHandler.doScope(ServletHandler.java:512)
   [junit4]   2> 	at org.eclipse.jetty.server.session.SessionHandler.doScope(SessionHandler.java:185)
   [junit4]   2> 	at org.eclipse.jetty.server.handler.ContextHandler.doScope(ContextHandler.java:1112)
   [junit4]   2> 	at org.eclipse.jetty.server.handler.ScopedHandler.handle(ScopedHandler.java:141)
   [junit4]   2> 	at org.eclipse.jetty.server.handler.gzip.GzipHandler.handle(GzipHandler.java:493)
   [junit4]   2> 	at org.eclipse.jetty.server.handler.HandlerWrapper.handle(HandlerWrapper.java:134)
   [junit4]   2> 	at org.eclipse.jetty.server.Server.handle(Server.java:534)
   [junit4]   2> 	at org.eclipse.jetty.server.HttpChannel.handle(HttpChannel.java:320)
   [junit4]   2> 	at org.eclipse.jetty.server.HttpConnection.onFillable(HttpConnection.java:251)
   [junit4]   2> 	at org.eclipse.jetty.io.AbstractConnection$ReadCallback.succeeded(AbstractConnection.java:283)
   [junit4]   2> 	at org.eclipse.jetty.io.FillInterest.fillable(FillInterest.java:108)
   [junit4]   2> 	at org.eclipse.jetty.io.SelectChannelEndPoint$2.run(SelectChannelEndPoint.java:93)
   [junit4]   2> 	at org.eclipse.jetty.util.thread.strategy.ExecuteProduceConsume.executeProduceConsume(ExecuteProduceConsume.java:303)
   [junit4]   2> 	at org.eclipse.jetty.util.thread.strategy.ExecuteProduceConsume.produceConsume(ExecuteProduceConsume.java:148)
   [junit4]   2> 	at org.eclipse.jetty.util.thread.strategy.ExecuteProduceConsume.run(ExecuteProduceConsume.java:136)
   [junit4]   2> 	at org.eclipse.jetty.util.thread.QueuedThreadPool.runJob(QueuedThreadPool.java:671)
   [junit4]   2> 	at org.eclipse.jetty.util.thread.QueuedThreadPool$2.run(QueuedThreadPool.java:589)
   [junit4]   2> 	at java.lang.Thread.run(Thread.java:748)
   [junit4]   2> Caused by: java.lang.IllegalArgumentException: userName is NULL, empty or contains a '&'
   [junit4]   2> 	at org.apache.hadoop.security.authentication.util.AuthToken.checkForIllegalArgument(AuthToken.java:87)
   [junit4]   2> 	at org.apache.hadoop.security.authentication.util.AuthToken.<init>(AuthToken.java:70)
   [junit4]   2> 	at org.apache.hadoop.security.authentication.server.AuthenticationToken.<init>(AuthenticationToken.java:58)
   [junit4]   2> 	at org.apache.solr.security.HttpParamDelegationTokenPlugin$HttpParamDelegationTokenAuthenticationHandler$HttpParamAuthenticationHandler.authenticate(HttpParamDelegationTokenPlugin.java:213)
   [junit4]   2> 	at org.apache.hadoop.security.token.delegation.web.DelegationTokenAuthenticationHandler.authenticate(DelegationTokenAuthenticationHandler.java:348)
   [junit4]   2> 	at org.apache.solr.security.RequestContinuesRecorderAuthenticationHandler.authenticate(RequestContinuesRecorderAuthenticationHandler.java:69)
   [junit4]   2> 	at org.apache.hadoop.security.authentication.server.AuthenticationFilter.doFilter(AuthenticationFilter.java:518)
   [junit4]   2> 	at org.apache.solr.security.DelegationTokenKerberosFilter.doFilter(DelegationTokenKerberosFilter.java:134)
   [junit4]   2> 	at org.apache.solr.security.HttpParamDelegationTokenPlugin$HttpParamToRequestFilter.doFilter(HttpParamDelegationTokenPlugin.java:245)
   [junit4]   2> 	at org.apache.solr.security.KerberosPlugin.doAuthenticate(KerberosPlugin.java:243)
   [junit4]   2> 	at org.apache.solr.servlet.SolrDispatchFilter.authenticateRequest(SolrDispatchFilter.java:451)
   [junit4]   2> 	... 26 more
   [junit4]   2> 3730835 INFO  (TEST-TestSolrCloudWithSecureImpersonation.testProxyNullProxyUser-seed#[BF073CDCBB54C00B]) [    ] o.a.s.SolrTestCaseJ4 ###Ending testProxyNullProxyUser
   [junit4]   2> 3730850 INFO  (TEST-TestSolrCloudWithSecureImpersonation.testProxyValidateGroup-seed#[BF073CDCBB54C00B]) [    ] o.a.s.SolrTestCaseJ4 ###Starting testProxyValidateGroup
   [junit4]   2> 3730866 INFO  (qtp1513328013-29800) [n:127.0.0.1:46751_solr    ] o.a.s.h.a.CollectionsHandler Invoked Collection Action :list with params doAs=jenkins&action=LIST&wt=javabin&version=2 and sendToOCPQueue=true
   [junit4]   2> 3730867 INFO  (qtp1513328013-29800) [n:127.0.0.1:46751_solr    ] o.a.s.s.HttpSolrCall [admin] webapp=null path=/admin/collections params={doAs=jenkins&action=LIST&wt=javabin&version=2} status=0 QTime=0
   [junit4]   2> 3730867 INFO  (TEST-TestSolrCloudWithSecureImpersonation.testProxyValidateGroup-seed#[BF073CDCBB54C00B]) [    ] o.a.s.SolrTestCaseJ4 ###Ending testProxyValidateGroup
   [junit4]   2> 3730885 INFO  (TEST-TestSolrCloudWithSecureImpersonation.testForwarding-seed#[BF073CDCBB54C00B]) [    ] o.a.s.SolrTestCaseJ4 ###Starting testForwarding
   [junit4]   2> 3730887 INFO  (zkConnectionManagerCallback-5519-thread-1) [    ] o.a.s.c.c.ConnectionManager zkClient has connected
   [junit4]   2> 3731370 INFO  (zkConnectionManagerCallback-5522-thread-1) [    ] o.a.s.c.c.ConnectionManager zkClient has connected
   [junit4]   2> 3731371 INFO  (TEST-TestSolrCloudWithSecureImpersonation.testForwarding-seed#[BF073CDCBB54C00B]) [    ] o.a.s.c.c.ZkStateReader Updated live nodes from ZooKeeper... (0) -> (2)
   [junit4]   2> 3731373 INFO  (TEST-TestSolrCloudWithSecureImpersonation.testForwarding-seed#[BF073CDCBB54C00B]) [    ] o.a.s.c.s.i.ZkClientClusterStateProvider Cluster at 127.0.0.1:35273/solr ready
   [junit4]   2> 3731374 INFO  (qtp1165164636-29787) [n:127.0.0.1:38906_solr    ] o.a.s.h.a.CollectionsHandler Invoked Collection Action :create with params pullReplicas=0&replicationFactor=1&collection.configName=conf1&maxShardsPerNode=1&name=forwardingCollection&nrtReplicas=1&action=CREATE&numShards=1&tlogReplicas=0&wt=javabin&version=2 and sendToOCPQueue=true
   [junit4]   2> 3731376 INFO  (OverseerThreadFactory-11758-thread-1-processing-n:127.0.0.1:38906_solr) [n:127.0.0.1:38906_solr    ] o.a.s.c.CreateCollectionCmd Create collection forwardingCollection
   [junit4]   2> 3731489 INFO  (OverseerStateUpdate-99289600997851142-127.0.0.1:38906_solr-n_0000000000) [n:127.0.0.1:38906_solr    ] o.a.s.c.o.SliceMutator createReplica() {
   [junit4]   2>   "operation":"ADDREPLICA",
   [junit4]   2>   "collection":"forwardingCollection",
   [junit4]   2>   "shard":"shard1",
   [junit4]   2>   "core":"forwardingCollection_shard1_replica_n1",
   [junit4]   2>   "state":"down",
   [junit4]   2>   "base_url":"http://127.0.0.1:46751/solr",
   [junit4]   2>   "type":"NRT",
   [junit4]   2>   "waitForFinalState":"false"} 
   [junit4]   2> 3731697 INFO  (qtp1513328013-29793) [n:127.0.0.1:46751_solr    ] o.a.s.h.a.CoreAdminOperation core create command qt=/admin/cores&coreNodeName=core_node2&collection.configName=conf1&newCollection=true&name=forwardingCollection_shard1_replica_n1&action=CREATE&numShards=1&collection=forwardingCollection&shard=shard1&wt=javabin&version=2&replicaType=NRT
   [junit4]   2> 3731697 INFO  (qtp1513328013-29793) [n:127.0.0.1:46751_solr    ] o.a.s.c.TransientSolrCoreCacheDefault Allocating transient cache for 2147483647 transient cores
   [junit4]   2> 3731806 INFO  (zkCallback-5507-thread-1-processing-n:127.0.0.1:46751_solr) [n:127.0.0.1:46751_solr    ] o.a.s.c.c.ZkStateReader A cluster state change: [WatchedEvent state:SyncConnected type:NodeDataChanged path:/collections/forwardingCollection/state.json] for collection [forwardingCollection] has occurred - updating... (live nodes size: [2])
   [junit4]   2> 3731806 INFO  (zkCallback-5507-thread-2-processing-n:127.0.0.1:46751_solr) [n:127.0.0.1:46751_solr    ] o.a.s.c.c.ZkStateReader A cluster state change: [WatchedEvent state:SyncConnected type:NodeDataChanged path:/collections/forwardingCollection/state.json] for collection [forwardingCollection] has occurred - updating... (live nodes size: [2])
   [junit4]   2> 3732733 INFO  (qtp1513328013-29793) [n:127.0.0.1:46751_solr c:forwardingCollection s:shard1 r:core_node2 x:forwardingCollection_shard1_replica_n1] o.a.s.c.SolrConfig Using Lucene MatchVersion: 7.3.0
   [junit4]   2> 3732755 INFO  (qtp1513328013-29793) [n:127.0.0.1:46751_solr c:forwardingCollection s:shard1 r:core_node2 x:forwardingCollection_shard1_replica_n1] o.a.s.s.IndexSchema [forwardingCollection_shard1_replica_n1] Schema name=test
   [junit4]   2> 3732824 INFO  (qtp1513328013-29793) [n:127.0.0.1:46751_solr c:forwardingCollection s:shard1 r:core_node2 x:forwardingCollection_shard1_replica_n1] o.a.s.s.IndexSchema Loaded schema test/1.0 with uniqueid field id
   [junit4]   2> 3732842 INFO  (qtp1513328013-29793) [n:127.0.0.1:46751_solr c:forwardingCollection s:shard1 r:core_node2 x:forwardingCollection_shard1_replica_n1] o.a.s.c.CoreContainer Creating SolrCore 'forwardingCollection_shard1_replica_n1' using configuration from collection forwardingCollection, trusted=true
   [junit4]   2> 3732842 INFO  (qtp1513328013-29793) [n:127.0.0.1:46751_solr c:forwardingCollection s:shard1 r:core_node2 x:forwardingCollection_shard1_replica_n1] o.a.s.m.r.SolrJmxReporter JMX monitoring for 'solr_46751.solr.core.forwardingCollection.shard1.replica_n1' (registry 'solr.core.forwardingCollection.shard1.replica_n1') enabled at server: com.sun.jmx.mbeanserver.JmxMBeanServer@7554e26d
   [junit4]   2> 3732842 INFO  (qtp1513328013-29793) [n:127.0.0.1:46751_solr c:forwardingCollection s:shard1 r:core_node2 x:forwardingCollection_shard1_replica_n1] o.a.s.c.SolrCore solr.RecoveryStrategy.Builder
   [junit4]   2> 3732842 INFO  (qtp1513328013-29793) [n:127.0.0.1:46751_solr c:forwardingCollection s:shard1 r:core_node2 x:forwardingCollection_shard1_replica_n1] o.a.s.c.SolrCore [[forwardingCollection_shard1_replica_n1] ] Opening new SolrCore at [/export/home/jenkins/workspace/Lucene-Solr-7.x-Solaris/solr/build/solr-core/test/J1/temp/solr.cloud.TestSolrCloudWithSecureImpersonation_BF073CDCBB54C00B-001/tempDir-001/node2/forwardingCollection_shard1_replica_n1], dataDir=[/export/home/jenkins/workspace/Lucene-Solr-7.x-Solaris/solr/build/solr-core/test/J1/temp/solr.cloud.TestSolrCloudWithSecureImpersonation_BF073CDCBB54C00B-001/tempDir-001/node2/./forwardingCollection_shard1_replica_n1/data/]
   [junit4]   2> 3732844 INFO  (qtp1513328013-29793) [n:127.0.0.1:46751_solr c:forwardingCollection s:shard1 r:core_node2 x:forwardingCollection_shard1_replica_n1] o.a.s.u.RandomMergePolicy RandomMergePolicy wrapping class org.apache.lucene.index.LogByteSizeMergePolicy: [LogByteSizeMergePolicy: minMergeSize=1677721, mergeFactor=50, maxMergeSize=2147483648, maxMergeSizeForForcedMerge=9223372036854775807, calibrateSizeByDeletes=true, maxMergeDocs=2147483647, maxCFSSegmentSizeMB=8.796093022207999E12, noCFSRatio=0.20503905800116531]
   [junit4]   2> 3732906 INFO  (qtp1513328013-29793) [n:127.0.0.1:46751_solr c:forwardingCollection s:shard1 r:core_node2 x:forwardingCollection_shard1_replica_n1] o.a.s.u.UpdateHandler Using UpdateLog implementation: org.apache.solr.update.UpdateLog
   [junit4]   2> 3732906 INFO  (qtp1513328013-29793) [n:127.0.0.1:46751_solr c:forwardingCollection s:shard1 r:core_node2 x:forwardingCollection_shard1_replica_n1] o.a.s.u.UpdateLog Initializing UpdateLog: dataDir= defaultSyncLevel=FLUSH numRecordsToKeep=100 maxNumLogsToKeep=10 numVersionBuckets=65536
   [junit4]   2> 3732907 INFO  (qtp1513328013-29793) [n:127.0.0.1:46751_solr c:forwardingCollection s:shard1 r:core_node2 x:forwardingCollection_shard1_replica_n1] o.a.s.u.CommitTracker Hard AutoCommit: disabled
   [junit4]   2> 3732907 INFO  (qtp1513328013-29793) [n:127.0.0.1:46751_solr c:forwardingCollection s:shard1 r:core_node2 x:forwardingCollection_shard1_replica_n1] o.a.s.u.CommitTracker Soft AutoCommit: disabled
   [junit4]   2> 3732908 INFO  (qtp1513328013-29793) [n:127.0.0.1:46751_solr c:forwardingCollection s:shard1 r:core_node2 x:forwardingCollection_shard1_replica_n1] o.a.s.u.RandomMergePolicy RandomMergePolicy wrapping class org.apache.lucene.index.LogDocMergePolicy: [LogDocMergePolicy: minMergeSize=1000, mergeFactor=14, maxMergeSize=9223372036854775807, maxMergeSizeForForcedMerge=9223372036854775807, calibrateSizeByDeletes=false, maxMergeDocs=2147483647, maxCFSSegmentSizeMB=8.796093022207999E12, noCFSRatio=0.10635901731026545]
   [junit4]   2> 3732908 INFO  (qtp1513328013-29793) [n:127.0.0.1:46751_solr c:forwardingCollection s:shard1 r:core_node2 x:forwardingCollection_shard1_replica_n1] o.a.s.s.SolrIndexSearcher Opening [Searcher@71d2873d[forwardingCollection_shard1_replica_n1] main]
   [junit4]   2> 3732910 INFO  (qtp1513328013-29793) [n:127.0.0.1:46751_solr c:forwardingCollection s:shard1 r:core_node2 x:forwardingCollection_shard1_replica_n1] o.a.s.h.c.SpellCheckComponent Initializing spell checkers
   [junit4]   2> 3732913 INFO  (qtp1513328013-29793) [n:127.0.0.1:46751_solr c:forwardingCollection s:shard1 r:core_node2 x:forwardingCollection_shard1_replica_n1] o.a.s.s.DirectSolrSpellChecker init: {name=direct,classname=DirectSolrSpellChecker,field=lowerfilt,minQueryLength=3}
   [junit4]   2> 3732929 INFO  (qtp1513328013-29793) [n:127.0.0.1:46751_solr c:forwardingCollection s:shard1 r:core_node2 x:forwardingCollection_shard1_replica_n1] o.a.s.h.ReplicationHandler Commits will be reserved for 10000ms.
   [junit4]   2> 3732929 INFO  (searcherExecutor-11763-thread-1-processing-n:127.0.0.1:46751_solr x:forwardingCollection_shard1_replica_n1 s:shard1 c:forwardingCollection r:core_node2) [n:127.0.0.1:46751_solr c:forwardingCollection s:shard1 r:core_node2 x:forwardingCollection_shard1_replica_n1] o.a.s.h.c.SpellCheckComponent Loading spell index for spellchecker: default
   [junit4]   2> 3732929 INFO  (qtp1513328013-29793) [n:127.0.0.1:46751_solr c:forwardingCollection s:shard1 r:core_node2 x:forwardingCollection_shard1_replica_n1] o.a.s.u.UpdateLog Could not find max version in index or recent updates, using new clock 1588633618697158656
   [junit4]   2> 3732931 INFO  (searcherExecutor-11763-thread-1-processing-n:127.0.0.1:46751_solr x:forwardingCollection_shard1_replica_n1 s:shard1 c:forwardingCollection r:core_node2) [n:127.0.0.1:46751_solr c:forwardingCollection s:shard1 r:core_node2 x:forwardingCollection_shard1_replica_n1] o.a.s.h.c.SpellCheckComponent Loading spell index for spellchecker: direct
   [junit4]   2> 3732931 INFO  (searcherExecutor-11763-thread-1-processing-n:127.0.0.1:46751_solr x:forwardingCollection_shard1_replica_n1 s:shard1 c:forwardingCollection r:core_node2) [n:127.0.0.1:46751_solr c:forwardingCollection s:shard1 r:core_node2 x:forwardingCollection_shard1_replica_n1] o.a.s.h.c.SpellCheckComponent Loading spell index for spellchecker: wordbreak
   [junit4]   2> 3732931 INFO  (searcherExecutor-11763-thread-1-processing-n:127.0.0.1:46751_solr x:forwardingCollection_shard1_replica_n1 s:shard1 c:forwardingCollection r:core_node2) [n:127.0.0.1:46751_solr c:forwardingCollection s:shard1 r:core_node2 x:forwardingCollection_shard1_replica_n1] o.a.s.h.c.SpellCheckComponent Loading spell index for spellchecker: multipleFields
   [junit4]   2> 3732931 INFO  (searcherExecutor-11763-thread-1-processing-n:127.0.0.1:46751_solr x:forwardingCollection_shard1_replica_n1 s:shard1 c:forwardingCollection r:core_node2) [n:127.0.0.1:46751_solr c:forwardingCollection s:shard1 r:core_node2 x:forwardingCollection_shard1_replica_n1] o.a.s.h.c.SpellCheckComponent Loading spell index for spellchecker: jarowinkler
   [junit4]   2> 3732932 INFO  (searcherExecutor-11763-thread-1-processing-n:127.0.0.1:46751_solr x:forwardingCollection_shard1_replica_n1 s:shard1 c:forwardingCollection r:core_node2) [n:127.0.0.1:46751_solr c:forwardingCollection s:shard1 r:core_node2 x:forwardingCollection_shard1_replica_n1] o.a.s.h.c.SpellCheckComponent Loading spell index for spellchecker: external
   [junit4]   2> 3732932 INFO  (searcherExecutor-11763-thread-1-processing-n:127.0.0.1:46751_solr x:forwardingCollection_shard1_replica_n1 s:shard1 c:forwardingCollection r:core_node2) [n:127.0.0.1:46751_solr c:forwardingCollection s:shard1 r:core_node2 x:forwardingCollection_shard1_replica_n1] o.a.s.h.c.SpellCheckComponent Loading spell index for spellchecker: freq
   [junit4]   2> 3732932 INFO  (searcherExecutor-11763-thread-1-processing-n:127.0.0.1:46751_solr x:forwardingCollection_shard1_replica_n1 s:shard1 c:forwardingCollection r:core_node2) [n:127.0.0.1:46751_solr c:forwardingCollection s:shard1 r:core_node2 x:forwardingCollection_shard1_replica_n1] o.a.s.h.c.SpellCheckComponent Loading spell index for spellchecker: fqcn
   [junit4]   2> 3732933 INFO  (searcherExecutor-11763-thread-1-processing-n:127.0.0.1:46751_solr x:forwardingCollection_shard1_replica_n1 s:shard1 c:forwardingCollection r:core_node2) [n:127.0.0.1:46751_solr c:forwardingCollection s:shard1 r:core_node2 x:forwardingCollection_shard1_replica_n1] o.a.s.h.c.SpellCheckComponent Loading spell index for spellchecker: perDict
   [junit4]   2> 3732934 INFO  (searcherExecutor-11763-thread-1-processing-n:127.0.0.1:46751_solr x:forwardingCollection_shard1_replica_n1 s:shard1 c:forwardingCollection r:core_node2) [n:127.0.0.1:46751_solr c:forwardingCollection s:shard1 r:core_node2 x:forwardingCollection_shard1_replica_n1] o.a.s.c.SolrCore [forwardingCollection_shard1_replica_n1] Registered new searcher Searcher@71d2873d[forwardingCollection_shard1_replica_n1] main{ExitableDirectoryReader(UninvertingDirectoryReader())}
   [junit4]   2> 3732936 INFO  (qtp1513328013-29793) [n:127.0.0.1:46751_solr c:forwardingCollection s:shard1 r:core_node2 x:forwardingCollection_shard1_replica_n1] o.a.s.c.ShardLeaderElectionContext Enough replicas found to continue.
   [junit4]   2> 3732936 INFO  (qtp1513328013-29793) [n:127.0.0.1:46751_solr c:forwardingCollection s:shard1 r:core_node2 x:forwardingCollection_shard1_replica_n1] o.a.s.c.ShardLeaderElectionContext I may be the new leader - try and sync
   [junit4]   2> 3732936 INFO  (qtp1513328013-29793) [n:127.0.0.1:46751_solr c:forwardingCollection s:shard1 r:core_node2 x:forwardingCollection_shard1_replica_n1] o.a.s.c.SyncStrategy Sync replicas to http://127.0.0.1:46751/solr/forwardingCollection_shard1_replica_n1/
   [junit4]   2> 3732936 INFO  (qtp1513328013-29793) [n:127.0.0.1:46751_solr c:forwardingCollection s:shard1 r:core_node2 x:forwardingCollection_shard1_replica_n1] o.a.s.c.SyncStrategy Sync Success - now sync replicas to me
   [junit4]   2> 3732936 INFO  (qtp1513328013-29793) [n:127.0.0.1:46751_solr c:forwardingCollection s:shard1 r:core_node2 x:forwardingCollection_shard1_replica_n1] o.a.s.c.SyncStrategy http://127.0.0.1:46751/solr/forwardingCollection_shard1_replica_n1/ has no replicas
   [junit4]   2> 3732936 INFO  (qtp1513328013-29793) [n:127.0.0.1:46751_solr c:forwardingCollection s:shard1 r:core_node2 x:forwardingCollection_shard1_replica_n1] o.a.s.c.ShardLeaderElectionContext Found all replicas participating in election, clear LIR
   [junit4]   2> 3732941 INFO  (qtp1513328013-29793) [n:127.0.0.1:46751_solr c:forwardingCollection s:shard1 r:core_node2 x:forwardingCollection_shard1_replica_n1] o.a.s.c.ShardLeaderElectionContext I am the new leader: http://127.0.0.1:46751/solr/forwardingCollection_shard1_replica_n1/ shard1
   [junit4]   2> 3733044 INFO  (zkCallback-5507-thread-2-processing-n:127.0.0.1:46751_solr) [n:127.0.0.1:46751_solr    ] o.a.s.c.c.ZkStateReader A cluster state change: [WatchedEvent state:SyncConnected type:NodeDataChanged path:/collections/forwardingCollection/state.json] for collection [forwardingCollection] has occurred - updating... (live nodes size: [2])
   [junit4]   2> 3733044 INFO  (zkCallback-5507-thread-1-processing-n:127.0.0.1:46751_solr) [n:127.0.0.1:46751_solr    ] o.a.s.c.c.ZkStateReader A cluster state change: [WatchedEvent state:SyncConnected type:NodeDataChanged path:/collections/forwardingCollection/state.json] for collection [forwardingCollection] has occurred - updating... (live nodes size: [2])
   [junit4]   2> 3733093 INFO  (qtp1513328013-29793) [n:127.0.0.1:46751_solr c:forwardingCollection s:shard1 r:core_node2 x:forwardingCollection_shard1_replica_n1] o.a.s.c.ZkController I am the leader, no recovery necessary
   [junit4]   2> 3733097 INFO  (qtp1513328013-29793) [n:127.0.0.1:46751_solr c:forwardingCollection s:shard1 r:core_node2 x:forwardingCollection_shard1_replica_n1] o.a.s.s.HttpSolrCall [admin] webapp=null path=/admin/cores params={qt=/admin/cores&coreNodeName=core_node2&collection.configName=conf1&newCollection=true&name=forwardingCollection_shard1_replica_n1&action=CREATE&numShards=1&collection=forwardingCollection&shard=shard1&wt=javabin&version=2&replicaType=NRT} status=0 QTime=1400
   [junit4]   2> 3733103 INFO  (qtp1165164636-29787) [n:127.0.0.1:38906_solr    ] o.a.s.h.a.CollectionsHandler Wait for new collection to be active for at most 30 seconds. Check all shard replicas
   [junit4]   2> 3733199 INFO  (zkCallback-5507-thread-2-processing-n:127.0.0.1:46751_solr) [n:127.0.0.1:46751_solr    ] o.a.s.c.c.ZkStateReader A cluster state change: [WatchedEvent state:SyncConnected type:NodeDataChanged path:/collections/forwardingCollection/state.json] for collection [forwardingCollection] has occurred - updating... (live nodes size: [2])
   [junit4]   2> 3733199 INFO  (zkCallback-5507-thread-1-processing-n:127.0.0.1:46751_solr) [n:127.0.0.1:46751_solr    ] o.a.s.c.c.ZkStateReader A cluster state change: [WatchedEvent state:SyncConnected type:NodeDataChanged path:/collections/forwardingCollection/state.json] for collection [forwardingCollection] has occurred - updating... (live nodes size: [2])
   [junit4]   2> 3733379 INFO  (OverseerCollectionConfigSetProcessor-99289600997851142-127.0.0.1:38906_solr-n_0000000000) [n:127.0.0.1:38906_solr    ] o.a.s.c.OverseerTaskQueue Response ZK path: /overseer/collection-queue-work/qnr-0000000000 doesn't exist.  Requestor may have disconnected from ZooKeeper
   [junit4]   2> 3734106 INFO  (qtp1165164636-29787) [n:127.0.0.1:38906_solr    ] o.a.s.s.HttpSolrCall [admin] webapp=null path=/admin/collections params={pullReplicas=0&replicationFactor=1&collection.configName=conf1&maxShardsPerNode=1&name=forwardingCollection&nrtReplicas=1&action=CREATE&numShards=1&tlogReplicas=0&wt=javabin&version=2} status=0 QTime=2732
   [junit4]   2> 3734106 INFO  (TEST-TestSolrCloudWithSecureImpersonation.testForwarding-seed#[BF073CDCBB54C00B]) [    ] o.a.s.c.AbstractDistribZkTestBase Wait for recoveries to finish - collection: forwardingCollection failOnTimeout:true timeout (sec):100
   [junit4]   2> 3734107 INFO  (TEST-TestSolrCloudWithSecureImpersonation.testForwarding-seed#[BF073CDCBB54C00B]) [    ] o.a.s.c.AbstractDistribZkTestBase Recoveries finished - collection: forwardingCollection
   [junit4]   2> 3734111 INFO  (qtp1513328013-29796) [n:127.0.0.1:46751_solr c:forwardingCollection s:shard1 r:core_node2 x:forwardingCollection_shard1_replica_n1] o.a.s.c.S.Request [forwardingCollection_shard1_replica_n1]  webapp=/solr path=/select params={q=*:*&wt=javabin&version=2} hits=0 status=0 QTime=0
   [junit4]   2> 3734116 INFO  (qtp1165164636-29788) [n:127.0.0.1:38906_solr    ] o.a.s.c.TransientSolrCoreCacheDefault Allocating transient cache for 2147483647 transient cores
   [junit4]   2> 3734121 INFO  (qtp1513328013-29797) [n:127.0.0.1:46751_solr c:forwardingCollection s:shard1 r:core_node2 x:forwardingCollection_shard1_replica_n1] o.a.s.c.S.Request [forwardingCollection_shard1_replica_n1]  webapp=/solr path=/select params={q=*:*&wt=javabin&version=2} hits=0 status=0 QTime=0
   [junit4]   2> 3734122 INFO  (TEST-TestSolrCloudWithSecureImpersonation.testForwarding-seed#[BF073CDCBB54C00B]) [    ] o.a.s.SolrTestCaseJ4 ###Ending testForwarding
   [junit4]   2> 3734156 INFO  (TEST-TestSolrCloudWithSecureImpersonation.testProxyInvalidGroup-seed#[BF073CDCBB54C00B]) [    ] o.a.s.SolrTestCaseJ4 ###Starting testProxyInvalidGroup
   [junit4]   2> 3734171 WARN  (qtp1513328013-29800) [n:127.0.0.1:46751_solr    ] o.a.h.s.ShellBasedUnixGroupsMapping got exception trying to get groups for user bar: id: invalid user name: "bar"
   [junit4]   2> id: invalid user name: "bar"
   [junit4]   2> 
   [junit4]   2> 3734173 INFO  (TEST-TestSolrCloudWithSecureImpersonation.testProxyInvalidGroup-seed#[BF073CDCBB54C00B]) [    ] o.a.s.SolrTestCaseJ4 ###Ending testProxyInvalidGroup
   [junit4]   2> 3734191 INFO  (TEST-TestSolrCloudWithSecureImpersonation.testProxyNoConfigGroups-seed#[BF073CDCBB54C00B]) [    ] o.a.s.SolrTestCaseJ4 ###Starting testProxyNoConfigGroups
   [junit4]   2> 3734194 INFO  (TEST-TestSolrCloudWithSecureImpersonation.testProxyNoConfigGroups-seed#[BF073CDCBB54C00B]) [    ] o.a.s.SolrTestCaseJ4 ###Ending testProxyNoConfigGroups
   [junit4]   2> 3734212 INFO  (TEST-TestSolrCloudWithSecureImpersonation.testProxyValidateHost-seed#[BF073CDCBB54C00B]) [    ] o.a.s.SolrTestCaseJ4 ###Starting testProxyValidateHost
   [junit4]   2> 3734212 INFO  (qtp1513328013-29793) [n:127.0.0.1:46751_solr    ] o.a.s.h.a.CollectionsHandler Invoked Collection Action :list with params doAs=bar&action=LIST&wt=javabin&version=2 and sendToOCPQueue=true
   [junit4]   2> 3734212 INFO  (qtp1513328013-29793) [n:127.0.0.1:46751_solr    ] o.a.s.s.HttpSolrCall [admin] webapp=null path=/admin/collections params={doAs=bar&action=LIST&wt=javabin&version=2} status=0 QTime=0
   [junit4]   2> 3734213 INFO  (TEST-TestSolrCloudWithSecureImpersonation.testProxyValidateHost-seed#[BF073CDCBB54C00B]) [    ] o.a.s.SolrTestCaseJ4 ###Ending testProxyValidateHost
   [junit4]   2> 3734234 INFO  (TEST-TestSolrCloudWithSecureImpersonation.testProxyUnknownRemote-seed#[BF073CDCBB54C00B]) [    ] o.a.s.SolrTestCaseJ4 ###Starting testProxyUnknownRemote
   [junit4]   2> 3748654 WARN  (jetty-launcher-5491-thread-2-SendThread(127.0.0.1:35273)) [n:127.0.0.1:46751_solr    ] o.a.z.ClientCnxn Client session timed out, have not heard from server in 15454ms for sessionid 0x160bf5db55e0005
   [junit4]   2> 3748654 WARN  (jetty-launcher-5491-thread-2-SendThread(127.0.0.1:35273)) [n:127.0.0.1:46751_solr    ] o.a.z.ClientCnxn Client session timed out, have not heard from server in 17906ms for sessionid 0x160bf5db55e0007
   [junit4]   2> 3748654 WARN  (jetty-launcher-5491-thread-1-SendThread(127.0.0.1:35273)) [n:127.0.0.1:38906_solr    ] o.a.z.ClientCnxn Client session timed out, have not heard from server in 17906ms for sessionid 0x160bf5db55e0008
   [junit4]   2> 3748655 WARN  (NIOServerCxn.Factory:0.0.0.0/0.0.0.0:0) [    ] o.a.z.s.NIOServerCnxn caught end of stream exception
   [junit4]   2> EndOfStreamException: Unable to read additional data from client sessionid 0x160bf5db55e0007, likely client has closed socket
   [junit4]   2> 	at org.apache.zookeeper.server.NIOServerCnxn.doIO(NIOServerCnxn.java:239)
   [junit4]   2> 	at org.apache.zookeeper.server.NIOServerCnxnFactory.run(NIOServerCnxnFactory.java:203)
   [junit4]   2> 	at java.lang.Thread.run(Thread.java:748)
   [junit4]   2> 3748655 WARN  (NIOServerCxn.Factory:0.0.0.0/0.0.0.0:0) [    ] o.a.z.s.NIOServerCnxn caught end of stream exception
   [junit4]   2> EndOfStreamException: Unable to read additional data from client sessionid 0x160bf5db55e0005, likely client has closed socket
   [junit4]   2> 	at org.apache.zookeeper.server.NIOServerCnxn.doIO(NIOServerCnxn.java:239)
   [junit4]   2> 	at org.apache.zookeeper.server.NIOServerCnxnFactory.run(NIOServerCnxnFactory.java:203)
   [junit4]   2> 	at java.lang.Thread.run(Thread.java:748)
   [junit4]   2> 3748656 WARN  (NIOServerCxn.Factory:0.0.0.0/0.0.0.0:0) [    ] o.a.z.s.NIOServerCnxn caught end of stream exception
   [junit4]   2> EndOfStreamException: Unable to read additional data from client sessionid 0x160bf5db55e0008, likely client has closed socket
   [junit4]   2> 	at org.apache.zookeeper.server.NIOServerCnxn.doIO(NIOServerCnxn.java:239)
   [junit4]   2> 	at org.apache.zookeeper.server.NIOServerCnxnFactory.run(NIOServerCnxnFactory.java:203)
   [junit4]   2> 	at java.lang.Thread.run(Thread.java:748)
   [junit4]   2> 3748656 WARN  (jetty-launcher-5491-thread-1-SendThread(127.0.0.1:35273)) [n:127.0.0.1:38906_solr    ] o.a.z.ClientCnxn Client session timed out, have not heard from server in 14537ms for sessionid 0x160bf5db55e0006
   [junit4]   2> 3748656 WARN  (NIOServerCxn.Factory:0.0.0.0/0.0.0.0:0) [    ] o.a.z.s.NIOServerCnxn caught end of stream exception
   [junit4]   2> EndOfStreamException: Unable to read additional data from client sessionid 0x160bf5db55e0006, likely client has closed socket
   [junit4]   2> 	at org.apache.zookeeper.server.NIOServerCnxn.doIO(NIOServerCnxn.java:239)
   [junit4]   2> 	at org.apache.zookeeper.server.NIOServerCnxnFactory.run(NIOServerCnxnFactory.java:203)
   [junit4]   2> 	at java.lang.Thread.run(Thread.java:748)
   [junit4]   2> 3748656 INFO  (TEST-TestSolrCloudWithSecureImpersonation.testProxyUnknownRemote-seed#[BF073CDCBB54C00B]) [    ] o.a.s.SolrTestCaseJ4 ###Ending testProxyUnknownRemote
   [junit4]   2> 3748711 INFO  (TEST-TestSolrCloudWithSecureImpersonation.testProxyValidateAnyHostAnyUser-seed#[BF073CDCBB54C00B]) [    ] o.a.s.SolrTestCaseJ4 ###Starting testProxyValidateAnyHostAnyUser
   [junit4]   2> 3748712 INFO  (qtp1513328013-29799) [n:127.0.0.1:46751_solr    ] o.a.s.h.a.CollectionsHandler Invoked Collection Action :list with params doAs=bar&action=LIST&wt=javabin&version=2 and sendToOCPQueue=true
   [junit4]   2> 3748712 INFO  (qtp1513328013-29799) [n:127.0.0.1:46751_solr    ] o.a.s.s.HttpSolrCall [admin] webapp=null path=/admin/collections params={doAs=bar&action=LIST&wt=javabin&version=2} status=0 QTime=0
   [junit4]   2> 3748713 INFO  (TEST-TestSolrCloudWithSecureImpersonation.testProxyValidateAnyHostAnyUser-seed#[BF073CDCBB54C00B]) [    ] o.a.s.SolrTestCaseJ4 ###Ending testProxyValidateAnyHostAnyUser
   [junit4]   2> 3748744 INFO  (TEST-TestSolrCloudWithSecureImpersonation.testProxyNoConfigHosts-seed#[BF073CDCBB54C00B]) [    ] o.a.s.SolrTestCaseJ4 ###Starting testProxyNoConfigHosts
   [junit4]   2> 3748746 INFO  (TEST-TestSolrCloudWithSecureImpersonation.testProxyNoConfigHosts-seed#[BF073CDCBB54C00B]) [    ] o.a.s.SolrTestCaseJ4 ###Ending testProxyNoConfigHosts
   [junit4]   2> 3748755 INFO  (jetty-launcher-5491-thread-2-EventThread) [n:127.0.0.1:46751_solr    ] o.a.c.f.s.ConnectionStateManager State change: SUSPENDED
   [junit4]   2> 3748756 WARN  (zkConnectionManagerCallback-5522-thread-1) [    ] o.a.s.c.c.ConnectionManager Watcher org.apache.solr.common.cloud.ConnectionManager@7d457b91 name: ZooKeeperConnection Watcher:127.0.0.1:35273/solr got event WatchedEvent state:Disconnected type:None path:null path: null type: None
   [junit4]   2> 3748756 WARN  (zkConnectionManagerCallback-5522-thread-1) [    ] o.a.s.c.c.ConnectionManager zkClient has disconnected
   [junit4]   2> 3748760 WARN  (zkConnectionManagerCallback-5510-thread-1-processing-n:127.0.0.1:38906_solr) [n:127.0.0.1:38906_solr    ] o.a.s.c.c.ConnectionManager Watcher org.apache.solr.common.cloud.ConnectionManager@269dfc66 name: ZooKeeperConnection Watcher:127.0.0.1:35273/solr got event WatchedEvent state:Disconnected type:None path:null path: null type: None
   [junit4]   2> 3748760 WARN  (zkConnectionManagerCallback-5510-thread-1-processing-n:127.0.0.1:38906_solr) [n:127.0.0.1:38906_solr    ] o.a.s.c.c.ConnectionManager zkClient has disconnected
   [junit4]   2> 3748760 WARN  (zkConnectionManagerCallback-5508-thread-1-processing-n:127.0.0.1:46751_solr) [n:127.0.0.1:46751_solr    ] o.a.s.c.c.ConnectionManager Watcher org.apache.solr.common.cloud.ConnectionManager@3a98c53f name: ZooKeeperConnection Watcher:127.0.0.1:35273/solr got event WatchedEvent state:Disconnected type:None path:null path: null type: None
   [junit4]   2> 3748761 WARN  (zkConnectionManagerCallback-5508-thread-1-processing-n:127.0.0.1:46751_solr) [n:127.0.0.1:46751_solr    ] o.a.s.c.c.ConnectionManager zkClient has disconnected
   [junit4]   2> 3748779 INFO  (TEST-TestSolrCloudWithSecureImpersonation.testProxyWrongHost-seed#[BF073CDCBB54C00B]) [    ] o.a.s.SolrTestCaseJ4 ###Starting testProxyWrongHost
   [junit4]   2> 3748808 INFO  (TEST-TestSolrCloudWithSecureImpersonation.testProxyWrongHost-seed#[BF073CDCBB54C00B]) [    ] o.a.s.SolrTestCaseJ4 ###Ending testProxyWrongHost
   [junit4]   2> 3748863 INFO  (TEST-TestSolrCloudWithSecureImpersonation.testProxyInvalidRemote-seed#[BF073CDCBB54C00B]) [    ] o.a.s.SolrTestCaseJ4 ###Starting testProxyInvalidRemote
   [junit4]   2> 3748869 INFO  (TEST-TestSolrCloudWithSecureImpersonation.testProxyInvalidRemote-seed#[BF073CDCBB54C00B]) [    ] o.a.s.SolrTestCaseJ4 ###Ending testProxyInvalidRemote
   [junit4]   2> 3749004 INFO  (jetty-closer-5492-thread-1) [    ] o.e.j.s.AbstractConnector Stopped ServerConnector@188878ae{HTTP/1.1,[http/1.1]}{127.0.0.1:0}
   [junit4]   2> 3749005 INFO  (jetty-closer-5492-thread-1) [    ] o.a.s.c.CoreContainer Shutting down CoreContainer instance=1351243310
   [junit4]   2> 3749006 INFO  (jetty-closer-5492-thread-2) [    ] o.e.j.s.AbstractConnector Stopped ServerConnector@3014e0{HTTP/1.1,[http/1.1]}{127.0.0.1:0}
   [junit4]   2> 3749006 INFO  (jetty-closer-5492-thread-2) [    ] o.a.s.c.CoreContainer Shutting down CoreContainer instance=1848684303
   [junit4]   2> 3749007 INFO  (jetty-closer-5492-thread-1) [    ] o.a.s.m.SolrMetricManager Closing metric reporters for registry=solr.node, tag=null
   [junit4]   2> 3749007 INFO  (jetty-closer-5492-thread-1) [    ] o.a.s.m.r.SolrJmxReporter Closing reporter [org.apache.solr.metrics.reporters.SolrJmxReporter@c77d8c3: rootName = solr_46751, domain = solr.node, service url = null, agent id = null] for registry solr.node / com.codahale.metrics.MetricRegistry@1523a657
   [junit4]   2> 3749007 INFO  (jetty-closer-5492-thread-2) [    ] o.a.s.m.SolrMetricManager Closing metric reporters for registry=solr.node, tag=null
   [junit4]   2> 3749007 INFO  (jetty-closer-5492-thread-2) [    ] o.a.s.m.r.SolrJmxReporter Closing reporter [org.apache.solr.metrics.reporters.SolrJmxReporter@39ffcb5d: rootName = solr_38906, domain = solr.node, service url = null, agent id = null] for registry solr.node / com.codahale.metrics.MetricRegistry@6e235901
   [junit4]   2> 3749017 INFO  (jetty-closer-5492-thread-1) [    ] o.a.s.m.SolrMetricManager Closing metric reporters for registry=solr.jvm, tag=null
   [junit4]   2> 3749017 INFO  (jetty-closer-5492-thread-1) [    ] o.a.s.m.r.SolrJmxReporter Closing reporter [org.apache.solr.metrics.reporters.SolrJmxReporter@339d864a: rootName = solr_46751, domain = solr.jvm, service url = null, agent id = null] for registry solr.jvm / com.codahale.metrics.MetricRegistry@58d8acf0
   [junit4]   2> 3749017 INFO  (jetty-closer-5492-thread-2) [    ] o.a.s.m.SolrMetricManager Closing metric reporters for registry=solr.jvm, tag=null
   [junit4]   2> 3749017 INFO  (jetty-closer-5492-thread-2) [    ] o.a.s.m.r.SolrJmxReporter Closing reporter [org.apache.solr.metrics.reporters.SolrJmxReporter@1c13da8d: rootName = solr_38906, domain = solr.jvm, service url = null, agent id = null] for registry solr.jvm / com.codahale.metrics.MetricRegistry@58d8acf0
   [junit4]   2> 3749023 INFO  (jetty-closer-5492-thread-1) [    ] o.a.s.m.SolrMetricManager Closing metric reporters for registry=solr.jetty, tag=null
   [junit4]   2> 3749023 INFO  (jetty-closer-5492-thread-1) [    ] o.a.s.m.r.SolrJmxReporter Closing reporter [org.apache.solr.metrics.reporters.SolrJmxReporter@63b40c44: rootName = solr_46751, domain = solr.jetty, service url = null, agent id = null] for registry solr.jetty / com.codahale.metrics.MetricRegistry@4061a35b
   [junit4]   2> 3749024 INFO  (jetty-closer-5492-thread-2) [    ] o.a.s.m.SolrMetricManager Closing metric reporters for registry=solr.jetty, tag=null
   [junit4]   2> 3749024 INFO  (jetty-closer-5492-thread-2) [    ] o.a.s.m.r.SolrJmxReporter Closing reporter [org.apache.solr.metrics.reporters.SolrJmxReporter@453764c3: rootName = solr_38906, domain = solr.jetty, service url = null, agent id = null] for registry solr.jetty / com.codahale.metrics.MetricRegistry@4061a35b
   [junit4]   2> 3750115 INFO  (zkConnectionManagerCallback-5508-thread-1-processing-n:127.0.0.1:46751_solr) [n:127.0.0.1:46751_solr    ] o.a.s.c.c.ConnectionManager zkClient has connected
   [junit4]   2> 3750118 INFO  (jetty-closer-5492-thread-1) [    ] o.a.s.c.ZkController Remove node as live in ZooKeeper:/live_nodes/127.0.0.1:46751_solr
   [junit4]   2> 3750120 INFO  (jetty-closer-5492-thread-1) [    ] o.a.s.m.SolrMetricManager Closing metric reporters for registry=solr.cluster, tag=null
   [junit4]   2> 3750121 INFO  (zkCallback-5507-thread-6-processing-n:127.0.0.1:46751_solr) [n:127.0.0.1:46751_solr    ] o.a.s.c.c.ZkStateReader Updated live nodes from ZooKeeper... (2) -> (1)
   [junit4]   2> 3750122 INFO  (coreCloseExecutor-11768-thread-1) [n:127.0.0.1:46751_solr c:forwardingCollection s:shard1 r:core_node2 x:forwardingCollection_shard1_replica_n1] o.a.s.c.SolrCore [forwardingCollection_shard1_replica_n1]  CLOSING SolrCore org.apache.solr.core.SolrCore@48f01630
   [junit4]   2> 3750123 INFO  (coreCloseExecutor-11768-thread-1) [n:127.0.0.1:46751_solr c:forwardingCollection s:shard1 r:core_node2 x:forwardingCollection_shard1_replica_n1] o.a.s.m.SolrMetricManager Closing metric reporters for registry=solr.core.forwardingCollection.shard1.replica_n1, tag=1223693872
   [junit4]   2> 3750123 INFO  (coreCloseExecutor-11768-thread-1) [n:127.0.0.1:46751_solr c:forwardingCollection s:shard1 r:core_node2 x:forwardingCollection_shard1_replica_n1] o.a.s.m.r.SolrJmxReporter Closing reporter [org.apache.solr.metrics.reporters.SolrJmxReporter@40f7bed5: rootName = solr_46751, domain = solr.core.forwardingCollection.shard1.replica_n1, service url = null, agent id = null] for registry solr.core.forwardingCollection.shard1.replica_n1 / com.codahale.metrics.MetricRegistry@775c2f5c
   [junit4]   2> 3750139 INFO  (coreCloseExecutor-11768-thread-1) [n:127.0.0.1:46751_solr c:forwardingCollection s:shard1 r:core_node2 x:forwardingCollection_shard1_replica_n1] o.a.s.m.SolrMetricManager Closing metric reporters for registry=solr.collection.forwardingCollection.shard1.leader, tag=1223693872
   [junit4]   2> 3750144 WARN  (NIOServerCxn.Factory:0.0.0.0/0.0.0.0:0) [    ] o.a.z.s.NIOServerCnxn caught end of stream exception
   [junit4]   2> EndOfStreamException: Unable to read additional data from client sessionid 0x160bf5db55e0005, likely client has closed socket
   [junit4]   2> 	at org.apache.zookeeper.server.NIOServerCnxn.doIO(NIOServerCnxn.java:239)
   [junit4]   2> 	at org.apache.zookeeper.server.NIOServerCnxnFactory.run(NIOServerCnxnFactory.java:203)
   [junit4]   2> 	at java.lang.Thread.run(Thread.java:748)
   [junit4]   2> 3750146 ERROR (Thread[Thread-7578,5,TGRP-TestSolrCloudWithSecureImpersonation]) [n:127.0.0.1:46751_solr    ] o.a.h.s.t.d.AbstractDelegationTokenSecretManager ExpiredTokenRemover received java.lang.InterruptedException: sleep interrupted
   [junit4]   2> 3750154 INFO  (jetty-closer-5492-thread-1) [    ] o.e.j.s.h.ContextHandler Stopped o.e.j.s.ServletContextHandler@47a4c0c4{/solr,null,UNAVAILABLE}
   [junit4]   2> 3750305 INFO  (zkConnectionManagerCallback-5510-thread-1-processing-n:127.0.0.1:38906_solr) [n:127.0.0.1:38906_solr    ] o.a.s.c.c.ConnectionManager zkClient has connected
   [junit4]   2> 3750307 INFO  (zkCallback-5509-thread-5-processing-n:127.0.0.1:38906_solr) [n:127.0.0.1:38906_solr    ] o.a.s.c.c.ZkStateReader Updated live nodes from ZooKeeper... (2) -> (1)
   [junit4]   2> 3750309 INFO  (jetty-closer-5492-thread-2) [    ] o.a.s.c.ZkController Remove node as live in ZooKeeper:/live_nodes/127.0.0.1:38906_solr
   [junit4]   2> 3750311 INFO  (jetty-closer-5492-thread-2) [    ] o.a.s.m.SolrMetricManager Closing metric reporters for registry=solr.cluster, tag=null
   [junit4]   2> 3750312 INFO  (jetty-closer-5492-thread-2) [    ] o.a.s.c.Overseer Overseer (id=99289600997851142-127.0.0.1:38906_solr-n_0000000000) closing
   [junit4]   2> 3750313 INFO  (OverseerStateUpdate-99289600997851142-127.0.0.1:38906_solr-n_0000000000) [n:127.0.0.1:38906_solr    ] o.a.s.c.Overseer Overseer Loop exiting : 127.0.0.1:38906_solr
   [junit4]   2> 3750313 INFO  (zkCallback-5509-thread-5-processing-n:127.0.0.1:38906_solr) [n:127.0.0.1:38906_solr    ] o.a.s.c.c.ZkStateReader Updated live nodes from ZooKeeper... (1) -> (0)
   [junit4]   2> 3750314 WARN  (OverseerAutoScalingTriggerThread-99289600997851142-127.0.0.1:38906_solr-n_0000000000) [n:127.0.0.1:38906_solr    ] o.a.s.c.a.OverseerTriggerThread OverseerTriggerThread woken up but we are closed, exiting.
   [junit4]   2> 3750321 ERROR (Thread[Thread-7580,5,TGRP-TestSolrCloudWithSecureImpersonation]) [n:127.0.0.1:38906_solr    ] o.a.h.s.t.d.AbstractDelegationTokenSecretManager ExpiredTokenRemover received java.lang.InterruptedException: sleep interrupted
   [junit4]   2> 3750497 INFO  (jetty-closer-5492-thread-2) [    ] o.e.j.s.h.ContextHandler Stopped o.e.j.s.ServletContextHandler@29c8bae0{/solr,null,UNAVAILABLE}
   [junit4]   2> 3750500 ERROR (SUITE-TestSolrCloudWithSecureImpersonation-seed#[BF073CDCBB54C00B]-worker) [    ] o.a.z.s.ZooKeeperServer ZKShutdownHandler is not registered, so ZooKeeper server won't take any action on ERROR or SHUTDOWN server state changes
   [junit4]   2> 3750501 INFO  (SUITE-TestSolrCloudWithSecureImpersonation-seed#[BF073CDCBB54C00B]-worker) [    ] o.a.s.c.ZkTestServer connecting to 127.0.0.1:35273 35273
   [junit4]   2> 3751911 INFO  (Thread-7561) [    ] o.a.s.c.ZkTestServer connecting to 127.0.0.1:35273 35273
   [junit4]   2> 3751911 WARN  (Thread-7561) [    ] o.a.s.c.ZkTestServer Watch limit violations: 
   [junit4]   2> Maximum concurrent create/delete watches above limit:
   [junit4]   2> 
   [junit4]   2> 	3	/solr/aliases.json
   [junit4]   2> 	3	/solr/clusterprops.json
   [junit4]   2> 	2	/solr/security.json
   [junit4]   2> 
   [junit4]   2> Maximum concurrent data watches above limit:
   [junit4]   2> 
   [junit4]   2> 	5	/solr/collections/forwardingCollection/state.json
   [junit4]   2> 	3	/solr/security/zkdtsm/ZKDTSMRoot/ZKDTSMKeyIdRoot
   [junit4]   2> 	3	/solr/clusterstate.json
   [junit4]   2> 	2	/solr/security/zkdtsm/ZKDTSMRoot/ZKDTSMMasterKeyRoot/DK_1
   [junit4]   2> 	2	/solr/security/zkdtsm/ZKDTSMRoot/ZKDTSMMasterKeyRoot/DK_3
   [junit4]   2> 	2	/solr/security/zkdtsm/ZKDTSMRoot/ZKDTSMMasterKeyRoot/DK_2
   [junit4]   2> 	2	/solr/security/zkdtsm/ZKDTSMRoot/ZKDTSMMasterKeyRoot/DK_4
   [junit4]   2> 	2	/solr/security/zkdtsm/ZKDTSMRoot/ZKDTSMSeqNumRoot
   [junit4]   2> 
   [junit4]   2> Maximum concurrent children watches above limit:
   [junit4]   2> 
   [junit4]   2> 	3	/solr/live_nodes
   [junit4]   2> 	3	/solr/collections
   [junit4]   2> 	2	/solr/security/zkdtsm/ZKDTSMRoot/ZKDTSMMasterKeyRoot
   [junit4]   2> 	2	/solr/security/zkdtsm/ZKDTSMRoot/ZKDTSMTokensRoot
   [junit4]   2> 
   [junit4]   2> 3751937 INFO  (SUITE-TestSolrCloudWithSecureImpersonation-seed#[BF073CDCBB54C00B]-worker) [    ] o.a.s.SolrTestCaseJ4 ------------------------------------------------------- Done waiting for tracked resources to be released
   [junit4]   2> Jan 04, 2018 4:11:39 AM com.carrotsearch.randomizedtesting.ThreadLeakControl checkThreadLeaks
   [junit4]   2> WARNING: Will linger awaiting termination of 1 leaked thread(s).
   [junit4]   2> Jan 04, 2018 4:11:59 AM com.carrotsearch.randomizedtesting.ThreadLeakControl checkThreadLeaks
   [junit4]   2> SEVERE: 1 thread leaked from SUITE scope at org.apache.solr.cloud.TestSolrCloudWithSecureImpersonation: 
   [junit4]   2>    1) Thread[id=29835, name=jetty-launcher-5491-thread-2-EventThread, state=TIMED_WAITING, group=TGRP-TestSolrCloudWithSecureImpersonation]
   [junit4]   2>         at sun.misc.Unsafe.park(Native Method)
   [junit4]   2>         at java.util.concurrent.locks.LockSupport.parkNanos(LockSupport.java:215)
   [junit4]   2>         at java.util.concurrent.locks.AbstractQueuedSynchronizer.doAcquireSharedNanos(AbstractQueuedSynchronizer.java:1037)
   [junit4]   2>         at java.util.concurrent.locks.AbstractQueuedSynchronizer.tryAcquireSharedNanos(AbstractQueuedSynchronizer.java:1328)
   [junit4]   2>         at java.util.concurrent.CountDownLatch.await(CountDownLatch.java:277)
   [junit4]   2>         at org.apache.curator.CuratorZookeeperClient.internalBlockUntilConnectedOrTimedOut(CuratorZookeeperClient.java:323)
   [junit4]   2>         at org.apache.curator.RetryLoop.callWithRetry(RetryLoop.java:105)
   [junit4]   2>         at org.apache.curator.framework.imps.GetDataBuilderImpl.pathInForeground(GetDataBuilderImpl.java:288)
   [junit4]   2>         at org.apache.curator.framework.imps.GetDataBuilderImpl.forPath(GetDataBuilderImpl.java:279)
   [junit4]   2>         at org.apache.curator.framework.imps.GetDataBuilderImpl.forPath(GetDataBuilderImpl.java:41)
   [junit4]   2>         at org.apache.curator.framework.recipes.shared.SharedValue.readValue(SharedValue.java:244)
   [junit4]   2>         at org.apache.curator.framework.recipes.shared.SharedValue.access$100(SharedValue.java:44)
   [junit4]   2>         at org.apache.curator.framework.recipes.shared.SharedValue$1.process(SharedValue.java:61)
   [junit4]   2>         at org.apache.curator.framework.imps.NamespaceWatcher.process(NamespaceWatcher.java:67)
   [junit4]   2>         at org.apache.zookeeper.ClientCnxn$EventThread.processEvent(ClientCnxn.java:530)
   [junit4]   2>         at org.apache.zookeeper.ClientCnxn$EventThread.run(ClientCnxn.java:505)
   [junit4]   2> Jan 04, 2018 4:11:59 AM com.carrotsearch.randomizedtesting.ThreadLeakControl tryToInterruptAll
   [junit4]   2> INFO: Starting to interrupt leaked threads:
   [junit4]   2>    1) Thread[id=29835, name=jetty-launcher-5491-thread-2-EventThread, state=TIMED_WAITING, group=TGRP-TestSolrCloudWithSecureImpersonation]
   [junit4]   2> 3772190 ERROR (jetty-launcher-5491-thread-2-EventThread) [n:127.0.0.1:46751_solr    ] o.a.c.f.i.CuratorFrameworkImpl Watcher exception
   [junit4]   2> java.lang.InterruptedException
   [junit4]   2> 	at java.util.concurrent.locks.AbstractQueuedSynchronizer.doAcquireSharedNanos(AbstractQueuedSynchronizer.java:1039)
   [junit4]   2> 	at java.util.concurrent.locks.AbstractQueuedSynchronizer.tryAcquireSharedNanos(AbstractQueuedSynchronizer.java:1328)
   [junit4]   2> 	at java.util.concurrent.CountDownLatch.await(CountDownLatch.java:277)
   [junit4]   2> 	at org.apache.curator.CuratorZookeeperClient.internalBlockUntilConnectedOrTimedOut(CuratorZookeeperClient.java:323)
   [junit4]   2> 	at org.apache.curator.RetryLoop.callWithRetry(RetryLoop.java:105)
   [junit4]   2> 	at org.apache.curator.framework.imps.GetDataBuilderImpl.pathInForeground(GetDataBuilderImpl.java:288)
   [junit4]   2> 	at org.apache.curator.framework.imps.GetDataBuilderImpl.forPath(GetDataBuilderImpl.java:279)
   [junit4]   2> 	at org.apache.curator.framework.imps.GetDataBuilderImpl.forPath(GetDataBuilderImpl.java:41)
   [junit4]   2> 	at org.apache.curator.framework.recipes.shared.SharedValue.readValue(SharedValue.java:244)
   [junit4]   2> 	at org.apache.curator.framework.recipes.shared.SharedValue.access$100(SharedValue.java:44)
   [junit4]   2> 	at org.apache.curator.framework.recipes.shared.SharedValue$1.process(SharedValue.java:61)
   [junit4]   2> 	at org.apache.curator.framework.imps.NamespaceWatcher.process(NamespaceWatcher.java:67)
   [junit4]   2> 	at org.apache.zookeeper.ClientCnxn$EventThread.processEvent(ClientCnxn.java:530)
   [junit4]   2> 	at org.apache.zookeeper.ClientCnxn$EventThread.run(ClientCnxn.java:505)
   [junit4]   2> Jan 04, 2018 4:11:59 AM com.carrotsearch.randomizedtesting.ThreadLeakControl tryToInterruptAll
   [junit4]   2> INFO: All leaked threads terminated.
   [junit4]   2> NOTE: test params are: codec=Asserting(Lucene70): {}, docValues:{}, maxPointsInLeafNode=1985, maxMBSortInHeap=7.513319882251589, sim=RandomSimilarity(queryNorm=true): {}, locale=en-PH, timezone=America/Mendoza
   [junit4]   2> NOTE: SunOS 5.11 amd64/Oracle Corporation 1.8.0_152 (64-bit)/cpus=3,threads=1,free=252356056,total=518979584
   [junit4]   2> NOTE: All tests run in this JVM: [RecoveryAfterSoftCommitTest, TestFreeTextSuggestions, BlobRepositoryCloudTest, TestRandomFaceting, TestBlobHandler, BufferStoreTest, DocumentAnalysisRequestHandlerTest, MoreLikeThisHandlerTest, TestLegacyField, TestTolerantUpdateProcessorCloud, TestCopyFieldCollectionResource, DistributedSuggestComponentTest, StatelessScriptUpdateProcessorFactoryTest, TestJsonFacets, TestFastWriter, TestFunctionQuery, TestPostingsSolrHighlighter, DocValuesTest, TestDocBasedVersionConstraints, TestBadConfig, DistributedDebugComponentTest, TestConfigSetProperties, TestDistributedStatsComponentCardinality, SpellPossibilityIteratorTest, SolrJmxReporterTest, TestChildDocTransformer, TestDistributedMissingSort, TestCharFilters, TestCustomDocTransformer, TestSchemaManager, TestRTimerTree, DeleteLastCustomShardedReplicaTest, TestHashPartitioner, HdfsNNFailoverTest, TestCryptoKeys, TestComponentsName, TestManagedResource, TestGeoJSONResponseWriter, TestSSLRandomization, CdcrUpdateLogTest, TestQueryUtils, TestReload, SchemaVersionSpecificBehaviorTest, HdfsAutoAddReplicasIntegrationTest, TestCollationFieldDocValues, TestComputePlanAction, DistributedMLTComponentTest, QueryResultKeyTest, DistribDocExpirationUpdateProcessorTest, TestStressCloudBlindAtomicUpdates, CacheHeaderTest, TestRawResponseWriter, ZkNodePropsTest, TestCoreBackup, OpenCloseCoreStressTest, TestConfigSetsAPIExclusivity, TestTrackingShardHandlerFactory, HdfsRecoveryZkTest, TestMultiWordSynonyms, TestInPlaceUpdatesStandalone, InfixSuggestersTest, SolrCoreTest, TestCrossCoreJoin, SolrMetricsIntegrationTest, BaseCdcrDistributedZkTest, TestClusterStateMutator, BigEndianAscendingWordSerializerTest, TestCollapseQParserPlugin, ShufflingReplicaListTransformerTest, CdcrVersionReplicationTest, RequestLoggingTest, BJQParserTest, TestSimpleTrackingShardHandler, HdfsChaosMonkeySafeLeaderTest, TestSystemIdResolver, V2ApiIntegrationTest, TestRandomCollapseQParserPlugin, TestNodeLostTrigger, TestValueSourceCache, TestLuceneMatchVersion, DeleteStatusTest, TestRandomFlRTGCloud, CoreSorterTest, SystemInfoHandlerTest, TestFastOutputStream, TestSolrCloudWithKerberosAlt, TestFieldCacheSort, TestWordDelimiterFilterFactory, SpatialRPTFieldTypeTest, TolerantUpdateProcessorTest, TestDocSet, HighlighterMaxOffsetTest, SimplePostToolTest, HdfsTlogReplayBufferedWhileIndexingTest, BasicFunctionalityTest, TestUniqueKeyFieldResource, HdfsWriteToMultipleCollectionsTest, TestShardHandlerFactory, TestReloadDeadlock, SynonymTokenizerTest, MissingSegmentRecoveryTest, MergeStrategyTest, SolrMetricManagerTest, BasicAuthIntegrationTest, TestCloudPivotFacet, RuleEngineTest, TestMacros, ShardSplitTest, FileUtilsTest, EnumFieldTest, SolrGraphiteReporterTest, AutoAddReplicasPlanActionTest, FileBasedSpellCheckerTest, TestLeaderElectionWithEmptyReplica, TestBM25SimilarityFactory, BadComponentTest, TestSolrCloudSnapshots, TestUseDocValuesAsStored, TestJavabinTupleStreamParser, UpdateParamsTest, CursorMarkTest, TestSolrConfigHandler, ClassificationUpdateProcessorFactoryTest, InfoHandlerTest, PreAnalyzedFieldManagedSchemaCloudTest, PluginInfoTest, TestDistributedGrouping, TestConfig, ReplaceNodeTest, SolrCloudReportersTest, OverseerRolesTest, SolrIndexSplitterTest, OpenExchangeRatesOrgProviderTest, TestComplexPhraseQParserPlugin, TestExecutePlanAction, TestPerFieldSimilarity, DistributedFacetSimpleRefinementLongTailTest, TestSQLHandlerNonCloud, ChaosMonkeyNothingIsSafeWithPullReplicasTest, TestSubQueryTransformerCrossCore, TestGraphTermsQParserPlugin, SimpleFacetsTest, TestJettySolrRunner, TestLargeCluster, OutOfBoxZkACLAndCredentialsProvidersTest, TermVectorComponentTest, TestDocumentBuilder, MoveReplicaHDFSTest, TestNonDefinedSimilarityFactory, TestManagedSchemaThreadSafety, BasicDistributedZk2Test, DateRangeFieldTest, PingRequestHandlerTest, ShardRoutingCustomTest, TestConfigOverlay, TestImpersonationWithHadoopAuth, NodeLostTriggerTest, EchoParamsTest, TestAuthenticationFramework, ExternalFileFieldSortTest, SparseHLLTest, TestFieldCacheVsDocValues, TestSimpleQParserPlugin, DocValuesMultiTest, TestSolrQueryParser, HdfsSyncSliceTest, DirectSolrSpellCheckerTest, LegacyCloudClusterPropTest, DistributedFacetExistsSmallTest, BlockJoinFacetRandomTest, CachingDirectoryFactoryTest, ClassificationUpdateProcessorTest, TestSha256AuthenticationProvider, TestExactStatsCache, BlockCacheTest, TestMaxScoreQueryParser, TestRemoteStreaming, PolyFieldTest, ExplicitHLLTest, TestElisionMultitermQuery, SampleTest, SpellingQueryConverterTest, BadCopyFieldTest, TestRestoreCore, ChaosMonkeySafeLeaderTest, UnloadDistributedZkTest, CollectionsAPIDistributedZkTest, LeaderElectionIntegrationTest, ClusterStateUpdateTest, ZkSolrClientTest, ZkCLITest, TestGroupingSearch, QueryElevationComponentTest, BadIndexSchemaTest, ConvertedLegacyTest, TestSort, TestFiltering, TestLazyCores, DirectUpdateHandlerTest, TestIndexSearcher, ShowFileRequestHandlerTest, DistributedQueryElevationComponentTest, TestCoreDiscovery, AnalysisAfterCoreReloadTest, SignatureUpdateProcessorFactoryTest, TestExtendedDismaxParser, CoreAdminHandlerTest, TestFoldingMultitermQuery, SuggesterTest, TestStressLucene, TestTrie, TestCSVLoader, NoCacheHeaderTest, WordBreakSolrSpellCheckerTest, SolrCoreCheckLockOnStartupTest, FieldMutatingUpdateProcessorTest, TestAtomicUpdateErrorCases, QueryEqualityTest, DirectUpdateHandlerOptimizeTest, DefaultValueUpdateProcessorTest, SortByFunctionTest, DistanceFunctionTest, TestSolrDeletionPolicy1, DebugComponentTest, IndexBasedSpellCheckerTest, TestSurroundQueryParser, LukeRequestHandlerTest, DisMaxRequestHandlerTest, TestQueryTypes, PrimitiveFieldTypeTest, TermsComponentTest, XmlUpdateRequestHandlerTest, RequestHandlersTest, DocumentBuilderTest, TestIndexingPerformance, FastVectorHighlighterTest, IndexSchemaRuntimeFieldTest, LoggingHandlerTest, SolrPluginUtilsTest, TestJmxIntegration, TestCollationField, UpdateRequestProcessorFactoryTest, MBeansHandlerTest, QueryParsingTest, TestAnalyzedSuggestions, UniqFieldsUpdateProcessorFactoryTest, JsonLoaderTest, TestPartialUpdateDeduplication, SearchHandlerTest, SOLR749Test, TestSolrIndexConfig, CopyFieldTest, ResponseLogComponentTest, SolrIndexConfigTest, TestStressRecovery, TestMergePolicyConfig, TestSolrCoreProperties, TestLMDirichletSimilarityFactory, TestLMJelinekMercerSimilarityFactory, URLClassifyProcessorTest, ChaosMonkeyNothingIsSafeTest, AssignBackwardCompatibilityTest, AsyncCallRequestStatusResponseTest, CleanupOldIndexTest, CollectionTooManyReplicasTest, CollectionsAPISolrJTest, CustomCollectionTest, DeleteReplicaTest, DistributedVersionInfoTest, HttpPartitionTest, LeaderFailureAfterFreshStartTest, LeaderInitiatedRecoveryOnCommitTest, MultiThreadedOCPTest, OverseerCollectionConfigSetProcessorTest, OverseerStatusTest, OverseerTaskQueueTest, SSLMigrationTest, SharedFSAutoReplicaFailoverTest, SimpleCollectionCreateDeleteTest, SolrXmlInZkTest, TestCloudInspectUtil, TestCloudJSONFacetJoinDomain, TestClusterProperties, TestCollectionsAPIViaSolrCloudCluster, TestConfigSetsAPI, TestLeaderElectionZkExpiry, TestLocalFSCloudBackupRestore, TestOnReconnectListenerSupport, TestPullReplica, TestRebalanceLeaders, TestSegmentSorting, TestShortCircuitedRequests, TestSolrCloudWithSecureImpersonation]
   [junit4]   2> NOTE: reproduce with: ant test  -Dtestcase=TestSolrCloudWithSecureImpersonation -Dtests.seed=BF073CDCBB54C00B -Dtests.slow=true -Dtests.locale=en-PH -Dtests.timezone=America/Mendoza -Dtests.asserts=true -Dtests.file.encoding=ISO-8859-1
   [junit4] ERROR   0.00s J1 | TestSolrCloudWithSecureImpersonation (suite) <<<
   [junit4]    > Throwable #1: com.carrotsearch.randomizedtesting.ThreadLeakError: 1 thread leaked from SUITE scope at org.apache.solr.cloud.TestSolrCloudWithSecureImpersonation: 
   [junit4]    >    1) Thread[id=29835, name=jetty-launcher-5491-thread-2-EventThread, state=TIMED_WAITING, group=TGRP-TestSolrCloudWithSecureImpersonation]
   [junit4]    >         at sun.misc.Unsafe.park(Native Method)
   [junit4]    >         at java.util.concurrent.locks.LockSupport.parkNanos(LockSupport.java:215)
   [junit4]    >         at java.util.concurrent.locks.AbstractQueuedSynchronizer.doAcquireSharedNanos(AbstractQueuedSynchronizer.java:1037)
   [junit4]    >         at java.util.concurrent.locks.AbstractQueuedSynchronizer.tryAcquireSharedNanos(AbstractQueuedSynchronizer.java:1328)
   [junit4]    >         at java.util.concurrent.CountDownLatch.await(CountDownLatch.java:277)
   [junit4]    >         at org.apache.curator.CuratorZookeeperClient.internalBlockUntilConnectedOrTimedOut(CuratorZookeeperClient.java:323)
   [junit4]    >         at org.apache.curator.RetryLoop.callWithRetry(RetryLoop.java:105)
   [junit4]    >         at org.apache.curator.framework.imps.GetDataBuilderImpl.pathInForeground(GetDataBuilderImpl.java:288)
   [junit4]    >         at org.apache.curator.framework.imps.GetDataBuilderImpl.forPath(GetDataBuilderImpl.java:279)
   [junit4]    >         at org.apache.curator.framework.imps.GetDataBuilderImpl.forPath(GetDataBuilderImpl.java:41)
   [junit4]    >         at org.apache.curator.framework.recipes.shared.SharedValue.readValue(SharedValue.java:244)
   [junit4]    >         at org.apache.curator.framework.recipes.shared.SharedValue.access$100(SharedValue.java:44)
   [junit4]    >         at org.apache.curator.framework.recipes.shared.SharedValue$1.process(SharedValue.java:61)
   [junit4]    >         at org.apache.curator.framework.imps.NamespaceWatcher.process(NamespaceWatcher.java:67)
   [junit4]    >         at org.apache.zookeeper.ClientCnxn$EventThread.processEvent(ClientCnxn.java:530)
   [junit4]    >         at org.apache.zookeeper.ClientCnxn$EventThread.run(ClientCnxn.java:505)
   [junit4]    > 	at __randomizedtesting.SeedInfo.seed([BF073CDCBB54C00B]:0)
   [junit4] Completed [575/764 (2!)] on J1 in 41.93s, 12 tests, 1 error <<< FAILURES!

[...truncated 48722 lines...]

Mime
View raw message