lucene-dev mailing list archives

Site index · List index
Message view « Date » · « Thread »
Top « Date » · « Thread »
From Policeman Jenkins Server <jenk...@thetaphi.de>
Subject [JENKINS-EA] Lucene-Solr-master-Linux (64bit/jdk-10-ea+41) - Build # 21362 - Still Unstable!
Date Sun, 28 Jan 2018 08:04:04 GMT
Build: https://jenkins.thetaphi.de/job/Lucene-Solr-master-Linux/21362/
Java: 64bit/jdk-10-ea+41 -XX:-UseCompressedOops -XX:+UseParallelGC

3 tests failed.
FAILED:  org.apache.solr.cloud.api.collections.CollectionsAPIDistributedZkTest.testCollectionsAPI

Error Message:
Error from server at https://127.0.0.1:43495/solr/awhollynewcollection_0_shard1_replica_n6: ClusterState says we are the leader (https://127.0.0.1:43495/solr/awhollynewcollection_0_shard1_replica_n6), but locally we don't think so. Request came from null

Stack Trace:
org.apache.solr.client.solrj.impl.CloudSolrClient$RouteException: Error from server at https://127.0.0.1:43495/solr/awhollynewcollection_0_shard1_replica_n6: ClusterState says we are the leader (https://127.0.0.1:43495/solr/awhollynewcollection_0_shard1_replica_n6), but locally we don't think so. Request came from null
	at __randomizedtesting.SeedInfo.seed([47888F234334DAF3:FFDFB974507F566]:0)
	at org.apache.solr.client.solrj.impl.CloudSolrClient.directUpdate(CloudSolrClient.java:550)
	at org.apache.solr.client.solrj.impl.CloudSolrClient.sendRequest(CloudSolrClient.java:1013)
	at org.apache.solr.client.solrj.impl.CloudSolrClient.requestWithRetryOnStaleState(CloudSolrClient.java:884)
	at org.apache.solr.client.solrj.impl.CloudSolrClient.requestWithRetryOnStaleState(CloudSolrClient.java:946)
	at org.apache.solr.client.solrj.impl.CloudSolrClient.requestWithRetryOnStaleState(CloudSolrClient.java:946)
	at org.apache.solr.client.solrj.impl.CloudSolrClient.requestWithRetryOnStaleState(CloudSolrClient.java:946)
	at org.apache.solr.client.solrj.impl.CloudSolrClient.requestWithRetryOnStaleState(CloudSolrClient.java:946)
	at org.apache.solr.client.solrj.impl.CloudSolrClient.requestWithRetryOnStaleState(CloudSolrClient.java:946)
	at org.apache.solr.client.solrj.impl.CloudSolrClient.request(CloudSolrClient.java:817)
	at org.apache.solr.client.solrj.SolrRequest.process(SolrRequest.java:194)
	at org.apache.solr.client.solrj.request.UpdateRequest.commit(UpdateRequest.java:233)
	at org.apache.solr.cloud.api.collections.CollectionsAPIDistributedZkTest.testCollectionsAPI(CollectionsAPIDistributedZkTest.java:463)
	at java.base/jdk.internal.reflect.NativeMethodAccessorImpl.invoke0(Native Method)
	at java.base/jdk.internal.reflect.NativeMethodAccessorImpl.invoke(NativeMethodAccessorImpl.java:62)
	at java.base/jdk.internal.reflect.DelegatingMethodAccessorImpl.invoke(DelegatingMethodAccessorImpl.java:43)
	at java.base/java.lang.reflect.Method.invoke(Method.java:564)
	at com.carrotsearch.randomizedtesting.RandomizedRunner.invoke(RandomizedRunner.java:1737)
	at com.carrotsearch.randomizedtesting.RandomizedRunner$8.evaluate(RandomizedRunner.java:934)
	at com.carrotsearch.randomizedtesting.RandomizedRunner$9.evaluate(RandomizedRunner.java:970)
	at com.carrotsearch.randomizedtesting.RandomizedRunner$10.evaluate(RandomizedRunner.java:984)
	at com.carrotsearch.randomizedtesting.rules.SystemPropertiesRestoreRule$1.evaluate(SystemPropertiesRestoreRule.java:57)
	at org.apache.lucene.util.TestRuleSetupTeardownChained$1.evaluate(TestRuleSetupTeardownChained.java:49)
	at org.apache.lucene.util.AbstractBeforeAfterRule$1.evaluate(AbstractBeforeAfterRule.java:45)
	at org.apache.lucene.util.TestRuleThreadAndTestName$1.evaluate(TestRuleThreadAndTestName.java:48)
	at org.apache.lucene.util.TestRuleIgnoreAfterMaxFailures$1.evaluate(TestRuleIgnoreAfterMaxFailures.java:64)
	at org.apache.lucene.util.TestRuleMarkFailure$1.evaluate(TestRuleMarkFailure.java:47)
	at com.carrotsearch.randomizedtesting.rules.StatementAdapter.evaluate(StatementAdapter.java:36)
	at com.carrotsearch.randomizedtesting.ThreadLeakControl$StatementRunner.run(ThreadLeakControl.java:368)
	at com.carrotsearch.randomizedtesting.ThreadLeakControl.forkTimeoutingTask(ThreadLeakControl.java:817)
	at com.carrotsearch.randomizedtesting.ThreadLeakControl$3.evaluate(ThreadLeakControl.java:468)
	at com.carrotsearch.randomizedtesting.RandomizedRunner.runSingleTest(RandomizedRunner.java:943)
	at com.carrotsearch.randomizedtesting.RandomizedRunner$5.evaluate(RandomizedRunner.java:829)
	at com.carrotsearch.randomizedtesting.RandomizedRunner$6.evaluate(RandomizedRunner.java:879)
	at com.carrotsearch.randomizedtesting.RandomizedRunner$7.evaluate(RandomizedRunner.java:890)
	at com.carrotsearch.randomizedtesting.rules.StatementAdapter.evaluate(StatementAdapter.java:36)
	at com.carrotsearch.randomizedtesting.rules.SystemPropertiesRestoreRule$1.evaluate(SystemPropertiesRestoreRule.java:57)
	at org.apache.lucene.util.AbstractBeforeAfterRule$1.evaluate(AbstractBeforeAfterRule.java:45)
	at com.carrotsearch.randomizedtesting.rules.StatementAdapter.evaluate(StatementAdapter.java:36)
	at org.apache.lucene.util.TestRuleStoreClassName$1.evaluate(TestRuleStoreClassName.java:41)
	at com.carrotsearch.randomizedtesting.rules.NoShadowingOrOverridesOnMethodsRule$1.evaluate(NoShadowingOrOverridesOnMethodsRule.java:40)
	at com.carrotsearch.randomizedtesting.rules.NoShadowingOrOverridesOnMethodsRule$1.evaluate(NoShadowingOrOverridesOnMethodsRule.java:40)
	at com.carrotsearch.randomizedtesting.rules.StatementAdapter.evaluate(StatementAdapter.java:36)
	at com.carrotsearch.randomizedtesting.rules.StatementAdapter.evaluate(StatementAdapter.java:36)
	at org.apache.lucene.util.TestRuleAssertionsRequired$1.evaluate(TestRuleAssertionsRequired.java:53)
	at org.apache.lucene.util.TestRuleMarkFailure$1.evaluate(TestRuleMarkFailure.java:47)
	at org.apache.lucene.util.TestRuleIgnoreAfterMaxFailures$1.evaluate(TestRuleIgnoreAfterMaxFailures.java:64)
	at org.apache.lucene.util.TestRuleIgnoreTestSuites$1.evaluate(TestRuleIgnoreTestSuites.java:54)
	at com.carrotsearch.randomizedtesting.rules.StatementAdapter.evaluate(StatementAdapter.java:36)
	at com.carrotsearch.randomizedtesting.ThreadLeakControl$StatementRunner.run(ThreadLeakControl.java:368)
	at java.base/java.lang.Thread.run(Thread.java:844)
Caused by: org.apache.solr.client.solrj.impl.HttpSolrClient$RemoteSolrException: Error from server at https://127.0.0.1:43495/solr/awhollynewcollection_0_shard1_replica_n6: ClusterState says we are the leader (https://127.0.0.1:43495/solr/awhollynewcollection_0_shard1_replica_n6), but locally we don't think so. Request came from null
	at org.apache.solr.client.solrj.impl.HttpSolrClient.executeMethod(HttpSolrClient.java:643)
	at org.apache.solr.client.solrj.impl.HttpSolrClient.request(HttpSolrClient.java:255)
	at org.apache.solr.client.solrj.impl.HttpSolrClient.request(HttpSolrClient.java:244)
	at org.apache.solr.client.solrj.impl.LBHttpSolrClient.doRequest(LBHttpSolrClient.java:483)
	at org.apache.solr.client.solrj.impl.LBHttpSolrClient.request(LBHttpSolrClient.java:413)
	at org.apache.solr.client.solrj.impl.CloudSolrClient.lambda$directUpdate$0(CloudSolrClient.java:527)
	at java.base/java.util.concurrent.FutureTask.run(FutureTask.java:264)
	at org.apache.solr.common.util.ExecutorUtil$MDCAwareThreadPoolExecutor.lambda$execute$0(ExecutorUtil.java:188)
	at java.base/java.util.concurrent.ThreadPoolExecutor.runWorker(ThreadPoolExecutor.java:1135)
	at java.base/java.util.concurrent.ThreadPoolExecutor$Worker.run(ThreadPoolExecutor.java:635)
	... 1 more


FAILED:  org.apache.solr.cloud.autoscaling.TriggerIntegrationTest.testNodeLostTriggerRestoreState

Error Message:
The trigger did not fire at all

Stack Trace:
java.lang.AssertionError: The trigger did not fire at all
	at __randomizedtesting.SeedInfo.seed([47888F234334DAF3:6C775A78D94CCF23]:0)
	at org.junit.Assert.fail(Assert.java:93)
	at org.junit.Assert.assertTrue(Assert.java:43)
	at org.apache.solr.cloud.autoscaling.TriggerIntegrationTest.testNodeLostTriggerRestoreState(TriggerIntegrationTest.java:368)
	at java.base/jdk.internal.reflect.NativeMethodAccessorImpl.invoke0(Native Method)
	at java.base/jdk.internal.reflect.NativeMethodAccessorImpl.invoke(NativeMethodAccessorImpl.java:62)
	at java.base/jdk.internal.reflect.DelegatingMethodAccessorImpl.invoke(DelegatingMethodAccessorImpl.java:43)
	at java.base/java.lang.reflect.Method.invoke(Method.java:564)
	at com.carrotsearch.randomizedtesting.RandomizedRunner.invoke(RandomizedRunner.java:1737)
	at com.carrotsearch.randomizedtesting.RandomizedRunner$8.evaluate(RandomizedRunner.java:934)
	at com.carrotsearch.randomizedtesting.RandomizedRunner$9.evaluate(RandomizedRunner.java:970)
	at com.carrotsearch.randomizedtesting.RandomizedRunner$10.evaluate(RandomizedRunner.java:984)
	at com.carrotsearch.randomizedtesting.rules.SystemPropertiesRestoreRule$1.evaluate(SystemPropertiesRestoreRule.java:57)
	at org.apache.lucene.util.TestRuleSetupTeardownChained$1.evaluate(TestRuleSetupTeardownChained.java:49)
	at org.apache.lucene.util.AbstractBeforeAfterRule$1.evaluate(AbstractBeforeAfterRule.java:45)
	at org.apache.lucene.util.TestRuleThreadAndTestName$1.evaluate(TestRuleThreadAndTestName.java:48)
	at org.apache.lucene.util.TestRuleIgnoreAfterMaxFailures$1.evaluate(TestRuleIgnoreAfterMaxFailures.java:64)
	at org.apache.lucene.util.TestRuleMarkFailure$1.evaluate(TestRuleMarkFailure.java:47)
	at com.carrotsearch.randomizedtesting.rules.StatementAdapter.evaluate(StatementAdapter.java:36)
	at com.carrotsearch.randomizedtesting.ThreadLeakControl$StatementRunner.run(ThreadLeakControl.java:368)
	at com.carrotsearch.randomizedtesting.ThreadLeakControl.forkTimeoutingTask(ThreadLeakControl.java:817)
	at com.carrotsearch.randomizedtesting.ThreadLeakControl$3.evaluate(ThreadLeakControl.java:468)
	at com.carrotsearch.randomizedtesting.RandomizedRunner.runSingleTest(RandomizedRunner.java:943)
	at com.carrotsearch.randomizedtesting.RandomizedRunner$5.evaluate(RandomizedRunner.java:829)
	at com.carrotsearch.randomizedtesting.RandomizedRunner$6.evaluate(RandomizedRunner.java:879)
	at com.carrotsearch.randomizedtesting.RandomizedRunner$7.evaluate(RandomizedRunner.java:890)
	at com.carrotsearch.randomizedtesting.rules.StatementAdapter.evaluate(StatementAdapter.java:36)
	at com.carrotsearch.randomizedtesting.rules.SystemPropertiesRestoreRule$1.evaluate(SystemPropertiesRestoreRule.java:57)
	at org.apache.lucene.util.AbstractBeforeAfterRule$1.evaluate(AbstractBeforeAfterRule.java:45)
	at com.carrotsearch.randomizedtesting.rules.StatementAdapter.evaluate(StatementAdapter.java:36)
	at org.apache.lucene.util.TestRuleStoreClassName$1.evaluate(TestRuleStoreClassName.java:41)
	at com.carrotsearch.randomizedtesting.rules.NoShadowingOrOverridesOnMethodsRule$1.evaluate(NoShadowingOrOverridesOnMethodsRule.java:40)
	at com.carrotsearch.randomizedtesting.rules.NoShadowingOrOverridesOnMethodsRule$1.evaluate(NoShadowingOrOverridesOnMethodsRule.java:40)
	at com.carrotsearch.randomizedtesting.rules.StatementAdapter.evaluate(StatementAdapter.java:36)
	at com.carrotsearch.randomizedtesting.rules.StatementAdapter.evaluate(StatementAdapter.java:36)
	at org.apache.lucene.util.TestRuleAssertionsRequired$1.evaluate(TestRuleAssertionsRequired.java:53)
	at org.apache.lucene.util.TestRuleMarkFailure$1.evaluate(TestRuleMarkFailure.java:47)
	at org.apache.lucene.util.TestRuleIgnoreAfterMaxFailures$1.evaluate(TestRuleIgnoreAfterMaxFailures.java:64)
	at org.apache.lucene.util.TestRuleIgnoreTestSuites$1.evaluate(TestRuleIgnoreTestSuites.java:54)
	at com.carrotsearch.randomizedtesting.rules.StatementAdapter.evaluate(StatementAdapter.java:36)
	at com.carrotsearch.randomizedtesting.ThreadLeakControl$StatementRunner.run(ThreadLeakControl.java:368)
	at java.base/java.lang.Thread.run(Thread.java:844)


FAILED:  org.apache.solr.cloud.autoscaling.TriggerIntegrationTest.testListeners

Error Message:


Stack Trace:
java.lang.AssertionError
	at __randomizedtesting.SeedInfo.seed([47888F234334DAF3:AA481833FE58472A]:0)
	at org.junit.Assert.fail(Assert.java:92)
	at org.junit.Assert.assertTrue(Assert.java:43)
	at org.junit.Assert.assertTrue(Assert.java:54)
	at org.apache.solr.cloud.autoscaling.TriggerIntegrationTest.testListeners(TriggerIntegrationTest.java:1053)
	at java.base/jdk.internal.reflect.NativeMethodAccessorImpl.invoke0(Native Method)
	at java.base/jdk.internal.reflect.NativeMethodAccessorImpl.invoke(NativeMethodAccessorImpl.java:62)
	at java.base/jdk.internal.reflect.DelegatingMethodAccessorImpl.invoke(DelegatingMethodAccessorImpl.java:43)
	at java.base/java.lang.reflect.Method.invoke(Method.java:564)
	at com.carrotsearch.randomizedtesting.RandomizedRunner.invoke(RandomizedRunner.java:1737)
	at com.carrotsearch.randomizedtesting.RandomizedRunner$8.evaluate(RandomizedRunner.java:934)
	at com.carrotsearch.randomizedtesting.RandomizedRunner$9.evaluate(RandomizedRunner.java:970)
	at com.carrotsearch.randomizedtesting.RandomizedRunner$10.evaluate(RandomizedRunner.java:984)
	at com.carrotsearch.randomizedtesting.rules.SystemPropertiesRestoreRule$1.evaluate(SystemPropertiesRestoreRule.java:57)
	at org.apache.lucene.util.TestRuleSetupTeardownChained$1.evaluate(TestRuleSetupTeardownChained.java:49)
	at org.apache.lucene.util.AbstractBeforeAfterRule$1.evaluate(AbstractBeforeAfterRule.java:45)
	at org.apache.lucene.util.TestRuleThreadAndTestName$1.evaluate(TestRuleThreadAndTestName.java:48)
	at org.apache.lucene.util.TestRuleIgnoreAfterMaxFailures$1.evaluate(TestRuleIgnoreAfterMaxFailures.java:64)
	at org.apache.lucene.util.TestRuleMarkFailure$1.evaluate(TestRuleMarkFailure.java:47)
	at com.carrotsearch.randomizedtesting.rules.StatementAdapter.evaluate(StatementAdapter.java:36)
	at com.carrotsearch.randomizedtesting.ThreadLeakControl$StatementRunner.run(ThreadLeakControl.java:368)
	at com.carrotsearch.randomizedtesting.ThreadLeakControl.forkTimeoutingTask(ThreadLeakControl.java:817)
	at com.carrotsearch.randomizedtesting.ThreadLeakControl$3.evaluate(ThreadLeakControl.java:468)
	at com.carrotsearch.randomizedtesting.RandomizedRunner.runSingleTest(RandomizedRunner.java:943)
	at com.carrotsearch.randomizedtesting.RandomizedRunner$5.evaluate(RandomizedRunner.java:829)
	at com.carrotsearch.randomizedtesting.RandomizedRunner$6.evaluate(RandomizedRunner.java:879)
	at com.carrotsearch.randomizedtesting.RandomizedRunner$7.evaluate(RandomizedRunner.java:890)
	at com.carrotsearch.randomizedtesting.rules.StatementAdapter.evaluate(StatementAdapter.java:36)
	at com.carrotsearch.randomizedtesting.rules.SystemPropertiesRestoreRule$1.evaluate(SystemPropertiesRestoreRule.java:57)
	at org.apache.lucene.util.AbstractBeforeAfterRule$1.evaluate(AbstractBeforeAfterRule.java:45)
	at com.carrotsearch.randomizedtesting.rules.StatementAdapter.evaluate(StatementAdapter.java:36)
	at org.apache.lucene.util.TestRuleStoreClassName$1.evaluate(TestRuleStoreClassName.java:41)
	at com.carrotsearch.randomizedtesting.rules.NoShadowingOrOverridesOnMethodsRule$1.evaluate(NoShadowingOrOverridesOnMethodsRule.java:40)
	at com.carrotsearch.randomizedtesting.rules.NoShadowingOrOverridesOnMethodsRule$1.evaluate(NoShadowingOrOverridesOnMethodsRule.java:40)
	at com.carrotsearch.randomizedtesting.rules.StatementAdapter.evaluate(StatementAdapter.java:36)
	at com.carrotsearch.randomizedtesting.rules.StatementAdapter.evaluate(StatementAdapter.java:36)
	at org.apache.lucene.util.TestRuleAssertionsRequired$1.evaluate(TestRuleAssertionsRequired.java:53)
	at org.apache.lucene.util.TestRuleMarkFailure$1.evaluate(TestRuleMarkFailure.java:47)
	at org.apache.lucene.util.TestRuleIgnoreAfterMaxFailures$1.evaluate(TestRuleIgnoreAfterMaxFailures.java:64)
	at org.apache.lucene.util.TestRuleIgnoreTestSuites$1.evaluate(TestRuleIgnoreTestSuites.java:54)
	at com.carrotsearch.randomizedtesting.rules.StatementAdapter.evaluate(StatementAdapter.java:36)
	at com.carrotsearch.randomizedtesting.ThreadLeakControl$StatementRunner.run(ThreadLeakControl.java:368)
	at java.base/java.lang.Thread.run(Thread.java:844)




Build Log:
[...truncated 12648 lines...]
   [junit4] Suite: org.apache.solr.cloud.api.collections.CollectionsAPIDistributedZkTest
   [junit4]   2> 981844 INFO  (SUITE-CollectionsAPIDistributedZkTest-seed#[47888F234334DAF3]-worker) [    ] o.a.s.SolrTestCaseJ4 SecureRandom sanity checks: test.solr.allowed.securerandom=null & java.security.egd=file:/dev/./urandom
   [junit4]   2> Creating dataDir: /home/jenkins/workspace/Lucene-Solr-master-Linux/solr/build/solr-core/test/J1/temp/solr.cloud.api.collections.CollectionsAPIDistributedZkTest_47888F234334DAF3-001/init-core-data-001
   [junit4]   2> 981845 WARN  (SUITE-CollectionsAPIDistributedZkTest-seed#[47888F234334DAF3]-worker) [    ] o.a.s.SolrTestCaseJ4 startTrackingSearchers: numOpens=4 numCloses=4
   [junit4]   2> 981845 INFO  (SUITE-CollectionsAPIDistributedZkTest-seed#[47888F234334DAF3]-worker) [    ] o.a.s.SolrTestCaseJ4 Using PointFields (NUMERIC_POINTS_SYSPROP=true) w/NUMERIC_DOCVALUES_SYSPROP=true
   [junit4]   2> 981845 INFO  (SUITE-CollectionsAPIDistributedZkTest-seed#[47888F234334DAF3]-worker) [    ] o.a.s.SolrTestCaseJ4 Randomized ssl (true) and clientAuth (true) via: @org.apache.solr.util.RandomizeSSL(reason="", value=0.0/0.0, ssl=0.0/0.0, clientAuth=0.0/0.0)
   [junit4]   2> 981846 INFO  (SUITE-CollectionsAPIDistributedZkTest-seed#[47888F234334DAF3]-worker) [    ] o.a.s.c.MiniSolrCloudCluster Starting cluster of 4 servers in /home/jenkins/workspace/Lucene-Solr-master-Linux/solr/build/solr-core/test/J1/temp/solr.cloud.api.collections.CollectionsAPIDistributedZkTest_47888F234334DAF3-001/tempDir-001
   [junit4]   2> 981846 INFO  (SUITE-CollectionsAPIDistributedZkTest-seed#[47888F234334DAF3]-worker) [    ] o.a.s.c.ZkTestServer STARTING ZK TEST SERVER
   [junit4]   2> 981846 INFO  (Thread-5547) [    ] o.a.s.c.ZkTestServer client port:0.0.0.0/0.0.0.0:0
   [junit4]   2> 981846 INFO  (Thread-5547) [    ] o.a.s.c.ZkTestServer Starting server
   [junit4]   2> 981848 ERROR (Thread-5547) [    ] o.a.z.s.ZooKeeperServer ZKShutdownHandler is not registered, so ZooKeeper server won't take any action on ERROR or SHUTDOWN server state changes
   [junit4]   2> 981946 INFO  (SUITE-CollectionsAPIDistributedZkTest-seed#[47888F234334DAF3]-worker) [    ] o.a.s.c.ZkTestServer start zk server on port:46187
   [junit4]   2> 981949 INFO  (zkConnectionManagerCallback-1940-thread-1) [    ] o.a.s.c.c.ConnectionManager zkClient has connected
   [junit4]   2> 981952 INFO  (jetty-launcher-1937-thread-1) [    ] o.e.j.s.Server jetty-9.4.8.v20171121, build timestamp: 2017-11-22T08:27:37+11:00, git hash: 82b8fb23f757335bb3329d540ce37a2a2615f0a8
   [junit4]   2> 981952 INFO  (jetty-launcher-1937-thread-2) [    ] o.e.j.s.Server jetty-9.4.8.v20171121, build timestamp: 2017-11-22T08:27:37+11:00, git hash: 82b8fb23f757335bb3329d540ce37a2a2615f0a8
   [junit4]   2> 981952 INFO  (jetty-launcher-1937-thread-3) [    ] o.e.j.s.Server jetty-9.4.8.v20171121, build timestamp: 2017-11-22T08:27:37+11:00, git hash: 82b8fb23f757335bb3329d540ce37a2a2615f0a8
   [junit4]   2> 981952 INFO  (jetty-launcher-1937-thread-4) [    ] o.e.j.s.Server jetty-9.4.8.v20171121, build timestamp: 2017-11-22T08:27:37+11:00, git hash: 82b8fb23f757335bb3329d540ce37a2a2615f0a8
   [junit4]   2> 981953 INFO  (jetty-launcher-1937-thread-3) [    ] o.e.j.s.session DefaultSessionIdManager workerName=node0
   [junit4]   2> 981953 INFO  (jetty-launcher-1937-thread-3) [    ] o.e.j.s.session No SessionScavenger set, using defaults
   [junit4]   2> 981953 INFO  (jetty-launcher-1937-thread-3) [    ] o.e.j.s.session Scavenging every 600000ms
   [junit4]   2> 981953 INFO  (jetty-launcher-1937-thread-4) [    ] o.e.j.s.session DefaultSessionIdManager workerName=node0
   [junit4]   2> 981953 INFO  (jetty-launcher-1937-thread-4) [    ] o.e.j.s.session No SessionScavenger set, using defaults
   [junit4]   2> 981953 INFO  (jetty-launcher-1937-thread-4) [    ] o.e.j.s.session Scavenging every 600000ms
   [junit4]   2> 981953 INFO  (jetty-launcher-1937-thread-3) [    ] o.e.j.s.h.ContextHandler Started o.e.j.s.ServletContextHandler@208fe3bf{/solr,null,AVAILABLE}
   [junit4]   2> 981954 INFO  (jetty-launcher-1937-thread-2) [    ] o.e.j.s.session DefaultSessionIdManager workerName=node0
   [junit4]   2> 981954 INFO  (jetty-launcher-1937-thread-2) [    ] o.e.j.s.session No SessionScavenger set, using defaults
   [junit4]   2> 981954 INFO  (jetty-launcher-1937-thread-1) [    ] o.e.j.s.session DefaultSessionIdManager workerName=node0
   [junit4]   2> 981954 INFO  (jetty-launcher-1937-thread-2) [    ] o.e.j.s.session Scavenging every 660000ms
   [junit4]   2> 981954 INFO  (jetty-launcher-1937-thread-1) [    ] o.e.j.s.session No SessionScavenger set, using defaults
   [junit4]   2> 981954 INFO  (jetty-launcher-1937-thread-4) [    ] o.e.j.s.h.ContextHandler Started o.e.j.s.ServletContextHandler@61518dcd{/solr,null,AVAILABLE}
   [junit4]   2> 981954 INFO  (jetty-launcher-1937-thread-1) [    ] o.e.j.s.session Scavenging every 660000ms
   [junit4]   2> 981954 INFO  (jetty-launcher-1937-thread-2) [    ] o.e.j.s.h.ContextHandler Started o.e.j.s.ServletContextHandler@5a084045{/solr,null,AVAILABLE}
   [junit4]   2> 981955 INFO  (jetty-launcher-1937-thread-1) [    ] o.e.j.s.h.ContextHandler Started o.e.j.s.ServletContextHandler@7cca951e{/solr,null,AVAILABLE}
   [junit4]   2> 981955 INFO  (jetty-launcher-1937-thread-3) [    ] o.e.j.s.AbstractConnector Started ServerConnector@76768403{SSL,[ssl, http/1.1]}{127.0.0.1:40105}
   [junit4]   2> 981955 INFO  (jetty-launcher-1937-thread-3) [    ] o.e.j.s.Server Started @984007ms
   [junit4]   2> 981955 INFO  (jetty-launcher-1937-thread-3) [    ] o.a.s.c.s.e.JettySolrRunner Jetty properties: {hostContext=/solr, hostPort=40105}
   [junit4]   2> 981955 ERROR (jetty-launcher-1937-thread-3) [    ] o.a.s.u.StartupLoggingUtils Missing Java Option solr.log.dir. Logging may be missing or incomplete.
   [junit4]   2> 981955 INFO  (jetty-launcher-1937-thread-1) [    ] o.e.j.s.AbstractConnector Started ServerConnector@9f826b4{SSL,[ssl, http/1.1]}{127.0.0.1:34243}
   [junit4]   2> 981955 INFO  (jetty-launcher-1937-thread-3) [    ] o.a.s.s.SolrDispatchFilter  ___      _       Welcome to Apache Solr? version 8.0.0
   [junit4]   2> 981955 INFO  (jetty-launcher-1937-thread-1) [    ] o.e.j.s.Server Started @984007ms
   [junit4]   2> 981955 INFO  (jetty-launcher-1937-thread-3) [    ] o.a.s.s.SolrDispatchFilter / __| ___| |_ _   Starting in cloud mode on port null
   [junit4]   2> 981955 INFO  (jetty-launcher-1937-thread-1) [    ] o.a.s.c.s.e.JettySolrRunner Jetty properties: {hostContext=/solr, hostPort=34243}
   [junit4]   2> 981955 INFO  (jetty-launcher-1937-thread-3) [    ] o.a.s.s.SolrDispatchFilter \__ \/ _ \ | '_|  Install dir: null
   [junit4]   2> 981955 INFO  (jetty-launcher-1937-thread-3) [    ] o.a.s.s.SolrDispatchFilter |___/\___/_|_|    Start time: 2018-01-28T07:09:48.341584Z
   [junit4]   2> 981955 ERROR (jetty-launcher-1937-thread-1) [    ] o.a.s.u.StartupLoggingUtils Missing Java Option solr.log.dir. Logging may be missing or incomplete.
   [junit4]   2> 981955 INFO  (jetty-launcher-1937-thread-1) [    ] o.a.s.s.SolrDispatchFilter  ___      _       Welcome to Apache Solr? version 8.0.0
   [junit4]   2> 981955 INFO  (jetty-launcher-1937-thread-1) [    ] o.a.s.s.SolrDispatchFilter / __| ___| |_ _   Starting in cloud mode on port null
   [junit4]   2> 981955 INFO  (jetty-launcher-1937-thread-1) [    ] o.a.s.s.SolrDispatchFilter \__ \/ _ \ | '_|  Install dir: null
   [junit4]   2> 981955 INFO  (jetty-launcher-1937-thread-1) [    ] o.a.s.s.SolrDispatchFilter |___/\___/_|_|    Start time: 2018-01-28T07:09:48.341779Z
   [junit4]   2> 981955 INFO  (jetty-launcher-1937-thread-2) [    ] o.e.j.s.AbstractConnector Started ServerConnector@7db3dd81{SSL,[ssl, http/1.1]}{127.0.0.1:37777}
   [junit4]   2> 981956 INFO  (jetty-launcher-1937-thread-2) [    ] o.e.j.s.Server Started @984008ms
   [junit4]   2> 981956 INFO  (jetty-launcher-1937-thread-2) [    ] o.a.s.c.s.e.JettySolrRunner Jetty properties: {hostContext=/solr, hostPort=37777}
   [junit4]   2> 981956 ERROR (jetty-launcher-1937-thread-2) [    ] o.a.s.u.StartupLoggingUtils Missing Java Option solr.log.dir. Logging may be missing or incomplete.
   [junit4]   2> 981956 INFO  (jetty-launcher-1937-thread-2) [    ] o.a.s.s.SolrDispatchFilter  ___      _       Welcome to Apache Solr? version 8.0.0
   [junit4]   2> 981956 INFO  (jetty-launcher-1937-thread-2) [    ] o.a.s.s.SolrDispatchFilter / __| ___| |_ _   Starting in cloud mode on port null
   [junit4]   2> 981956 INFO  (jetty-launcher-1937-thread-2) [    ] o.a.s.s.SolrDispatchFilter \__ \/ _ \ | '_|  Install dir: null
   [junit4]   2> 981956 INFO  (jetty-launcher-1937-thread-2) [    ] o.a.s.s.SolrDispatchFilter |___/\___/_|_|    Start time: 2018-01-28T07:09:48.342287Z
   [junit4]   2> 981956 INFO  (zkConnectionManagerCallback-1942-thread-1) [    ] o.a.s.c.c.ConnectionManager zkClient has connected
   [junit4]   2> 981956 INFO  (jetty-launcher-1937-thread-4) [    ] o.e.j.s.AbstractConnector Started ServerConnector@7abd1815{SSL,[ssl, http/1.1]}{127.0.0.1:43495}
   [junit4]   2> 981956 INFO  (zkConnectionManagerCallback-1944-thread-1) [    ] o.a.s.c.c.ConnectionManager zkClient has connected
   [junit4]   2> 981956 INFO  (jetty-launcher-1937-thread-4) [    ] o.e.j.s.Server Started @984008ms
   [junit4]   2> 981956 INFO  (jetty-launcher-1937-thread-4) [    ] o.a.s.c.s.e.JettySolrRunner Jetty properties: {hostContext=/solr, hostPort=43495}
   [junit4]   2> 981956 ERROR (jetty-launcher-1937-thread-4) [    ] o.a.s.u.StartupLoggingUtils Missing Java Option solr.log.dir. Logging may be missing or incomplete.
   [junit4]   2> 981956 INFO  (jetty-launcher-1937-thread-3) [    ] o.a.s.s.SolrDispatchFilter solr.xml found in ZooKeeper. Loading...
   [junit4]   2> 981956 INFO  (jetty-launcher-1937-thread-4) [    ] o.a.s.s.SolrDispatchFilter  ___      _       Welcome to Apache Solr? version 8.0.0
   [junit4]   2> 981956 INFO  (jetty-launcher-1937-thread-4) [    ] o.a.s.s.SolrDispatchFilter / __| ___| |_ _   Starting in cloud mode on port null
   [junit4]   2> 981956 INFO  (jetty-launcher-1937-thread-4) [    ] o.a.s.s.SolrDispatchFilter \__ \/ _ \ | '_|  Install dir: null
   [junit4]   2> 981956 INFO  (jetty-launcher-1937-thread-1) [    ] o.a.s.s.SolrDispatchFilter solr.xml found in ZooKeeper. Loading...
   [junit4]   2> 981956 INFO  (jetty-launcher-1937-thread-4) [    ] o.a.s.s.SolrDispatchFilter |___/\___/_|_|    Start time: 2018-01-28T07:09:48.342963Z
   [junit4]   2> 981957 INFO  (zkConnectionManagerCallback-1946-thread-1) [    ] o.a.s.c.c.ConnectionManager zkClient has connected
   [junit4]   2> 981957 INFO  (jetty-launcher-1937-thread-2) [    ] o.a.s.s.SolrDispatchFilter solr.xml found in ZooKeeper. Loading...
   [junit4]   2> 981958 INFO  (jetty-launcher-1937-thread-1) [    ] o.a.s.c.SolrXmlConfig Configuration parameter autoReplicaFailoverWorkLoopDelay is ignored
   [junit4]   2> 981958 INFO  (jetty-launcher-1937-thread-3) [    ] o.a.s.c.SolrXmlConfig Configuration parameter autoReplicaFailoverWorkLoopDelay is ignored
   [junit4]   2> 981958 INFO  (jetty-launcher-1937-thread-1) [    ] o.a.s.c.SolrXmlConfig Configuration parameter autoReplicaFailoverBadNodeExpiration is ignored
   [junit4]   2> 981958 INFO  (jetty-launcher-1937-thread-3) [    ] o.a.s.c.SolrXmlConfig Configuration parameter autoReplicaFailoverBadNodeExpiration is ignored
   [junit4]   2> 981958 INFO  (jetty-launcher-1937-thread-2) [    ] o.a.s.c.SolrXmlConfig Configuration parameter autoReplicaFailoverWorkLoopDelay is ignored
   [junit4]   2> 981958 INFO  (jetty-launcher-1937-thread-2) [    ] o.a.s.c.SolrXmlConfig Configuration parameter autoReplicaFailoverBadNodeExpiration is ignored
   [junit4]   2> 981961 INFO  (zkConnectionManagerCallback-1948-thread-1) [    ] o.a.s.c.c.ConnectionManager zkClient has connected
   [junit4]   2> 981961 INFO  (jetty-launcher-1937-thread-4) [    ] o.a.s.s.SolrDispatchFilter solr.xml found in ZooKeeper. Loading...
   [junit4]   2> 981963 INFO  (jetty-launcher-1937-thread-4) [    ] o.a.s.c.SolrXmlConfig Configuration parameter autoReplicaFailoverWorkLoopDelay is ignored
   [junit4]   2> 981963 INFO  (jetty-launcher-1937-thread-4) [    ] o.a.s.c.SolrXmlConfig Configuration parameter autoReplicaFailoverBadNodeExpiration is ignored
   [junit4]   2> 981963 INFO  (jetty-launcher-1937-thread-1) [    ] o.a.s.c.ZkContainer Zookeeper client=127.0.0.1:46187/solr
   [junit4]   2> 981964 INFO  (zkConnectionManagerCallback-1953-thread-1) [    ] o.a.s.c.c.ConnectionManager zkClient has connected
   [junit4]   2> 981965 INFO  (jetty-launcher-1937-thread-4) [    ] o.a.s.c.ZkContainer Zookeeper client=127.0.0.1:46187/solr
   [junit4]   2> 981966 INFO  (jetty-launcher-1937-thread-3) [    ] o.a.s.c.ZkContainer Zookeeper client=127.0.0.1:46187/solr
   [junit4]   2> 981969 INFO  (jetty-launcher-1937-thread-2) [    ] o.a.s.c.ZkContainer Zookeeper client=127.0.0.1:46187/solr
   [junit4]   2> 981975 INFO  (zkConnectionManagerCallback-1958-thread-1-processing-n:127.0.0.1:34243_solr) [n:127.0.0.1:34243_solr    ] o.a.s.c.c.ConnectionManager zkClient has connected
   [junit4]   2> 981975 INFO  (zkConnectionManagerCallback-1960-thread-1) [    ] o.a.s.c.c.ConnectionManager zkClient has connected
   [junit4]   2> 981989 INFO  (zkConnectionManagerCallback-1963-thread-1) [    ] o.a.s.c.c.ConnectionManager zkClient has connected
   [junit4]   2> 982004 INFO  (zkConnectionManagerCallback-1966-thread-1) [    ] o.a.s.c.c.ConnectionManager zkClient has connected
   [junit4]   2> 982004 INFO  (zkConnectionManagerCallback-1968-thread-1-processing-n:127.0.0.1:43495_solr) [n:127.0.0.1:43495_solr    ] o.a.s.c.c.ConnectionManager zkClient has connected
   [junit4]   2> 982008 INFO  (jetty-launcher-1937-thread-4) [n:127.0.0.1:43495_solr    ] o.a.s.c.Overseer Overseer (id=null) closing
   [junit4]   2> 982009 INFO  (jetty-launcher-1937-thread-4) [n:127.0.0.1:43495_solr    ] o.a.s.c.OverseerElectionContext I am going to be the leader 127.0.0.1:43495_solr
   [junit4]   2> 982009 INFO  (jetty-launcher-1937-thread-4) [n:127.0.0.1:43495_solr    ] o.a.s.c.Overseer Overseer (id=99426198371237898-127.0.0.1:43495_solr-n_0000000000) starting
   [junit4]   2> 982011 INFO  (zkConnectionManagerCallback-1971-thread-1-processing-n:127.0.0.1:40105_solr) [n:127.0.0.1:40105_solr    ] o.a.s.c.c.ConnectionManager zkClient has connected
   [junit4]   2> 982013 INFO  (zkConnectionManagerCallback-1973-thread-1-processing-n:127.0.0.1:37777_solr) [n:127.0.0.1:37777_solr    ] o.a.s.c.c.ConnectionManager zkClient has connected
   [junit4]   2> 982014 INFO  (jetty-launcher-1937-thread-4) [n:127.0.0.1:43495_solr    ] o.a.s.c.ZkController Register node as live in ZooKeeper:/live_nodes/127.0.0.1:43495_solr
   [junit4]   2> 982015 INFO  (OverseerStateUpdate-99426198371237898-127.0.0.1:43495_solr-n_0000000000) [n:127.0.0.1:43495_solr    ] o.a.s.c.c.ZkStateReader Updated live nodes from ZooKeeper... (0) -> (1)
   [junit4]   2> 982018 INFO  (jetty-launcher-1937-thread-3) [n:127.0.0.1:40105_solr    ] o.a.s.c.c.ZkStateReader Updated live nodes from ZooKeeper... (0) -> (1)
   [junit4]   2> 982019 INFO  (jetty-launcher-1937-thread-2) [n:127.0.0.1:37777_solr    ] o.a.s.c.c.ZkStateReader Updated live nodes from ZooKeeper... (0) -> (1)
   [junit4]   2> 982020 INFO  (jetty-launcher-1937-thread-3) [n:127.0.0.1:40105_solr    ] o.a.s.c.Overseer Overseer (id=null) closing
   [junit4]   2> 982021 INFO  (jetty-launcher-1937-thread-2) [n:127.0.0.1:37777_solr    ] o.a.s.c.Overseer Overseer (id=null) closing
   [junit4]   2> 982023 INFO  (jetty-launcher-1937-thread-3) [n:127.0.0.1:40105_solr    ] o.a.s.c.ZkController Register node as live in ZooKeeper:/live_nodes/127.0.0.1:40105_solr
   [junit4]   2> 982023 INFO  (jetty-launcher-1937-thread-2) [n:127.0.0.1:37777_solr    ] o.a.s.c.ZkController Register node as live in ZooKeeper:/live_nodes/127.0.0.1:37777_solr
   [junit4]   2> 982029 INFO  (zkCallback-1967-thread-1-processing-n:127.0.0.1:43495_solr) [n:127.0.0.1:43495_solr    ] o.a.s.c.c.ZkStateReader Updated live nodes from ZooKeeper... (1) -> (3)
   [junit4]   2> 982035 INFO  (jetty-launcher-1937-thread-1) [n:127.0.0.1:34243_solr    ] o.a.s.c.c.ZkStateReader Updated live nodes from ZooKeeper... (0) -> (3)
   [junit4]   2> 982037 INFO  (jetty-launcher-1937-thread-1) [n:127.0.0.1:34243_solr    ] o.a.s.c.Overseer Overseer (id=null) closing
   [junit4]   2> 982038 INFO  (jetty-launcher-1937-thread-1) [n:127.0.0.1:34243_solr    ] o.a.s.c.ZkController Register node as live in ZooKeeper:/live_nodes/127.0.0.1:34243_solr
   [junit4]   2> 982039 INFO  (zkCallback-1967-thread-2-processing-n:127.0.0.1:43495_solr) [n:127.0.0.1:43495_solr    ] o.a.s.c.c.ZkStateReader Updated live nodes from ZooKeeper... (3) -> (4)
   [junit4]   2> 982040 INFO  (jetty-launcher-1937-thread-4) [n:127.0.0.1:43495_solr    ] o.a.s.m.r.SolrJmxReporter JMX monitoring for 'solr.node' (registry 'solr.node') enabled at server: com.sun.jmx.mbeanserver.JmxMBeanServer@342523bc
   [junit4]   2> 982045 INFO  (jetty-launcher-1937-thread-4) [n:127.0.0.1:43495_solr    ] o.a.s.m.r.SolrJmxReporter JMX monitoring for 'solr.jvm' (registry 'solr.jvm') enabled at server: com.sun.jmx.mbeanserver.JmxMBeanServer@342523bc
   [junit4]   2> 982045 INFO  (jetty-launcher-1937-thread-4) [n:127.0.0.1:43495_solr    ] o.a.s.m.r.SolrJmxReporter JMX monitoring for 'solr.jetty' (registry 'solr.jetty') enabled at server: com.sun.jmx.mbeanserver.JmxMBeanServer@342523bc
   [junit4]   2> 982046 INFO  (jetty-launcher-1937-thread-4) [n:127.0.0.1:43495_solr    ] o.a.s.c.CorePropertiesLocator Found 0 core definitions underneath /home/jenkins/workspace/Lucene-Solr-master-Linux/solr/build/solr-core/test/J1/temp/solr.cloud.api.collections.CollectionsAPIDistributedZkTest_47888F234334DAF3-001/tempDir-001/node4
   [junit4]   2> 982049 INFO  (zkCallback-1970-thread-1-processing-n:127.0.0.1:40105_solr) [n:127.0.0.1:40105_solr    ] o.a.s.c.c.ZkStateReader Updated live nodes from ZooKeeper... (1) -> (3)
   [junit4]   2> 982049 INFO  (zkCallback-1972-thread-1-processing-n:127.0.0.1:37777_solr) [n:127.0.0.1:37777_solr    ] o.a.s.c.c.ZkStateReader Updated live nodes from ZooKeeper... (1) -> (4)
   [junit4]   2> 982049 INFO  (zkCallback-1970-thread-2-processing-n:127.0.0.1:40105_solr) [n:127.0.0.1:40105_solr    ] o.a.s.c.c.ZkStateReader Updated live nodes from ZooKeeper... (3) -> (4)
   [junit4]   2> 982053 INFO  (zkCallback-1957-thread-1-processing-n:127.0.0.1:34243_solr) [n:127.0.0.1:34243_solr    ] o.a.s.c.c.ZkStateReader Updated live nodes from ZooKeeper... (3) -> (4)
   [junit4]   2> 982060 INFO  (jetty-launcher-1937-thread-2) [n:127.0.0.1:37777_solr    ] o.a.s.m.r.SolrJmxReporter JMX monitoring for 'solr.node' (registry 'solr.node') enabled at server: com.sun.jmx.mbeanserver.JmxMBeanServer@342523bc
   [junit4]   2> 982068 INFO  (jetty-launcher-1937-thread-2) [n:127.0.0.1:37777_solr    ] o.a.s.m.r.SolrJmxReporter JMX monitoring for 'solr.jvm' (registry 'solr.jvm') enabled at server: com.sun.jmx.mbeanserver.JmxMBeanServer@342523bc
   [junit4]   2> 982068 INFO  (jetty-launcher-1937-thread-2) [n:127.0.0.1:37777_solr    ] o.a.s.m.r.SolrJmxReporter JMX monitoring for 'solr.jetty' (registry 'solr.jetty') enabled at server: com.sun.jmx.mbeanserver.JmxMBeanServer@342523bc
   [junit4]   2> 982069 INFO  (jetty-launcher-1937-thread-2) [n:127.0.0.1:37777_solr    ] o.a.s.c.CorePropertiesLocator Found 0 core definitions underneath /home/jenkins/workspace/Lucene-Solr-master-Linux/solr/build/solr-core/test/J1/temp/solr.cloud.api.collections.CollectionsAPIDistributedZkTest_47888F234334DAF3-001/tempDir-001/node2
   [junit4]   2> 982082 INFO  (jetty-launcher-1937-thread-1) [n:127.0.0.1:34243_solr    ] o.a.s.m.r.SolrJmxReporter JMX monitoring for 'solr.node' (registry 'solr.node') enabled at server: com.sun.jmx.mbeanserver.JmxMBeanServer@342523bc
   [junit4]   2> 982089 INFO  (jetty-launcher-1937-thread-1) [n:127.0.0.1:34243_solr    ] o.a.s.m.r.SolrJmxReporter JMX monitoring for 'solr.jvm' (registry 'solr.jvm') enabled at server: com.sun.jmx.mbeanserver.JmxMBeanServer@342523bc
   [junit4]   2> 982090 INFO  (jetty-launcher-1937-thread-1) [n:127.0.0.1:34243_solr    ] o.a.s.m.r.SolrJmxReporter JMX monitoring for 'solr.jetty' (registry 'solr.jetty') enabled at server: com.sun.jmx.mbeanserver.JmxMBeanServer@342523bc
   [junit4]   2> 982091 INFO  (jetty-launcher-1937-thread-1) [n:127.0.0.1:34243_solr    ] o.a.s.c.CorePropertiesLocator Found 0 core definitions underneath /home/jenkins/workspace/Lucene-Solr-master-Linux/solr/build/solr-core/test/J1/temp/solr.cloud.api.collections.CollectionsAPIDistributedZkTest_47888F234334DAF3-001/tempDir-001/node1
   [junit4]   2> 982101 INFO  (jetty-launcher-1937-thread-3) [n:127.0.0.1:40105_solr    ] o.a.s.m.r.SolrJmxReporter JMX monitoring for 'solr.node' (registry 'solr.node') enabled at server: com.sun.jmx.mbeanserver.JmxMBeanServer@342523bc
   [junit4]   2> 982115 WARN  (jetty-launcher-1937-thread-1) [n:127.0.0.1:34243_solr    ] o.a.s.m.r.j.JmxMetricsReporter Unable to register gauge
   [junit4]   2> javax.management.InstanceNotFoundException: solr:dom1=jvm,name0=memory,name1=non-heap,name=usage
   [junit4]   2> 	at java.management/com.sun.jmx.interceptor.DefaultMBeanServerInterceptor.getMBean(DefaultMBeanServerInterceptor.java:1083)
   [junit4]   2> 	at java.management/com.sun.jmx.interceptor.DefaultMBeanServerInterceptor.exclusiveUnregisterMBean(DefaultMBeanServerInterceptor.java:423)
   [junit4]   2> 	at java.management/com.sun.jmx.interceptor.DefaultMBeanServerInterceptor.unregisterMBean(DefaultMBeanServerInterceptor.java:411)
   [junit4]   2> 	at java.management/com.sun.jmx.mbeanserver.JmxMBeanServer.unregisterMBean(JmxMBeanServer.java:546)
   [junit4]   2> 	at org.apache.solr.metrics.reporters.jmx.JmxMetricsReporter$JmxListener.registerMBean(JmxMetricsReporter.java:530)
   [junit4]   2> 	at org.apache.solr.metrics.reporters.jmx.JmxMetricsReporter$JmxListener.onGaugeAdded(JmxMetricsReporter.java:565)
   [junit4]   2> 	at com.codahale.metrics.MetricRegistry.notifyListenerOfAddedMetric(MetricRegistry.java:454)
   [junit4]   2> 	at com.codahale.metrics.MetricRegistry.onMetricAdded(MetricRegistry.java:448)
   [junit4]   2> 	at com.codahale.metrics.MetricRegistry.register(MetricRegistry.java:89)
   [junit4]   2> 	at org.apache.solr.metrics.SolrMetricManager.registerAll(SolrMetricManager.java:523)
   [junit4]   2> 	at org.apache.solr.servlet.SolrDispatchFilter.setupJvmMetrics(SolrDispatchFilter.java:214)
   [junit4]   2> 	at org.apache.solr.servlet.SolrDispatchFilter.init(SolrDispatchFilter.java:186)
   [junit4]   2> 	at org.eclipse.jetty.servlet.FilterHolder.initialize(FilterHolder.java:139)
   [junit4]   2> 	at org.eclipse.jetty.servlet.ServletHandler.initialize(ServletHandler.java:741)
   [junit4]   2> 	at org.eclipse.jetty.servlet.ServletHandler.updateMappings(ServletHandler.java:1474)
   [junit4]   2> 	at org.eclipse.jetty.servlet.ServletHandler.setFilterMappings(ServletHandler.java:1537)
   [junit4]   2> 	at org.eclipse.jetty.servlet.ServletHandler.addFilterMapping(ServletHandler.java:1183)
   [junit4]   2> 	at org.eclipse.jetty.servlet.ServletHandler.addFilterWithMapping(ServletHandler.java:1020)
   [junit4]   2> 	at org.eclipse.jetty.servlet.ServletContextHandler.addFilter(ServletContextHandler.java:447)
   [junit4]   2> 	at org.apache.solr.client.solrj.embedded.JettySolrRunner$1.lifeCycleStarted(JettySolrRunner.java:306)
   [junit4]   2> 	at org.eclipse.jetty.util.component.AbstractLifeCycle.setStarted(AbstractLifeCycle.java:179)
   [junit4]   2> 	at org.eclipse.jetty.util.component.AbstractLifeCycle.start(AbstractLifeCycle.java:69)
   [junit4]   2> 	at org.apache.solr.client.solrj.embedded.JettySolrRunner.start(JettySolrRunner.java:394)
   [junit4]   2> 	at org.apache.solr.client.solrj.embedded.JettySolrRunner.start(JettySolrRunner.java:367)
   [junit4]   2> 	at org.apache.solr.cloud.MiniSolrCloudCluster.startJettySolrRunner(MiniSolrCloudCluster.java:384)
   [junit4]   2> 	at org.apache.solr.cloud.MiniSolrCloudCluster.lambda$new$0(MiniSolrCloudCluster.java:247)
   [junit4]   2> 	at java.base/java.util.concurrent.FutureTask.run(FutureTask.java:264)
   [junit4]   2> 	at org.apache.solr.common.util.ExecutorUtil$MDCAwareThreadPoolExecutor.lambda$execute$0(ExecutorUtil.java:188)
   [junit4]   2> 	at java.base/java.util.concurrent.ThreadPoolExecutor.runWorker(ThreadPoolExecutor.java:1135)
   [junit4]   2> 	at java.base/java.util.concurrent.ThreadPoolExecutor$Worker.run(ThreadPoolExecutor.java:635)
   [junit4]   2> 	at java.base/java.lang.Thread.run(Thread.java:844)
   [junit4]   2> 982116 INFO  (jetty-launcher-1937-thread-3) [n:127.0.0.1:40105_solr    ] o.a.s.m.r.SolrJmxReporter JMX monitoring for 'solr.jvm' (registry 'solr.jvm') enabled at server: com.sun.jmx.mbeanserver.JmxMBeanServer@342523bc
   [junit4]   2> 982117 INFO  (jetty-launcher-1937-thread-3) [n:127.0.0.1:40105_solr    ] o.a.s.m.r.SolrJmxReporter JMX monitoring for 'solr.jetty' (registry 'solr.jetty') enabled at server: com.sun.jmx.mbeanserver.JmxMBeanServer@342523bc
   [junit4]   2> 982118 INFO  (jetty-launcher-1937-thread-3) [n:127.0.0.1:40105_solr    ] o.a.s.c.CorePropertiesLocator Found 0 core definitions underneath /home/jenkins/workspace/Lucene-Solr-master-Linux/solr/build/solr-core/test/J1/temp/solr.cloud.api.collections.CollectionsAPIDistributedZkTest_47888F234334DAF3-001/tempDir-001/node3
   [junit4]   2> 982156 INFO  (zkConnectionManagerCallback-1982-thread-1) [    ] o.a.s.c.c.ConnectionManager zkClient has connected
   [junit4]   2> 982161 INFO  (zkConnectionManagerCallback-1986-thread-1) [    ] o.a.s.c.c.ConnectionManager zkClient has connected
   [junit4]   2> 982162 INFO  (SUITE-CollectionsAPIDistributedZkTest-seed#[47888F234334DAF3]-worker) [    ] o.a.s.c.c.ZkStateReader Updated live nodes from ZooKeeper... (0) -> (4)
   [junit4]   2> 982162 INFO  (SUITE-CollectionsAPIDistributedZkTest-seed#[47888F234334DAF3]-worker) [    ] o.a.s.c.s.i.ZkClientClusterStateProvider Cluster at 127.0.0.1:46187/solr ready
   [junit4]   2> 982174 INFO  (TEST-CollectionsAPIDistributedZkTest.testZeroNumShards-seed#[47888F234334DAF3]) [    ] o.a.s.SolrTestCaseJ4 ###Starting testZeroNumShards
   [junit4]   2> 982175 INFO  (TEST-CollectionsAPIDistributedZkTest.testZeroNumShards-seed#[47888F234334DAF3]) [    ] o.a.s.c.c.ZkStateReader Updated live nodes from ZooKeeper... (0) -> (4)
   [junit4]   2> 982190 INFO  (qtp693360854-12748) [n:127.0.0.1:34243_solr    ] o.a.s.h.a.CollectionsHandler Invoked Collection Action :create with params replicationFactor=10&collection.configName=conf&name=acollection&action=CREATE&numShards=0&wt=javabin&version=2 and sendToOCPQueue=true
   [junit4]   2> 982193 INFO  (OverseerThreadFactory-4557-thread-1-processing-n:127.0.0.1:43495_solr) [n:127.0.0.1:43495_solr    ] o.a.s.c.a.c.CreateCollectionCmd Create collection acollection
   [junit4]   2> 982193 ERROR (OverseerThreadFactory-4557-thread-1-processing-n:127.0.0.1:43495_solr) [n:127.0.0.1:43495_solr    ] o.a.s.c.a.c.OverseerCollectionMessageHandler Collection: acollection operation: create failed:org.apache.solr.common.SolrException: numShards must be > 0
   [junit4]   2> 	at org.apache.solr.cloud.api.collections.CreateCollectionCmd.buildReplicaPositions(CreateCollectionCmd.java:285)
   [junit4]   2> 	at org.apache.solr.cloud.api.collections.CreateCollectionCmd.call(CreateCollectionCmd.java:121)
   [junit4]   2> 	at org.apache.solr.cloud.api.collections.OverseerCollectionMessageHandler.processMessage(OverseerCollectionMessageHandler.java:252)
   [junit4]   2> 	at org.apache.solr.cloud.OverseerTaskProcessor$Runner.run(OverseerTaskProcessor.java:469)
   [junit4]   2> 	at org.apache.solr.common.util.ExecutorUtil$MDCAwareThreadPoolExecutor.lambda$execute$0(ExecutorUtil.java:188)
   [junit4]   2> 	at java.base/java.util.concurrent.ThreadPoolExecutor.runWorker(ThreadPoolExecutor.java:1135)
   [junit4]   2> 	at java.base/java.util.concurrent.ThreadPoolExecutor$Worker.run(ThreadPoolExecutor.java:635)
   [junit4]   2> 	at java.base/java.lang.Thread.run(Thread.java:844)
   [junit4]   2> 
   [junit4]   2> 982195 INFO  (qtp693360854-12748) [n:127.0.0.1:34243_solr    ] o.a.s.s.HttpSolrCall [admin] webapp=null path=/admin/collections params={replicationFactor=10&collection.configName=conf&name=acollection&action=CREATE&numShards=0&wt=javabin&version=2} status=400 QTime=4
   [junit4]   2> 982195 INFO  (TEST-CollectionsAPIDistributedZkTest.testZeroNumShards-seed#[47888F234334DAF3]) [    ] o.a.s.SolrTestCaseJ4 ###Ending testZeroNumShards
   [junit4]   2> 982210 INFO  (TEST-CollectionsAPIDistributedZkTest.testCreateShouldFailOnExistingCore-seed#[47888F234334DAF3]) [    ] o.a.s.SolrTestCaseJ4 ###Starting testCreateShouldFailOnExistingCore
   [junit4]   2> 982210 INFO  (TEST-CollectionsAPIDistributedZkTest.testCreateShouldFailOnExistingCore-seed#[47888F234334DAF3]) [    ] o.a.s.c.c.ZkStateReader Updated live nodes from ZooKeeper... (0) -> (4)
   [junit4]   2> 982211 INFO  (qtp693360854-12756) [n:127.0.0.1:34243_solr    ] o.a.s.h.a.CollectionsHandler Invoked Collection Action :create with params replicationFactor=1&collection.configName=conf&name=halfcollectionblocker&nrtReplicas=1&action=CREATE&numShards=1&createNodeSet=&wt=javabin&version=2 and sendToOCPQueue=true
   [junit4]   2> 982217 INFO  (OverseerThreadFactory-4557-thread-2-processing-n:127.0.0.1:43495_solr) [n:127.0.0.1:43495_solr    ] o.a.s.c.a.c.CreateCollectionCmd Create collection halfcollectionblocker
   [junit4]   2> 982217 INFO  (OverseerCollectionConfigSetProcessor-99426198371237898-127.0.0.1:43495_solr-n_0000000000) [n:127.0.0.1:43495_solr    ] o.a.s.c.OverseerTaskQueue Response ZK path: /overseer/collection-queue-work/qnr-0000000000 doesn't exist.  Requestor may have disconnected from ZooKeeper
   [junit4]   2> 982217 WARN  (OverseerThreadFactory-4557-thread-2-processing-n:127.0.0.1:43495_solr) [n:127.0.0.1:43495_solr    ] o.a.s.c.a.c.CreateCollectionCmd It is unusual to create a collection (halfcollectionblocker) without cores.
   [junit4]   2> 982320 INFO  (qtp693360854-12756) [n:127.0.0.1:34243_solr    ] o.a.s.h.a.CollectionsHandler Wait for new collection to be active for at most 30 seconds. Check all shard replicas
   [junit4]   2> 982320 INFO  (qtp693360854-12756) [n:127.0.0.1:34243_solr    ] o.a.s.s.HttpSolrCall [admin] webapp=null path=/admin/collections params={replicationFactor=1&collection.configName=conf&name=halfcollectionblocker&nrtReplicas=1&action=CREATE&numShards=1&createNodeSet=&wt=javabin&version=2} status=0 QTime=109
   [junit4]   2> 982321 INFO  (qtp693360854-12748) [n:127.0.0.1:34243_solr    ] o.a.s.h.a.CollectionsHandler Invoked Collection Action :addreplica with params node=127.0.0.1:43495_solr&name=halfcollection_shard1_replica_n1&action=ADDREPLICA&collection=halfcollectionblocker&shard=shard1&type=NRT&wt=javabin&version=2 and sendToOCPQueue=true
   [junit4]   2> 982322 INFO  (OverseerCollectionConfigSetProcessor-99426198371237898-127.0.0.1:43495_solr-n_0000000000) [n:127.0.0.1:43495_solr    ] o.a.s.c.OverseerTaskQueue Response ZK path: /overseer/collection-queue-work/qnr-0000000002 doesn't exist.  Requestor may have disconnected from ZooKeeper
   [junit4]   2> 982322 INFO  (OverseerThreadFactory-4557-thread-3-processing-n:127.0.0.1:43495_solr) [n:127.0.0.1:43495_solr    ] o.a.s.c.a.c.AddReplicaCmd Node Identified 127.0.0.1:43495_solr for creating new replica
   [junit4]   2> 982323 INFO  (OverseerStateUpdate-99426198371237898-127.0.0.1:43495_solr-n_0000000000) [n:127.0.0.1:43495_solr    ] o.a.s.c.o.SliceMutator createReplica() {
   [junit4]   2>   "operation":"addreplica",
   [junit4]   2>   "collection":"halfcollectionblocker",
   [junit4]   2>   "shard":"shard1",
   [junit4]   2>   "core":"halfcollection_shard1_replica_n1",
   [junit4]   2>   "state":"down",
   [junit4]   2>   "base_url":"https://127.0.0.1:43495/solr",
   [junit4]   2>   "node_name":"127.0.0.1:43495_solr",
   [junit4]   2>   "type":"NRT"} 
   [junit4]   2> 982547 INFO  (qtp668179350-12745) [n:127.0.0.1:43495_solr    ] o.a.s.h.a.CoreAdminOperation core create command qt=/admin/cores&coreNodeName=core_node21&collection.configName=conf&name=halfcollection_shard1_replica_n1&action=CREATE&collection=halfcollectionblocker&shard=shard1&wt=javabin&version=2&replicaType=NRT
   [junit4]   2> 982548 INFO  (qtp668179350-12745) [n:127.0.0.1:43495_solr    ] o.a.s.c.TransientSolrCoreCacheDefault Allocating transient cache for 2147483647 transient cores
   [junit4]   2> 982571 INFO  (qtp668179350-12745) [n:127.0.0.1:43495_solr c:halfcollectionblocker s:shard1 r:core_node21 x:halfcollection_shard1_replica_n1] o.a.s.c.SolrConfig Using Lucene MatchVersion: 8.0.0
   [junit4]   2> 982577 INFO  (qtp668179350-12745) [n:127.0.0.1:43495_solr c:halfcollectionblocker s:shard1 r:core_node21 x:halfcollection_shard1_replica_n1] o.a.s.s.IndexSchema [halfcollection_shard1_replica_n1] Schema name=minimal
   [junit4]   2> 982580 INFO  (qtp668179350-12745) [n:127.0.0.1:43495_solr c:halfcollectionblocker s:shard1 r:core_node21 x:halfcollection_shard1_replica_n1] o.a.s.s.IndexSchema Loaded schema minimal/1.1 with uniqueid field id
   [junit4]   2> 982580 INFO  (qtp668179350-12745) [n:127.0.0.1:43495_solr c:halfcollectionblocker s:shard1 r:core_node21 x:halfcollection_shard1_replica_n1] o.a.s.c.CoreContainer Creating SolrCore 'halfcollection_shard1_replica_n1' using configuration from collection halfcollectionblocker, trusted=true
   [junit4]   2> 982581 INFO  (qtp668179350-12745) [n:127.0.0.1:43495_solr c:halfcollectionblocker s:shard1 r:core_node21 x:halfcollection_shard1_replica_n1] o.a.s.m.r.SolrJmxReporter JMX monitoring for 'solr.core.halfcollectionblocker.shard1.core_node21' (registry 'solr.core.halfcollectionblocker.shard1.core_node21') enabled at server: com.sun.jmx.mbeanserver.JmxMBeanServer@342523bc
   [junit4]   2> 982582 INFO  (qtp668179350-12745) [n:127.0.0.1:43495_solr c:halfcollectionblocker s:shard1 r:core_node21 x:halfcollection_shard1_replica_n1] o.a.s.c.SolrCore solr.RecoveryStrategy.Builder
   [junit4]   2> 982582 INFO  (qtp668179350-12745) [n:127.0.0.1:43495_solr c:halfcollectionblocker s:shard1 r:core_node21 x:halfcollection_shard1_replica_n1] o.a.s.c.SolrCore [[halfcollection_shard1_replica_n1] ] Opening new SolrCore at [/home/jenkins/workspace/Lucene-Solr-master-Linux/solr/build/solr-core/test/J1/temp/solr.cloud.api.collections.CollectionsAPIDistributedZkTest_47888F234334DAF3-001/tempDir-001/node4/halfcollection_shard1_replica_n1], dataDir=[/home/jenkins/workspace/Lucene-Solr-master-Linux/solr/build/solr-core/test/J1/temp/solr.cloud.api.collections.CollectionsAPIDistributedZkTest_47888F234334DAF3-001/tempDir-001/node4/halfcollection_shard1_replica_n1/data/]
   [junit4]   2> 982666 INFO  (zkCallback-1967-thread-2-processing-n:127.0.0.1:43495_solr) [n:127.0.0.1:43495_solr    ] o.a.s.c.c.ZkStateReader A cluster state change: [WatchedEvent state:SyncConnected type:NodeDataChanged path:/collections/halfcollectionblocker/state.json] for collection [halfcollectionblocker] has occurred - updating... (live nodes size: [4])
   [junit4]   2> 982666 INFO  (zkCallback-1967-thread-1-processing-n:127.0.0.1:43495_solr) [n:127.0.0.1:43495_solr    ] o.a.s.c.c.ZkStateReader A cluster state change: [WatchedEvent state:SyncConnected type:NodeDataChanged path:/collections/halfcollectionblocker/state.json] for collection [halfcollectionblocker] has occurred - updating... (live nodes size: [4])
   [junit4]   2> 982692 INFO  (qtp668179350-12745) [n:127.0.0.1:43495_solr c:halfcollectionblocker s:shard1 r:core_node21 x:halfcollection_shard1_replica_n1] o.a.s.u.UpdateHandler Using UpdateLog implementation: org.apache.solr.update.UpdateLog
   [junit4]   2> 982692 INFO  (qtp668179350-12745) [n:127.0.0.1:43495_solr c:halfcollectionblocker s:shard1 r:core_node21 x:halfcollection_shard1_replica_n1] o.a.s.u.UpdateLog Initializing UpdateLog: dataDir=null defaultSyncLevel=FLUSH numRecordsToKeep=100 maxNumLogsToKeep=10 numVersionBuckets=65536
   [junit4]   2> 982693 INFO  (qtp668179350-12745) [n:127.0.0.1:43495_solr c:halfcollectionblocker s:shard1 r:core_node21 x:halfcollection_shard1_replica_n1] o.a.s.u.CommitTracker Hard AutoCommit: disabled
   [junit4]   2> 982694 INFO  (qtp668179350-12745) [n:127.0.0.1:43495_solr c:halfcollectionblocker s:shard1 r:core_node21 x:halfcollection_shard1_replica_n1] o.a.s.u.CommitTracker Soft AutoCommit: disabled
   [junit4]   2> 982694 INFO  (qtp668179350-12745) [n:127.0.0.1:43495_solr c:halfcollectionblocker s:shard1 r:core_node21 x:halfcollection_shard1_replica_n1] o.a.s.s.SolrIndexSearcher Opening [Searcher@25dfa09d[halfcollection_shard1_replica_n1] main]
   [junit4]   2> 982695 INFO  (qtp668179350-12745) [n:127.0.0.1:43495_solr c:halfcollectionblocker s:shard1 r:core_node21 x:halfcollection_shard1_replica_n1] o.a.s.r.ManagedResourceStorage Configured ZooKeeperStorageIO with znodeBase: /configs/conf
   [junit4]   2> 982695 INFO  (qtp668179350-12745) [n:127.0.0.1:43495_solr c:halfcollectionblocker s:shard1 r:core_node21 x:halfcollection_shard1_replica_n1] o.a.s.r.ManagedResourceStorage Loaded null at path _rest_managed.json using ZooKeeperStorageIO:path=/configs/conf
   [junit4]   2> 982696 INFO  (qtp668179350-12745) [n:127.0.0.1:43495_solr c:halfcollectionblocker s:shard1 r:core_node21 x:halfcollection_shard1_replica_n1] o.a.s.h.ReplicationHandler Commits will be reserved for 10000ms.
   [junit4]   2> 982696 INFO  (searcherExecutor-4566-thread-1-processing-n:127.0.0.1:43495_solr x:halfcollection_shard1_replica_n1 s:shard1 c:halfcollectionblocker r:core_node21) [n:127.0.0.1:43495_solr c:halfcollectionblocker s:shard1 r:core_node21 x:halfcollection_shard1_replica_n1] o.a.s.c.SolrCore [halfcollection_shard1_replica_n1] Registered new searcher Searcher@25dfa09d[halfcollection_shard1_replica_n1] main{ExitableDirectoryReader(UninvertingDirectoryReader())}
   [junit4]   2> 982696 INFO  (qtp668179350-12745) [n:127.0.0.1:43495_solr c:halfcollectionblocker s:shard1 r:core_node21 x:halfcollection_shard1_replica_n1] o.a.s.u.UpdateLog Could not find max version in index or recent updates, using new clock 1590819174830047232
   [junit4]   2> 982701 INFO  (qtp668179350-12745) [n:127.0.0.1:43495_solr c:halfcollectionblocker s:shard1 r:core_node21 x:halfcollection_shard1_replica_n1] o.a.s.c.ShardLeaderElectionContext Enough replicas found to continue.
   [junit4]   2> 982701 INFO  (qtp668179350-12745) [n:127.0.0.1:43495_solr c:halfcollectionblocker s:shard1 r:core_node21 x:halfcollection_shard1_replica_n1] o.a.s.c.ShardLeaderElectionContext I may be the new leader - try and sync
   [junit4]   2> 982701 INFO  (qtp668179350-12745) [n:127.0.0.1:43495_solr c:halfcollectionblocker s:shard1 r:core_node21 x:halfcollection_shard1_replica_n1] o.a.s.c.SyncStrategy Sync replicas to https://127.0.0.1:43495/solr/halfcollection_shard1_replica_n1/
   [junit4]   2> 982701 INFO  (qtp668179350-12745) [n:127.0.0.1:43495_solr c:halfcollectionblocker s:shard1 r:core_node21 x:halfcollection_shard1_replica_n1] o.a.s.c.SyncStrategy Sync Success - now sync replicas to me
   [junit4]   2> 982701 INFO  (qtp668179350-12745) [n:127.0.0.1:43495_solr c:halfcollectionblocker s:shard1 r:core_node21 x:halfcollection_shard1_replica_n1] o.a.s.c.SyncStrategy https://127.0.0.1:43495/solr/halfcollection_shard1_replica_n1/ has no replicas
   [junit4]   2> 982701 INFO  (qtp668179350-12745) [n:127.0.0.1:43495_solr c:halfcollectionblocker s:shard1 r:core_node21 x:halfcollection_shard1_replica_n1] o.a.s.c.ShardLeaderElectionContext Found all replicas participating in election, clear LIR
   [junit4]   2> 982703 INFO  (qtp668179350-12745) [n:127.0.0.1:43495_solr c:halfcollectionblocker s:shard1 r:core_node21 x:halfcollection_shard1_replica_n1] o.a.s.c.ShardLeaderElectionContext I am the new leader: https://127.0.0.1:43495/solr/halfcollection_shard1_replica_n1/ shard1
   [junit4]   2> 982804 INFO  (zkCallback-1967-thread-3-processing-n:127.0.0.1:43495_solr) [n:127.0.0.1:43495_solr    ] o.a.s.c.c.ZkStateReader A cluster state change: [WatchedEvent state:SyncConnected type:NodeDataChanged path:/collections/halfcollectionblocker/state.json] for collection [halfcollectionblocker] has occurred - updating... (live nodes size: [4])
   [junit4]   2> 982804 INFO  (zkCallback-1967-thread-2-processing-n:127.0.0.1:43495_solr) [n:127.0.0.1:43495_solr    ] o.a.s.c.c.ZkStateReader A cluster state change: [WatchedEvent state:SyncConnected type:NodeDataChanged path:/collections/halfcollectionblocker/state.json] for collection [halfcollectionblocker] has occurred - updating... (live nodes size: [4])
   [junit4]   2> 982854 INFO  (qtp668179350-12745) [n:127.0.0.1:43495_solr c:halfcollectionblocker s:shard1 r:core_node21 x:halfcollection_shard1_replica_n1] o.a.s.c.ZkController I am the leader, no recovery necessary
   [junit4]   2> 982856 INFO  (qtp668179350-12745) [n:127.0.0.1:43495_solr c:halfcollectionblocker s:shard1 r:core_node21 x:halfcollection_shard1_replica_n1] o.a.s.s.HttpSolrCall [admin] webapp=null path=/admin/cores params={qt=/admin/cores&coreNodeName=core_node21&collection.configName=conf&name=halfcollection_shard1_replica_n1&action=CREATE&collection=halfcollectionblocker&shard=shard1&wt=javabin&version=2&replicaType=NRT} status=0 QTime=308
   [junit4]   2> 982859 INFO  (qtp693360854-12748) [n:127.0.0.1:34243_solr    ] o.a.s.s.HttpSolrCall [admin] webapp=null path=/admin/collections params={node=127.0.0.1:43495_solr&name=halfcollection_shard1_replica_n1&action=ADDREPLICA&collection=halfcollectionblocker&shard=shard1&type=NRT&wt=javabin&version=2} status=0 QTime=538
   [junit4]   2> 982860 INFO  (qtp693360854-12756) [n:127.0.0.1:34243_solr    ] o.a.s.h.a.CollectionsHandler Invoked Collection Action :create with params replicationFactor=1&collection.configName=conf&name=halfcollectionblocker2&nrtReplicas=1&action=CREATE&numShards=1&createNodeSet=&wt=javabin&version=2 and sendToOCPQueue=true
   [junit4]   2> 982865 INFO  (OverseerThreadFactory-4557-thread-4-processing-n:127.0.0.1:43495_solr) [n:127.0.0.1:43495_solr    ] o.a.s.c.a.c.CreateCollectionCmd Create collection halfcollectionblocker2
   [junit4]   2> 982866 INFO  (OverseerCollectionConfigSetProcessor-99426198371237898-127.0.0.1:43495_solr-n_0000000000) [n:127.0.0.1:43495_solr    ] o.a.s.c.OverseerTaskQueue Response ZK path: /overseer/collection-queue-work/qnr-0000000004 doesn't exist.  Requestor may have disconnected from ZooKeeper
   [junit4]   2> 982866 WARN  (OverseerThreadFactory-4557-thread-4-processing-n:127.0.0.1:43495_solr) [n:127.0.0.1:43495_solr    ] o.a.s.c.a.c.CreateCollectionCmd It is unusual to create a collection (halfcollectionblocker2) without cores.
   [junit4]   2> 982971 INFO  (zkCallback-1967-thread-2-processing-n:127.0.0.1:43495_solr) [n:127.0.0.1:43495_solr    ] o.a.s.c.c.ZkStateReader A cluster state change: [WatchedEvent state:SyncConnected type:NodeDataChanged path:/collections/halfcollectionblocker/state.json] for collection [halfcollectionblocker] has occurred - updating... (live nodes size: [4])
   [junit4]   2> 982971 INFO  (zkCallback-1967-thread-3-processing-n:127.0.0.1:43495_solr) [n:127.0.0.1:43495_solr    ] o.a.s.c.c.ZkStateReader A cluster state change: [WatchedEvent state:SyncConnected type:NodeDataChanged path:/collections/halfcollectionblocker/state.json] for collection [halfcollectionblocker] has occurred - updating... (live nodes size: [4])
   [junit4]   2> 983072 INFO  (qtp693360854-12756) [n:127.0.0.1:34243_solr    ] o.a.s.h.a.CollectionsHandler Wait for new collection to be active for at most 30 seconds. Check all shard replicas
   [junit4]   2> 983072 INFO  (qtp693360854-12756) [n:127.0.0.1:34243_solr    ] o.a.s.s.HttpSolrCall [admin] webapp=null path=/admin/collections params={replicationFactor=1&collection.configName=conf&name=halfcollectionblocker2&nrtReplicas=1&action=CREATE&numShards=1&createNodeSet=&wt=javabin&version=2} status=0 QTime=212
   [junit4]   2> 983073 INFO  (qtp693360854-12748) [n:127.0.0.1:34243_solr    ] o.a.s.h.a.CollectionsHandler Invoked Collection Action :addreplica with params node=127.0.0.1:37777_solr&name=halfcollection_shard1_replica_n1&action=ADDREPLICA&collection=halfcollectionblocker2&shard=shard1&type=NRT&wt=javabin&version=2 and sendToOCPQueue=true
   [junit4]   2> 983077 INFO  (OverseerCollectionConfigSetProcessor-99426198371237898-127.0.0.1:43495_solr-n_0000000000) [n:127.0.0.1:43495_solr    ] o.a.s.c.OverseerTaskQueue Response ZK path: /overseer/collection-queue-work/qnr-0000000006 doesn't exist.  Requestor may have disconnected from ZooKeeper
   [junit4]   2> 983079 INFO  (OverseerThreadFactory-4557-thread-5-processing-n:127.0.0.1:43495_solr) [n:127.0.0.1:43495_solr    ] o.a.s.c.a.c.AddReplicaCmd Node Identified 127.0.0.1:37777_solr for creating new replica
   [junit4]   2> 983083 INFO  (OverseerStateUpdate-99426198371237898-127.0.0.1:43495_solr-n_0000000000) [n:127.0.0.1:43495_solr    ] o.a.s.c.o.SliceMutator createReplica() {
   [junit4]   2>   "operation":"addreplica",
   [junit4]   2>   "collection":"halfcollectionblocker2",
   [junit4]   2>   "shard":"shard1",
   [junit4]   2>   "core":"halfcollection_shard1_replica_n1",
   [junit4]   2>   "state":"down",
   [junit4]   2>   "base_url":"https://127.0.0.1:37777/solr",
   [junit4]   2>   "node_name":"127.0.0.1:37777_solr",
   [junit4]   2>   "type":"NRT"} 
   [junit4]   2> 983310 INFO  (qtp1722477196-12755) [n:127.0.0.1:37777_solr    ] o.a.s.h.a.CoreAdminOperation core create command qt=/admin/cores&coreNodeName=core_node21&collection.configName=conf&name=halfcollection_shard1_replica_n1&action=CREATE&collection=halfcollectionblocker2&shard=shard1&wt=javabin&version=2&replicaType=NRT
   [junit4]   2> 983311 INFO  (qtp1722477196-12755) [n:127.0.0.1:37777_solr    ] o.a.s.c.TransientSolrCoreCacheDefault Allocating transient cache for 2147483647 transient cores
   [junit4]   2> 983320 INFO  (qtp1722477196-12755) [n:127.0.0.1:37777_solr c:halfcollectionblocker2 s:shard1 r:core_node21 x:halfcollection_shard1_replica_n1] o.a.s.c.SolrConfig Using Lucene MatchVersion: 8.0.0
   [junit4]   2> 983342 INFO  (qtp1722477196-12755) [n:127.0.0.1:37777_solr c:halfcollectionblocker2 s:shard1 r:core_node21 x:halfcollection_shard1_replica_n1] o.a.s.s.IndexSchema [halfcollection_shard1_replica_n1] Schema name=minimal
   [junit4]   2> 983344 INFO  (qtp1722477196-12755) [n:127.0.0.1:37777_solr c:halfcollectionblocker2 s:shard1 r:core_node21 x:halfcollection_shard1_replica_n1] o.a.s.s.IndexSchema Loaded schema minimal/1.1 with uniqueid field id
   [junit4]   2> 983344 INFO  (qtp1722477196-12755) [n:127.0.0.1:37777_solr c:halfcollectionblocker2 s:shard1 r:core_node21 x:halfcollection_shard1_replica_n1] o.a.s.c.CoreContainer Creating SolrCore 'halfcollection_shard1_replica_n1' using configuration from collection halfcollectionblocker2, trusted=true
   [junit4]   2> 983344 INFO  (qtp1722477196-12755) [n:127.0.0.1:37777_solr c:halfcollectionblocker2 s:shard1 r:core_node21 x:halfcollection_shard1_replica_n1] o.a.s.m.r.SolrJmxReporter JMX monitoring for 'solr.core.halfcollectionblocker2.shard1.core_node21' (registry 'solr.core.halfcollectionblocker2.shard1.core_node21') enabled at server: com.sun.jmx.mbeanserver.JmxMBeanServer@342523bc
   [junit4]   2> 983344 INFO  (qtp1722477196-12755) [n:127.0.0.1:37777_solr c:halfcollectionblocker2 s:shard1 r:core_node21 x:halfcollection_shard1_replica_n1] o.a.s.c.SolrCore solr.RecoveryStrategy.Builder
   [junit4]   2> 983344 INFO  (qtp1722477196-12755) [n:127.0.0.1:37777_solr c:halfcollectionblocker2 s:shard1 r:core_node21 x:halfcollection_shard1_replica_n1] o.a.s.c.SolrCore [[halfcollection_shard1_replica_n1] ] Opening new SolrCore at [/home/jenkins/workspace/Lucene-Solr-master-Linux/solr/build/solr-core/test/J1/temp/solr.cloud.api.collections.CollectionsAPIDistributedZkTest_47888F234334DAF3-001/tempDir-001/node2/halfcollection_shard1_replica_n1], dataDir=[/home/jenkins/workspace/Lucene-Solr-master-Linux/solr/build/solr-core/test/J1/temp/solr.cloud.api.collections.CollectionsAPIDistributedZkTest_47888F234334DAF3-001/tempDir-001/node2/halfcollection_shard1_replica_n1/data/]
   [junit4]   2> 983413 INFO  (qtp1722477196-12755) [n:127.0.0.1:37777_solr c:halfcollectionblocker2 s:shard1 r:core_node21 x:halfcollection_shard1_replica_n1] o.a.s.u.UpdateHandler Using UpdateLog implementation: org.apache.solr.update.UpdateLog
   [junit4]   2> 983413 INFO  (qtp1722477196-12755) [n:127.0.0.1:37777_solr c:halfcollectionblocker2 s:shard1 r:core_node21 x:halfcollection_shard1_replica_n1] o.a.s.u.UpdateLog Initializing UpdateLog: dataDir=null defaultSyncLevel=FLUSH numRecordsToKeep=100 maxNumLogsToKeep=10 numVersionBuckets=65536
   [junit4]   2> 983415 INFO  (zkCallback-1972-thread-1-processing-n:127.0.0.1:37777_solr) [n:127.0.0.1:37777_solr    ] o.a.s.c.c.ZkStateReader A cluster state change: [WatchedEvent state:SyncConnected type:NodeDataChanged path:/collections/halfcollectionblocker2/state.json] for collection [halfcollectionblocker2] has occurred - updating... (live nodes size: [4])
   [junit4]   2> 983416 INFO  (qtp1722477196-12755) [n:127.0.0.1:37777_solr c:halfcollectionblocker2 s:shard1 r:core_node21 x:halfcollection_shard1_replica_n1] o.a.s.u.CommitTracker Hard AutoCommit: disabled
   [junit4]   2> 983416 INFO  (qtp1722477196-12755) [n:127.0.0.1:37777_solr c:halfcollectionblocker2 s:shard1 r:core_node21 x:halfcollection_shard1_replica_n1] o.a.s.u.CommitTracker Soft AutoCommit: disabled
   [junit4]   2> 983418 INFO  (qtp1722477196-12755) [n:127.0.0.1:37777_solr c:halfcollectionblocker2 s:shard1 r:core_node21 x:halfcollection_shard1_replica_n1] o.a.s.s.SolrIndexSearcher Opening [Searcher@2e50255a[halfcollection_shard1_replica_n1] main]
   [junit4]   2> 983419 INFO  (qtp1722477196-12755) [n:127.0.0.1:37777_solr c:halfcollectionblocker2 s:shard1 r:core_node21 x:halfcollection_shard1_replica_n1] o.a.s.r.ManagedResourceStorage Configured ZooKeeperStorageIO with znodeBase: /configs/conf
   [junit4]   2> 983419 INFO  (qtp1722477196-12755) [n:127.0.0.1:37777_solr c:halfcollectionblocker2 s:shard1 r:core_node21 x:halfcollection_shard1_replica_n1] o.a.s.r.ManagedResourceStorage Loaded null at path _rest_managed.json using ZooKeeperStorageIO:path=/configs/conf
   [junit4]   2> 983420 INFO  (qtp1722477196-12755) [n:127.0.0.1:37777_solr c:halfcollectionblocker2 s:shard1 r:core_node21 x:halfcollection_shard1_replica_n1] o.a.s.h.ReplicationHandler Commits will be reserved for 10000ms.
   [junit4]   2> 983421 INFO  (searcherExecutor-4571-thread-1-processing-n:127.0.0.1:37777_solr x:halfcollection_shard1_replica_n1 s:shard1 c:halfcollectionblocker2 r:core_node21) [n:127.0.0.1:37777_solr c:halfcollectionblocker2 s:shard1 r:core_node21 x:halfcollection_shard1_replica_n1] o.a.s.c.SolrCore [halfcollection_shard1_replica_n1] Registered new searcher Searcher@2e50255a[halfcollection_shard1_replica_n1] main{ExitableDirectoryReader(UninvertingDirectoryReader())}
   [junit4]   2> 983421 INFO  (qtp1722477196-12755) [n:127.0.0.1:37777_solr c:halfcollectionblocker2 s:shard1 r:core_node21 x:halfcollection_shard1_replica_n1] o.a.s.u.UpdateLog Could not find max version in index or recent updates, using new clock 1590819175590264832
   [junit4]   2> 983421 INFO  (zkCallback-1972-thread-2-processing-n:127.0.0.1:37777_solr) [n:127.0.0.1:37777_solr    ] o.a.s.c.c.ZkStateReader A cluster state change: [WatchedEvent state:SyncConnected type:NodeDataChanged path:/collections/halfcollectionblocker2/state.json] for collection [halfcollectionblocker2] has occurred - updating... (live nodes size: [4])
   [junit4]   2> 983427 INFO  (qtp1722477196-12755) [n:127.0.0.1:37777_solr c:halfcollectionblocker2 s:shard1 r:core_node21 x:halfcollection_shard1_replica_n1] o.a.s.c.ShardLeaderElectionContext Enough replicas found to continue.
   [junit4]   2> 983428 INFO  (qtp1722477196-12755) [n:127.0.0.1:37777_solr c:halfcollectionblocker2 s:shard1 r:core_node21 x:halfcollection_shard1_replica_n1] o.a.s.c.ShardLeaderElectionContext I may be the new leader - try and sync
   [junit4]   2> 983428 INFO  (qtp1722477196-12755) [n:127.0.0.1:37777_solr c:halfcollectionblocker2 s:shard1 r:core_node21 x:halfcollection_shard1_replica_n1] o.a.s.c.SyncStrategy Sync replicas to https://127.0.0.1:37777/solr/halfcollection_shard1_replica_n1/
   [junit4]   2> 983428 INFO  (qtp1722477196-12755) [n:127.0.0.1:37777_solr c:halfcollectionblocker2 s:shard1 r:core_node21 x:halfcollection_shard1_replica_n1] o.a.s.c.SyncStrategy Sync Success - now sync replicas to me
   [junit4]   2> 983428 INFO  (qtp1722477196-12755) [n:127.0.0.1:37777_solr c:halfcollectionblocker2 s:shard1 r:core_node21 x:halfcollection_shard1_replica_n1] o.a.s.c.SyncStrategy https://127.0.0.1:37777/solr/halfcollection_shard1_replica_n1/ has no replicas
   [junit4]   2> 983428 INFO  (qtp1722477196-12755) [n:127.0.0.1:37777_solr c:halfcollectionblocker2 s:shard1 r:core_node21 x:halfcollection_shard1_replica_n1] o.a.s.c.ShardLeaderElectionContext Found all replicas participating in election, clear LIR
   [junit4]   2> 983430 INFO  (qtp1722477196-12755) [n:127.0.0.1:37777_solr c:halfcollectionblocker2 s:shard1 r:core_node21 x:halfcollection_shard1_replica_n1] o.a.s.c.ShardLeaderElectionContext I am the new leader: https://127.0.0.1:37777/solr/halfcollection_shard1_replica_n1/ shard1
   [junit4]   2> 983532 INFO  (zkCallback-1972-thread-2-processing-n:127.0.0.1:37777_solr) [n:127.0.0.1:37777_solr    ] o.a.s.c.c.ZkStateReader A cluster state change: [WatchedEvent state:SyncConnected type:NodeDataChanged path:/collections/halfcollectionblocker2/state.json] for collection [halfcollectionblocker2] has occurred - updating... (live nodes size: [4])
   [junit4]   2> 983532 INFO  (zkCallback-1972-thread-1-processing-n:127.0.0.1:37777_solr) [n:127.0.0.1:37777_solr    ] o.a.s.c.c.ZkStateReader A cluster state change: [WatchedEvent state:SyncConnected type:NodeDataChanged path:/collections/halfcollectionblocker2/state.json] for collection [halfcollectionblocker2] has occurred - updating... (live nodes size: [4])
   [junit4]   2> 983581 INFO  (qtp1722477196-12755) [n:127.0.0.1:37777_solr c:halfcollectionblocker2 s:shard1 r:core_node21 x:halfcollection_shard1_replica_n1] o.a.s.c.ZkController I am the leader, no recovery necessary
   [junit4]   2> 983624 INFO  (qtp1722477196-12755) [n:127.0.0.1:37777_solr c:halfcollectionblocker2 s:shard1 r:core_node21 x:halfcollection_shard1_replica_n1] o.a.s.s.HttpSolrCall [admin] webapp=null path=/admin/cores params={qt=/admin/cores&coreNodeName=core_node21&collection.configName=conf&name=halfcollection_shard1_replica_n1&action=CREATE&collection=halfcollectionblocker2&shard=shard1&wt=javabin&version=2&replicaType=NRT} status=0 QTime=314
   [junit4]   2> 983627 INFO  (qtp693360854-12748) [n:127.0.0.1:34243_solr    ] o.a.s.s.HttpSolrCall [admin] webapp=null path=/admin/collections params={node=127.0.0.1:37777_solr&name=halfcollection_shard1_replica_n1&action=ADDREPLICA&collection=halfcollectionblocker2&shard=shard1&type=NRT&wt=javabin&version=2} status=0 QTime=553
   [junit4]   2> 983627 INFO  (qtp693360854-12756) [n:127.0.0.1:34243_solr    ] o.a.s.h.a.CollectionsHandler Invoked Collection Action :create with params replicationFactor=1&collection.configName=conf&name=halfcollection&nrtReplicas=1&action=CREATE&numShards=2&createNodeSet=127.0.0.1:43495_solr,127.0.0.1:37777_solr&wt=javabin&version=2 and sendToOCPQueue=true
   [junit4]   2> 983628 INFO  (OverseerThreadFactory-4557-thread-5-processing-n:127.0.0.1:43495_solr) [n:127.0.0.1:43495_solr    ] o.a.s.c.a.c.CreateCollectionCmd Create collection halfcollection
   [junit4]   2> 983628 INFO  (OverseerCollectionConfigSetProcessor-99426198371237898-127.0.0.1:43495_solr-n_0000000000) [n:127.0.0.1:43495_solr    ] o.a.s.c.OverseerTaskQueue Response ZK path: /overseer/collection-queue-work/qnr-0000000008 doesn't exist.  Requestor may have disconnected from ZooKeeper
   [junit4]   2> 983738 INFO  (zkCallback-1972-thread-2-processing-n:127.0.0.1:37777_solr) [n:127.0.0.1:37777_solr    ] o.a.s.c.c.ZkStateReader A cluster state change: [WatchedEvent state:SyncConnected type:NodeDataChanged path:/collections/halfcollectionblocker2/state.json] for collection [halfcollectionblocker2] has occurred - updating... (live nodes size: [4])
   [junit4]   2> 983738 INFO  (zkCallback-1972-thread-1-processing-n:127.0.0.1:37777_solr) [n:127.0.0.1:37777_solr    ] o.a.s.c.c.ZkStateReader A cluster state change: [WatchedEvent state:SyncConnected type:NodeDataChanged path:/collections/halfcollectionblocker2/state.json] for collection [halfcollectionblocker2] has occurred - updating... (live nodes size: [4])
   [junit4]   2> 983834 INFO  (OverseerStateUpdate-99426198371237898-127.0.0.1:43495_solr-n_0000000000) [n:127.0.0.1:43495_solr    ] o.a.s.c.o.SliceMutator createReplica() {
   [junit4]   2>   "operation":"ADDREPLICA",
   [junit4]   2>   "collection":"halfcollection",
   [junit4]   2>   "shard":"shard1",
   [junit4]   2>   "core":"halfcollection_shard1_replica_n1",
   [junit4]   2>   "state":"down",
   [junit4]   2>   "base_url":"https://127.0.0.1:37777/solr",
   [junit4]   2>   "type":"NRT",
   [junit4]   2>   "waitForFinalState":"false"} 
   [junit4]   2> 983837 INFO  (OverseerStateUpdate-99426198371237898-127.0.0.1:43495_solr-n_0000000000) [n:127.0.0.1:43495_solr    ] o.a.s.c.o.SliceMutator createReplica() {
   [junit4]   2>   "operation":"ADDREPLICA",
   [junit4]   2>   "collection":"halfcollection",
   [junit4]   2>   "shard":"shard2",
   [junit4]   2>   "core":"halfcollection_shard2_replica_n2",
   [junit4]   2>   "state":"down",
   [junit4]   2>   "base_url":"https://127.0.0.1:43495/solr",
   [junit4]   2>   "type":"NRT",
   [junit4]   2>   "waitForFinalState":"false"} 
   [junit4]   2> 984053 INFO  (qtp1722477196-12751) [n:127.0.0.1:37777_solr    ] o.a.s.h.a.CoreAdminOperation core create command qt=/admin/cores&coreNodeName=core_node3&collection.configName=conf&newCollection=true&name=halfcollection_shard1_replica_n1&action=CREATE&numShards=2&collection=halfcollection&shard=shard1&wt=javabin&version=2&replicaType=NRT
   [junit4]   2> 984054 INFO  (qtp668179350-12749) [n:127.0.0.1:43495_solr    ] o.a.s.h.a.CoreAdminOperation core create command qt=/admin/cores&coreNodeName=core_node4&collection.configName=conf&newCollection=true&name=halfcollection_shard2_replica_n2&action=CREATE&numShards=2&collection=halfcollection&shard=shard2&wt=javabin&version=2&replicaType=NRT
   [junit4]   2> 984054 WARN  (qtp1722477196-12751) [n:127.0.0.1:37777_solr    ] o.a.s.c.CoreContainer Creating a core with existing name is not allowed
   [junit4]   2> 984054 ERROR (qtp1722477196-12751) [n:127.0.0.1:37777_solr    ] o.a.s.h.RequestHandlerBase org.apache.solr.common.SolrException: Core with name 'halfcollection_shard1_replica_n1' already exists.
   [junit4]   2> 	at org.apache.solr.core.CoreContainer.create(CoreContainer.java:932)
   [junit4]   2> 	at org.apache.solr.handler.admin.CoreAdminOperation.lambda$static$0(CoreAdminOperation.java:91)
   [junit4]   2> 	at org.apache.solr.handler.admin.CoreAdminOperation.execute(CoreAdminOperation.java:384)
   [junit4]   2> 	at org.apache.solr.handler.admin.CoreAdminHandler$CallInfo.call(CoreAdminHandler.java:389)
   [junit4]   2> 	at org.apache.solr.handler.admin.CoreAdminHandler.handleRequestBody(CoreAdminHandler.java:174)
   [junit4]   2> 	at org.apache.solr.handler.RequestHandlerBase.handleRequest(RequestHandlerBase.java:177)
   [junit4]   2> 	at org.apache.solr.servlet.HttpSolrCall.handleAdmin(HttpSolrCall.java:736)
   [junit4]   2> 	at org.apache.solr.servlet.HttpSolrCall.handleAdminRequest(HttpSolrCall.java:717)
   [junit4]   2> 	at org.apache.solr.servlet.HttpSolrCall.call(HttpSolrCall.java:498)
   [junit4]   2> 	at org.apache.solr.servlet.SolrDispatchFilter.doFilter(SolrDispatchFilter.java:380)
   [junit4]   2> 	at org.apache.solr.servlet.SolrDispatchFilter.doFilter(SolrDispatchFilter.java:326)
   [junit4]   2> 	at org.eclipse.jetty.servlet.ServletHandler$CachedChain.doFilter(ServletHandler.java:1637)
   [junit4]   2> 	at org.apache.solr.client.solrj.embedded.JettySolrRunner$DebugFilter.doFilter(JettySolrRunner.java:139)
   [junit4]   2> 	at org.eclipse.jetty.servlet.ServletHandler$CachedChain.doFilter(ServletHandler.java:1637)
   [junit4]   2> 	at org.eclipse.jetty.servlet.ServletHandler.doHandle(ServletHandler.java:533)
   [junit4]   2> 	at org.eclipse.jetty.server.handler.ScopedHandler.nextHandle(ScopedHandler.java:188)
   [junit4]   2> 	at org.eclipse.jetty.server.session.SessionHandler.doHandle(SessionHandler.java:1595)
   [junit4]   2> 	at org.eclipse.jetty.server.handler.ScopedHandler.nextHandle(ScopedHandler.java:188)
   [junit4]   2> 	at org.eclipse.jetty.server.handler.ContextHandler.doHandle(ContextHandler.java:1253)
   [junit4]   2> 	at org.eclipse.jetty.server.handler.ScopedHandler.nextScope(ScopedHandler.java:168)
   [junit4]   2> 	at org.eclipse.jetty.servlet.ServletHandler.doScope(ServletHandler.java:473)
   [junit4]   2> 	at org.eclipse.jetty.server.session.SessionHandler.doScope(SessionHandler.java:1564)
   [junit4]   2> 	at org.eclipse.jetty.server.handler.ScopedHandler.nextScope(ScopedHandler.java:166)
   [junit4]   2> 	at org.eclipse.jetty.server.handler.ContextHandler.doScope(ContextHandler.java:1155)
   [junit4]   2> 	at org.eclipse.jetty.server.handler.ScopedHandler.handle(ScopedHandler.java:141)
   [junit4]   2> 	at org.eclipse.jetty.server.handler.gzip.GzipHandler.handle(GzipHandler.java:455)
   [junit4]   2> 	at org.eclipse.jetty.server.handler.HandlerWrapper.handle(HandlerWrapper.java:132)
   [junit4]   2> 	at org.eclipse.jetty.server.Server.handle(Server.java:530)
   [junit4]   2> 	at org.eclipse.jetty.server.HttpChannel.handle(HttpChannel.java:347)
   [junit4]   2> 	at org.eclipse.jetty.server.HttpConnection.onFillable(HttpConnection.java:256)
   [junit4]   2> 	at org.eclipse.jetty.io.AbstractConnection$ReadCallback.succeeded(AbstractConnection.java:279)
   [junit4]   2> 	at org.eclipse.jetty.io.FillInterest.fillable(FillInterest.java:102)
   [junit4]   2> 	at org.eclipse.jetty.io.ssl.SslConnection.onFillable(SslConnection.java:289)
   [junit4]   2> 	at org.eclipse.jetty.io.ssl.SslConnection$3.succeeded(SslConnection.java:149)
   [junit4]   2> 	at org.eclipse.jetty.io.FillInterest.fillable(FillInterest.java:102)
   [junit4]   2> 	at org.eclipse.jetty.io.ChannelEndPoint$2.run(ChannelEndPoint.java:124)
   [junit4]   2> 	at org.eclipse.jetty.util.thread.strategy.EatWhatYouKill.doProduce(EatWhatYouKill.java:247)
   [junit4]   2> 	at org.eclipse.jetty.util.thread.strategy.EatWhatYouKill.produce(EatWhatYouKill.java:140)
   [junit4]   2> 	at org.eclipse.jetty.util.thread.strategy.EatWhatYouKill.run(EatWhatYouKill.java:131)
   [junit4]   2> 	at org.eclipse.jetty.util.thread.ReservedThreadExecutor$ReservedThread.run(ReservedThreadExecutor.java:382)
   [junit4]   2> 	at org.eclipse.jetty.util.thread.QueuedThreadPool.runJob(QueuedThreadPool.java:708)
   [junit4]   2> 	at org.eclipse.jetty.util.thread.QueuedThreadPool$2.run(QueuedThreadPool.java:626)
   [junit4]   2> 	at java.base/java.lang.Thread.run(Thread.java:844)
   [junit4]   2> 
   [junit4]   2> 984055 INFO  (qtp1722477196-12751) [n:127.0.0.1:37777_solr    ] o.a.s.s.HttpSolrCall [admin] webapp=null path=/admin/cores params={qt=/admin/cores&coreNodeName=core_node3&collection.configName=conf&newCollection=true&name=halfcollection_shard1_replica_n1&action=CREATE&numShards=2&collection=halfcollection&shard=shard1&wt=javabin&version=2&replicaType=NRT} status=500 QTime=1
   [junit4]   2> 984055 ERROR (qtp1722477196-12751) [n:127.0.0.1:37777_solr    ] o.a.s.s.HttpSolrCall null:org.apache.solr.common.SolrException: Core with name 'halfcollection_shard1_replica_n1' already exists.
   [junit4]   2> 	at org.apache.solr.core.CoreContainer.create(CoreContainer.java:932)
   [junit4]   2> 	at org.apache.solr.handler.admin.CoreAdminOperation.lambda$static$0(CoreAdminOperation.java:91)
   [junit4]   2> 	at org.apache.solr.handler.admin.CoreAdminOperation.execute(CoreAdminOperation.java:384)
   [junit4]   2> 	at org.apache.solr.handler.admin.CoreAdminHandler$CallInfo.call(CoreAdminHandler.java:389)
   [junit4]   2> 	at org.apache.solr.handler.admin.CoreAdminHandler.handleRequestBody(CoreAdminHandler.java:174)
   [junit4]   2> 	at org.apache.solr.handler.RequestHandlerBase.handleRequest(RequestHandlerBase.java:177)
   [junit4]   2> 	at org.apache.solr.servlet.HttpSolrCall.handleAdmin(HttpSolrCall.java:736)
   [junit4]   2> 	at org.apache.solr.servlet.HttpSolrCall.handleAdminRequest(HttpSolrCall.java:717)
   [junit4]   2> 	at org.apache.solr.servlet.HttpSolrCall.call(HttpSolrCall.java:498)
   [junit4]   2> 	at org.apache.solr.servlet.SolrDispatchFilter.doFilter(SolrDispatchFilter.java:380)
   [junit4]   2> 	at org.apache.solr.servlet.SolrDispatchFilter.doFilter(SolrDispatchFilter.java:326)
   [junit4]   2> 	at org.eclipse.jetty.servlet.ServletHandler$CachedChain.doFilter(ServletHandler.java:1637)
   [junit4]   2> 	at org.apache.solr.client.solrj.embedded.JettySolrRunner$DebugFilter.doFilter(JettySolrRunner.java:139)
   [junit4]   2> 	at org.eclipse.jetty.servlet.ServletHandler$CachedChain.doFilter(ServletHandler.java:1637)
   [junit4]   2> 	at org.eclipse.jetty.servlet.ServletHandler.doHandle(ServletHandler.java:533)
   [junit4]   2> 	at org.eclipse.jetty.server.handler.ScopedHandler.nextHandle(ScopedHandler.java:188)
   [junit4]   2> 	at org.eclipse.jetty.server.session.SessionHandler.doHandle(SessionHandler.java:1595)
   [junit4]   2> 	at org.eclipse.jetty.server.handler.ScopedHandler.nextHandle(ScopedHandler.java:188)
   [junit4]   2> 	at org.eclipse.jetty.server.handler.ContextHandler.doHandle(ContextHandler.java:1253)
   [junit4]   2> 	at org.eclipse.jetty.server.handler.ScopedHandler.nextScope(ScopedHandler.java:168)
   [junit4]   2> 	at org.eclipse.jetty.servlet.ServletHandler.doScope(ServletHandler.java:473)
   [junit4]   2> 	at org.eclipse.jetty.server.session.SessionHandler.doScope(SessionHandler.java:1564)
   [junit4]   2> 	at org.eclipse.jetty.server.handler.ScopedHandler.nextScope(ScopedHandler.java:166)
   [junit4]   2> 	at org.eclipse.jetty.server.handler.ContextHandler.doScope(ContextHandler.java:1155)
   [junit4]   2> 	at org.eclipse.jetty.server.handler.ScopedHandler.handle(ScopedHandler.java:141)
   [junit4]   2> 	at org.eclipse.jetty.server.handler.gzip.GzipHandler.handle(GzipHandler.java:455)
   [junit4]   2> 	at org.eclipse.jetty.server.handler.HandlerWrapper.handle(HandlerWrapper.java:132)
   [junit4]   2> 	at org.eclipse.jetty.server.Server.handle(Server.java:530)
   [junit4]   2> 	at org.eclipse.jetty.server.HttpChannel.handle(HttpChannel.java:347)
   [junit4]   2> 	at org.eclipse.jetty.server.HttpConnection.onFillable(HttpConnection.java:256)
   [junit4]   2> 	at org.eclipse.jetty.io.AbstractConnection$ReadCallback.succeeded(AbstractConnection.java:279)
   [junit4]   2> 	at org.eclipse.jetty.io.FillInterest.fillable(FillInterest.java:102)
   [junit4]   2> 	at org.eclipse.jetty.io.ssl.SslConnection.onFillable(SslConnection.java:289)
   [junit4]   2> 	at org.eclipse.jetty.io.ssl.SslConnection$3.succeeded(SslConnection.java:149)
   [junit4]   2> 	at org.eclipse.jetty.io.FillInterest.fillable(FillInterest.java:102)
   [junit4]   2> 	at org.eclipse.jetty.io.ChannelEndPoint$2.run(ChannelEndPoint.java:124)
   [junit4]   2> 	at org.eclipse.jetty.util.thread.strategy.EatWhatYouKill.doProduce(EatWhatYouKill.java:247)
   [junit4]   2> 	at org.eclipse.jetty.util.thread.strategy.EatWhatYouKill.produce(EatWhatYouKill.java:140)
   [junit4]   2> 	at org.eclipse.jetty.util.thread.strategy.EatWhatYouKill.run(EatWhatYouKill.java:131)
   [junit4]   2> 	at org.eclipse.jetty.util.thread.ReservedThreadExecutor$ReservedThread.run(ReservedThreadExecutor.java:382)
   [junit4]   2> 	at org.eclipse.jetty.util.thread.QueuedThreadPool.runJob(QueuedThreadPool.java:708)
   [junit4]   2> 	at org.eclipse.jetty.util.thread.QueuedThreadPool$2.run(QueuedThreadPool.java:626)
   [junit4]   2> 	at java.base/java.lang.Thread.run(Thread.java:844)
   [junit4]   2> 
   [junit4]   2> 984055 ERROR (OverseerThreadFactory-4557-thread-5-processing-n:127.0.0.1:43495_solr) [n:127.0.0.1:43495_solr    ] o.a.s.c.a.c.OverseerCollectionMessageHandler Error from shard: https://127.0.0.1:37777/solr
   [junit4]   2> org.apache.solr.client.solrj.impl.HttpSolrClient$RemoteSolrException: Error from server at https://127.0.0.1:37777/solr: Core with name 'halfcollection_shard1_replica_n1' already exists.
   [junit4]   2> 	at org.apache.solr.client.solrj.impl.HttpSolrClient.executeMethod(HttpSolrClient.java:643)
   [junit4]   2> 	at org.apache.solr.client.solrj.impl.HttpSolrClient.request(HttpSolrClient.java:255)
   [junit4]   2> 	at org.apache.solr.client.solrj.impl.HttpSolrClient.request(HttpSolrClient.java:244)
   [junit4]   2> 	at org.apache.solr.client.solrj.SolrClient.request(SolrClient.java:1219)
   [junit4]   2> 	at org.apache.solr.handler.component.HttpShardHandler.lambda$submit$0(HttpShardHandler.java:172)
   [junit4]   2> 	at java.base/java.util.concurrent.FutureTask.run(FutureTask.java:264)
   [junit4]   2> 	at java.base/java.util.concurrent.Executors$RunnableAdapter.call(Executors.java:514)
   [junit4]   2> 	at java.base/java.util.concurrent.FutureTask.run(FutureTask.java:264)
   [junit4]   2> 	at com.codahale.metrics.InstrumentedExecutorService$InstrumentedRunnable.run(InstrumentedExecutorService.java:176)
   [junit4]   2> 	at org.apache.solr.common.util.ExecutorUtil$MDCAwareThreadPoolExecutor.lambda$execute$0(ExecutorUtil.java:188)
   [junit4]   2> 	at java.base/java.util.concurrent.ThreadPoolExecutor.runWorker(ThreadPoolExecutor.java:1135)
   [junit4]   2> 	at java.base/java.util.concurrent.ThreadPoolExecutor$Worker.run(ThreadPoolExecutor.java:635)
   [junit4]   2> 	at java.base/java.lang.Thread.run(Thread.java:844)
   [junit4]   2> 984164 INFO  (zkCallback-1967-thread-3-processing-n:127.0.0.1:43495_solr) [n:127.0.0.1:43495_solr    ] o.a.s.c.c.ZkStateReader A cluster state change: [WatchedEvent state:SyncConnected type:NodeDataChanged path:/collections/halfcollection/state.json] for collection [halfcollection] has occurred - updating... (live nodes size: [4])
   [junit4]   2> 984164 INFO  (zkCallback-1967-thread-2-processing-n:127.0.0.1:43495_solr) [n:127.0.0.1:43495_solr    ] o.a.s.c.c.ZkStateReader A cluster state change: [WatchedEvent state:SyncConnected type:NodeDataChanged path:/collections/halfcollection/state.json] for collection [halfcollection] has occurred - updating... (live nodes size: [4])
   [junit4]   2> 985068 INFO  (qtp668179350-12749) [n:127.0.0.1:43495_solr c:halfcollection s:shard2 r:core_node4 x:halfcollection_shard2_replica_n2] o.a.s.c.SolrConfig Using Lucene MatchVersion: 8.0.0
   [junit4]   2> 985071 INFO  (qtp668179350-12749) [n:127.0.0.1:43495_solr c:halfcollection s:shard2 r:core_node4 x:halfcollection_shard2_replica_n2] o.a.s.s.IndexSchema [halfcollection_shard2_replica_n2] Schema name=minimal
   [junit4]   2> 985073 INFO  (qtp668179350-12749) [n:127.0.0.1:43495_solr c:halfcollection s:shard2 r:core_node4 x:halfcollection_shard2_replica_n2] o.a.s.s.IndexSchema Loaded schema minimal/1.1 with uniqueid field id
   [junit4]   2> 985073 INFO  (qtp668179350-12749) [n:127.0.0.1:43495_solr c:halfcollection s:shard2 r:core_node4 x:halfcollection_shard2_replica_n2] o.a.s.c.CoreContainer Creating SolrCore 'halfcollection_shard2_replica_n2' using configuration from collection halfcollection, trusted=true
   [junit4]   2> 985073 INFO  (qtp668179350-12749) [n:127.0.0.1:43495_solr c:halfcollection s:shard2 r:core_node4 x:halfcollection_shard2_replica_n2] o.a.s.m.r.SolrJmxReporter JMX monitoring for 'solr.core.halfcollection.shard2.replica_n2' (registry 'solr.core.halfcollection.shard2.replica_n2') enabled at server: com.sun.jmx.mbeanserver.JmxMBeanServer@342523bc
   [junit4]   2> 985073 INFO  (qtp668179350-12749) [n:127.0.0.1:43495_solr c:halfcollection s:shard2 r:core_node4 x:halfcollection_shard2_replica_n2] o.a.s.c.SolrCore solr.RecoveryStrategy.Builder
   [junit4]   2> 985073 INFO  (qtp668179350-12749) [n:127.0.0.1:43495_solr c:halfcollection s:shard2 r:core_node4 x:halfcollection_shard2_replica_n2] o.a.s.c.SolrCore [[halfcollection_shard2_replica_n2] ] Opening new SolrCore at [/home/jenkins/workspace/Lucene-Solr-master-Linux/solr/build/solr-core/test/J1/temp/solr.cloud.api.collections.CollectionsAPIDistributedZkTest_47888F234334DAF3-001/tempDir-001/node4/halfcollection_shard2_replica_n2], dataDir=[/home/jenkins/workspace/Lucene-Solr-master-Linux/solr/build/solr-core/test/J1/temp/solr.cloud.api.collections.CollectionsAPIDistributedZkTest_47888F234334DAF3-001/tempDir-001/node4/halfcollection_shard2_replica_n2/data/]
   [junit4]   2> 985106 INFO  (qtp668179350-12749) [n:127.0.0.1:43495_solr c:halfcollection s:shard2 r:core_node4 x:halfcollection_shard2_replica_n2] o.a.s.u.UpdateHandler Using UpdateLog implementation: org.apache.solr.update.UpdateLog
   [junit4]   2> 985106 INFO  (qtp668179350-12749) [n:127.0.0.1:43495_solr c:halfcollection s:shard2 r:core_node4 x:halfcollection_shard2_replica_n2] o.a.s.u.UpdateLog Initializing UpdateLog: dataDir=null defaultSyncLevel=FLUSH numRecordsToKeep=100 maxNumLogsToKeep=10 numVersionBuckets=65536
   [junit4]   2> 985107 INFO  (qtp668179350-12749) [n:127.0.0.1:43495_solr c:halfcollection s:shard2 r:core_node4 x:halfcollection_shard2_replica_n2] o.a.s.u.CommitTracker Hard AutoCommit: disabled
   [junit4]   2> 985107 INFO  (qtp668179350-12749) [n:127.0.0.1:43495_solr c:halfcollection s:shard2 r:core_node4 x:halfcollection_shard2_replica_n2] o.a.s.u.CommitTracker Soft AutoCommit: disabled
   [junit4]   2> 985108 INFO  (qtp668179350-12749) [n:127.0.0.1:43495_solr c:halfcollection s:shard2 r:core_node4 x:halfcollection_shard2_replica_n2] o.a.s.s.SolrIndexSearcher Opening [Searcher@2a5283b8[halfcollection_shard2_replica_n2] main]
   [junit4]   2> 985109 INFO  (qtp668179350-12749) [n:127.0.0.1:43495_solr c:halfcollection s:shard2 r:core_node4 x:halfcollection_shard2_replica_n2] o.a.s.r.ManagedResourceStorage Configured ZooKeeperStorageIO with znodeBase: /configs/conf
   [junit4]   2> 985109 INFO  (qtp668179350-12749) [n:127.0.0.1:43495_solr c:halfcollection s:shard2 r:core_node4 x:halfcol

[...truncated too long message...]

atcher.process(ZkStateReader.java:1085)
   [junit4]   2> 	at org.apache.solr.common.cloud.SolrZkClient$1.lambda$process$1(SolrZkClient.java:268)
   [junit4]   2> 	at java.base/java.util.concurrent.Executors$RunnableAdapter.call(Executors.java:514)
   [junit4]   2> 	at java.base/java.util.concurrent.FutureTask.run(FutureTask.java:264)
   [junit4]   2> 	at org.apache.solr.common.util.ExecutorUtil$MDCAwareThreadPoolExecutor.lambda$execute$0(ExecutorUtil.java:188)
   [junit4]   2> 	at java.base/java.util.concurrent.ThreadPoolExecutor.runWorker(ThreadPoolExecutor.java:1135)
   [junit4]   2> 	at java.base/java.util.concurrent.ThreadPoolExecutor$Worker.run(ThreadPoolExecutor.java:635)
   [junit4]   2> 	at java.base/java.lang.Thread.run(Thread.java:844)
   [junit4]   2> 3338278 INFO  (jetty-closer-5880-thread-9) [    ] o.e.j.s.h.ContextHandler Stopped o.e.j.s.ServletContextHandler@4bbbda5e{/solr,null,UNAVAILABLE}
   [junit4]   2> 3338278 INFO  (jetty-closer-5880-thread-9) [    ] o.e.j.s.session Stopped scavenging
   [junit4]   2> 3338279 ERROR (SUITE-TriggerIntegrationTest-seed#[47888F234334DAF3]-worker) [    ] o.a.z.s.ZooKeeperServer ZKShutdownHandler is not registered, so ZooKeeper server won't take any action on ERROR or SHUTDOWN server state changes
   [junit4]   2> 3338279 INFO  (SUITE-TriggerIntegrationTest-seed#[47888F234334DAF3]-worker) [    ] o.a.s.c.ZkTestServer connecting to 127.0.0.1:45091 45091
   [junit4]   2> 3338391 INFO  (Thread-9358) [    ] o.a.s.c.ZkTestServer connecting to 127.0.0.1:45091 45091
   [junit4]   2> 3338391 WARN  (Thread-9358) [    ] o.a.s.c.ZkTestServer Watch limit violations: 
   [junit4]   2> Maximum concurrent create/delete watches above limit:
   [junit4]   2> 
   [junit4]   2> 	21	/solr/aliases.json
   [junit4]   2> 	20	/solr/security.json
   [junit4]   2> 	8	/solr/configs/conf
   [junit4]   2> 
   [junit4]   2> Maximum concurrent data watches above limit:
   [junit4]   2> 
   [junit4]   2> 	97	/solr/collections/collection1/state.json
   [junit4]   2> 	37	/solr/collections/testMetricTrigger/state.json
   [junit4]   2> 	21	/solr/clusterprops.json
   [junit4]   2> 	21	/solr/clusterstate.json
   [junit4]   2> 	6	/solr/autoscaling.json
   [junit4]   2> 	4	/solr/overseer_elect/election/99426339510222874-127.0.0.1:34149_solr-n_0000000007
   [junit4]   2> 	2	/solr/collections/collection1/leader_elect/shard1/election/99426339510222871-core_node6-n_0000000002
   [junit4]   2> 	2	/solr/overseer_elect/election/99426339510222862-127.0.0.1:38243_solr-n_0000000003
   [junit4]   2> 	2	/solr/overseer_elect/election/99426339510222886-127.0.0.1:44143_solr-n_0000000011
   [junit4]   2> 	2	/solr/collections/collection1/leader_elect/shard1/election/99426339510222862-core_node8-n_0000000003
   [junit4]   2> 	2	/solr/collections/collection1/leader_elect/shard1/election/99426339510222874-core_node4-n_0000000000
   [junit4]   2> 
   [junit4]   2> Maximum concurrent children watches above limit:
   [junit4]   2> 
   [junit4]   2> 	21	/solr/live_nodes
   [junit4]   2> 	21	/solr/collections
   [junit4]   2> 	6	/solr/overseer/queue-work
   [junit4]   2> 	6	/solr/autoscaling/events/.auto_add_replicas
   [junit4]   2> 	6	/solr/overseer/queue
   [junit4]   2> 	6	/solr/overseer/collection-queue-work
   [junit4]   2> 	2	/solr/autoscaling/events/node_lost_triggerMR
   [junit4]   2> 	2	/solr/autoscaling/events/node_added_triggerCTOOR
   [junit4]   2> 
   [junit4]   2> NOTE: leaving temporary files on disk at: /home/jenkins/workspace/Lucene-Solr-master-Linux/solr/build/solr-core/test/J1/temp/solr.cloud.autoscaling.TriggerIntegrationTest_47888F234334DAF3-001
   [junit4]   2> Jan 28, 2018 7:49:04 AM com.carrotsearch.randomizedtesting.ThreadLeakControl checkThreadLeaks
   [junit4]   2> WARNING: Will linger awaiting termination of 1 leaked thread(s).
   [junit4]   2> NOTE: test params are: codec=Asserting(Lucene70): {id=PostingsFormat(name=Asserting), x_s=Lucene50(blocksize=128)}, docValues:{_version_=DocValuesFormat(name=Lucene70)}, maxPointsInLeafNode=1458, maxMBSortInHeap=6.665252006510016, sim=Asserting(org.apache.lucene.search.similarities.AssertingSimilarity@6f45d88c), locale=uk, timezone=Atlantic/Cape_Verde
   [junit4]   2> NOTE: Linux 4.13.0-31-generic amd64/Oracle Corporation 10-ea (64-bit)/cpus=8,threads=1,free=204662264,total=492830720
   [junit4]   2> NOTE: All tests run in this JVM: [TestCharFilters, SolrCoreTest, TestTlogReplica, SpatialHeatmapFacetsTest, SolrInfoBeanTest, DistributedFacetPivotSmallTest, TestPivotHelperCode, HdfsBasicDistributedZkTest, ComputePlanActionTest, DistributedQueryComponentOptimizationTest, SchemaApiFailureTest, TestSolr4Spatial, AtomicUpdatesTest, TestCursorMarkWithoutUniqueKey, TestLegacyTerms, UninvertDocValuesMergePolicyTest, PrimUtilsTest, SolrMetricManagerTest, TestManagedSchemaAPI, TestLRUCache, DocValuesNotIndexedTest, AddBlockUpdateTest, TestLocalFSCloudBackupRestore, PrimitiveFieldTypeTest, TestBulkSchemaConcurrent, TestUtilizeNode, ReplaceNodeTest, TestFastLRUCache, TestSolrCloudWithDelegationTokens, ResponseHeaderTest, TestQueryUtils, OverseerTest, TestCollationFieldDocValues, CdcrBootstrapTest, TestPolicyCloud, MoveReplicaHDFSFailoverTest, TestPostingsSolrHighlighter, ClassificationUpdateProcessorTest, FieldMutatingUpdateProcessorTest, StatsReloadRaceTest, TestRandomFlRTGCloud, ZkStateWriterTest, TestCollectionAPI, TestUseDocValuesAsStored2, CollectionReloadTest, DeleteStatusTest, TestJettySolrRunner, TestFoldingMultitermQuery, TestSha256AuthenticationProvider, TestCoreBackup, IgnoreCommitOptimizeUpdateProcessorFactoryTest, SOLR749Test, CdcrRequestHandlerTest, BlockDirectoryTest, TestSchemaVersionResource, TestSolr4Spatial2, SmileWriterTest, VersionInfoTest, DistribJoinFromCollectionTest, TestDocBasedVersionConstraints, StressHdfsTest, TestTestInjection, HLLUtilTest, DistributedFacetPivotLargeTest, TestSimpleTrackingShardHandler, TestMissingGroups, TestPrepRecovery, TestDistributedGrouping, TestSchemaNameResource, TestRecovery, HdfsRestartWhileUpdatingTest, SoftAutoCommitTest, TestNodeLostTrigger, TestSubQueryTransformerDistrib, DeleteNodeTest, BasicAuthIntegrationTest, TestExactSharedStatsCache, TestEmbeddedSolrServerAdminHandler, TestSearchPerf, TestComputePlanAction, TestSimpleTextCodec, LegacyCloudClusterPropTest, TestDistributedStatsComponentCardinality, TestRestManager, DistributedIntervalFacetingTest, TestOverriddenPrefixQueryForCustomFieldType, CollectionsAPIDistributedZkTest, SystemInfoHandlerTest, BigEndianAscendingWordDeserializerTest, TestScoreJoinQPNoScore, QueryElevationComponentTest, SliceStateTest, VMParamsZkACLAndCredentialsProvidersTest, TestCorePropertiesReload, ExplicitHLLTest, ConfigSetsAPITest, TestRequestForwarding, CollectionStateFormat2Test, TestSystemIdResolver, TestManagedStopFilterFactory, TestAddFieldRealTimeGet, TestSchemaManager, HighlighterMaxOffsetTest, TestShortCircuitedRequests, TestSolrCloudWithHadoopAuthPlugin, TestSolrJ, TestSolrIndexConfig, AlternateDirectoryTest, RequiredFieldsTest, TestXIncludeConfig, DistributedMLTComponentTest, TestSQLHandlerNonCloud, TestLegacyField, QueryEqualityTest, TestNumericTerms32, CoreMergeIndexesAdminHandlerTest, BadComponentTest, CloudMLTQParserTest, TestSolrCloudSnapshots, QueryParsingTest, AsyncCallRequestStatusResponseTest, SolrShardReporterTest, TestDFISimilarityFactory, InfixSuggestersTest, SchemaVersionSpecificBehaviorTest, TestFieldCacheVsDocValues, ChaosMonkeySafeLeaderTest, UnloadDistributedZkTest, SyncSliceTest, OpenCloseCoreStressTest, LeaderElectionIntegrationTest, FullSolrCloudDistribCmdsTest, LeaderElectionTest, TestZkChroot, ShardRoutingCustomTest, TestHashPartitioner, TestRealTimeGet, TestStressReorder, TestJoin, TestStressVersions, SolrCmdDistributorTest, ConvertedLegacyTest, TestSort, TestFiltering, HighlighterTest, ShowFileRequestHandlerTest, SimplePostToolTest, TestCoreDiscovery, SuggesterFSTTest, CoreAdminHandlerTest, TestTrie, SuggesterWFSTTest, PolyFieldTest, TestPseudoReturnFields, DirectUpdateHandlerOptimizeTest, StatelessScriptUpdateProcessorFactoryTest, XsltUpdateRequestHandlerTest, TestSurroundQueryParser, TestWriterPerf, DirectSolrSpellCheckerTest, TestOmitPositions, TermsComponentTest, TermVectorComponentTest, TestSolrQueryParser, LoggingHandlerTest, TestJmxIntegration, ReturnFieldsTest, UniqFieldsUpdateProcessorFactoryTest, JsonLoaderTest, TestPartialUpdateDeduplication, CSVRequestHandlerTest, TestLFUCache, SynonymTokenizerTest, TestDFRSimilarityFactory, TestPerFieldSimilarity, TimeZoneUtilsTest, TestFastOutputStream, ChaosMonkeyNothingIsSafeTest, ChaosMonkeyNothingIsSafeWithPullReplicasTest, ConcurrentCreateRoutedAliasTest, ConnectionManagerTest, DeleteInactiveReplicaTest, DistributedQueueTest, HttpPartitionTest, MoveReplicaTest, NodeMutatorTest, OverriddenZkACLAndCredentialsProvidersTest, OverseerCollectionConfigSetProcessorTest, OverseerModifyCollectionTest, OverseerRolesTest, PeerSyncReplicationTest, RecoveryAfterSoftCommitTest, RemoteQueryErrorTest, ReplicationFactorTest, RestartWhileUpdatingTest, RollingRestartTest, SaslZkACLProviderTest, SharedFSAutoReplicaFailoverTest, SolrCLIZkUtilsTest, SolrCloudExampleTest, SolrXmlInZkTest, TestAuthenticationFramework, TestCloudDeleteByQuery, TestCloudInspectUtil, TestCloudPivotFacet, TestCloudPseudoReturnFields, TestCloudSearcherWarming, TestClusterProperties, TestConfigSetsAPIExclusivity, TestConfigSetsAPIZkFailure, TestDeleteCollectionOnDownNodes, TestDistribDocBasedVersion, TestDownShardTolerantSearch, TestExclusionRuleCollectionAccess, TestLeaderElectionWithEmptyReplica, TestLeaderElectionZkExpiry, TestLeaderInitiatedRecoveryThread, TestLockTree, TestMiniSolrCloudClusterSSL, TestSSLRandomization, TestStressCloudBlindAtomicUpdates, TestStressInPlaceUpdates, CollectionTooManyReplicasTest, CollectionsAPIAsyncDistributedZkTest, HdfsCollectionsAPIDistributedZkTest, ShardSplitTest, TriggerIntegrationTest]
   [junit4] Completed [630/770 (2!)] on J1 in 203.20s, 14 tests, 2 failures <<< FAILURES!

[...truncated 41353 lines...]

Mime
View raw message