lucene-dev mailing list archives

Site index · List index
Message view « Date » · « Thread »
Top « Date » · « Thread »
From Policeman Jenkins Server <jenk...@thetaphi.de>
Subject [JENKINS] Lucene-Solr-7.x-Windows (64bit/jdk-9.0.1) - Build # 427 - Still Unstable!
Date Sat, 27 Jan 2018 21:13:04 GMT
Build: https://jenkins.thetaphi.de/job/Lucene-Solr-7.x-Windows/427/
Java: 64bit/jdk-9.0.1 -XX:-UseCompressedOops -XX:+UseSerialGC

5 tests failed.
FAILED:  junit.framework.TestSuite.org.apache.lucene.index.TestBackwardsCompatibility

Error Message:
Could not remove the following files (in the order of attempts):    C:\Users\jenkins\workspace\Lucene-Solr-7.x-Windows\lucene\build\backward-codecs\test\J1\temp\lucene.index.TestBackwardsCompatibility_428A79AEFA059D79-001\2.9.4-cfs-001:
java.nio.file.DirectoryNotEmptyException: C:\Users\jenkins\workspace\Lucene-Solr-7.x-Windows\lucene\build\backward-codecs\test\J1\temp\lucene.index.TestBackwardsCompatibility_428A79AEFA059D79-001\2.9.4-cfs-001


Stack Trace:
java.io.IOException: Could not remove the following files (in the order of attempts):
   C:\Users\jenkins\workspace\Lucene-Solr-7.x-Windows\lucene\build\backward-codecs\test\J1\temp\lucene.index.TestBackwardsCompatibility_428A79AEFA059D79-001\2.9.4-cfs-001:
java.nio.file.DirectoryNotEmptyException: C:\Users\jenkins\workspace\Lucene-Solr-7.x-Windows\lucene\build\backward-codecs\test\J1\temp\lucene.index.TestBackwardsCompatibility_428A79AEFA059D79-001\2.9.4-cfs-001

	at __randomizedtesting.SeedInfo.seed([428A79AEFA059D79]:0)
	at org.apache.lucene.util.IOUtils.rm(IOUtils.java:329)
	at org.apache.lucene.util.TestRuleTemporaryFilesCleanup.afterAlways(TestRuleTemporaryFilesCleanup.java:216)
	at com.carrotsearch.randomizedtesting.rules.TestRuleAdapter$1.afterAlways(TestRuleAdapter.java:31)
	at com.carrotsearch.randomizedtesting.rules.StatementAdapter.evaluate(StatementAdapter.java:43)
	at com.carrotsearch.randomizedtesting.rules.StatementAdapter.evaluate(StatementAdapter.java:36)
	at org.apache.lucene.util.TestRuleAssertionsRequired$1.evaluate(TestRuleAssertionsRequired.java:53)
	at org.apache.lucene.util.TestRuleMarkFailure$1.evaluate(TestRuleMarkFailure.java:47)
	at org.apache.lucene.util.TestRuleIgnoreAfterMaxFailures$1.evaluate(TestRuleIgnoreAfterMaxFailures.java:64)
	at org.apache.lucene.util.TestRuleIgnoreTestSuites$1.evaluate(TestRuleIgnoreTestSuites.java:54)
	at com.carrotsearch.randomizedtesting.rules.StatementAdapter.evaluate(StatementAdapter.java:36)
	at com.carrotsearch.randomizedtesting.ThreadLeakControl$StatementRunner.run(ThreadLeakControl.java:368)
	at java.base/java.lang.Thread.run(Thread.java:844)


FAILED:  junit.framework.TestSuite.org.apache.solr.analytics.OverallAnalyticsTest

Error Message:
Could not remove the following files (in the order of attempts):    C:\Users\jenkins\workspace\Lucene-Solr-7.x-Windows\solr\build\contrib\solr-analytics\test\J1\temp\solr.analytics.OverallAnalyticsTest_1C3DE99668323C1F-001\tempDir-001\node1\collection1_shard1_replica_n1\data\tlog:
java.nio.file.DirectoryNotEmptyException: C:\Users\jenkins\workspace\Lucene-Solr-7.x-Windows\solr\build\contrib\solr-analytics\test\J1\temp\solr.analytics.OverallAnalyticsTest_1C3DE99668323C1F-001\tempDir-001\node1\collection1_shard1_replica_n1\data\tlog
   C:\Users\jenkins\workspace\Lucene-Solr-7.x-Windows\solr\build\contrib\solr-analytics\test\J1\temp\solr.analytics.OverallAnalyticsTest_1C3DE99668323C1F-001\tempDir-001\node1\collection1_shard1_replica_n1\data:
java.nio.file.DirectoryNotEmptyException: C:\Users\jenkins\workspace\Lucene-Solr-7.x-Windows\solr\build\contrib\solr-analytics\test\J1\temp\solr.analytics.OverallAnalyticsTest_1C3DE99668323C1F-001\tempDir-001\node1\collection1_shard1_replica_n1\data
   C:\Users\jenkins\workspace\Lucene-Solr-7.x-Windows\solr\build\contrib\solr-analytics\test\J1\temp\solr.analytics.OverallAnalyticsTest_1C3DE99668323C1F-001\tempDir-001\node1\collection1_shard1_replica_n1:
java.nio.file.DirectoryNotEmptyException: C:\Users\jenkins\workspace\Lucene-Solr-7.x-Windows\solr\build\contrib\solr-analytics\test\J1\temp\solr.analytics.OverallAnalyticsTest_1C3DE99668323C1F-001\tempDir-001\node1\collection1_shard1_replica_n1
   C:\Users\jenkins\workspace\Lucene-Solr-7.x-Windows\solr\build\contrib\solr-analytics\test\J1\temp\solr.analytics.OverallAnalyticsTest_1C3DE99668323C1F-001\tempDir-001\node1:
java.nio.file.DirectoryNotEmptyException: C:\Users\jenkins\workspace\Lucene-Solr-7.x-Windows\solr\build\contrib\solr-analytics\test\J1\temp\solr.analytics.OverallAnalyticsTest_1C3DE99668323C1F-001\tempDir-001\node1
   C:\Users\jenkins\workspace\Lucene-Solr-7.x-Windows\solr\build\contrib\solr-analytics\test\J1\temp\solr.analytics.OverallAnalyticsTest_1C3DE99668323C1F-001\tempDir-001:
java.nio.file.DirectoryNotEmptyException: C:\Users\jenkins\workspace\Lucene-Solr-7.x-Windows\solr\build\contrib\solr-analytics\test\J1\temp\solr.analytics.OverallAnalyticsTest_1C3DE99668323C1F-001\tempDir-001


Stack Trace:
java.io.IOException: Could not remove the following files (in the order of attempts):
   C:\Users\jenkins\workspace\Lucene-Solr-7.x-Windows\solr\build\contrib\solr-analytics\test\J1\temp\solr.analytics.OverallAnalyticsTest_1C3DE99668323C1F-001\tempDir-001\node1\collection1_shard1_replica_n1\data\tlog:
java.nio.file.DirectoryNotEmptyException: C:\Users\jenkins\workspace\Lucene-Solr-7.x-Windows\solr\build\contrib\solr-analytics\test\J1\temp\solr.analytics.OverallAnalyticsTest_1C3DE99668323C1F-001\tempDir-001\node1\collection1_shard1_replica_n1\data\tlog
   C:\Users\jenkins\workspace\Lucene-Solr-7.x-Windows\solr\build\contrib\solr-analytics\test\J1\temp\solr.analytics.OverallAnalyticsTest_1C3DE99668323C1F-001\tempDir-001\node1\collection1_shard1_replica_n1\data:
java.nio.file.DirectoryNotEmptyException: C:\Users\jenkins\workspace\Lucene-Solr-7.x-Windows\solr\build\contrib\solr-analytics\test\J1\temp\solr.analytics.OverallAnalyticsTest_1C3DE99668323C1F-001\tempDir-001\node1\collection1_shard1_replica_n1\data
   C:\Users\jenkins\workspace\Lucene-Solr-7.x-Windows\solr\build\contrib\solr-analytics\test\J1\temp\solr.analytics.OverallAnalyticsTest_1C3DE99668323C1F-001\tempDir-001\node1\collection1_shard1_replica_n1:
java.nio.file.DirectoryNotEmptyException: C:\Users\jenkins\workspace\Lucene-Solr-7.x-Windows\solr\build\contrib\solr-analytics\test\J1\temp\solr.analytics.OverallAnalyticsTest_1C3DE99668323C1F-001\tempDir-001\node1\collection1_shard1_replica_n1
   C:\Users\jenkins\workspace\Lucene-Solr-7.x-Windows\solr\build\contrib\solr-analytics\test\J1\temp\solr.analytics.OverallAnalyticsTest_1C3DE99668323C1F-001\tempDir-001\node1:
java.nio.file.DirectoryNotEmptyException: C:\Users\jenkins\workspace\Lucene-Solr-7.x-Windows\solr\build\contrib\solr-analytics\test\J1\temp\solr.analytics.OverallAnalyticsTest_1C3DE99668323C1F-001\tempDir-001\node1
   C:\Users\jenkins\workspace\Lucene-Solr-7.x-Windows\solr\build\contrib\solr-analytics\test\J1\temp\solr.analytics.OverallAnalyticsTest_1C3DE99668323C1F-001\tempDir-001:
java.nio.file.DirectoryNotEmptyException: C:\Users\jenkins\workspace\Lucene-Solr-7.x-Windows\solr\build\contrib\solr-analytics\test\J1\temp\solr.analytics.OverallAnalyticsTest_1C3DE99668323C1F-001\tempDir-001

	at __randomizedtesting.SeedInfo.seed([1C3DE99668323C1F]:0)
	at org.apache.lucene.util.IOUtils.rm(IOUtils.java:329)
	at org.apache.lucene.util.TestRuleTemporaryFilesCleanup.afterAlways(TestRuleTemporaryFilesCleanup.java:216)
	at com.carrotsearch.randomizedtesting.rules.TestRuleAdapter$1.afterAlways(TestRuleAdapter.java:31)
	at com.carrotsearch.randomizedtesting.rules.StatementAdapter.evaluate(StatementAdapter.java:43)
	at com.carrotsearch.randomizedtesting.rules.StatementAdapter.evaluate(StatementAdapter.java:36)
	at org.apache.lucene.util.TestRuleAssertionsRequired$1.evaluate(TestRuleAssertionsRequired.java:53)
	at org.apache.lucene.util.TestRuleMarkFailure$1.evaluate(TestRuleMarkFailure.java:47)
	at org.apache.lucene.util.TestRuleIgnoreAfterMaxFailures$1.evaluate(TestRuleIgnoreAfterMaxFailures.java:64)
	at org.apache.lucene.util.TestRuleIgnoreTestSuites$1.evaluate(TestRuleIgnoreTestSuites.java:54)
	at com.carrotsearch.randomizedtesting.rules.StatementAdapter.evaluate(StatementAdapter.java:36)
	at com.carrotsearch.randomizedtesting.ThreadLeakControl$StatementRunner.run(ThreadLeakControl.java:368)
	at java.base/java.lang.Thread.run(Thread.java:844)


FAILED:  junit.framework.TestSuite.org.apache.solr.cloud.api.collections.TestHdfsCloudBackupRestore

Error Message:
HDFS tests were disabled by -Dtests.disableHdfs

Stack Trace:
com.carrotsearch.randomizedtesting.InternalAssumptionViolatedException: HDFS tests were disabled
by -Dtests.disableHdfs
	at __randomizedtesting.SeedInfo.seed([DDB246A44A2BDF02]:0)
	at com.carrotsearch.randomizedtesting.RandomizedTest.assumeTrue(RandomizedTest.java:722)
	at com.carrotsearch.randomizedtesting.RandomizedTest.assumeFalse(RandomizedTest.java:730)
	at org.apache.lucene.util.LuceneTestCase.assumeFalse(LuceneTestCase.java:866)
	at org.apache.solr.cloud.hdfs.HdfsTestUtil.setupClass(HdfsTestUtil.java:71)
	at org.apache.solr.cloud.hdfs.HdfsTestUtil.setupClass(HdfsTestUtil.java:63)
	at org.apache.solr.cloud.api.collections.TestHdfsCloudBackupRestore.setupClass(TestHdfsCloudBackupRestore.java:104)
	at java.base/jdk.internal.reflect.NativeMethodAccessorImpl.invoke0(Native Method)
	at java.base/jdk.internal.reflect.NativeMethodAccessorImpl.invoke(NativeMethodAccessorImpl.java:62)
	at java.base/jdk.internal.reflect.DelegatingMethodAccessorImpl.invoke(DelegatingMethodAccessorImpl.java:43)
	at java.base/java.lang.reflect.Method.invoke(Method.java:564)
	at com.carrotsearch.randomizedtesting.RandomizedRunner.invoke(RandomizedRunner.java:1737)
	at com.carrotsearch.randomizedtesting.RandomizedRunner$6.evaluate(RandomizedRunner.java:874)
	at com.carrotsearch.randomizedtesting.RandomizedRunner$7.evaluate(RandomizedRunner.java:890)
	at com.carrotsearch.randomizedtesting.rules.StatementAdapter.evaluate(StatementAdapter.java:36)
	at com.carrotsearch.randomizedtesting.rules.SystemPropertiesRestoreRule$1.evaluate(SystemPropertiesRestoreRule.java:57)
	at org.apache.lucene.util.AbstractBeforeAfterRule$1.evaluate(AbstractBeforeAfterRule.java:45)
	at com.carrotsearch.randomizedtesting.rules.StatementAdapter.evaluate(StatementAdapter.java:36)
	at org.apache.lucene.util.TestRuleStoreClassName$1.evaluate(TestRuleStoreClassName.java:41)
	at com.carrotsearch.randomizedtesting.rules.NoShadowingOrOverridesOnMethodsRule$1.evaluate(NoShadowingOrOverridesOnMethodsRule.java:40)
	at com.carrotsearch.randomizedtesting.rules.NoShadowingOrOverridesOnMethodsRule$1.evaluate(NoShadowingOrOverridesOnMethodsRule.java:40)
	at com.carrotsearch.randomizedtesting.rules.StatementAdapter.evaluate(StatementAdapter.java:36)
	at com.carrotsearch.randomizedtesting.rules.StatementAdapter.evaluate(StatementAdapter.java:36)
	at org.apache.lucene.util.TestRuleAssertionsRequired$1.evaluate(TestRuleAssertionsRequired.java:53)
	at org.apache.lucene.util.TestRuleMarkFailure$1.evaluate(TestRuleMarkFailure.java:47)
	at org.apache.lucene.util.TestRuleIgnoreAfterMaxFailures$1.evaluate(TestRuleIgnoreAfterMaxFailures.java:64)
	at org.apache.lucene.util.TestRuleIgnoreTestSuites$1.evaluate(TestRuleIgnoreTestSuites.java:54)
	at com.carrotsearch.randomizedtesting.rules.StatementAdapter.evaluate(StatementAdapter.java:36)
	at com.carrotsearch.randomizedtesting.ThreadLeakControl$StatementRunner.run(ThreadLeakControl.java:368)
	at java.base/java.lang.Thread.run(Thread.java:844)


FAILED:  junit.framework.TestSuite.org.apache.solr.cloud.api.collections.TestHdfsCloudBackupRestore

Error Message:
Could not remove the following files (in the order of attempts):    C:\Users\jenkins\workspace\Lucene-Solr-7.x-Windows\solr\build\solr-core\test\J0\temp\solr.cloud.api.collections.TestHdfsCloudBackupRestore_DDB246A44A2BDF02-001\init-core-data-001:
java.nio.file.AccessDeniedException: C:\Users\jenkins\workspace\Lucene-Solr-7.x-Windows\solr\build\solr-core\test\J0\temp\solr.cloud.api.collections.TestHdfsCloudBackupRestore_DDB246A44A2BDF02-001\init-core-data-001
   C:\Users\jenkins\workspace\Lucene-Solr-7.x-Windows\solr\build\solr-core\test\J0\temp\solr.cloud.api.collections.TestHdfsCloudBackupRestore_DDB246A44A2BDF02-001:
java.nio.file.DirectoryNotEmptyException: C:\Users\jenkins\workspace\Lucene-Solr-7.x-Windows\solr\build\solr-core\test\J0\temp\solr.cloud.api.collections.TestHdfsCloudBackupRestore_DDB246A44A2BDF02-001


Stack Trace:
java.io.IOException: Could not remove the following files (in the order of attempts):
   C:\Users\jenkins\workspace\Lucene-Solr-7.x-Windows\solr\build\solr-core\test\J0\temp\solr.cloud.api.collections.TestHdfsCloudBackupRestore_DDB246A44A2BDF02-001\init-core-data-001:
java.nio.file.AccessDeniedException: C:\Users\jenkins\workspace\Lucene-Solr-7.x-Windows\solr\build\solr-core\test\J0\temp\solr.cloud.api.collections.TestHdfsCloudBackupRestore_DDB246A44A2BDF02-001\init-core-data-001
   C:\Users\jenkins\workspace\Lucene-Solr-7.x-Windows\solr\build\solr-core\test\J0\temp\solr.cloud.api.collections.TestHdfsCloudBackupRestore_DDB246A44A2BDF02-001:
java.nio.file.DirectoryNotEmptyException: C:\Users\jenkins\workspace\Lucene-Solr-7.x-Windows\solr\build\solr-core\test\J0\temp\solr.cloud.api.collections.TestHdfsCloudBackupRestore_DDB246A44A2BDF02-001

	at org.apache.lucene.util.IOUtils.rm(IOUtils.java:329)
	at org.apache.lucene.util.TestRuleTemporaryFilesCleanup.afterAlways(TestRuleTemporaryFilesCleanup.java:216)
	at com.carrotsearch.randomizedtesting.rules.TestRuleAdapter$1.afterAlways(TestRuleAdapter.java:31)
	at com.carrotsearch.randomizedtesting.rules.StatementAdapter.evaluate(StatementAdapter.java:43)
	at com.carrotsearch.randomizedtesting.rules.StatementAdapter.evaluate(StatementAdapter.java:36)
	at org.apache.lucene.util.TestRuleAssertionsRequired$1.evaluate(TestRuleAssertionsRequired.java:53)
	at org.apache.lucene.util.TestRuleMarkFailure$1.evaluate(TestRuleMarkFailure.java:47)
	at org.apache.lucene.util.TestRuleIgnoreAfterMaxFailures$1.evaluate(TestRuleIgnoreAfterMaxFailures.java:64)
	at org.apache.lucene.util.TestRuleIgnoreTestSuites$1.evaluate(TestRuleIgnoreTestSuites.java:54)
	at com.carrotsearch.randomizedtesting.rules.StatementAdapter.evaluate(StatementAdapter.java:36)
	at com.carrotsearch.randomizedtesting.ThreadLeakControl$StatementRunner.run(ThreadLeakControl.java:368)
	at java.base/java.lang.Thread.run(Thread.java:844)


FAILED:  junit.framework.TestSuite.org.apache.solr.update.processor.TestOpenNLPExtractNamedEntitiesUpdateProcessorFactory

Error Message:
Could not remove the following files (in the order of attempts):    C:\Users\jenkins\workspace\Lucene-Solr-7.x-Windows\solr\build\contrib\solr-analysis-extras\test\J1\temp\solr.update.processor.TestOpenNLPExtractNamedEntitiesUpdateProcessorFactory_1734E3A29CC63F0B-001\tempDir-001\collection1\conf:
java.nio.file.DirectoryNotEmptyException: C:\Users\jenkins\workspace\Lucene-Solr-7.x-Windows\solr\build\contrib\solr-analysis-extras\test\J1\temp\solr.update.processor.TestOpenNLPExtractNamedEntitiesUpdateProcessorFactory_1734E3A29CC63F0B-001\tempDir-001\collection1\conf
   C:\Users\jenkins\workspace\Lucene-Solr-7.x-Windows\solr\build\contrib\solr-analysis-extras\test\J1\temp\solr.update.processor.TestOpenNLPExtractNamedEntitiesUpdateProcessorFactory_1734E3A29CC63F0B-001\tempDir-001\collection1:
java.nio.file.DirectoryNotEmptyException: C:\Users\jenkins\workspace\Lucene-Solr-7.x-Windows\solr\build\contrib\solr-analysis-extras\test\J1\temp\solr.update.processor.TestOpenNLPExtractNamedEntitiesUpdateProcessorFactory_1734E3A29CC63F0B-001\tempDir-001\collection1
   C:\Users\jenkins\workspace\Lucene-Solr-7.x-Windows\solr\build\contrib\solr-analysis-extras\test\J1\temp\solr.update.processor.TestOpenNLPExtractNamedEntitiesUpdateProcessorFactory_1734E3A29CC63F0B-001\tempDir-001:
java.nio.file.DirectoryNotEmptyException: C:\Users\jenkins\workspace\Lucene-Solr-7.x-Windows\solr\build\contrib\solr-analysis-extras\test\J1\temp\solr.update.processor.TestOpenNLPExtractNamedEntitiesUpdateProcessorFactory_1734E3A29CC63F0B-001\tempDir-001
   C:\Users\jenkins\workspace\Lucene-Solr-7.x-Windows\solr\build\contrib\solr-analysis-extras\test\J1\temp\solr.update.processor.TestOpenNLPExtractNamedEntitiesUpdateProcessorFactory_1734E3A29CC63F0B-001\tempDir-001\collection1\conf\en-test-tokenizer.bin:
java.nio.file.AccessDeniedException: C:\Users\jenkins\workspace\Lucene-Solr-7.x-Windows\solr\build\contrib\solr-analysis-extras\test\J1\temp\solr.update.processor.TestOpenNLPExtractNamedEntitiesUpdateProcessorFactory_1734E3A29CC63F0B-001\tempDir-001\collection1\conf\en-test-tokenizer.bin
   C:\Users\jenkins\workspace\Lucene-Solr-7.x-Windows\solr\build\contrib\solr-analysis-extras\test\J1\temp\solr.update.processor.TestOpenNLPExtractNamedEntitiesUpdateProcessorFactory_1734E3A29CC63F0B-001\tempDir-001\collection1\conf\en-test-ner-person.bin:
java.nio.file.AccessDeniedException: C:\Users\jenkins\workspace\Lucene-Solr-7.x-Windows\solr\build\contrib\solr-analysis-extras\test\J1\temp\solr.update.processor.TestOpenNLPExtractNamedEntitiesUpdateProcessorFactory_1734E3A29CC63F0B-001\tempDir-001\collection1\conf\en-test-ner-person.bin
   C:\Users\jenkins\workspace\Lucene-Solr-7.x-Windows\solr\build\contrib\solr-analysis-extras\test\J1\temp\solr.update.processor.TestOpenNLPExtractNamedEntitiesUpdateProcessorFactory_1734E3A29CC63F0B-001\tempDir-001\collection1\conf\en-test-sent.bin:
java.nio.file.AccessDeniedException: C:\Users\jenkins\workspace\Lucene-Solr-7.x-Windows\solr\build\contrib\solr-analysis-extras\test\J1\temp\solr.update.processor.TestOpenNLPExtractNamedEntitiesUpdateProcessorFactory_1734E3A29CC63F0B-001\tempDir-001\collection1\conf\en-test-sent.bin
   C:\Users\jenkins\workspace\Lucene-Solr-7.x-Windows\solr\build\contrib\solr-analysis-extras\test\J1\temp\solr.update.processor.TestOpenNLPExtractNamedEntitiesUpdateProcessorFactory_1734E3A29CC63F0B-001:
java.nio.file.DirectoryNotEmptyException: C:\Users\jenkins\workspace\Lucene-Solr-7.x-Windows\solr\build\contrib\solr-analysis-extras\test\J1\temp\solr.update.processor.TestOpenNLPExtractNamedEntitiesUpdateProcessorFactory_1734E3A29CC63F0B-001


Stack Trace:
java.io.IOException: Could not remove the following files (in the order of attempts):
   C:\Users\jenkins\workspace\Lucene-Solr-7.x-Windows\solr\build\contrib\solr-analysis-extras\test\J1\temp\solr.update.processor.TestOpenNLPExtractNamedEntitiesUpdateProcessorFactory_1734E3A29CC63F0B-001\tempDir-001\collection1\conf:
java.nio.file.DirectoryNotEmptyException: C:\Users\jenkins\workspace\Lucene-Solr-7.x-Windows\solr\build\contrib\solr-analysis-extras\test\J1\temp\solr.update.processor.TestOpenNLPExtractNamedEntitiesUpdateProcessorFactory_1734E3A29CC63F0B-001\tempDir-001\collection1\conf
   C:\Users\jenkins\workspace\Lucene-Solr-7.x-Windows\solr\build\contrib\solr-analysis-extras\test\J1\temp\solr.update.processor.TestOpenNLPExtractNamedEntitiesUpdateProcessorFactory_1734E3A29CC63F0B-001\tempDir-001\collection1:
java.nio.file.DirectoryNotEmptyException: C:\Users\jenkins\workspace\Lucene-Solr-7.x-Windows\solr\build\contrib\solr-analysis-extras\test\J1\temp\solr.update.processor.TestOpenNLPExtractNamedEntitiesUpdateProcessorFactory_1734E3A29CC63F0B-001\tempDir-001\collection1
   C:\Users\jenkins\workspace\Lucene-Solr-7.x-Windows\solr\build\contrib\solr-analysis-extras\test\J1\temp\solr.update.processor.TestOpenNLPExtractNamedEntitiesUpdateProcessorFactory_1734E3A29CC63F0B-001\tempDir-001:
java.nio.file.DirectoryNotEmptyException: C:\Users\jenkins\workspace\Lucene-Solr-7.x-Windows\solr\build\contrib\solr-analysis-extras\test\J1\temp\solr.update.processor.TestOpenNLPExtractNamedEntitiesUpdateProcessorFactory_1734E3A29CC63F0B-001\tempDir-001
   C:\Users\jenkins\workspace\Lucene-Solr-7.x-Windows\solr\build\contrib\solr-analysis-extras\test\J1\temp\solr.update.processor.TestOpenNLPExtractNamedEntitiesUpdateProcessorFactory_1734E3A29CC63F0B-001\tempDir-001\collection1\conf\en-test-tokenizer.bin:
java.nio.file.AccessDeniedException: C:\Users\jenkins\workspace\Lucene-Solr-7.x-Windows\solr\build\contrib\solr-analysis-extras\test\J1\temp\solr.update.processor.TestOpenNLPExtractNamedEntitiesUpdateProcessorFactory_1734E3A29CC63F0B-001\tempDir-001\collection1\conf\en-test-tokenizer.bin
   C:\Users\jenkins\workspace\Lucene-Solr-7.x-Windows\solr\build\contrib\solr-analysis-extras\test\J1\temp\solr.update.processor.TestOpenNLPExtractNamedEntitiesUpdateProcessorFactory_1734E3A29CC63F0B-001\tempDir-001\collection1\conf\en-test-ner-person.bin:
java.nio.file.AccessDeniedException: C:\Users\jenkins\workspace\Lucene-Solr-7.x-Windows\solr\build\contrib\solr-analysis-extras\test\J1\temp\solr.update.processor.TestOpenNLPExtractNamedEntitiesUpdateProcessorFactory_1734E3A29CC63F0B-001\tempDir-001\collection1\conf\en-test-ner-person.bin
   C:\Users\jenkins\workspace\Lucene-Solr-7.x-Windows\solr\build\contrib\solr-analysis-extras\test\J1\temp\solr.update.processor.TestOpenNLPExtractNamedEntitiesUpdateProcessorFactory_1734E3A29CC63F0B-001\tempDir-001\collection1\conf\en-test-sent.bin:
java.nio.file.AccessDeniedException: C:\Users\jenkins\workspace\Lucene-Solr-7.x-Windows\solr\build\contrib\solr-analysis-extras\test\J1\temp\solr.update.processor.TestOpenNLPExtractNamedEntitiesUpdateProcessorFactory_1734E3A29CC63F0B-001\tempDir-001\collection1\conf\en-test-sent.bin
   C:\Users\jenkins\workspace\Lucene-Solr-7.x-Windows\solr\build\contrib\solr-analysis-extras\test\J1\temp\solr.update.processor.TestOpenNLPExtractNamedEntitiesUpdateProcessorFactory_1734E3A29CC63F0B-001:
java.nio.file.DirectoryNotEmptyException: C:\Users\jenkins\workspace\Lucene-Solr-7.x-Windows\solr\build\contrib\solr-analysis-extras\test\J1\temp\solr.update.processor.TestOpenNLPExtractNamedEntitiesUpdateProcessorFactory_1734E3A29CC63F0B-001

	at __randomizedtesting.SeedInfo.seed([1734E3A29CC63F0B]:0)
	at org.apache.lucene.util.IOUtils.rm(IOUtils.java:329)
	at org.apache.lucene.util.TestRuleTemporaryFilesCleanup.afterAlways(TestRuleTemporaryFilesCleanup.java:216)
	at com.carrotsearch.randomizedtesting.rules.TestRuleAdapter$1.afterAlways(TestRuleAdapter.java:31)
	at com.carrotsearch.randomizedtesting.rules.StatementAdapter.evaluate(StatementAdapter.java:43)
	at com.carrotsearch.randomizedtesting.rules.StatementAdapter.evaluate(StatementAdapter.java:36)
	at org.apache.lucene.util.TestRuleAssertionsRequired$1.evaluate(TestRuleAssertionsRequired.java:53)
	at org.apache.lucene.util.TestRuleMarkFailure$1.evaluate(TestRuleMarkFailure.java:47)
	at org.apache.lucene.util.TestRuleIgnoreAfterMaxFailures$1.evaluate(TestRuleIgnoreAfterMaxFailures.java:64)
	at org.apache.lucene.util.TestRuleIgnoreTestSuites$1.evaluate(TestRuleIgnoreTestSuites.java:54)
	at com.carrotsearch.randomizedtesting.rules.StatementAdapter.evaluate(StatementAdapter.java:36)
	at com.carrotsearch.randomizedtesting.ThreadLeakControl$StatementRunner.run(ThreadLeakControl.java:368)
	at java.base/java.lang.Thread.run(Thread.java:844)




Build Log:
[...truncated 4784 lines...]
   [junit4] Suite: org.apache.lucene.index.TestBackwardsCompatibility
   [junit4] IGNOR/A 0.00s J1 | TestBackwardsCompatibility.testCreateSingleSegmentCFS
   [junit4]    > Assumption #1: backcompat creation tests must be run with -Dtests.bwcdir=/path/to/write/indexes
   [junit4] IGNOR/A 0.00s J1 | TestBackwardsCompatibility.testCreateEmptyIndex
   [junit4]    > Assumption #1: backcompat creation tests must be run with -Dtests.bwcdir=/path/to/write/indexes
   [junit4] IGNOR/A 0.00s J1 | TestBackwardsCompatibility.testCreateCFS
   [junit4]    > Assumption #1: backcompat creation tests must be run with -Dtests.bwcdir=/path/to/write/indexes
   [junit4] IGNOR/A 0.00s J1 | TestBackwardsCompatibility.testCreateNoCFS
   [junit4]    > Assumption #1: backcompat creation tests must be run with -Dtests.bwcdir=/path/to/write/indexes
   [junit4] IGNOR/A 0.00s J1 | TestBackwardsCompatibility.testCreateMoreTermsIndex
   [junit4]    > Assumption #1: backcompat creation tests must be run with -Dtests.bwcdir=/path/to/write/indexes
   [junit4] IGNOR/A 0.00s J1 | TestBackwardsCompatibility.testCreateIndexWithDocValuesUpdates
   [junit4]    > Assumption #1: backcompat creation tests must be run with -Dtests.bwcdir=/path/to/write/indexes
   [junit4] IGNOR/A 0.00s J1 | TestBackwardsCompatibility.testCreateSortedIndex
   [junit4]    > Assumption #1: backcompat creation tests must be run with -Dtests.bwcdir=/path/to/write/indexes
   [junit4] IGNOR/A 0.00s J1 | TestBackwardsCompatibility.testCreateSingleSegmentNoCFS
   [junit4]    > Assumption #1: backcompat creation tests must be run with -Dtests.bwcdir=/path/to/write/indexes
   [junit4]   2> NOTE: test params are: codec=Asserting(Lucene70): {content6=PostingsFormat(name=Memory),
content5=PostingsFormat(name=Direct), content4=PostingsFormat(name=Asserting), trieInt=PostingsFormat(name=Memory),
content3=Lucene50(blocksize=128), content2=PostingsFormat(name=Memory), fie?ld=PostingsFormat(name=Memory),
utf8=PostingsFormat(name=Asserting), trieLong=Lucene50(blocksize=128), id=PostingsFormat(name=Memory),
content=PostingsFormat(name=Asserting), autf8=Lucene50(blocksize=128)}, docValues:{dvShort=DocValuesFormat(name=Asserting),
utf8=DocValuesFormat(name=Lucene70), fie?ld=DocValuesFormat(name=Direct), dvInt=DocValuesFormat(name=Lucene70),
longPoint2d=DocValuesFormat(name=Asserting), dvBytesSortedVar=DocValuesFormat(name=Direct),
dvSortedSet=DocValuesFormat(name=Direct), content=DocValuesFormat(name=Lucene70), floatPoint1d=DocValuesFormat(name=Direct),
intPoint1d=DocValuesFormat(name=Memory), doublePoint2d=DocValuesFormat(name=Direct), trieLong=DocValuesFormat(name=Asserting),
dvBytesDerefVar=DocValuesFormat(name=Asserting), id=DocValuesFormat(name=Direct), binaryPoint2d=DocValuesFormat(name=Lucene70),
dvSortedNumeric=DocValuesFormat(name=Asserting), dvBytesDerefFixed=DocValuesFormat(name=Lucene70),
autf8=DocValuesFormat(name=Asserting), dvBytesSortedFixed=DocValuesFormat(name=Asserting),
dvBytesStraightVar=DocValuesFormat(name=Memory), trieInt=DocValuesFormat(name=Direct), dvBytesStraightFixed=DocValuesFormat(name=Direct),
dvLong=DocValuesFormat(name=Asserting), longPoint1d=DocValuesFormat(name=Lucene70), floatPoint2d=DocValuesFormat(name=Asserting),
dvDouble=DocValuesFormat(name=Direct), dvFloat=DocValuesFormat(name=Asserting), content6=DocValuesFormat(name=Direct),
content5=DocValuesFormat(name=Memory), dvPacked=DocValuesFormat(name=Asserting), intPoint2d=DocValuesFormat(name=Direct),
content4=DocValuesFormat(name=Lucene70), content3=DocValuesFormat(name=Asserting), content2=DocValuesFormat(name=Direct),
doublePoint1d=DocValuesFormat(name=Asserting), dvByte=DocValuesFormat(name=Asserting), binaryPoint1d=DocValuesFormat(name=Asserting)},
maxPointsInLeafNode=720, maxMBSortInHeap=5.379360960713848, sim=RandomSimilarity(queryNorm=false):
{content6=DFR GZ(0.3), content5=IB SPL-DZ(0.3), content2=DFR GLZ(0.3), utf8=IB SPL-L2, fie?ld=DFR
I(F)B3(800.0), content=DFI(Saturated), autf8=DFR I(ne)1}, locale=de-AT, timezone=Asia/Novokuznetsk
   [junit4]   2> NOTE: Windows 10 10.0 amd64/Oracle Corporation 9.0.1 (64-bit)/cpus=3,threads=1,free=60212272,total=97386496
   [junit4]   2> NOTE: All tests run in this JVM: [TestLucene53NormsFormat, TestLucene62SegmentInfoFormat,
TestBackwardsCompatibility]
   [junit4]   2> NOTE: reproduce with: ant test  -Dtestcase=TestBackwardsCompatibility
-Dtests.seed=428A79AEFA059D79 -Dtests.slow=true -Dtests.locale=de-AT -Dtests.timezone=Asia/Novokuznetsk
-Dtests.asserts=true -Dtests.file.encoding=Cp1252
   [junit4] ERROR   0.00s J1 | TestBackwardsCompatibility (suite) <<<
   [junit4]    > Throwable #1: java.io.IOException: Could not remove the following files
(in the order of attempts):
   [junit4]    >    C:\Users\jenkins\workspace\Lucene-Solr-7.x-Windows\lucene\build\backward-codecs\test\J1\temp\lucene.index.TestBackwardsCompatibility_428A79AEFA059D79-001\2.9.4-cfs-001:
java.nio.file.DirectoryNotEmptyException: C:\Users\jenkins\workspace\Lucene-Solr-7.x-Windows\lucene\build\backward-codecs\test\J1\temp\lucene.index.TestBackwardsCompatibility_428A79AEFA059D79-001\2.9.4-cfs-001
   [junit4]    > 	at __randomizedtesting.SeedInfo.seed([428A79AEFA059D79]:0)
   [junit4]    > 	at org.apache.lucene.util.IOUtils.rm(IOUtils.java:329)
   [junit4]    > 	at java.base/java.lang.Thread.run(Thread.java:844)
   [junit4] Completed [5/8 (1!)] on J1 in 57.26s, 30 tests, 1 error, 8 skipped <<<
FAILURES!

[...truncated 7600 lines...]
   [junit4] Suite: org.apache.solr.cloud.api.collections.TestHdfsCloudBackupRestore
   [junit4]   2> 859413 INFO  (SUITE-TestHdfsCloudBackupRestore-seed#[DDB246A44A2BDF02]-worker)
[    ] o.a.s.SolrTestCaseJ4 SecureRandom sanity checks: test.solr.allowed.securerandom=null
& java.security.egd=file:/dev/./urandom
   [junit4]   2> Creating dataDir: C:\Users\jenkins\workspace\Lucene-Solr-7.x-Windows\solr\build\solr-core\test\J0\temp\solr.cloud.api.collections.TestHdfsCloudBackupRestore_DDB246A44A2BDF02-001\init-core-data-001
   [junit4]   2> 859413 INFO  (SUITE-TestHdfsCloudBackupRestore-seed#[DDB246A44A2BDF02]-worker)
[    ] o.a.s.SolrTestCaseJ4 Using TrieFields (NUMERIC_POINTS_SYSPROP=false) w/NUMERIC_DOCVALUES_SYSPROP=true
   [junit4]   2> 859415 INFO  (SUITE-TestHdfsCloudBackupRestore-seed#[DDB246A44A2BDF02]-worker)
[    ] o.a.s.SolrTestCaseJ4 Randomized ssl (false) and clientAuth (false) via: @org.apache.solr.util.RandomizeSSL(reason="",
value=0.0/0.0, ssl=0.0/0.0, clientAuth=0.0/0.0)
   [junit4]   2> 859415 INFO  (SUITE-TestHdfsCloudBackupRestore-seed#[DDB246A44A2BDF02]-worker)
[    ] o.a.s.SolrTestCaseJ4 ------------------------------------------------------- Done waiting
for tracked resources to be released
   [junit4]   2> NOTE: test params are: codec=CheapBastard, sim=RandomSimilarity(queryNorm=true):
{}, locale=os-RU, timezone=ROK
   [junit4]   2> NOTE: Windows 10 10.0 amd64/Oracle Corporation 9.0.1 (64-bit)/cpus=3,threads=1,free=92974504,total=352571392
   [junit4]   2> NOTE: All tests run in this JVM: [TestLeaderInitiatedRecoveryThread, DeleteNodeTest,
TestNRTOpen, OpenCloseCoreStressTest, TestIBSimilarityFactory, JavabinLoaderTest, CloudExitableDirectoryReaderTest,
TestFunctionQuery, SolrShardReporterTest, BigEndianAscendingWordDeserializerTest, MoreLikeThisHandlerTest,
RecoveryZkTest, ReplicationFactorTest, TestQueryWrapperFilter, TestShardHandlerFactory, TestMergePolicyConfig,
AutoscalingHistoryHandlerTest, MoveReplicaHDFSFailoverTest, HttpTriggerListenerTest, TestGenericDistributedQueue,
ManagedSchemaRoundRobinCloudTest, TestPayloadCheckQParserPlugin, TestLazyCores, AutoScalingHandlerTest,
TestPostingsSolrHighlighter, TestPrepRecovery, SolrIndexMetricsTest, TestZkChroot, InfoHandlerTest,
TestSchemaManager, WordBreakSolrSpellCheckerTest, TestSolrCoreParser, CoreSorterTest, StatelessScriptUpdateProcessorFactoryTest,
SolrMetricReporterTest, SolrInfoBeanTest, HighlighterTest, ClassificationUpdateProcessorIntegrationTest,
SOLR749Test, BooleanFieldTest, ExecutePlanActionTest, TestNumericTokenStream, HdfsDirectoryTest,
FastVectorHighlighterTest, TestConfigSetsAPI, TestCursorMarkWithoutUniqueKey, TestDelegationWithHadoopAuth,
TestSweetSpotSimilarityFactory, SolrIndexSplitterTest, TestRemoteStreaming, TestExportWriter,
TestExactSharedStatsCache, BlobRepositoryCloudTest, BasicZkTest, UUIDUpdateProcessorFallbackTest,
TestPullReplicaErrorHandling, MultiTermTest, BlockJoinFacetSimpleTest, RuleEngineTest, AutoAddReplicasIntegrationTest,
SaslZkACLProviderTest, TestSegmentSorting, MBeansHandlerTest, TemplateUpdateProcessorTest,
ConfigSetsAPITest, CdcrReplicationDistributedZkTest, TestSolrCLIRunExample, SolrPluginUtilsTest,
TestQueryTypes, TestDynamicFieldCollectionResource, TestClusterStateMutator, AddSchemaFieldsUpdateProcessorFactoryTest,
DataDrivenBlockJoinTest, QueryElevationComponentTest, TestLegacyFieldReuse, NumericFieldsTest,
TestUninvertingReader, TestConfigSetProperties, SolrCoreMetricManagerTest, TestLRUStatsCache,
TestHashQParserPlugin, UpdateLogTest, TestUtils, TestFileDictionaryLookup, TestNumericTerms32,
SampleTest, MetricUtilsTest, FileUtilsTest, TestHdfsCloudBackupRestore]
   [junit4]   2> NOTE: reproduce with: ant test  -Dtestcase=TestHdfsCloudBackupRestore
-Dtests.seed=DDB246A44A2BDF02 -Dtests.slow=true -Dtests.locale=os-RU -Dtests.timezone=ROK
-Dtests.asserts=true -Dtests.file.encoding=ISO-8859-1
   [junit4] ERROR   0.00s J0 | TestHdfsCloudBackupRestore (suite) <<<
   [junit4]    > Assumption #1: HDFS tests were disabled by -Dtests.disableHdfsThrowable
#2: java.io.IOException: Could not remove the following files (in the order of attempts):
   [junit4]    >    C:\Users\jenkins\workspace\Lucene-Solr-7.x-Windows\solr\build\solr-core\test\J0\temp\solr.cloud.api.collections.TestHdfsCloudBackupRestore_DDB246A44A2BDF02-001\init-core-data-001:
java.nio.file.AccessDeniedException: C:\Users\jenkins\workspace\Lucene-Solr-7.x-Windows\solr\build\solr-core\test\J0\temp\solr.cloud.api.collections.TestHdfsCloudBackupRestore_DDB246A44A2BDF02-001\init-core-data-001
   [junit4]    >    C:\Users\jenkins\workspace\Lucene-Solr-7.x-Windows\solr\build\solr-core\test\J0\temp\solr.cloud.api.collections.TestHdfsCloudBackupRestore_DDB246A44A2BDF02-001:
java.nio.file.DirectoryNotEmptyException: C:\Users\jenkins\workspace\Lucene-Solr-7.x-Windows\solr\build\solr-core\test\J0\temp\solr.cloud.api.collections.TestHdfsCloudBackupRestore_DDB246A44A2BDF02-001
   [junit4]    > 	at org.apache.lucene.util.IOUtils.rm(IOUtils.java:329)
   [junit4]    > 	at java.base/java.lang.Thread.run(Thread.java:844)
   [junit4] Completed [200/769 (1!)] on J0 in 0.02s, 0 tests, 1 error <<< FAILURES!

[...truncated 4322 lines...]
   [junit4] Suite: org.apache.solr.update.processor.TestOpenNLPExtractNamedEntitiesUpdateProcessorFactory
   [junit4]   2> Creating dataDir: C:\Users\jenkins\workspace\Lucene-Solr-7.x-Windows\solr\build\contrib\solr-analysis-extras\test\J1\temp\solr.update.processor.TestOpenNLPExtractNamedEntitiesUpdateProcessorFactory_1734E3A29CC63F0B-001\init-core-data-001
   [junit4]   2> NOTE: test params are: codec=Asserting(Lucene70): {}, docValues:{}, maxPointsInLeafNode=344,
maxMBSortInHeap=5.9638393433994645, sim=RandomSimilarity(queryNorm=false): {}, locale=en-IM,
timezone=Africa/Gaborone
   [junit4]   2> NOTE: Windows 10 10.0 amd64/Oracle Corporation 9.0.1 (64-bit)/cpus=3,threads=1,free=64265800,total=97386496
   [junit4]   2> NOTE: All tests run in this JVM: [TestFoldingMultitermExtrasQuery, TestOpenNLPExtractNamedEntitiesUpdateProcessorFactory]
   [junit4]   2> NOTE: reproduce with: ant test  -Dtestcase=TestOpenNLPExtractNamedEntitiesUpdateProcessorFactory
-Dtests.seed=1734E3A29CC63F0B -Dtests.slow=true -Dtests.locale=en-IM -Dtests.timezone=Africa/Gaborone
-Dtests.asserts=true -Dtests.file.encoding=Cp1252
   [junit4] ERROR   0.00s J1 | TestOpenNLPExtractNamedEntitiesUpdateProcessorFactory (suite)
<<<
   [junit4]    > Throwable #1: java.io.IOException: Could not remove the following files
(in the order of attempts):
   [junit4]    >    C:\Users\jenkins\workspace\Lucene-Solr-7.x-Windows\solr\build\contrib\solr-analysis-extras\test\J1\temp\solr.update.processor.TestOpenNLPExtractNamedEntitiesUpdateProcessorFactory_1734E3A29CC63F0B-001\tempDir-001\collection1\conf:
java.nio.file.DirectoryNotEmptyException: C:\Users\jenkins\workspace\Lucene-Solr-7.x-Windows\solr\build\contrib\solr-analysis-extras\test\J1\temp\solr.update.processor.TestOpenNLPExtractNamedEntitiesUpdateProcessorFactory_1734E3A29CC63F0B-001\tempDir-001\collection1\conf
   [junit4]    >    C:\Users\jenkins\workspace\Lucene-Solr-7.x-Windows\solr\build\contrib\solr-analysis-extras\test\J1\temp\solr.update.processor.TestOpenNLPExtractNamedEntitiesUpdateProcessorFactory_1734E3A29CC63F0B-001\tempDir-001\collection1:
java.nio.file.DirectoryNotEmptyException: C:\Users\jenkins\workspace\Lucene-Solr-7.x-Windows\solr\build\contrib\solr-analysis-extras\test\J1\temp\solr.update.processor.TestOpenNLPExtractNamedEntitiesUpdateProcessorFactory_1734E3A29CC63F0B-001\tempDir-001\collection1
   [junit4]    >    C:\Users\jenkins\workspace\Lucene-Solr-7.x-Windows\solr\build\contrib\solr-analysis-extras\test\J1\temp\solr.update.processor.TestOpenNLPExtractNamedEntitiesUpdateProcessorFactory_1734E3A29CC63F0B-001\tempDir-001:
java.nio.file.DirectoryNotEmptyException: C:\Users\jenkins\workspace\Lucene-Solr-7.x-Windows\solr\build\contrib\solr-analysis-extras\test\J1\temp\solr.update.processor.TestOpenNLPExtractNamedEntitiesUpdateProcessorFactory_1734E3A29CC63F0B-001\tempDir-001
   [junit4]    >    C:\Users\jenkins\workspace\Lucene-Solr-7.x-Windows\solr\build\contrib\solr-analysis-extras\test\J1\temp\solr.update.processor.TestOpenNLPExtractNamedEntitiesUpdateProcessorFactory_1734E3A29CC63F0B-001\tempDir-001\collection1\conf\en-test-tokenizer.bin:
java.nio.file.AccessDeniedException: C:\Users\jenkins\workspace\Lucene-Solr-7.x-Windows\solr\build\contrib\solr-analysis-extras\test\J1\temp\solr.update.processor.TestOpenNLPExtractNamedEntitiesUpdateProcessorFactory_1734E3A29CC63F0B-001\tempDir-001\collection1\conf\en-test-tokenizer.bin
   [junit4]    >    C:\Users\jenkins\workspace\Lucene-Solr-7.x-Windows\solr\build\contrib\solr-analysis-extras\test\J1\temp\solr.update.processor.TestOpenNLPExtractNamedEntitiesUpdateProcessorFactory_1734E3A29CC63F0B-001\tempDir-001\collection1\conf\en-test-ner-person.bin:
java.nio.file.AccessDeniedException: C:\Users\jenkins\workspace\Lucene-Solr-7.x-Windows\solr\build\contrib\solr-analysis-extras\test\J1\temp\solr.update.processor.TestOpenNLPExtractNamedEntitiesUpdateProcessorFactory_1734E3A29CC63F0B-001\tempDir-001\collection1\conf\en-test-ner-person.bin
   [junit4]    >    C:\Users\jenkins\workspace\Lucene-Solr-7.x-Windows\solr\build\contrib\solr-analysis-extras\test\J1\temp\solr.update.processor.TestOpenNLPExtractNamedEntitiesUpdateProcessorFactory_1734E3A29CC63F0B-001\tempDir-001\collection1\conf\en-test-sent.bin:
java.nio.file.AccessDeniedException: C:\Users\jenkins\workspace\Lucene-Solr-7.x-Windows\solr\build\contrib\solr-analysis-extras\test\J1\temp\solr.update.processor.TestOpenNLPExtractNamedEntitiesUpdateProcessorFactory_1734E3A29CC63F0B-001\tempDir-001\collection1\conf\en-test-sent.bin
   [junit4]    >    C:\Users\jenkins\workspace\Lucene-Solr-7.x-Windows\solr\build\contrib\solr-analysis-extras\test\J1\temp\solr.update.processor.TestOpenNLPExtractNamedEntitiesUpdateProcessorFactory_1734E3A29CC63F0B-001:
java.nio.file.DirectoryNotEmptyException: C:\Users\jenkins\workspace\Lucene-Solr-7.x-Windows\solr\build\contrib\solr-analysis-extras\test\J1\temp\solr.update.processor.TestOpenNLPExtractNamedEntitiesUpdateProcessorFactory_1734E3A29CC63F0B-001
   [junit4]    > 	at __randomizedtesting.SeedInfo.seed([1734E3A29CC63F0B]:0)
   [junit4]    > 	at org.apache.lucene.util.IOUtils.rm(IOUtils.java:329)
   [junit4]    > 	at java.base/java.lang.Thread.run(Thread.java:844)
   [junit4] Completed [4/5 (1!)] on J1 in 1.66s, 8 tests, 1 error <<< FAILURES!

[...truncated 681 lines...]
   [junit4] Suite: org.apache.solr.analytics.OverallAnalyticsTest
   [junit4]   2> Creating dataDir: C:\Users\jenkins\workspace\Lucene-Solr-7.x-Windows\solr\build\contrib\solr-analytics\test\J1\temp\solr.analytics.OverallAnalyticsTest_1C3DE99668323C1F-001\init-core-data-001
   [junit4]   2> Jan 27, 2018 9:04:58 PM com.carrotsearch.randomizedtesting.ThreadLeakControl
checkThreadLeaks
   [junit4]   2> WARNING: Will linger awaiting termination of 5 leaked thread(s).
   [junit4]   2> NOTE: test params are: codec=Asserting(Lucene70): {string_s=PostingsFormat(name=Direct),
id=Lucene50(blocksize=128), string_sm=BlockTreeOrds(blocksize=128)}, docValues:{int_i=DocValuesFormat(name=Asserting),
double_dm=DocValuesFormat(name=Lucene70), float_fm=DocValuesFormat(name=Lucene70), int_im=DocValuesFormat(name=Lucene70),
date_dt=DocValuesFormat(name=Asserting), date_dtm=DocValuesFormat(name=Direct), long_lm=DocValuesFormat(name=Direct),
double_d=DocValuesFormat(name=Lucene70), float_f=DocValuesFormat(name=Lucene70), long_l=DocValuesFormat(name=Asserting),
_version_=DocValuesFormat(name=Direct), string_s=DocValuesFormat(name=Asserting), id=DocValuesFormat(name=Lucene70),
string_sm=DocValuesFormat(name=Lucene70)}, maxPointsInLeafNode=1234, maxMBSortInHeap=7.33029734017537,
sim=RandomSimilarity(queryNorm=false): {}, locale=vai, timezone=Asia/Srednekolymsk
   [junit4]   2> NOTE: Windows 10 10.0 amd64/Oracle Corporation 9.0.1 (64-bit)/cpus=3,threads=1,free=15365640,total=104738816
   [junit4]   2> NOTE: All tests run in this JVM: [DateFieldsTest, ExistsFunctionTest,
CastingStringValueStreamTest, AndFunctionTest, LegacyAbstractAnalyticsFacetCloudTest, LegacyQueryFacetTest,
NoFacetTest, LongFieldsTest, CastingBooleanValueStreamTest, MultFunctionTest, LegacyFieldFacetExtrasCloudTest,
ConstantValueTest, LegacyAbstractAnalyticsCloudTest, DateMathFunctionTest, LegacyFieldFacetTest,
CastingDoubleValueStreamTest, RemoveFunctionTest, RangeFacetTest, CastingIntValueStreamTest,
SubtractFunctionTest, OverallAnalyticsTest]
   [junit4]   2> NOTE: reproduce with: ant test  -Dtestcase=OverallAnalyticsTest -Dtests.seed=1C3DE99668323C1F
-Dtests.slow=true -Dtests.locale=vai -Dtests.timezone=Asia/Srednekolymsk -Dtests.asserts=true
-Dtests.file.encoding=UTF-8
   [junit4] ERROR   0.00s J1 | OverallAnalyticsTest (suite) <<<
   [junit4]    > Throwable #1: java.io.IOException: Could not remove the following files
(in the order of attempts):
   [junit4]    >    C:\Users\jenkins\workspace\Lucene-Solr-7.x-Windows\solr\build\contrib\solr-analytics\test\J1\temp\solr.analytics.OverallAnalyticsTest_1C3DE99668323C1F-001\tempDir-001\node1\collection1_shard1_replica_n1\data\tlog:
java.nio.file.DirectoryNotEmptyException: C:\Users\jenkins\workspace\Lucene-Solr-7.x-Windows\solr\build\contrib\solr-analytics\test\J1\temp\solr.analytics.OverallAnalyticsTest_1C3DE99668323C1F-001\tempDir-001\node1\collection1_shard1_replica_n1\data\tlog
   [junit4]    >    C:\Users\jenkins\workspace\Lucene-Solr-7.x-Windows\solr\build\contrib\solr-analytics\test\J1\temp\solr.analytics.OverallAnalyticsTest_1C3DE99668323C1F-001\tempDir-001\node1\collection1_shard1_replica_n1\data:
java.nio.file.DirectoryNotEmptyException: C:\Users\jenkins\workspace\Lucene-Solr-7.x-Windows\solr\build\contrib\solr-analytics\test\J1\temp\solr.analytics.OverallAnalyticsTest_1C3DE99668323C1F-001\tempDir-001\node1\collection1_shard1_replica_n1\data
   [junit4]    >    C:\Users\jenkins\workspace\Lucene-Solr-7.x-Windows\solr\build\contrib\solr-analytics\test\J1\temp\solr.analytics.OverallAnalyticsTest_1C3DE99668323C1F-001\tempDir-001\node1\collection1_shard1_replica_n1:
java.nio.file.DirectoryNotEmptyException: C:\Users\jenkins\workspace\Lucene-Solr-7.x-Windows\solr\build\contrib\solr-analytics\test\J1\temp\solr.analytics.OverallAnalyticsTest_1C3DE99668323C1F-001\tempDir-001\node1\collection1_shard1_replica_n1
   [junit4]    >    C:\Users\jenkins\workspace\Lucene-Solr-7.x-Windows\solr\build\contrib\solr-analytics\test\J1\temp\solr.analytics.OverallAnalyticsTest_1C3DE99668323C1F-001\tempDir-001\node1:
java.nio.file.DirectoryNotEmptyException: C:\Users\jenkins\workspace\Lucene-Solr-7.x-Windows\solr\build\contrib\solr-analytics\test\J1\temp\solr.analytics.OverallAnalyticsTest_1C3DE99668323C1F-001\tempDir-001\node1
   [junit4]    >    C:\Users\jenkins\workspace\Lucene-Solr-7.x-Windows\solr\build\contrib\solr-analytics\test\J1\temp\solr.analytics.OverallAnalyticsTest_1C3DE99668323C1F-001\tempDir-001:
java.nio.file.DirectoryNotEmptyException: C:\Users\jenkins\workspace\Lucene-Solr-7.x-Windows\solr\build\contrib\solr-analytics\test\J1\temp\solr.analytics.OverallAnalyticsTest_1C3DE99668323C1F-001\tempDir-001
   [junit4]    > 	at __randomizedtesting.SeedInfo.seed([1C3DE99668323C1F]:0)
   [junit4]    > 	at org.apache.lucene.util.IOUtils.rm(IOUtils.java:329)
   [junit4]    > 	at java.base/java.lang.Thread.run(Thread.java:844)
   [junit4] Completed [38/78 (1!)] on J1 in 5.58s, 1 test, 1 error <<< FAILURES!

[...truncated 37846 lines...]

Mime
View raw message