lucene-dev mailing list archives

Site index · List index
Message view « Date » · « Thread »
Top « Date » · « Thread »
From Policeman Jenkins Server <jenk...@thetaphi.de>
Subject [JENKINS-EA] Lucene-Solr-7.x-Linux (64bit/jdk-10-ea+37) - Build # 1154 - Still Unstable!
Date Tue, 09 Jan 2018 17:08:29 GMT
Build: https://jenkins.thetaphi.de/job/Lucene-Solr-7.x-Linux/1154/
Java: 64bit/jdk-10-ea+37 -XX:-UseCompressedOops -XX:+UseG1GC

10 tests failed.
FAILED:  org.apache.solr.cloud.MoveReplicaHDFSTest.testFailedMove

Error Message:
No live SolrServers available to handle this request:[https://127.0.0.1:46105/solr/MoveReplicaHDFSTest_failed_coll_true, https://127.0.0.1:43641/solr/MoveReplicaHDFSTest_failed_coll_true]

Stack Trace:
org.apache.solr.client.solrj.SolrServerException: No live SolrServers available to handle this request:[https://127.0.0.1:46105/solr/MoveReplicaHDFSTest_failed_coll_true, https://127.0.0.1:43641/solr/MoveReplicaHDFSTest_failed_coll_true]
	at __randomizedtesting.SeedInfo.seed([787A96007F702FE8:D2B745F2C8A3FA38]:0)
	at org.apache.solr.client.solrj.impl.LBHttpSolrClient.request(LBHttpSolrClient.java:462)
	at org.apache.solr.client.solrj.impl.CloudSolrClient.sendRequest(CloudSolrClient.java:1104)
	at org.apache.solr.client.solrj.impl.CloudSolrClient.requestWithRetryOnStaleState(CloudSolrClient.java:884)
	at org.apache.solr.client.solrj.impl.CloudSolrClient.requestWithRetryOnStaleState(CloudSolrClient.java:991)
	at org.apache.solr.client.solrj.impl.CloudSolrClient.request(CloudSolrClient.java:817)
	at org.apache.solr.client.solrj.SolrRequest.process(SolrRequest.java:194)
	at org.apache.solr.client.solrj.SolrClient.query(SolrClient.java:942)
	at org.apache.solr.cloud.MoveReplicaTest.testFailedMove(MoveReplicaTest.java:306)
	at java.base/jdk.internal.reflect.NativeMethodAccessorImpl.invoke0(Native Method)
	at java.base/jdk.internal.reflect.NativeMethodAccessorImpl.invoke(NativeMethodAccessorImpl.java:62)
	at java.base/jdk.internal.reflect.DelegatingMethodAccessorImpl.invoke(DelegatingMethodAccessorImpl.java:43)
	at java.base/java.lang.reflect.Method.invoke(Method.java:564)
	at com.carrotsearch.randomizedtesting.RandomizedRunner.invoke(RandomizedRunner.java:1737)
	at com.carrotsearch.randomizedtesting.RandomizedRunner$8.evaluate(RandomizedRunner.java:934)
	at com.carrotsearch.randomizedtesting.RandomizedRunner$9.evaluate(RandomizedRunner.java:970)
	at com.carrotsearch.randomizedtesting.RandomizedRunner$10.evaluate(RandomizedRunner.java:984)
	at com.carrotsearch.randomizedtesting.rules.SystemPropertiesRestoreRule$1.evaluate(SystemPropertiesRestoreRule.java:57)
	at org.apache.lucene.util.TestRuleSetupTeardownChained$1.evaluate(TestRuleSetupTeardownChained.java:49)
	at org.apache.lucene.util.AbstractBeforeAfterRule$1.evaluate(AbstractBeforeAfterRule.java:45)
	at org.apache.lucene.util.TestRuleThreadAndTestName$1.evaluate(TestRuleThreadAndTestName.java:48)
	at org.apache.lucene.util.TestRuleIgnoreAfterMaxFailures$1.evaluate(TestRuleIgnoreAfterMaxFailures.java:64)
	at org.apache.lucene.util.TestRuleMarkFailure$1.evaluate(TestRuleMarkFailure.java:47)
	at com.carrotsearch.randomizedtesting.rules.StatementAdapter.evaluate(StatementAdapter.java:36)
	at com.carrotsearch.randomizedtesting.ThreadLeakControl$StatementRunner.run(ThreadLeakControl.java:368)
	at com.carrotsearch.randomizedtesting.ThreadLeakControl.forkTimeoutingTask(ThreadLeakControl.java:817)
	at com.carrotsearch.randomizedtesting.ThreadLeakControl$3.evaluate(ThreadLeakControl.java:468)
	at com.carrotsearch.randomizedtesting.RandomizedRunner.runSingleTest(RandomizedRunner.java:943)
	at com.carrotsearch.randomizedtesting.RandomizedRunner$5.evaluate(RandomizedRunner.java:829)
	at com.carrotsearch.randomizedtesting.RandomizedRunner$6.evaluate(RandomizedRunner.java:879)
	at com.carrotsearch.randomizedtesting.RandomizedRunner$7.evaluate(RandomizedRunner.java:890)
	at com.carrotsearch.randomizedtesting.rules.StatementAdapter.evaluate(StatementAdapter.java:36)
	at com.carrotsearch.randomizedtesting.rules.SystemPropertiesRestoreRule$1.evaluate(SystemPropertiesRestoreRule.java:57)
	at org.apache.lucene.util.AbstractBeforeAfterRule$1.evaluate(AbstractBeforeAfterRule.java:45)
	at com.carrotsearch.randomizedtesting.rules.StatementAdapter.evaluate(StatementAdapter.java:36)
	at org.apache.lucene.util.TestRuleStoreClassName$1.evaluate(TestRuleStoreClassName.java:41)
	at com.carrotsearch.randomizedtesting.rules.NoShadowingOrOverridesOnMethodsRule$1.evaluate(NoShadowingOrOverridesOnMethodsRule.java:40)
	at com.carrotsearch.randomizedtesting.rules.NoShadowingOrOverridesOnMethodsRule$1.evaluate(NoShadowingOrOverridesOnMethodsRule.java:40)
	at com.carrotsearch.randomizedtesting.rules.StatementAdapter.evaluate(StatementAdapter.java:36)
	at com.carrotsearch.randomizedtesting.rules.StatementAdapter.evaluate(StatementAdapter.java:36)
	at org.apache.lucene.util.TestRuleAssertionsRequired$1.evaluate(TestRuleAssertionsRequired.java:53)
	at org.apache.lucene.util.TestRuleMarkFailure$1.evaluate(TestRuleMarkFailure.java:47)
	at org.apache.lucene.util.TestRuleIgnoreAfterMaxFailures$1.evaluate(TestRuleIgnoreAfterMaxFailures.java:64)
	at org.apache.lucene.util.TestRuleIgnoreTestSuites$1.evaluate(TestRuleIgnoreTestSuites.java:54)
	at com.carrotsearch.randomizedtesting.rules.StatementAdapter.evaluate(StatementAdapter.java:36)
	at com.carrotsearch.randomizedtesting.ThreadLeakControl$StatementRunner.run(ThreadLeakControl.java:368)
	at java.base/java.lang.Thread.run(Thread.java:844)
Caused by: org.apache.solr.client.solrj.impl.HttpSolrClient$RemoteSolrException: Error from server at https://127.0.0.1:46105/solr/MoveReplicaHDFSTest_failed_coll_true: no servers hosting shard: shard1
	at org.apache.solr.client.solrj.impl.HttpSolrClient.executeMethod(HttpSolrClient.java:643)
	at org.apache.solr.client.solrj.impl.HttpSolrClient.request(HttpSolrClient.java:255)
	at org.apache.solr.client.solrj.impl.HttpSolrClient.request(HttpSolrClient.java:244)
	at org.apache.solr.client.solrj.impl.LBHttpSolrClient.doRequest(LBHttpSolrClient.java:483)
	at org.apache.solr.client.solrj.impl.LBHttpSolrClient.request(LBHttpSolrClient.java:436)
	... 45 more


FAILED:  org.apache.solr.cloud.autoscaling.sim.TestDistribStateManager.testGetSetRemoveData

Error Message:
Node watch should have fired!

Stack Trace:
java.lang.AssertionError: Node watch should have fired!
	at __randomizedtesting.SeedInfo.seed([787A96007F702FE8:5EEA79522BFEE9E2]:0)
	at org.junit.Assert.fail(Assert.java:93)
	at org.apache.solr.cloud.autoscaling.sim.TestDistribStateManager.testGetSetRemoveData(TestDistribStateManager.java:256)
	at java.base/jdk.internal.reflect.NativeMethodAccessorImpl.invoke0(Native Method)
	at java.base/jdk.internal.reflect.NativeMethodAccessorImpl.invoke(NativeMethodAccessorImpl.java:62)
	at java.base/jdk.internal.reflect.DelegatingMethodAccessorImpl.invoke(DelegatingMethodAccessorImpl.java:43)
	at java.base/java.lang.reflect.Method.invoke(Method.java:564)
	at com.carrotsearch.randomizedtesting.RandomizedRunner.invoke(RandomizedRunner.java:1737)
	at com.carrotsearch.randomizedtesting.RandomizedRunner$8.evaluate(RandomizedRunner.java:934)
	at com.carrotsearch.randomizedtesting.RandomizedRunner$9.evaluate(RandomizedRunner.java:970)
	at com.carrotsearch.randomizedtesting.RandomizedRunner$10.evaluate(RandomizedRunner.java:984)
	at com.carrotsearch.randomizedtesting.rules.SystemPropertiesRestoreRule$1.evaluate(SystemPropertiesRestoreRule.java:57)
	at org.apache.lucene.util.TestRuleSetupTeardownChained$1.evaluate(TestRuleSetupTeardownChained.java:49)
	at org.apache.lucene.util.AbstractBeforeAfterRule$1.evaluate(AbstractBeforeAfterRule.java:45)
	at org.apache.lucene.util.TestRuleThreadAndTestName$1.evaluate(TestRuleThreadAndTestName.java:48)
	at org.apache.lucene.util.TestRuleIgnoreAfterMaxFailures$1.evaluate(TestRuleIgnoreAfterMaxFailures.java:64)
	at org.apache.lucene.util.TestRuleMarkFailure$1.evaluate(TestRuleMarkFailure.java:47)
	at com.carrotsearch.randomizedtesting.rules.StatementAdapter.evaluate(StatementAdapter.java:36)
	at com.carrotsearch.randomizedtesting.ThreadLeakControl$StatementRunner.run(ThreadLeakControl.java:368)
	at com.carrotsearch.randomizedtesting.ThreadLeakControl.forkTimeoutingTask(ThreadLeakControl.java:817)
	at com.carrotsearch.randomizedtesting.ThreadLeakControl$3.evaluate(ThreadLeakControl.java:468)
	at com.carrotsearch.randomizedtesting.RandomizedRunner.runSingleTest(RandomizedRunner.java:943)
	at com.carrotsearch.randomizedtesting.RandomizedRunner$5.evaluate(RandomizedRunner.java:829)
	at com.carrotsearch.randomizedtesting.RandomizedRunner$6.evaluate(RandomizedRunner.java:879)
	at com.carrotsearch.randomizedtesting.RandomizedRunner$7.evaluate(RandomizedRunner.java:890)
	at com.carrotsearch.randomizedtesting.rules.StatementAdapter.evaluate(StatementAdapter.java:36)
	at com.carrotsearch.randomizedtesting.rules.SystemPropertiesRestoreRule$1.evaluate(SystemPropertiesRestoreRule.java:57)
	at org.apache.lucene.util.AbstractBeforeAfterRule$1.evaluate(AbstractBeforeAfterRule.java:45)
	at com.carrotsearch.randomizedtesting.rules.StatementAdapter.evaluate(StatementAdapter.java:36)
	at org.apache.lucene.util.TestRuleStoreClassName$1.evaluate(TestRuleStoreClassName.java:41)
	at com.carrotsearch.randomizedtesting.rules.NoShadowingOrOverridesOnMethodsRule$1.evaluate(NoShadowingOrOverridesOnMethodsRule.java:40)
	at com.carrotsearch.randomizedtesting.rules.NoShadowingOrOverridesOnMethodsRule$1.evaluate(NoShadowingOrOverridesOnMethodsRule.java:40)
	at com.carrotsearch.randomizedtesting.rules.StatementAdapter.evaluate(StatementAdapter.java:36)
	at com.carrotsearch.randomizedtesting.rules.StatementAdapter.evaluate(StatementAdapter.java:36)
	at org.apache.lucene.util.TestRuleAssertionsRequired$1.evaluate(TestRuleAssertionsRequired.java:53)
	at org.apache.lucene.util.TestRuleMarkFailure$1.evaluate(TestRuleMarkFailure.java:47)
	at org.apache.lucene.util.TestRuleIgnoreAfterMaxFailures$1.evaluate(TestRuleIgnoreAfterMaxFailures.java:64)
	at org.apache.lucene.util.TestRuleIgnoreTestSuites$1.evaluate(TestRuleIgnoreTestSuites.java:54)
	at com.carrotsearch.randomizedtesting.rules.StatementAdapter.evaluate(StatementAdapter.java:36)
	at com.carrotsearch.randomizedtesting.ThreadLeakControl$StatementRunner.run(ThreadLeakControl.java:368)
	at java.base/java.lang.Thread.run(Thread.java:844)


FAILED:  org.apache.solr.client.solrj.request.SchemaTest.copyFieldsShouldFailWhenOneOfTheFieldsDoesntExistInTheSchema

Error Message:
Error from server at http://127.0.0.1:35681/solr/collection1: error processing commands

Stack Trace:
org.apache.solr.client.solrj.impl.HttpSolrClient$RemoteExecutionException: Error from server at http://127.0.0.1:35681/solr/collection1: error processing commands
	at __randomizedtesting.SeedInfo.seed([C443592F98B8841F:EB877E8FACB0FC75]:0)
	at org.apache.solr.client.solrj.impl.HttpSolrClient$RemoteExecutionException.create(HttpSolrClient.java:830)
	at org.apache.solr.client.solrj.impl.HttpSolrClient.executeMethod(HttpSolrClient.java:620)
	at org.apache.solr.client.solrj.impl.HttpSolrClient.request(HttpSolrClient.java:255)
	at org.apache.solr.client.solrj.impl.HttpSolrClient.request(HttpSolrClient.java:244)
	at org.apache.solr.client.solrj.SolrRequest.process(SolrRequest.java:194)
	at org.apache.solr.client.solrj.SolrRequest.process(SolrRequest.java:211)
	at org.apache.solr.client.solrj.request.SchemaTest.copyFieldsShouldFailWhenOneOfTheFieldsDoesntExistInTheSchema(SchemaTest.java:806)
	at java.base/jdk.internal.reflect.NativeMethodAccessorImpl.invoke0(Native Method)
	at java.base/jdk.internal.reflect.NativeMethodAccessorImpl.invoke(NativeMethodAccessorImpl.java:62)
	at java.base/jdk.internal.reflect.DelegatingMethodAccessorImpl.invoke(DelegatingMethodAccessorImpl.java:43)
	at java.base/java.lang.reflect.Method.invoke(Method.java:564)
	at com.carrotsearch.randomizedtesting.RandomizedRunner.invoke(RandomizedRunner.java:1737)
	at com.carrotsearch.randomizedtesting.RandomizedRunner$8.evaluate(RandomizedRunner.java:934)
	at com.carrotsearch.randomizedtesting.RandomizedRunner$9.evaluate(RandomizedRunner.java:970)
	at com.carrotsearch.randomizedtesting.RandomizedRunner$10.evaluate(RandomizedRunner.java:984)
	at com.carrotsearch.randomizedtesting.rules.SystemPropertiesRestoreRule$1.evaluate(SystemPropertiesRestoreRule.java:57)
	at org.apache.lucene.util.TestRuleSetupTeardownChained$1.evaluate(TestRuleSetupTeardownChained.java:49)
	at org.apache.lucene.util.AbstractBeforeAfterRule$1.evaluate(AbstractBeforeAfterRule.java:45)
	at org.apache.lucene.util.TestRuleThreadAndTestName$1.evaluate(TestRuleThreadAndTestName.java:48)
	at org.apache.lucene.util.TestRuleIgnoreAfterMaxFailures$1.evaluate(TestRuleIgnoreAfterMaxFailures.java:64)
	at org.apache.lucene.util.TestRuleMarkFailure$1.evaluate(TestRuleMarkFailure.java:47)
	at com.carrotsearch.randomizedtesting.rules.StatementAdapter.evaluate(StatementAdapter.java:36)
	at com.carrotsearch.randomizedtesting.ThreadLeakControl$StatementRunner.run(ThreadLeakControl.java:368)
	at com.carrotsearch.randomizedtesting.ThreadLeakControl.forkTimeoutingTask(ThreadLeakControl.java:817)
	at com.carrotsearch.randomizedtesting.ThreadLeakControl$3.evaluate(ThreadLeakControl.java:468)
	at com.carrotsearch.randomizedtesting.RandomizedRunner.runSingleTest(RandomizedRunner.java:943)
	at com.carrotsearch.randomizedtesting.RandomizedRunner$5.evaluate(RandomizedRunner.java:829)
	at com.carrotsearch.randomizedtesting.RandomizedRunner$6.evaluate(RandomizedRunner.java:879)
	at com.carrotsearch.randomizedtesting.RandomizedRunner$7.evaluate(RandomizedRunner.java:890)
	at com.carrotsearch.randomizedtesting.rules.StatementAdapter.evaluate(StatementAdapter.java:36)
	at com.carrotsearch.randomizedtesting.rules.SystemPropertiesRestoreRule$1.evaluate(SystemPropertiesRestoreRule.java:57)
	at org.apache.lucene.util.AbstractBeforeAfterRule$1.evaluate(AbstractBeforeAfterRule.java:45)
	at com.carrotsearch.randomizedtesting.rules.StatementAdapter.evaluate(StatementAdapter.java:36)
	at org.apache.lucene.util.TestRuleStoreClassName$1.evaluate(TestRuleStoreClassName.java:41)
	at com.carrotsearch.randomizedtesting.rules.NoShadowingOrOverridesOnMethodsRule$1.evaluate(NoShadowingOrOverridesOnMethodsRule.java:40)
	at com.carrotsearch.randomizedtesting.rules.NoShadowingOrOverridesOnMethodsRule$1.evaluate(NoShadowingOrOverridesOnMethodsRule.java:40)
	at com.carrotsearch.randomizedtesting.rules.StatementAdapter.evaluate(StatementAdapter.java:36)
	at com.carrotsearch.randomizedtesting.rules.StatementAdapter.evaluate(StatementAdapter.java:36)
	at org.apache.lucene.util.TestRuleAssertionsRequired$1.evaluate(TestRuleAssertionsRequired.java:53)
	at org.apache.lucene.util.TestRuleMarkFailure$1.evaluate(TestRuleMarkFailure.java:47)
	at org.apache.lucene.util.TestRuleIgnoreAfterMaxFailures$1.evaluate(TestRuleIgnoreAfterMaxFailures.java:64)
	at org.apache.lucene.util.TestRuleIgnoreTestSuites$1.evaluate(TestRuleIgnoreTestSuites.java:54)
	at com.carrotsearch.randomizedtesting.rules.StatementAdapter.evaluate(StatementAdapter.java:36)
	at com.carrotsearch.randomizedtesting.ThreadLeakControl$StatementRunner.run(ThreadLeakControl.java:368)
	at java.base/java.lang.Thread.run(Thread.java:844)


FAILED:  org.apache.solr.client.solrj.request.SchemaTest.addFieldTypeShouldntBeCalledTwiceWithTheSameName

Error Message:
Error from server at http://127.0.0.1:38427/solr/collection1: error processing commands

Stack Trace:
org.apache.solr.client.solrj.impl.HttpSolrClient$RemoteExecutionException: Error from server at http://127.0.0.1:38427/solr/collection1: error processing commands
	at __randomizedtesting.SeedInfo.seed([C443592F98B8841F:1A2AB3F66C596B7]:0)
	at org.apache.solr.client.solrj.impl.HttpSolrClient$RemoteExecutionException.create(HttpSolrClient.java:830)
	at org.apache.solr.client.solrj.impl.HttpSolrClient.executeMethod(HttpSolrClient.java:620)
	at org.apache.solr.client.solrj.impl.HttpSolrClient.request(HttpSolrClient.java:255)
	at org.apache.solr.client.solrj.impl.HttpSolrClient.request(HttpSolrClient.java:244)
	at org.apache.solr.client.solrj.SolrRequest.process(SolrRequest.java:194)
	at org.apache.solr.client.solrj.SolrRequest.process(SolrRequest.java:211)
	at org.apache.solr.client.solrj.request.SchemaTest.addFieldTypeShouldntBeCalledTwiceWithTheSameName(SchemaTest.java:649)
	at java.base/jdk.internal.reflect.NativeMethodAccessorImpl.invoke0(Native Method)
	at java.base/jdk.internal.reflect.NativeMethodAccessorImpl.invoke(NativeMethodAccessorImpl.java:62)
	at java.base/jdk.internal.reflect.DelegatingMethodAccessorImpl.invoke(DelegatingMethodAccessorImpl.java:43)
	at java.base/java.lang.reflect.Method.invoke(Method.java:564)
	at com.carrotsearch.randomizedtesting.RandomizedRunner.invoke(RandomizedRunner.java:1737)
	at com.carrotsearch.randomizedtesting.RandomizedRunner$8.evaluate(RandomizedRunner.java:934)
	at com.carrotsearch.randomizedtesting.RandomizedRunner$9.evaluate(RandomizedRunner.java:970)
	at com.carrotsearch.randomizedtesting.RandomizedRunner$10.evaluate(RandomizedRunner.java:984)
	at com.carrotsearch.randomizedtesting.rules.SystemPropertiesRestoreRule$1.evaluate(SystemPropertiesRestoreRule.java:57)
	at org.apache.lucene.util.TestRuleSetupTeardownChained$1.evaluate(TestRuleSetupTeardownChained.java:49)
	at org.apache.lucene.util.AbstractBeforeAfterRule$1.evaluate(AbstractBeforeAfterRule.java:45)
	at org.apache.lucene.util.TestRuleThreadAndTestName$1.evaluate(TestRuleThreadAndTestName.java:48)
	at org.apache.lucene.util.TestRuleIgnoreAfterMaxFailures$1.evaluate(TestRuleIgnoreAfterMaxFailures.java:64)
	at org.apache.lucene.util.TestRuleMarkFailure$1.evaluate(TestRuleMarkFailure.java:47)
	at com.carrotsearch.randomizedtesting.rules.StatementAdapter.evaluate(StatementAdapter.java:36)
	at com.carrotsearch.randomizedtesting.ThreadLeakControl$StatementRunner.run(ThreadLeakControl.java:368)
	at com.carrotsearch.randomizedtesting.ThreadLeakControl.forkTimeoutingTask(ThreadLeakControl.java:817)
	at com.carrotsearch.randomizedtesting.ThreadLeakControl$3.evaluate(ThreadLeakControl.java:468)
	at com.carrotsearch.randomizedtesting.RandomizedRunner.runSingleTest(RandomizedRunner.java:943)
	at com.carrotsearch.randomizedtesting.RandomizedRunner$5.evaluate(RandomizedRunner.java:829)
	at com.carrotsearch.randomizedtesting.RandomizedRunner$6.evaluate(RandomizedRunner.java:879)
	at com.carrotsearch.randomizedtesting.RandomizedRunner$7.evaluate(RandomizedRunner.java:890)
	at com.carrotsearch.randomizedtesting.rules.StatementAdapter.evaluate(StatementAdapter.java:36)
	at com.carrotsearch.randomizedtesting.rules.SystemPropertiesRestoreRule$1.evaluate(SystemPropertiesRestoreRule.java:57)
	at org.apache.lucene.util.AbstractBeforeAfterRule$1.evaluate(AbstractBeforeAfterRule.java:45)
	at com.carrotsearch.randomizedtesting.rules.StatementAdapter.evaluate(StatementAdapter.java:36)
	at org.apache.lucene.util.TestRuleStoreClassName$1.evaluate(TestRuleStoreClassName.java:41)
	at com.carrotsearch.randomizedtesting.rules.NoShadowingOrOverridesOnMethodsRule$1.evaluate(NoShadowingOrOverridesOnMethodsRule.java:40)
	at com.carrotsearch.randomizedtesting.rules.NoShadowingOrOverridesOnMethodsRule$1.evaluate(NoShadowingOrOverridesOnMethodsRule.java:40)
	at com.carrotsearch.randomizedtesting.rules.StatementAdapter.evaluate(StatementAdapter.java:36)
	at com.carrotsearch.randomizedtesting.rules.StatementAdapter.evaluate(StatementAdapter.java:36)
	at org.apache.lucene.util.TestRuleAssertionsRequired$1.evaluate(TestRuleAssertionsRequired.java:53)
	at org.apache.lucene.util.TestRuleMarkFailure$1.evaluate(TestRuleMarkFailure.java:47)
	at org.apache.lucene.util.TestRuleIgnoreAfterMaxFailures$1.evaluate(TestRuleIgnoreAfterMaxFailures.java:64)
	at org.apache.lucene.util.TestRuleIgnoreTestSuites$1.evaluate(TestRuleIgnoreTestSuites.java:54)
	at com.carrotsearch.randomizedtesting.rules.StatementAdapter.evaluate(StatementAdapter.java:36)
	at com.carrotsearch.randomizedtesting.ThreadLeakControl$StatementRunner.run(ThreadLeakControl.java:368)
	at java.base/java.lang.Thread.run(Thread.java:844)


FAILED:  org.apache.solr.client.solrj.request.SchemaTest.deletingAFieldTypeThatDoesntExistInTheSchemaShouldFail

Error Message:
Error from server at http://127.0.0.1:38457/solr/collection1: error processing commands

Stack Trace:
org.apache.solr.client.solrj.impl.HttpSolrClient$RemoteExecutionException: Error from server at http://127.0.0.1:38457/solr/collection1: error processing commands
	at __randomizedtesting.SeedInfo.seed([C443592F98B8841F:BF7568F5D1A2A8CA]:0)
	at org.apache.solr.client.solrj.impl.HttpSolrClient$RemoteExecutionException.create(HttpSolrClient.java:830)
	at org.apache.solr.client.solrj.impl.HttpSolrClient.executeMethod(HttpSolrClient.java:620)
	at org.apache.solr.client.solrj.impl.HttpSolrClient.request(HttpSolrClient.java:255)
	at org.apache.solr.client.solrj.impl.HttpSolrClient.request(HttpSolrClient.java:244)
	at org.apache.solr.client.solrj.SolrRequest.process(SolrRequest.java:194)
	at org.apache.solr.client.solrj.SolrRequest.process(SolrRequest.java:211)
	at org.apache.solr.client.solrj.request.SchemaTest.deletingAFieldTypeThatDoesntExistInTheSchemaShouldFail(SchemaTest.java:694)
	at java.base/jdk.internal.reflect.NativeMethodAccessorImpl.invoke0(Native Method)
	at java.base/jdk.internal.reflect.NativeMethodAccessorImpl.invoke(NativeMethodAccessorImpl.java:62)
	at java.base/jdk.internal.reflect.DelegatingMethodAccessorImpl.invoke(DelegatingMethodAccessorImpl.java:43)
	at java.base/java.lang.reflect.Method.invoke(Method.java:564)
	at com.carrotsearch.randomizedtesting.RandomizedRunner.invoke(RandomizedRunner.java:1737)
	at com.carrotsearch.randomizedtesting.RandomizedRunner$8.evaluate(RandomizedRunner.java:934)
	at com.carrotsearch.randomizedtesting.RandomizedRunner$9.evaluate(RandomizedRunner.java:970)
	at com.carrotsearch.randomizedtesting.RandomizedRunner$10.evaluate(RandomizedRunner.java:984)
	at com.carrotsearch.randomizedtesting.rules.SystemPropertiesRestoreRule$1.evaluate(SystemPropertiesRestoreRule.java:57)
	at org.apache.lucene.util.TestRuleSetupTeardownChained$1.evaluate(TestRuleSetupTeardownChained.java:49)
	at org.apache.lucene.util.AbstractBeforeAfterRule$1.evaluate(AbstractBeforeAfterRule.java:45)
	at org.apache.lucene.util.TestRuleThreadAndTestName$1.evaluate(TestRuleThreadAndTestName.java:48)
	at org.apache.lucene.util.TestRuleIgnoreAfterMaxFailures$1.evaluate(TestRuleIgnoreAfterMaxFailures.java:64)
	at org.apache.lucene.util.TestRuleMarkFailure$1.evaluate(TestRuleMarkFailure.java:47)
	at com.carrotsearch.randomizedtesting.rules.StatementAdapter.evaluate(StatementAdapter.java:36)
	at com.carrotsearch.randomizedtesting.ThreadLeakControl$StatementRunner.run(ThreadLeakControl.java:368)
	at com.carrotsearch.randomizedtesting.ThreadLeakControl.forkTimeoutingTask(ThreadLeakControl.java:817)
	at com.carrotsearch.randomizedtesting.ThreadLeakControl$3.evaluate(ThreadLeakControl.java:468)
	at com.carrotsearch.randomizedtesting.RandomizedRunner.runSingleTest(RandomizedRunner.java:943)
	at com.carrotsearch.randomizedtesting.RandomizedRunner$5.evaluate(RandomizedRunner.java:829)
	at com.carrotsearch.randomizedtesting.RandomizedRunner$6.evaluate(RandomizedRunner.java:879)
	at com.carrotsearch.randomizedtesting.RandomizedRunner$7.evaluate(RandomizedRunner.java:890)
	at com.carrotsearch.randomizedtesting.rules.StatementAdapter.evaluate(StatementAdapter.java:36)
	at com.carrotsearch.randomizedtesting.rules.SystemPropertiesRestoreRule$1.evaluate(SystemPropertiesRestoreRule.java:57)
	at org.apache.lucene.util.AbstractBeforeAfterRule$1.evaluate(AbstractBeforeAfterRule.java:45)
	at com.carrotsearch.randomizedtesting.rules.StatementAdapter.evaluate(StatementAdapter.java:36)
	at org.apache.lucene.util.TestRuleStoreClassName$1.evaluate(TestRuleStoreClassName.java:41)
	at com.carrotsearch.randomizedtesting.rules.NoShadowingOrOverridesOnMethodsRule$1.evaluate(NoShadowingOrOverridesOnMethodsRule.java:40)
	at com.carrotsearch.randomizedtesting.rules.NoShadowingOrOverridesOnMethodsRule$1.evaluate(NoShadowingOrOverridesOnMethodsRule.java:40)
	at com.carrotsearch.randomizedtesting.rules.StatementAdapter.evaluate(StatementAdapter.java:36)
	at com.carrotsearch.randomizedtesting.rules.StatementAdapter.evaluate(StatementAdapter.java:36)
	at org.apache.lucene.util.TestRuleAssertionsRequired$1.evaluate(TestRuleAssertionsRequired.java:53)
	at org.apache.lucene.util.TestRuleMarkFailure$1.evaluate(TestRuleMarkFailure.java:47)
	at org.apache.lucene.util.TestRuleIgnoreAfterMaxFailures$1.evaluate(TestRuleIgnoreAfterMaxFailures.java:64)
	at org.apache.lucene.util.TestRuleIgnoreTestSuites$1.evaluate(TestRuleIgnoreTestSuites.java:54)
	at com.carrotsearch.randomizedtesting.rules.StatementAdapter.evaluate(StatementAdapter.java:36)
	at com.carrotsearch.randomizedtesting.ThreadLeakControl$StatementRunner.run(ThreadLeakControl.java:368)
	at java.base/java.lang.Thread.run(Thread.java:844)


FAILED:  org.apache.solr.client.solrj.request.SchemaTest.deletingAFieldThatDoesntExistInTheSchemaShouldFail

Error Message:
Error from server at http://127.0.0.1:39851/solr/collection1: error processing commands

Stack Trace:
org.apache.solr.client.solrj.impl.HttpSolrClient$RemoteExecutionException: Error from server at http://127.0.0.1:39851/solr/collection1: error processing commands
	at __randomizedtesting.SeedInfo.seed([C443592F98B8841F:FDAC201852D8D605]:0)
	at org.apache.solr.client.solrj.impl.HttpSolrClient$RemoteExecutionException.create(HttpSolrClient.java:830)
	at org.apache.solr.client.solrj.impl.HttpSolrClient.executeMethod(HttpSolrClient.java:620)
	at org.apache.solr.client.solrj.impl.HttpSolrClient.request(HttpSolrClient.java:255)
	at org.apache.solr.client.solrj.impl.HttpSolrClient.request(HttpSolrClient.java:244)
	at org.apache.solr.client.solrj.SolrRequest.process(SolrRequest.java:194)
	at org.apache.solr.client.solrj.SolrRequest.process(SolrRequest.java:211)
	at org.apache.solr.client.solrj.request.SchemaTest.deletingAFieldThatDoesntExistInTheSchemaShouldFail(SchemaTest.java:332)
	at java.base/jdk.internal.reflect.NativeMethodAccessorImpl.invoke0(Native Method)
	at java.base/jdk.internal.reflect.NativeMethodAccessorImpl.invoke(NativeMethodAccessorImpl.java:62)
	at java.base/jdk.internal.reflect.DelegatingMethodAccessorImpl.invoke(DelegatingMethodAccessorImpl.java:43)
	at java.base/java.lang.reflect.Method.invoke(Method.java:564)
	at com.carrotsearch.randomizedtesting.RandomizedRunner.invoke(RandomizedRunner.java:1737)
	at com.carrotsearch.randomizedtesting.RandomizedRunner$8.evaluate(RandomizedRunner.java:934)
	at com.carrotsearch.randomizedtesting.RandomizedRunner$9.evaluate(RandomizedRunner.java:970)
	at com.carrotsearch.randomizedtesting.RandomizedRunner$10.evaluate(RandomizedRunner.java:984)
	at com.carrotsearch.randomizedtesting.rules.SystemPropertiesRestoreRule$1.evaluate(SystemPropertiesRestoreRule.java:57)
	at org.apache.lucene.util.TestRuleSetupTeardownChained$1.evaluate(TestRuleSetupTeardownChained.java:49)
	at org.apache.lucene.util.AbstractBeforeAfterRule$1.evaluate(AbstractBeforeAfterRule.java:45)
	at org.apache.lucene.util.TestRuleThreadAndTestName$1.evaluate(TestRuleThreadAndTestName.java:48)
	at org.apache.lucene.util.TestRuleIgnoreAfterMaxFailures$1.evaluate(TestRuleIgnoreAfterMaxFailures.java:64)
	at org.apache.lucene.util.TestRuleMarkFailure$1.evaluate(TestRuleMarkFailure.java:47)
	at com.carrotsearch.randomizedtesting.rules.StatementAdapter.evaluate(StatementAdapter.java:36)
	at com.carrotsearch.randomizedtesting.ThreadLeakControl$StatementRunner.run(ThreadLeakControl.java:368)
	at com.carrotsearch.randomizedtesting.ThreadLeakControl.forkTimeoutingTask(ThreadLeakControl.java:817)
	at com.carrotsearch.randomizedtesting.ThreadLeakControl$3.evaluate(ThreadLeakControl.java:468)
	at com.carrotsearch.randomizedtesting.RandomizedRunner.runSingleTest(RandomizedRunner.java:943)
	at com.carrotsearch.randomizedtesting.RandomizedRunner$5.evaluate(RandomizedRunner.java:829)
	at com.carrotsearch.randomizedtesting.RandomizedRunner$6.evaluate(RandomizedRunner.java:879)
	at com.carrotsearch.randomizedtesting.RandomizedRunner$7.evaluate(RandomizedRunner.java:890)
	at com.carrotsearch.randomizedtesting.rules.StatementAdapter.evaluate(StatementAdapter.java:36)
	at com.carrotsearch.randomizedtesting.rules.SystemPropertiesRestoreRule$1.evaluate(SystemPropertiesRestoreRule.java:57)
	at org.apache.lucene.util.AbstractBeforeAfterRule$1.evaluate(AbstractBeforeAfterRule.java:45)
	at com.carrotsearch.randomizedtesting.rules.StatementAdapter.evaluate(StatementAdapter.java:36)
	at org.apache.lucene.util.TestRuleStoreClassName$1.evaluate(TestRuleStoreClassName.java:41)
	at com.carrotsearch.randomizedtesting.rules.NoShadowingOrOverridesOnMethodsRule$1.evaluate(NoShadowingOrOverridesOnMethodsRule.java:40)
	at com.carrotsearch.randomizedtesting.rules.NoShadowingOrOverridesOnMethodsRule$1.evaluate(NoShadowingOrOverridesOnMethodsRule.java:40)
	at com.carrotsearch.randomizedtesting.rules.StatementAdapter.evaluate(StatementAdapter.java:36)
	at com.carrotsearch.randomizedtesting.rules.StatementAdapter.evaluate(StatementAdapter.java:36)
	at org.apache.lucene.util.TestRuleAssertionsRequired$1.evaluate(TestRuleAssertionsRequired.java:53)
	at org.apache.lucene.util.TestRuleMarkFailure$1.evaluate(TestRuleMarkFailure.java:47)
	at org.apache.lucene.util.TestRuleIgnoreAfterMaxFailures$1.evaluate(TestRuleIgnoreAfterMaxFailures.java:64)
	at org.apache.lucene.util.TestRuleIgnoreTestSuites$1.evaluate(TestRuleIgnoreTestSuites.java:54)
	at com.carrotsearch.randomizedtesting.rules.StatementAdapter.evaluate(StatementAdapter.java:36)
	at com.carrotsearch.randomizedtesting.ThreadLeakControl$StatementRunner.run(ThreadLeakControl.java:368)
	at java.base/java.lang.Thread.run(Thread.java:844)


FAILED:  org.apache.solr.client.solrj.request.SchemaTest.addDynamicFieldShouldntBeCalledTwiceWithTheSameName

Error Message:
Error from server at http://127.0.0.1:45043/solr/collection1: error processing commands

Stack Trace:
org.apache.solr.client.solrj.impl.HttpSolrClient$RemoteExecutionException: Error from server at http://127.0.0.1:45043/solr/collection1: error processing commands
	at __randomizedtesting.SeedInfo.seed([C443592F98B8841F:8EB3160940A93102]:0)
	at org.apache.solr.client.solrj.impl.HttpSolrClient$RemoteExecutionException.create(HttpSolrClient.java:830)
	at org.apache.solr.client.solrj.impl.HttpSolrClient.executeMethod(HttpSolrClient.java:620)
	at org.apache.solr.client.solrj.impl.HttpSolrClient.request(HttpSolrClient.java:255)
	at org.apache.solr.client.solrj.impl.HttpSolrClient.request(HttpSolrClient.java:244)
	at org.apache.solr.client.solrj.SolrRequest.process(SolrRequest.java:194)
	at org.apache.solr.client.solrj.SolrRequest.process(SolrRequest.java:211)
	at org.apache.solr.client.solrj.request.SchemaTest.addDynamicFieldShouldntBeCalledTwiceWithTheSameName(SchemaTest.java:417)
	at java.base/jdk.internal.reflect.NativeMethodAccessorImpl.invoke0(Native Method)
	at java.base/jdk.internal.reflect.NativeMethodAccessorImpl.invoke(NativeMethodAccessorImpl.java:62)
	at java.base/jdk.internal.reflect.DelegatingMethodAccessorImpl.invoke(DelegatingMethodAccessorImpl.java:43)
	at java.base/java.lang.reflect.Method.invoke(Method.java:564)
	at com.carrotsearch.randomizedtesting.RandomizedRunner.invoke(RandomizedRunner.java:1737)
	at com.carrotsearch.randomizedtesting.RandomizedRunner$8.evaluate(RandomizedRunner.java:934)
	at com.carrotsearch.randomizedtesting.RandomizedRunner$9.evaluate(RandomizedRunner.java:970)
	at com.carrotsearch.randomizedtesting.RandomizedRunner$10.evaluate(RandomizedRunner.java:984)
	at com.carrotsearch.randomizedtesting.rules.SystemPropertiesRestoreRule$1.evaluate(SystemPropertiesRestoreRule.java:57)
	at org.apache.lucene.util.TestRuleSetupTeardownChained$1.evaluate(TestRuleSetupTeardownChained.java:49)
	at org.apache.lucene.util.AbstractBeforeAfterRule$1.evaluate(AbstractBeforeAfterRule.java:45)
	at org.apache.lucene.util.TestRuleThreadAndTestName$1.evaluate(TestRuleThreadAndTestName.java:48)
	at org.apache.lucene.util.TestRuleIgnoreAfterMaxFailures$1.evaluate(TestRuleIgnoreAfterMaxFailures.java:64)
	at org.apache.lucene.util.TestRuleMarkFailure$1.evaluate(TestRuleMarkFailure.java:47)
	at com.carrotsearch.randomizedtesting.rules.StatementAdapter.evaluate(StatementAdapter.java:36)
	at com.carrotsearch.randomizedtesting.ThreadLeakControl$StatementRunner.run(ThreadLeakControl.java:368)
	at com.carrotsearch.randomizedtesting.ThreadLeakControl.forkTimeoutingTask(ThreadLeakControl.java:817)
	at com.carrotsearch.randomizedtesting.ThreadLeakControl$3.evaluate(ThreadLeakControl.java:468)
	at com.carrotsearch.randomizedtesting.RandomizedRunner.runSingleTest(RandomizedRunner.java:943)
	at com.carrotsearch.randomizedtesting.RandomizedRunner$5.evaluate(RandomizedRunner.java:829)
	at com.carrotsearch.randomizedtesting.RandomizedRunner$6.evaluate(RandomizedRunner.java:879)
	at com.carrotsearch.randomizedtesting.RandomizedRunner$7.evaluate(RandomizedRunner.java:890)
	at com.carrotsearch.randomizedtesting.rules.StatementAdapter.evaluate(StatementAdapter.java:36)
	at com.carrotsearch.randomizedtesting.rules.SystemPropertiesRestoreRule$1.evaluate(SystemPropertiesRestoreRule.java:57)
	at org.apache.lucene.util.AbstractBeforeAfterRule$1.evaluate(AbstractBeforeAfterRule.java:45)
	at com.carrotsearch.randomizedtesting.rules.StatementAdapter.evaluate(StatementAdapter.java:36)
	at org.apache.lucene.util.TestRuleStoreClassName$1.evaluate(TestRuleStoreClassName.java:41)
	at com.carrotsearch.randomizedtesting.rules.NoShadowingOrOverridesOnMethodsRule$1.evaluate(NoShadowingOrOverridesOnMethodsRule.java:40)
	at com.carrotsearch.randomizedtesting.rules.NoShadowingOrOverridesOnMethodsRule$1.evaluate(NoShadowingOrOverridesOnMethodsRule.java:40)
	at com.carrotsearch.randomizedtesting.rules.StatementAdapter.evaluate(StatementAdapter.java:36)
	at com.carrotsearch.randomizedtesting.rules.StatementAdapter.evaluate(StatementAdapter.java:36)
	at org.apache.lucene.util.TestRuleAssertionsRequired$1.evaluate(TestRuleAssertionsRequired.java:53)
	at org.apache.lucene.util.TestRuleMarkFailure$1.evaluate(TestRuleMarkFailure.java:47)
	at org.apache.lucene.util.TestRuleIgnoreAfterMaxFailures$1.evaluate(TestRuleIgnoreAfterMaxFailures.java:64)
	at org.apache.lucene.util.TestRuleIgnoreTestSuites$1.evaluate(TestRuleIgnoreTestSuites.java:54)
	at com.carrotsearch.randomizedtesting.rules.StatementAdapter.evaluate(StatementAdapter.java:36)
	at com.carrotsearch.randomizedtesting.ThreadLeakControl$StatementRunner.run(ThreadLeakControl.java:368)
	at java.base/java.lang.Thread.run(Thread.java:844)


FAILED:  org.apache.solr.client.solrj.request.SchemaTest.deleteCopyFieldShouldFailWhenOneOfTheFieldsDoesntExistInTheSchema

Error Message:
Error from server at http://127.0.0.1:39783/solr/collection1: error processing commands

Stack Trace:
org.apache.solr.client.solrj.impl.HttpSolrClient$RemoteExecutionException: Error from server at http://127.0.0.1:39783/solr/collection1: error processing commands
	at __randomizedtesting.SeedInfo.seed([C443592F98B8841F:1DE54D9EFA76461]:0)
	at org.apache.solr.client.solrj.impl.HttpSolrClient$RemoteExecutionException.create(HttpSolrClient.java:830)
	at org.apache.solr.client.solrj.impl.HttpSolrClient.executeMethod(HttpSolrClient.java:620)
	at org.apache.solr.client.solrj.impl.HttpSolrClient.request(HttpSolrClient.java:255)
	at org.apache.solr.client.solrj.impl.HttpSolrClient.request(HttpSolrClient.java:244)
	at org.apache.solr.client.solrj.SolrRequest.process(SolrRequest.java:194)
	at org.apache.solr.client.solrj.SolrRequest.process(SolrRequest.java:211)
	at org.apache.solr.client.solrj.request.SchemaTest.deleteCopyFieldShouldFailWhenOneOfTheFieldsDoesntExistInTheSchema(SchemaTest.java:841)
	at java.base/jdk.internal.reflect.NativeMethodAccessorImpl.invoke0(Native Method)
	at java.base/jdk.internal.reflect.NativeMethodAccessorImpl.invoke(NativeMethodAccessorImpl.java:62)
	at java.base/jdk.internal.reflect.DelegatingMethodAccessorImpl.invoke(DelegatingMethodAccessorImpl.java:43)
	at java.base/java.lang.reflect.Method.invoke(Method.java:564)
	at com.carrotsearch.randomizedtesting.RandomizedRunner.invoke(RandomizedRunner.java:1737)
	at com.carrotsearch.randomizedtesting.RandomizedRunner$8.evaluate(RandomizedRunner.java:934)
	at com.carrotsearch.randomizedtesting.RandomizedRunner$9.evaluate(RandomizedRunner.java:970)
	at com.carrotsearch.randomizedtesting.RandomizedRunner$10.evaluate(RandomizedRunner.java:984)
	at com.carrotsearch.randomizedtesting.rules.SystemPropertiesRestoreRule$1.evaluate(SystemPropertiesRestoreRule.java:57)
	at org.apache.lucene.util.TestRuleSetupTeardownChained$1.evaluate(TestRuleSetupTeardownChained.java:49)
	at org.apache.lucene.util.AbstractBeforeAfterRule$1.evaluate(AbstractBeforeAfterRule.java:45)
	at org.apache.lucene.util.TestRuleThreadAndTestName$1.evaluate(TestRuleThreadAndTestName.java:48)
	at org.apache.lucene.util.TestRuleIgnoreAfterMaxFailures$1.evaluate(TestRuleIgnoreAfterMaxFailures.java:64)
	at org.apache.lucene.util.TestRuleMarkFailure$1.evaluate(TestRuleMarkFailure.java:47)
	at com.carrotsearch.randomizedtesting.rules.StatementAdapter.evaluate(StatementAdapter.java:36)
	at com.carrotsearch.randomizedtesting.ThreadLeakControl$StatementRunner.run(ThreadLeakControl.java:368)
	at com.carrotsearch.randomizedtesting.ThreadLeakControl.forkTimeoutingTask(ThreadLeakControl.java:817)
	at com.carrotsearch.randomizedtesting.ThreadLeakControl$3.evaluate(ThreadLeakControl.java:468)
	at com.carrotsearch.randomizedtesting.RandomizedRunner.runSingleTest(RandomizedRunner.java:943)
	at com.carrotsearch.randomizedtesting.RandomizedRunner$5.evaluate(RandomizedRunner.java:829)
	at com.carrotsearch.randomizedtesting.RandomizedRunner$6.evaluate(RandomizedRunner.java:879)
	at com.carrotsearch.randomizedtesting.RandomizedRunner$7.evaluate(RandomizedRunner.java:890)
	at com.carrotsearch.randomizedtesting.rules.StatementAdapter.evaluate(StatementAdapter.java:36)
	at com.carrotsearch.randomizedtesting.rules.SystemPropertiesRestoreRule$1.evaluate(SystemPropertiesRestoreRule.java:57)
	at org.apache.lucene.util.AbstractBeforeAfterRule$1.evaluate(AbstractBeforeAfterRule.java:45)
	at com.carrotsearch.randomizedtesting.rules.StatementAdapter.evaluate(StatementAdapter.java:36)
	at org.apache.lucene.util.TestRuleStoreClassName$1.evaluate(TestRuleStoreClassName.java:41)
	at com.carrotsearch.randomizedtesting.rules.NoShadowingOrOverridesOnMethodsRule$1.evaluate(NoShadowingOrOverridesOnMethodsRule.java:40)
	at com.carrotsearch.randomizedtesting.rules.NoShadowingOrOverridesOnMethodsRule$1.evaluate(NoShadowingOrOverridesOnMethodsRule.java:40)
	at com.carrotsearch.randomizedtesting.rules.StatementAdapter.evaluate(StatementAdapter.java:36)
	at com.carrotsearch.randomizedtesting.rules.StatementAdapter.evaluate(StatementAdapter.java:36)
	at org.apache.lucene.util.TestRuleAssertionsRequired$1.evaluate(TestRuleAssertionsRequired.java:53)
	at org.apache.lucene.util.TestRuleMarkFailure$1.evaluate(TestRuleMarkFailure.java:47)
	at org.apache.lucene.util.TestRuleIgnoreAfterMaxFailures$1.evaluate(TestRuleIgnoreAfterMaxFailures.java:64)
	at org.apache.lucene.util.TestRuleIgnoreTestSuites$1.evaluate(TestRuleIgnoreTestSuites.java:54)
	at com.carrotsearch.randomizedtesting.rules.StatementAdapter.evaluate(StatementAdapter.java:36)
	at com.carrotsearch.randomizedtesting.ThreadLeakControl$StatementRunner.run(ThreadLeakControl.java:368)
	at java.base/java.lang.Thread.run(Thread.java:844)


FAILED:  org.apache.solr.client.solrj.request.SchemaTest.deletingADynamicFieldThatDoesntExistInTheSchemaShouldFail

Error Message:
Error from server at http://127.0.0.1:35153/solr/collection1: error processing commands

Stack Trace:
org.apache.solr.client.solrj.impl.HttpSolrClient$RemoteExecutionException: Error from server at http://127.0.0.1:35153/solr/collection1: error processing commands
	at __randomizedtesting.SeedInfo.seed([C443592F98B8841F:40B05ACC5363F0D0]:0)
	at org.apache.solr.client.solrj.impl.HttpSolrClient$RemoteExecutionException.create(HttpSolrClient.java:830)
	at org.apache.solr.client.solrj.impl.HttpSolrClient.executeMethod(HttpSolrClient.java:620)
	at org.apache.solr.client.solrj.impl.HttpSolrClient.request(HttpSolrClient.java:255)
	at org.apache.solr.client.solrj.impl.HttpSolrClient.request(HttpSolrClient.java:244)
	at org.apache.solr.client.solrj.SolrRequest.process(SolrRequest.java:194)
	at org.apache.solr.client.solrj.SolrRequest.process(SolrRequest.java:211)
	at org.apache.solr.client.solrj.request.SchemaTest.deletingADynamicFieldThatDoesntExistInTheSchemaShouldFail(SchemaTest.java:458)
	at java.base/jdk.internal.reflect.NativeMethodAccessorImpl.invoke0(Native Method)
	at java.base/jdk.internal.reflect.NativeMethodAccessorImpl.invoke(NativeMethodAccessorImpl.java:62)
	at java.base/jdk.internal.reflect.DelegatingMethodAccessorImpl.invoke(DelegatingMethodAccessorImpl.java:43)
	at java.base/java.lang.reflect.Method.invoke(Method.java:564)
	at com.carrotsearch.randomizedtesting.RandomizedRunner.invoke(RandomizedRunner.java:1737)
	at com.carrotsearch.randomizedtesting.RandomizedRunner$8.evaluate(RandomizedRunner.java:934)
	at com.carrotsearch.randomizedtesting.RandomizedRunner$9.evaluate(RandomizedRunner.java:970)
	at com.carrotsearch.randomizedtesting.RandomizedRunner$10.evaluate(RandomizedRunner.java:984)
	at com.carrotsearch.randomizedtesting.rules.SystemPropertiesRestoreRule$1.evaluate(SystemPropertiesRestoreRule.java:57)
	at org.apache.lucene.util.TestRuleSetupTeardownChained$1.evaluate(TestRuleSetupTeardownChained.java:49)
	at org.apache.lucene.util.AbstractBeforeAfterRule$1.evaluate(AbstractBeforeAfterRule.java:45)
	at org.apache.lucene.util.TestRuleThreadAndTestName$1.evaluate(TestRuleThreadAndTestName.java:48)
	at org.apache.lucene.util.TestRuleIgnoreAfterMaxFailures$1.evaluate(TestRuleIgnoreAfterMaxFailures.java:64)
	at org.apache.lucene.util.TestRuleMarkFailure$1.evaluate(TestRuleMarkFailure.java:47)
	at com.carrotsearch.randomizedtesting.rules.StatementAdapter.evaluate(StatementAdapter.java:36)
	at com.carrotsearch.randomizedtesting.ThreadLeakControl$StatementRunner.run(ThreadLeakControl.java:368)
	at com.carrotsearch.randomizedtesting.ThreadLeakControl.forkTimeoutingTask(ThreadLeakControl.java:817)
	at com.carrotsearch.randomizedtesting.ThreadLeakControl$3.evaluate(ThreadLeakControl.java:468)
	at com.carrotsearch.randomizedtesting.RandomizedRunner.runSingleTest(RandomizedRunner.java:943)
	at com.carrotsearch.randomizedtesting.RandomizedRunner$5.evaluate(RandomizedRunner.java:829)
	at com.carrotsearch.randomizedtesting.RandomizedRunner$6.evaluate(RandomizedRunner.java:879)
	at com.carrotsearch.randomizedtesting.RandomizedRunner$7.evaluate(RandomizedRunner.java:890)
	at com.carrotsearch.randomizedtesting.rules.StatementAdapter.evaluate(StatementAdapter.java:36)
	at com.carrotsearch.randomizedtesting.rules.SystemPropertiesRestoreRule$1.evaluate(SystemPropertiesRestoreRule.java:57)
	at org.apache.lucene.util.AbstractBeforeAfterRule$1.evaluate(AbstractBeforeAfterRule.java:45)
	at com.carrotsearch.randomizedtesting.rules.StatementAdapter.evaluate(StatementAdapter.java:36)
	at org.apache.lucene.util.TestRuleStoreClassName$1.evaluate(TestRuleStoreClassName.java:41)
	at com.carrotsearch.randomizedtesting.rules.NoShadowingOrOverridesOnMethodsRule$1.evaluate(NoShadowingOrOverridesOnMethodsRule.java:40)
	at com.carrotsearch.randomizedtesting.rules.NoShadowingOrOverridesOnMethodsRule$1.evaluate(NoShadowingOrOverridesOnMethodsRule.java:40)
	at com.carrotsearch.randomizedtesting.rules.StatementAdapter.evaluate(StatementAdapter.java:36)
	at com.carrotsearch.randomizedtesting.rules.StatementAdapter.evaluate(StatementAdapter.java:36)
	at org.apache.lucene.util.TestRuleAssertionsRequired$1.evaluate(TestRuleAssertionsRequired.java:53)
	at org.apache.lucene.util.TestRuleMarkFailure$1.evaluate(TestRuleMarkFailure.java:47)
	at org.apache.lucene.util.TestRuleIgnoreAfterMaxFailures$1.evaluate(TestRuleIgnoreAfterMaxFailures.java:64)
	at org.apache.lucene.util.TestRuleIgnoreTestSuites$1.evaluate(TestRuleIgnoreTestSuites.java:54)
	at com.carrotsearch.randomizedtesting.rules.StatementAdapter.evaluate(StatementAdapter.java:36)
	at com.carrotsearch.randomizedtesting.ThreadLeakControl$StatementRunner.run(ThreadLeakControl.java:368)
	at java.base/java.lang.Thread.run(Thread.java:844)


FAILED:  org.apache.solr.client.solrj.request.SchemaTest.addFieldShouldntBeCalledTwiceWithTheSameName

Error Message:
Error from server at http://127.0.0.1:44255/solr/collection1: error processing commands

Stack Trace:
org.apache.solr.client.solrj.impl.HttpSolrClient$RemoteExecutionException: Error from server at http://127.0.0.1:44255/solr/collection1: error processing commands
	at __randomizedtesting.SeedInfo.seed([C443592F98B8841F:153031752C0064B3]:0)
	at org.apache.solr.client.solrj.impl.HttpSolrClient$RemoteExecutionException.create(HttpSolrClient.java:830)
	at org.apache.solr.client.solrj.impl.HttpSolrClient.executeMethod(HttpSolrClient.java:620)
	at org.apache.solr.client.solrj.impl.HttpSolrClient.request(HttpSolrClient.java:255)
	at org.apache.solr.client.solrj.impl.HttpSolrClient.request(HttpSolrClient.java:244)
	at org.apache.solr.client.solrj.SolrRequest.process(SolrRequest.java:194)
	at org.apache.solr.client.solrj.SolrRequest.process(SolrRequest.java:211)
	at org.apache.solr.client.solrj.request.SchemaTest.addFieldShouldntBeCalledTwiceWithTheSameName(SchemaTest.java:293)
	at java.base/jdk.internal.reflect.NativeMethodAccessorImpl.invoke0(Native Method)
	at java.base/jdk.internal.reflect.NativeMethodAccessorImpl.invoke(NativeMethodAccessorImpl.java:62)
	at java.base/jdk.internal.reflect.DelegatingMethodAccessorImpl.invoke(DelegatingMethodAccessorImpl.java:43)
	at java.base/java.lang.reflect.Method.invoke(Method.java:564)
	at com.carrotsearch.randomizedtesting.RandomizedRunner.invoke(RandomizedRunner.java:1737)
	at com.carrotsearch.randomizedtesting.RandomizedRunner$8.evaluate(RandomizedRunner.java:934)
	at com.carrotsearch.randomizedtesting.RandomizedRunner$9.evaluate(RandomizedRunner.java:970)
	at com.carrotsearch.randomizedtesting.RandomizedRunner$10.evaluate(RandomizedRunner.java:984)
	at com.carrotsearch.randomizedtesting.rules.SystemPropertiesRestoreRule$1.evaluate(SystemPropertiesRestoreRule.java:57)
	at org.apache.lucene.util.TestRuleSetupTeardownChained$1.evaluate(TestRuleSetupTeardownChained.java:49)
	at org.apache.lucene.util.AbstractBeforeAfterRule$1.evaluate(AbstractBeforeAfterRule.java:45)
	at org.apache.lucene.util.TestRuleThreadAndTestName$1.evaluate(TestRuleThreadAndTestName.java:48)
	at org.apache.lucene.util.TestRuleIgnoreAfterMaxFailures$1.evaluate(TestRuleIgnoreAfterMaxFailures.java:64)
	at org.apache.lucene.util.TestRuleMarkFailure$1.evaluate(TestRuleMarkFailure.java:47)
	at com.carrotsearch.randomizedtesting.rules.StatementAdapter.evaluate(StatementAdapter.java:36)
	at com.carrotsearch.randomizedtesting.ThreadLeakControl$StatementRunner.run(ThreadLeakControl.java:368)
	at com.carrotsearch.randomizedtesting.ThreadLeakControl.forkTimeoutingTask(ThreadLeakControl.java:817)
	at com.carrotsearch.randomizedtesting.ThreadLeakControl$3.evaluate(ThreadLeakControl.java:468)
	at com.carrotsearch.randomizedtesting.RandomizedRunner.runSingleTest(RandomizedRunner.java:943)
	at com.carrotsearch.randomizedtesting.RandomizedRunner$5.evaluate(RandomizedRunner.java:829)
	at com.carrotsearch.randomizedtesting.RandomizedRunner$6.evaluate(RandomizedRunner.java:879)
	at com.carrotsearch.randomizedtesting.RandomizedRunner$7.evaluate(RandomizedRunner.java:890)
	at com.carrotsearch.randomizedtesting.rules.StatementAdapter.evaluate(StatementAdapter.java:36)
	at com.carrotsearch.randomizedtesting.rules.SystemPropertiesRestoreRule$1.evaluate(SystemPropertiesRestoreRule.java:57)
	at org.apache.lucene.util.AbstractBeforeAfterRule$1.evaluate(AbstractBeforeAfterRule.java:45)
	at com.carrotsearch.randomizedtesting.rules.StatementAdapter.evaluate(StatementAdapter.java:36)
	at org.apache.lucene.util.TestRuleStoreClassName$1.evaluate(TestRuleStoreClassName.java:41)
	at com.carrotsearch.randomizedtesting.rules.NoShadowingOrOverridesOnMethodsRule$1.evaluate(NoShadowingOrOverridesOnMethodsRule.java:40)
	at com.carrotsearch.randomizedtesting.rules.NoShadowingOrOverridesOnMethodsRule$1.evaluate(NoShadowingOrOverridesOnMethodsRule.java:40)
	at com.carrotsearch.randomizedtesting.rules.StatementAdapter.evaluate(StatementAdapter.java:36)
	at com.carrotsearch.randomizedtesting.rules.StatementAdapter.evaluate(StatementAdapter.java:36)
	at org.apache.lucene.util.TestRuleAssertionsRequired$1.evaluate(TestRuleAssertionsRequired.java:53)
	at org.apache.lucene.util.TestRuleMarkFailure$1.evaluate(TestRuleMarkFailure.java:47)
	at org.apache.lucene.util.TestRuleIgnoreAfterMaxFailures$1.evaluate(TestRuleIgnoreAfterMaxFailures.java:64)
	at org.apache.lucene.util.TestRuleIgnoreTestSuites$1.evaluate(TestRuleIgnoreTestSuites.java:54)
	at com.carrotsearch.randomizedtesting.rules.StatementAdapter.evaluate(StatementAdapter.java:36)
	at com.carrotsearch.randomizedtesting.ThreadLeakControl$StatementRunner.run(ThreadLeakControl.java:368)
	at java.base/java.lang.Thread.run(Thread.java:844)




Build Log:
[...truncated 3332 lines...]
   [junit4] JVM J0: stdout was not empty, see: /home/jenkins/workspace/Lucene-Solr-7.x-Linux/lucene/build/analysis/icu/test/temp/junit4-J0-20180109_155631_7673999584948841126095.sysout
   [junit4] >>> JVM J0 emitted unexpected output (verbatim) ----
   [junit4] Default case invoked for: 
   [junit4]    opcode  = 0, "Node"
   [junit4] <<< JVM J0: EOF ----

[...truncated 8391 lines...]
   [junit4] Suite: org.apache.solr.cloud.autoscaling.sim.TestDistribStateManager
   [junit4]   2> Creating dataDir: /home/jenkins/workspace/Lucene-Solr-7.x-Linux/solr/build/solr-core/test/J0/temp/solr.cloud.autoscaling.sim.TestDistribStateManager_787A96007F702FE8-001/init-core-data-001
   [junit4]   2> 34800 WARN  (SUITE-TestDistribStateManager-seed#[787A96007F702FE8]-worker) [    ] o.a.s.SolrTestCaseJ4 startTrackingSearchers: numOpens=3 numCloses=3
   [junit4]   2> 34800 INFO  (SUITE-TestDistribStateManager-seed#[787A96007F702FE8]-worker) [    ] o.a.s.SolrTestCaseJ4 Using PointFields (NUMERIC_POINTS_SYSPROP=true) w/NUMERIC_DOCVALUES_SYSPROP=true
   [junit4]   2> 34800 INFO  (SUITE-TestDistribStateManager-seed#[787A96007F702FE8]-worker) [    ] o.a.s.SolrTestCaseJ4 Randomized ssl (false) and clientAuth (false) via: @org.apache.solr.util.RandomizeSSL(reason="", ssl=0.0/0.0, value=0.0/0.0, clientAuth=0.0/0.0)
   [junit4]   2> 34800 INFO  (SUITE-TestDistribStateManager-seed#[787A96007F702FE8]-worker) [    ] o.a.s.SolrTestCaseJ4 SecureRandom sanity checks: test.solr.allowed.securerandom=null & java.security.egd=file:/dev/./urandom
   [junit4]   2> 34803 INFO  (TEST-TestDistribStateManager.testCreateMode-seed#[787A96007F702FE8]) [    ] o.a.s.SolrTestCaseJ4 ###Starting testCreateMode
   [junit4]   2> 34804 INFO  (TEST-TestDistribStateManager.testCreateMode-seed#[787A96007F702FE8]) [    ] o.a.s.c.a.s.TestDistribStateManager Using org.apache.solr.cloud.autoscaling.sim.SimDistribStateManager
   [junit4]   2> 34806 INFO  (TEST-TestDistribStateManager.testCreateMode-seed#[787A96007F702FE8]) [    ] o.a.s.c.a.s.TestDistribStateManager Using org.apache.solr.cloud.autoscaling.sim.SimDistribStateManager
   [junit4]   2> 34806 INFO  (TEST-TestDistribStateManager.testCreateMode-seed#[787A96007F702FE8]) [    ] o.a.s.SolrTestCaseJ4 ###Ending testCreateMode
   [junit4]   2> 34807 INFO  (TEST-TestDistribStateManager.testHasData-seed#[787A96007F702FE8]) [    ] o.a.s.SolrTestCaseJ4 ###Starting testHasData
   [junit4]   2> 34807 INFO  (TEST-TestDistribStateManager.testHasData-seed#[787A96007F702FE8]) [    ] o.a.s.c.a.s.TestDistribStateManager Using org.apache.solr.cloud.autoscaling.sim.SimDistribStateManager
   [junit4]   2> 34807 INFO  (TEST-TestDistribStateManager.testHasData-seed#[787A96007F702FE8]) [    ] o.a.s.SolrTestCaseJ4 ###Ending testHasData
   [junit4]   2> 34808 INFO  (TEST-TestDistribStateManager.testGetSetRemoveData-seed#[787A96007F702FE8]) [    ] o.a.s.SolrTestCaseJ4 ###Starting testGetSetRemoveData
   [junit4]   2> 34820 INFO  (TEST-TestDistribStateManager.testGetSetRemoveData-seed#[787A96007F702FE8]) [    ] o.a.s.c.ZkTestServer STARTING ZK TEST SERVER
   [junit4]   2> 34820 INFO  (Thread-35) [    ] o.a.s.c.ZkTestServer client port:0.0.0.0/0.0.0.0:0
   [junit4]   2> 34820 INFO  (Thread-35) [    ] o.a.s.c.ZkTestServer Starting server
   [junit4]   2> 34822 ERROR (Thread-35) [    ] o.a.z.s.ZooKeeperServer ZKShutdownHandler is not registered, so ZooKeeper server won't take any action on ERROR or SHUTDOWN server state changes
   [junit4]   2> 34920 INFO  (TEST-TestDistribStateManager.testGetSetRemoveData-seed#[787A96007F702FE8]) [    ] o.a.s.c.ZkTestServer start zk server on port:37775
   [junit4]   2> 34925 INFO  (zkConnectionManagerCallback-44-thread-1) [    ] o.a.s.c.c.ConnectionManager zkClient has connected
   [junit4]   2> 34925 INFO  (TEST-TestDistribStateManager.testGetSetRemoveData-seed#[787A96007F702FE8]) [    ] o.a.s.c.a.s.TestDistribStateManager Using org.apache.solr.client.solrj.impl.ZkDistribStateManager
   [junit4]   2> 34938 INFO  (zkConnectionManagerCallback-46-thread-1) [    ] o.a.s.c.c.ConnectionManager zkClient has connected
   [junit4]   2> 34939 INFO  (TEST-TestDistribStateManager.testGetSetRemoveData-seed#[787A96007F702FE8]) [    ] o.a.s.c.a.s.TestDistribStateManager Using org.apache.solr.client.solrj.impl.ZkDistribStateManager
   [junit4]   2> 39940 ERROR (TEST-TestDistribStateManager.testGetSetRemoveData-seed#[787A96007F702FE8]) [    ] o.a.z.s.ZooKeeperServer ZKShutdownHandler is not registered, so ZooKeeper server won't take any action on ERROR or SHUTDOWN server state changes
   [junit4]   2> 39941 INFO  (TEST-TestDistribStateManager.testGetSetRemoveData-seed#[787A96007F702FE8]) [    ] o.a.s.c.ZkTestServer connecting to 127.0.0.1:37775 37775
   [junit4]   2> 50156 INFO  (Thread-35) [    ] o.a.s.c.ZkTestServer connecting to 127.0.0.1:37775 37775
   [junit4]   2> 50156 INFO  (TEST-TestDistribStateManager.testGetSetRemoveData-seed#[787A96007F702FE8]) [    ] o.a.s.SolrTestCaseJ4 ###Ending testGetSetRemoveData
   [junit4]   2> NOTE: reproduce with: ant test  -Dtestcase=TestDistribStateManager -Dtests.method=testGetSetRemoveData -Dtests.seed=787A96007F702FE8 -Dtests.multiplier=3 -Dtests.slow=true -Dtests.locale=en-001 -Dtests.timezone=MIT -Dtests.asserts=true -Dtests.file.encoding=ISO-8859-1
   [junit4] FAILURE 15.4s J0 | TestDistribStateManager.testGetSetRemoveData <<<
   [junit4]    > Throwable #1: java.lang.AssertionError: Node watch should have fired!
   [junit4]    > 	at __randomizedtesting.SeedInfo.seed([787A96007F702FE8:5EEA79522BFEE9E2]:0)
   [junit4]    > 	at org.apache.solr.cloud.autoscaling.sim.TestDistribStateManager.testGetSetRemoveData(TestDistribStateManager.java:256)
   [junit4]    > 	at java.base/jdk.internal.reflect.NativeMethodAccessorImpl.invoke0(Native Method)
   [junit4]    > 	at java.base/jdk.internal.reflect.NativeMethodAccessorImpl.invoke(NativeMethodAccessorImpl.java:62)
   [junit4]    > 	at java.base/jdk.internal.reflect.DelegatingMethodAccessorImpl.invoke(DelegatingMethodAccessorImpl.java:43)
   [junit4]    > 	at java.base/java.lang.reflect.Method.invoke(Method.java:564)
   [junit4]    > 	at java.base/java.lang.Thread.run(Thread.java:844)
   [junit4]   2> 50160 INFO  (TEST-TestDistribStateManager.testMulti-seed#[787A96007F702FE8]) [    ] o.a.s.SolrTestCaseJ4 ###Starting testMulti
   [junit4]   2> 50160 INFO  (TEST-TestDistribStateManager.testMulti-seed#[787A96007F702FE8]) [    ] o.a.s.c.ZkTestServer STARTING ZK TEST SERVER
   [junit4]   2> 50161 INFO  (Thread-36) [    ] o.a.s.c.ZkTestServer client port:0.0.0.0/0.0.0.0:0
   [junit4]   2> 50161 INFO  (Thread-36) [    ] o.a.s.c.ZkTestServer Starting server
   [junit4]   2> 50164 ERROR (Thread-36) [    ] o.a.z.s.ZooKeeperServer ZKShutdownHandler is not registered, so ZooKeeper server won't take any action on ERROR or SHUTDOWN server state changes
   [junit4]   2> 50261 INFO  (TEST-TestDistribStateManager.testMulti-seed#[787A96007F702FE8]) [    ] o.a.s.c.ZkTestServer start zk server on port:45627
   [junit4]   2> 50262 INFO  (zkConnectionManagerCallback-48-thread-1) [    ] o.a.s.c.c.ConnectionManager zkClient has connected
   [junit4]   2> 50263 INFO  (TEST-TestDistribStateManager.testMulti-seed#[787A96007F702FE8]) [    ] o.a.s.c.a.s.TestDistribStateManager Using org.apache.solr.client.solrj.impl.ZkDistribStateManager
   [junit4]   2> 50263 ERROR (TEST-TestDistribStateManager.testMulti-seed#[787A96007F702FE8]) [    ] o.a.z.s.ZooKeeperServer ZKShutdownHandler is not registered, so ZooKeeper server won't take any action on ERROR or SHUTDOWN server state changes
   [junit4]   2> 50263 INFO  (TEST-TestDistribStateManager.testMulti-seed#[787A96007F702FE8]) [    ] o.a.s.c.ZkTestServer connecting to 127.0.0.1:45627 45627
   [junit4]   2> 55396 INFO  (Thread-36) [    ] o.a.s.c.ZkTestServer connecting to 127.0.0.1:45627 45627
   [junit4]   2> 55397 INFO  (TEST-TestDistribStateManager.testMulti-seed#[787A96007F702FE8]) [    ] o.a.s.SolrTestCaseJ4 ###Ending testMulti
   [junit4]   2> 55400 INFO  (TEST-TestDistribStateManager.testListData-seed#[787A96007F702FE8]) [    ] o.a.s.SolrTestCaseJ4 ###Starting testListData
   [junit4]   2> 55400 INFO  (TEST-TestDistribStateManager.testListData-seed#[787A96007F702FE8]) [    ] o.a.s.c.a.s.TestDistribStateManager Using org.apache.solr.cloud.autoscaling.sim.SimDistribStateManager
   [junit4]   2> 55400 INFO  (TEST-TestDistribStateManager.testListData-seed#[787A96007F702FE8]) [    ] o.a.s.SolrTestCaseJ4 ###Ending testListData
   [junit4]   2> NOTE: leaving temporary files on disk at: /home/jenkins/workspace/Lucene-Solr-7.x-Linux/solr/build/solr-core/test/J0/temp/solr.cloud.autoscaling.sim.TestDistribStateManager_787A96007F702FE8-001
   [junit4]   2> NOTE: test params are: codec=Asserting(Lucene70): {}, docValues:{}, maxPointsInLeafNode=1477, maxMBSortInHeap=5.0174292045320055, sim=RandomSimilarity(queryNorm=false): {}, locale=en-001, timezone=MIT
   [junit4]   2> NOTE: Linux 4.10.0-40-generic amd64/Oracle Corporation 10-ea (64-bit)/cpus=8,threads=1,free=177858608,total=536870912
   [junit4]   2> NOTE: All tests run in this JVM: [ExecutePlanActionTest, TestRawTransformer, SparseHLLTest, TestUseDocValuesAsStored2, TestDistribStateManager]
   [junit4] Completed [9/766 (1!)] on J0 in 20.61s, 5 tests, 1 failure <<< FAILURES!

[...truncated 210 lines...]
   [junit4] Suite: org.apache.solr.cloud.MoveReplicaHDFSTest
   [junit4]   2> Creating dataDir: /home/jenkins/workspace/Lucene-Solr-7.x-Linux/solr/build/solr-core/test/J2/temp/solr.cloud.MoveReplicaHDFSTest_787A96007F702FE8-001/init-core-data-001
   [junit4]   2> 237708 WARN  (SUITE-MoveReplicaHDFSTest-seed#[787A96007F702FE8]-worker) [    ] o.a.s.SolrTestCaseJ4 startTrackingSearchers: numOpens=27 numCloses=27
   [junit4]   2> 237708 INFO  (SUITE-MoveReplicaHDFSTest-seed#[787A96007F702FE8]-worker) [    ] o.a.s.SolrTestCaseJ4 Using PointFields (NUMERIC_POINTS_SYSPROP=true) w/NUMERIC_DOCVALUES_SYSPROP=true
   [junit4]   2> 237709 INFO  (SUITE-MoveReplicaHDFSTest-seed#[787A96007F702FE8]-worker) [    ] o.a.s.SolrTestCaseJ4 Randomized ssl (true) and clientAuth (false) via: @org.apache.solr.util.RandomizeSSL(reason="", ssl=0.0/0.0, value=0.0/0.0, clientAuth=0.0/0.0)
   [junit4]   2> 237710 INFO  (SUITE-MoveReplicaHDFSTest-seed#[787A96007F702FE8]-worker) [    ] o.a.s.SolrTestCaseJ4 SecureRandom sanity checks: test.solr.allowed.securerandom=null & java.security.egd=file:/dev/./urandom
   [junit4]   2> 237710 INFO  (SUITE-MoveReplicaHDFSTest-seed#[787A96007F702FE8]-worker) [    ] o.a.s.c.MiniSolrCloudCluster Starting cluster of 4 servers in /home/jenkins/workspace/Lucene-Solr-7.x-Linux/solr/build/solr-core/test/J2/temp/solr.cloud.MoveReplicaHDFSTest_787A96007F702FE8-001/tempDir-001
   [junit4]   2> 237711 INFO  (SUITE-MoveReplicaHDFSTest-seed#[787A96007F702FE8]-worker) [    ] o.a.s.c.ZkTestServer STARTING ZK TEST SERVER
   [junit4]   2> 237718 INFO  (Thread-191) [    ] o.a.s.c.ZkTestServer client port:0.0.0.0/0.0.0.0:0
   [junit4]   2> 237718 INFO  (Thread-191) [    ] o.a.s.c.ZkTestServer Starting server
   [junit4]   2> 237745 ERROR (Thread-191) [    ] o.a.z.s.ZooKeeperServer ZKShutdownHandler is not registered, so ZooKeeper server won't take any action on ERROR or SHUTDOWN server state changes
   [junit4]   2> 237818 INFO  (SUITE-MoveReplicaHDFSTest-seed#[787A96007F702FE8]-worker) [    ] o.a.s.c.ZkTestServer start zk server on port:46173
   [junit4]   2> 237825 INFO  (zkConnectionManagerCallback-322-thread-1) [    ] o.a.s.c.c.ConnectionManager zkClient has connected
   [junit4]   2> 237865 INFO  (jetty-launcher-319-thread-2) [    ] o.e.j.s.Server jetty-9.3.20.v20170531
   [junit4]   2> 237865 INFO  (jetty-launcher-319-thread-3) [    ] o.e.j.s.Server jetty-9.3.20.v20170531
   [junit4]   2> 237865 INFO  (jetty-launcher-319-thread-1) [    ] o.e.j.s.Server jetty-9.3.20.v20170531
   [junit4]   2> 237866 INFO  (jetty-launcher-319-thread-4) [    ] o.e.j.s.Server jetty-9.3.20.v20170531
   [junit4]   2> 237870 INFO  (jetty-launcher-319-thread-1) [    ] o.e.j.s.h.ContextHandler Started o.e.j.s.ServletContextHandler@6b5d4c8e{/solr,null,AVAILABLE}
   [junit4]   2> 237871 INFO  (jetty-launcher-319-thread-4) [    ] o.e.j.s.h.ContextHandler Started o.e.j.s.ServletContextHandler@4011ab82{/solr,null,AVAILABLE}
   [junit4]   2> 237878 INFO  (jetty-launcher-319-thread-2) [    ] o.e.j.s.h.ContextHandler Started o.e.j.s.ServletContextHandler@790b7f7{/solr,null,AVAILABLE}
   [junit4]   2> 237878 INFO  (jetty-launcher-319-thread-3) [    ] o.e.j.s.h.ContextHandler Started o.e.j.s.ServletContextHandler@22f1bf03{/solr,null,AVAILABLE}
   [junit4]   2> 237893 INFO  (jetty-launcher-319-thread-3) [    ] o.e.j.s.AbstractConnector Started ServerConnector@1bc57bb3{SSL,[ssl, http/1.1]}{127.0.0.1:45039}
   [junit4]   2> 237893 INFO  (jetty-launcher-319-thread-3) [    ] o.e.j.s.Server Started @239776ms
   [junit4]   2> 237893 INFO  (jetty-launcher-319-thread-3) [    ] o.a.s.c.s.e.JettySolrRunner Jetty properties: {hostContext=/solr, hostPort=45039}
   [junit4]   2> 237893 ERROR (jetty-launcher-319-thread-3) [    ] o.a.s.u.StartupLoggingUtils Missing Java Option solr.log.dir. Logging may be missing or incomplete.
   [junit4]   2> 237893 INFO  (jetty-launcher-319-thread-3) [    ] o.a.s.s.SolrDispatchFilter  ___      _       Welcome to Apache Solr? version 7.3.0
   [junit4]   2> 237893 INFO  (jetty-launcher-319-thread-4) [    ] o.e.j.s.AbstractConnector Started ServerConnector@2311f085{SSL,[ssl, http/1.1]}{127.0.0.1:46569}
   [junit4]   2> 237893 INFO  (jetty-launcher-319-thread-3) [    ] o.a.s.s.SolrDispatchFilter / __| ___| |_ _   Starting in cloud mode on port null
   [junit4]   2> 237893 INFO  (jetty-launcher-319-thread-3) [    ] o.a.s.s.SolrDispatchFilter \__ \/ _ \ | '_|  Install dir: null
   [junit4]   2> 237893 INFO  (jetty-launcher-319-thread-4) [    ] o.e.j.s.Server Started @239777ms
   [junit4]   2> 237893 INFO  (jetty-launcher-319-thread-1) [    ] o.e.j.s.AbstractConnector Started ServerConnector@76af11f{SSL,[ssl, http/1.1]}{127.0.0.1:42201}
   [junit4]   2> 237893 INFO  (jetty-launcher-319-thread-4) [    ] o.a.s.c.s.e.JettySolrRunner Jetty properties: {hostContext=/solr, hostPort=46569}
   [junit4]   2> 237894 INFO  (jetty-launcher-319-thread-1) [    ] o.e.j.s.Server Started @239777ms
   [junit4]   2> 237894 INFO  (jetty-launcher-319-thread-1) [    ] o.a.s.c.s.e.JettySolrRunner Jetty properties: {hostContext=/solr, hostPort=42201}
   [junit4]   2> 237893 INFO  (jetty-launcher-319-thread-3) [    ] o.a.s.s.SolrDispatchFilter |___/\___/_|_|    Start time: 2018-01-09T16:12:18.702955Z
   [junit4]   2> 237894 INFO  (jetty-launcher-319-thread-2) [    ] o.e.j.s.AbstractConnector Started ServerConnector@18b7fe2c{SSL,[ssl, http/1.1]}{127.0.0.1:34225}
   [junit4]   2> 237894 INFO  (jetty-launcher-319-thread-2) [    ] o.e.j.s.Server Started @239777ms
   [junit4]   2> 237894 INFO  (jetty-launcher-319-thread-2) [    ] o.a.s.c.s.e.JettySolrRunner Jetty properties: {hostContext=/solr, hostPort=34225}
   [junit4]   2> 237894 ERROR (jetty-launcher-319-thread-1) [    ] o.a.s.u.StartupLoggingUtils Missing Java Option solr.log.dir. Logging may be missing or incomplete.
   [junit4]   2> 237894 ERROR (jetty-launcher-319-thread-2) [    ] o.a.s.u.StartupLoggingUtils Missing Java Option solr.log.dir. Logging may be missing or incomplete.
   [junit4]   2> 237894 ERROR (jetty-launcher-319-thread-4) [    ] o.a.s.u.StartupLoggingUtils Missing Java Option solr.log.dir. Logging may be missing or incomplete.
   [junit4]   2> 237894 INFO  (jetty-launcher-319-thread-1) [    ] o.a.s.s.SolrDispatchFilter  ___      _       Welcome to Apache Solr? version 7.3.0
   [junit4]   2> 237894 INFO  (jetty-launcher-319-thread-2) [    ] o.a.s.s.SolrDispatchFilter  ___      _       Welcome to Apache Solr? version 7.3.0
   [junit4]   2> 237894 INFO  (jetty-launcher-319-thread-1) [    ] o.a.s.s.SolrDispatchFilter / __| ___| |_ _   Starting in cloud mode on port null
   [junit4]   2> 237894 INFO  (jetty-launcher-319-thread-4) [    ] o.a.s.s.SolrDispatchFilter  ___      _       Welcome to Apache Solr? version 7.3.0
   [junit4]   2> 237894 INFO  (jetty-launcher-319-thread-1) [    ] o.a.s.s.SolrDispatchFilter \__ \/ _ \ | '_|  Install dir: null
   [junit4]   2> 237894 INFO  (jetty-launcher-319-thread-4) [    ] o.a.s.s.SolrDispatchFilter / __| ___| |_ _   Starting in cloud mode on port null
   [junit4]   2> 237894 INFO  (jetty-launcher-319-thread-2) [    ] o.a.s.s.SolrDispatchFilter / __| ___| |_ _   Starting in cloud mode on port null
   [junit4]   2> 237894 INFO  (jetty-launcher-319-thread-4) [    ] o.a.s.s.SolrDispatchFilter \__ \/ _ \ | '_|  Install dir: null
   [junit4]   2> 237894 INFO  (jetty-launcher-319-thread-2) [    ] o.a.s.s.SolrDispatchFilter \__ \/ _ \ | '_|  Install dir: null
   [junit4]   2> 237894 INFO  (jetty-launcher-319-thread-4) [    ] o.a.s.s.SolrDispatchFilter |___/\___/_|_|    Start time: 2018-01-09T16:12:18.703964Z
   [junit4]   2> 237895 INFO  (jetty-launcher-319-thread-2) [    ] o.a.s.s.SolrDispatchFilter |___/\___/_|_|    Start time: 2018-01-09T16:12:18.703984Z
   [junit4]   2> 237894 INFO  (jetty-launcher-319-thread-1) [    ] o.a.s.s.SolrDispatchFilter |___/\___/_|_|    Start time: 2018-01-09T16:12:18.703860Z
   [junit4]   2> 237903 INFO  (zkConnectionManagerCallback-324-thread-1) [    ] o.a.s.c.c.ConnectionManager zkClient has connected
   [junit4]   2> 237903 INFO  (zkConnectionManagerCallback-328-thread-1) [    ] o.a.s.c.c.ConnectionManager zkClient has connected
   [junit4]   2> 237903 INFO  (zkConnectionManagerCallback-326-thread-1) [    ] o.a.s.c.c.ConnectionManager zkClient has connected
   [junit4]   2> 237903 INFO  (jetty-launcher-319-thread-2) [    ] o.a.s.s.SolrDispatchFilter solr.xml found in ZooKeeper. Loading...
   [junit4]   2> 237903 INFO  (jetty-launcher-319-thread-3) [    ] o.a.s.s.SolrDispatchFilter solr.xml found in ZooKeeper. Loading...
   [junit4]   2> 237904 INFO  (zkConnectionManagerCallback-330-thread-1) [    ] o.a.s.c.c.ConnectionManager zkClient has connected
   [junit4]   2> 237904 INFO  (jetty-launcher-319-thread-1) [    ] o.a.s.s.SolrDispatchFilter solr.xml found in ZooKeeper. Loading...
   [junit4]   2> 237921 INFO  (jetty-launcher-319-thread-4) [    ] o.a.s.s.SolrDispatchFilter solr.xml found in ZooKeeper. Loading...
   [junit4]   2> 237931 INFO  (jetty-launcher-319-thread-1) [    ] o.a.s.c.ZkContainer Zookeeper client=127.0.0.1:46173/solr
   [junit4]   2> 237935 INFO  (jetty-launcher-319-thread-2) [    ] o.a.s.c.ZkContainer Zookeeper client=127.0.0.1:46173/solr
   [junit4]   2> 237936 INFO  (zkConnectionManagerCallback-338-thread-1) [    ] o.a.s.c.c.ConnectionManager zkClient has connected
   [junit4]   2> 237938 INFO  (zkConnectionManagerCallback-334-thread-1) [    ] o.a.s.c.c.ConnectionManager zkClient has connected
   [junit4]   2> 237938 INFO  (jetty-launcher-319-thread-3) [    ] o.a.s.c.ZkContainer Zookeeper client=127.0.0.1:46173/solr
   [junit4]   2> 237939 INFO  (zkConnectionManagerCallback-341-thread-1-processing-n:127.0.0.1:34225_solr) [n:127.0.0.1:34225_solr    ] o.a.s.c.c.ConnectionManager zkClient has connected
   [junit4]   2> 237939 INFO  (zkConnectionManagerCallback-344-thread-1) [    ] o.a.s.c.c.ConnectionManager zkClient has connected
   [junit4]   2> 237940 INFO  (jetty-launcher-319-thread-4) [    ] o.a.s.c.ZkContainer Zookeeper client=127.0.0.1:46173/solr
   [junit4]   2> 237940 INFO  (zkConnectionManagerCallback-347-thread-1-processing-n:127.0.0.1:42201_solr) [n:127.0.0.1:42201_solr    ] o.a.s.c.c.ConnectionManager zkClient has connected
   [junit4]   2> 237941 INFO  (zkConnectionManagerCallback-350-thread-1) [    ] o.a.s.c.c.ConnectionManager zkClient has connected
   [junit4]   2> 237941 INFO  (zkConnectionManagerCallback-352-thread-1-processing-n:127.0.0.1:45039_solr) [n:127.0.0.1:45039_solr    ] o.a.s.c.c.ConnectionManager zkClient has connected
   [junit4]   2> 237943 INFO  (zkConnectionManagerCallback-354-thread-1-processing-n:127.0.0.1:46569_solr) [n:127.0.0.1:46569_solr    ] o.a.s.c.c.ConnectionManager zkClient has connected
   [junit4]   2> 237990 INFO  (jetty-launcher-319-thread-2) [n:127.0.0.1:34225_solr    ] o.a.s.c.Overseer Overseer (id=null) closing
   [junit4]   2> 237990 INFO  (jetty-launcher-319-thread-1) [n:127.0.0.1:42201_solr    ] o.a.s.c.Overseer Overseer (id=null) closing
   [junit4]   2> 237991 INFO  (jetty-launcher-319-thread-4) [n:127.0.0.1:46569_solr    ] o.a.s.c.Overseer Overseer (id=null) closing
   [junit4]   2> 237991 INFO  (jetty-launcher-319-thread-2) [n:127.0.0.1:34225_solr    ] o.a.s.c.OverseerElectionContext I am going to be the leader 127.0.0.1:34225_solr
   [junit4]   2> 237991 INFO  (jetty-launcher-319-thread-1) [n:127.0.0.1:42201_solr    ] o.a.s.c.ZkController Register node as live in ZooKeeper:/live_nodes/127.0.0.1:42201_solr
   [junit4]   2> 237991 INFO  (jetty-launcher-319-thread-2) [n:127.0.0.1:34225_solr    ] o.a.s.c.Overseer Overseer (id=99320747690688519-127.0.0.1:34225_solr-n_0000000000) starting
   [junit4]   2> 238000 INFO  (zkCallback-351-thread-1-processing-n:127.0.0.1:45039_solr) [n:127.0.0.1:45039_solr    ] o.a.s.c.c.ZkStateReader Updated live nodes from ZooKeeper... (0) -> (1)
   [junit4]   2> 238000 INFO  (jetty-launcher-319-thread-3) [n:127.0.0.1:45039_solr    ] o.a.s.c.Overseer Overseer (id=null) closing
   [junit4]   2> 238000 INFO  (zkCallback-346-thread-1-processing-n:127.0.0.1:42201_solr) [n:127.0.0.1:42201_solr    ] o.a.s.c.c.ZkStateReader Updated live nodes from ZooKeeper... (0) -> (1)
   [junit4]   2> 238000 INFO  (zkCallback-353-thread-1-processing-n:127.0.0.1:46569_solr) [n:127.0.0.1:46569_solr    ] o.a.s.c.c.ZkStateReader Updated live nodes from ZooKeeper... (0) -> (1)
   [junit4]   2> 238001 INFO  (zkCallback-340-thread-1-processing-n:127.0.0.1:34225_solr) [n:127.0.0.1:34225_solr    ] o.a.s.c.c.ZkStateReader Updated live nodes from ZooKeeper... (0) -> (1)
   [junit4]   2> 238002 INFO  (jetty-launcher-319-thread-4) [n:127.0.0.1:46569_solr    ] o.a.s.c.ZkController Register node as live in ZooKeeper:/live_nodes/127.0.0.1:46569_solr
   [junit4]   2> 238002 INFO  (jetty-launcher-319-thread-3) [n:127.0.0.1:45039_solr    ] o.a.s.c.ZkController Register node as live in ZooKeeper:/live_nodes/127.0.0.1:45039_solr
   [junit4]   2> 238003 INFO  (zkCallback-353-thread-1-processing-n:127.0.0.1:46569_solr) [n:127.0.0.1:46569_solr    ] o.a.s.c.c.ZkStateReader Updated live nodes from ZooKeeper... (1) -> (3)
   [junit4]   2> 238003 INFO  (zkCallback-340-thread-1-processing-n:127.0.0.1:34225_solr) [n:127.0.0.1:34225_solr    ] o.a.s.c.c.ZkStateReader Updated live nodes from ZooKeeper... (1) -> (3)
   [junit4]   2> 238006 INFO  (zkCallback-351-thread-1-processing-n:127.0.0.1:45039_solr) [n:127.0.0.1:45039_solr    ] o.a.s.c.c.ZkStateReader Updated live nodes from ZooKeeper... (1) -> (3)
   [junit4]   2> 238008 INFO  (zkCallback-346-thread-1-processing-n:127.0.0.1:42201_solr) [n:127.0.0.1:42201_solr    ] o.a.s.c.c.ZkStateReader Updated live nodes from ZooKeeper... (1) -> (3)
   [junit4]   2> 238023 INFO  (jetty-launcher-319-thread-2) [n:127.0.0.1:34225_solr    ] o.a.s.c.ZkController Register node as live in ZooKeeper:/live_nodes/127.0.0.1:34225_solr
   [junit4]   2> 238024 INFO  (zkCallback-346-thread-1-processing-n:127.0.0.1:42201_solr) [n:127.0.0.1:42201_solr    ] o.a.s.c.c.ZkStateReader Updated live nodes from ZooKeeper... (3) -> (4)
   [junit4]   2> 238027 INFO  (zkCallback-351-thread-1-processing-n:127.0.0.1:45039_solr) [n:127.0.0.1:45039_solr    ] o.a.s.c.c.ZkStateReader Updated live nodes from ZooKeeper... (3) -> (4)
   [junit4]   2> 238030 INFO  (zkCallback-353-thread-1-processing-n:127.0.0.1:46569_solr) [n:127.0.0.1:46569_solr    ] o.a.s.c.c.ZkStateReader Updated live nodes from ZooKeeper... (3) -> (4)
   [junit4]   2> 238035 INFO  (zkCallback-340-thread-1-processing-n:127.0.0.1:34225_solr) [n:127.0.0.1:34225_solr    ] o.a.s.c.c.ZkStateReader Updated live nodes from ZooKeeper... (3) -> (4)
   [junit4]   2> 238037 INFO  (jetty-launcher-319-thread-1) [n:127.0.0.1:42201_solr    ] o.a.s.m.r.SolrJmxReporter JMX monitoring for 'solr_42201.solr.node' (registry 'solr.node') enabled at server: com.sun.jmx.mbeanserver.JmxMBeanServer@16e6c604
   [junit4]   2> 238050 INFO  (jetty-launcher-319-thread-1) [n:127.0.0.1:42201_solr    ] o.a.s.m.r.SolrJmxReporter JMX monitoring for 'solr_42201.solr.jvm' (registry 'solr.jvm') enabled at server: com.sun.jmx.mbeanserver.JmxMBeanServer@16e6c604
   [junit4]   2> 238050 INFO  (jetty-launcher-319-thread-1) [n:127.0.0.1:42201_solr    ] o.a.s.m.r.SolrJmxReporter JMX monitoring for 'solr_42201.solr.jetty' (registry 'solr.jetty') enabled at server: com.sun.jmx.mbeanserver.JmxMBeanServer@16e6c604
   [junit4]   2> 238052 INFO  (jetty-launcher-319-thread-1) [n:127.0.0.1:42201_solr    ] o.a.s.c.CorePropertiesLocator Found 0 core definitions underneath /home/jenkins/workspace/Lucene-Solr-7.x-Linux/solr/build/solr-core/test/J2/temp/solr.cloud.MoveReplicaHDFSTest_787A96007F702FE8-001/tempDir-001/node1/.
   [junit4]   2> 238056 INFO  (jetty-launcher-319-thread-4) [n:127.0.0.1:46569_solr    ] o.a.s.m.r.SolrJmxReporter JMX monitoring for 'solr_46569.solr.node' (registry 'solr.node') enabled at server: com.sun.jmx.mbeanserver.JmxMBeanServer@16e6c604
   [junit4]   2> 238061 INFO  (jetty-launcher-319-thread-3) [n:127.0.0.1:45039_solr    ] o.a.s.m.r.SolrJmxReporter JMX monitoring for 'solr_45039.solr.node' (registry 'solr.node') enabled at server: com.sun.jmx.mbeanserver.JmxMBeanServer@16e6c604
   [junit4]   2> 238069 INFO  (jetty-launcher-319-thread-3) [n:127.0.0.1:45039_solr    ] o.a.s.m.r.SolrJmxReporter JMX monitoring for 'solr_45039.solr.jvm' (registry 'solr.jvm') enabled at server: com.sun.jmx.mbeanserver.JmxMBeanServer@16e6c604
   [junit4]   2> 238070 INFO  (jetty-launcher-319-thread-3) [n:127.0.0.1:45039_solr    ] o.a.s.m.r.SolrJmxReporter JMX monitoring for 'solr_45039.solr.jetty' (registry 'solr.jetty') enabled at server: com.sun.jmx.mbeanserver.JmxMBeanServer@16e6c604
   [junit4]   2> 238071 INFO  (jetty-launcher-319-thread-3) [n:127.0.0.1:45039_solr    ] o.a.s.c.CorePropertiesLocator Found 0 core definitions underneath /home/jenkins/workspace/Lucene-Solr-7.x-Linux/solr/build/solr-core/test/J2/temp/solr.cloud.MoveReplicaHDFSTest_787A96007F702FE8-001/tempDir-001/node3/.
   [junit4]   2> 238078 INFO  (jetty-launcher-319-thread-2) [n:127.0.0.1:34225_solr    ] o.a.s.m.r.SolrJmxReporter JMX monitoring for 'solr_34225.solr.node' (registry 'solr.node') enabled at server: com.sun.jmx.mbeanserver.JmxMBeanServer@16e6c604
   [junit4]   2> 238086 INFO  (jetty-launcher-319-thread-4) [n:127.0.0.1:46569_solr    ] o.a.s.m.r.SolrJmxReporter JMX monitoring for 'solr_46569.solr.jvm' (registry 'solr.jvm') enabled at server: com.sun.jmx.mbeanserver.JmxMBeanServer@16e6c604
   [junit4]   2> 238086 INFO  (jetty-launcher-319-thread-4) [n:127.0.0.1:46569_solr    ] o.a.s.m.r.SolrJmxReporter JMX monitoring for 'solr_46569.solr.jetty' (registry 'solr.jetty') enabled at server: com.sun.jmx.mbeanserver.JmxMBeanServer@16e6c604
   [junit4]   2> 238087 INFO  (jetty-launcher-319-thread-4) [n:127.0.0.1:46569_solr    ] o.a.s.c.CorePropertiesLocator Found 0 core definitions underneath /home/jenkins/workspace/Lucene-Solr-7.x-Linux/solr/build/solr-core/test/J2/temp/solr.cloud.MoveReplicaHDFSTest_787A96007F702FE8-001/tempDir-001/node4/.
   [junit4]   2> 238094 INFO  (jetty-launcher-319-thread-2) [n:127.0.0.1:34225_solr    ] o.a.s.m.r.SolrJmxReporter JMX monitoring for 'solr_34225.solr.jvm' (registry 'solr.jvm') enabled at server: com.sun.jmx.mbeanserver.JmxMBeanServer@16e6c604
   [junit4]   2> 238094 INFO  (jetty-launcher-319-thread-2) [n:127.0.0.1:34225_solr    ] o.a.s.m.r.SolrJmxReporter JMX monitoring for 'solr_34225.solr.jetty' (registry 'solr.jetty') enabled at server: com.sun.jmx.mbeanserver.JmxMBeanServer@16e6c604
   [junit4]   2> 238096 INFO  (jetty-launcher-319-thread-2) [n:127.0.0.1:34225_solr    ] o.a.s.c.CorePropertiesLocator Found 0 core definitions underneath /home/jenkins/workspace/Lucene-Solr-7.x-Linux/solr/build/solr-core/test/J2/temp/solr.cloud.MoveReplicaHDFSTest_787A96007F702FE8-001/tempDir-001/node2/.
   [junit4]   2> 238183 INFO  (zkConnectionManagerCallback-364-thread-1) [    ] o.a.s.c.c.ConnectionManager zkClient has connected
   [junit4]   2> 238195 INFO  (zkConnectionManagerCallback-368-thread-1) [    ] o.a.s.c.c.ConnectionManager zkClient has connected
   [junit4]   2> 238197 INFO  (SUITE-MoveReplicaHDFSTest-seed#[787A96007F702FE8]-worker) [    ] o.a.s.c.c.ZkStateReader Updated live nodes from ZooKeeper... (0) -> (4)
   [junit4]   2> 238198 INFO  (SUITE-MoveReplicaHDFSTest-seed#[787A96007F702FE8]-worker) [    ] o.a.s.c.s.i.ZkClientClusterStateProvider Cluster at 127.0.0.1:46173/solr ready
   [junit4]   2> 238349 INFO  (qtp1854591390-1281) [n:127.0.0.1:34225_solr    ] o.a.s.h.a.CollectionsHandler Invoked Collection Action :overseerstatus with params action=OVERSEERSTATUS&wt=javabin&version=2 and sendToOCPQueue=true
   [junit4]   2> 238357 INFO  (qtp1854591390-1281) [n:127.0.0.1:34225_solr    ] o.a.s.s.HttpSolrCall [admin] webapp=null path=/admin/collections params={action=OVERSEERSTATUS&wt=javabin&version=2} status=0 QTime=8
   [junit4]   2> 238699 WARN  (SUITE-MoveReplicaHDFSTest-seed#[787A96007F702FE8]-worker) [    ] o.a.h.u.NativeCodeLoader Unable to load native-hadoop library for your platform... using builtin-java classes where applicable
   [junit4]   1> Formatting using clusterid: testClusterID
   [junit4]   2> 239054 WARN  (SUITE-MoveReplicaHDFSTest-seed#[787A96007F702FE8]-worker) [    ] o.a.h.m.i.MetricsConfig Cannot locate configuration: tried hadoop-metrics2-namenode.properties,hadoop-metrics2.properties
   [junit4]   2> 239174 INFO  (SUITE-MoveReplicaHDFSTest-seed#[787A96007F702FE8]-worker) [    ] o.m.log Logging to org.slf4j.impl.Log4jLoggerAdapter(org.mortbay.log) via org.mortbay.log.Slf4jLog
   [junit4]   2> 239186 WARN  (SUITE-MoveReplicaHDFSTest-seed#[787A96007F702FE8]-worker) [    ] o.a.h.h.HttpRequestLog Jetty request log can only be enabled using Log4j
   [junit4]   2> 239297 INFO  (SUITE-MoveReplicaHDFSTest-seed#[787A96007F702FE8]-worker) [    ] o.m.log jetty-6.1.26
   [junit4]   2> 239314 INFO  (SUITE-MoveReplicaHDFSTest-seed#[787A96007F702FE8]-worker) [    ] o.m.log Extract jar:file:/home/jenkins/.ivy2/cache/org.apache.hadoop/hadoop-hdfs/tests/hadoop-hdfs-2.7.4-tests.jar!/webapps/hdfs to ./temp/Jetty_localhost_localdomain_34409_hdfs____qsu6fq/webapp
   [junit4]   2> 239402 INFO  (SUITE-MoveReplicaHDFSTest-seed#[787A96007F702FE8]-worker) [    ] o.m.log Started HttpServer2$SelectChannelConnectorWithSafeStartup@localhost.localdomain:34409
   [junit4]   2> 239754 WARN  (SUITE-MoveReplicaHDFSTest-seed#[787A96007F702FE8]-worker) [    ] o.a.h.h.HttpRequestLog Jetty request log can only be enabled using Log4j
   [junit4]   2> 239756 INFO  (SUITE-MoveReplicaHDFSTest-seed#[787A96007F702FE8]-worker) [    ] o.m.log jetty-6.1.26
   [junit4]   2> 239758 INFO  (SUITE-MoveReplicaHDFSTest-seed#[787A96007F702FE8]-worker) [    ] o.m.log Extract jar:file:/home/jenkins/.ivy2/cache/org.apache.hadoop/hadoop-hdfs/tests/hadoop-hdfs-2.7.4-tests.jar!/webapps/datanode to ./temp/Jetty_localhost_41889_datanode____mka3yb/webapp
   [junit4]   2> 239845 INFO  (SUITE-MoveReplicaHDFSTest-seed#[787A96007F702FE8]-worker) [    ] o.m.log Started HttpServer2$SelectChannelConnectorWithSafeStartup@localhost:41889
   [junit4]   2> 239856 INFO  (SUITE-MoveReplicaHDFSTest-seed#[787A96007F702FE8]-worker) [    ] i.n.u.i.PlatformDependent Your platform does not provide complete low-level API for accessing direct buffers reliably. Unless explicitly requested, heap buffer will always be preferred to avoid potential system unstability.
   [junit4]   2> 240029 WARN  (SUITE-MoveReplicaHDFSTest-seed#[787A96007F702FE8]-worker) [    ] o.a.h.h.HttpRequestLog Jetty request log can only be enabled using Log4j
   [junit4]   2> 240030 INFO  (SUITE-MoveReplicaHDFSTest-seed#[787A96007F702FE8]-worker) [    ] o.m.log jetty-6.1.26
   [junit4]   2> 240032 INFO  (SUITE-MoveReplicaHDFSTest-seed#[787A96007F702FE8]-worker) [    ] o.m.log Extract jar:file:/home/jenkins/.ivy2/cache/org.apache.hadoop/hadoop-hdfs/tests/hadoop-hdfs-2.7.4-tests.jar!/webapps/datanode to ./temp/Jetty_localhost_40441_datanode____3jh0rg/webapp
   [junit4]   2> 240103 INFO  (SUITE-MoveReplicaHDFSTest-seed#[787A96007F702FE8]-worker) [    ] o.m.log Started HttpServer2$SelectChannelConnectorWithSafeStartup@localhost:40441
   [junit4]   2> 240352 INFO  (OverseerCollectionConfigSetProcessor-99320747690688519-127.0.0.1:34225_solr-n_0000000000) [n:127.0.0.1:34225_solr    ] o.a.s.c.OverseerTaskQueue Response ZK path: /overseer/collection-queue-work/qnr-0000000000 doesn't exist.  Requestor may have disconnected from ZooKeeper
   [junit4]   2> 240394 ERROR (DataNode: [[[DISK]file:/home/jenkins/workspace/Lucene-Solr-7.x-Linux/solr/build/solr-core/test/J2/temp/solr.cloud.MoveReplicaHDFSTest_787A96007F702FE8-001/tempDir-002/hdfsBaseDir/data/data1/, [DISK]file:/home/jenkins/workspace/Lucene-Solr-7.x-Linux/solr/build/solr-core/test/J2/temp/solr.cloud.MoveReplicaHDFSTest_787A96007F702FE8-001/tempDir-002/hdfsBaseDir/data/data2/]]  heartbeating to localhost.localdomain/127.0.0.1:44071) [    ] o.a.h.h.s.d.DirectoryScanner dfs.datanode.directoryscan.throttle.limit.ms.per.sec set to value below 1 ms/sec. Assuming default value of 1000
   [junit4]   2> 240425 ERROR (DataNode: [[[DISK]file:/home/jenkins/workspace/Lucene-Solr-7.x-Linux/solr/build/solr-core/test/J2/temp/solr.cloud.MoveReplicaHDFSTest_787A96007F702FE8-001/tempDir-002/hdfsBaseDir/data/data3/, [DISK]file:/home/jenkins/workspace/Lucene-Solr-7.x-Linux/solr/build/solr-core/test/J2/temp/solr.cloud.MoveReplicaHDFSTest_787A96007F702FE8-001/tempDir-002/hdfsBaseDir/data/data4/]]  heartbeating to localhost.localdomain/127.0.0.1:44071) [    ] o.a.h.h.s.d.DirectoryScanner dfs.datanode.directoryscan.throttle.limit.ms.per.sec set to value below 1 ms/sec. Assuming default value of 1000
   [junit4]   2> 240479 INFO  (Block report processor) [    ] BlockStateChange BLOCK* processReport 0xb6c7708f283ba: from storage DS-ca064bdd-bb86-40e3-84c4-608d3c06bafc node DatanodeRegistration(127.0.0.1:33115, datanodeUuid=de904c25-b21d-49ce-9580-952426cb95b0, infoPort=35787, infoSecurePort=0, ipcPort=32873, storageInfo=lv=-56;cid=testClusterID;nsid=1609231162;c=0), blocks: 0, hasStaleStorage: true, processing time: 2 msecs
   [junit4]   2> 240479 INFO  (Block report processor) [    ] BlockStateChange BLOCK* processReport 0xb6c7708f283ba: from storage DS-83bcdac4-c8f5-42d0-ae7a-58de06c18e4e node DatanodeRegistration(127.0.0.1:33115, datanodeUuid=de904c25-b21d-49ce-9580-952426cb95b0, infoPort=35787, infoSecurePort=0, ipcPort=32873, storageInfo=lv=-56;cid=testClusterID;nsid=1609231162;c=0), blocks: 0, hasStaleStorage: false, processing time: 0 msecs
   [junit4]   2> 240495 INFO  (Block report processor) [    ] BlockStateChange BLOCK* processReport 0xb6c7708f2847c: from storage DS-ec71e34f-b2d7-4430-88ee-22ba11841290 node DatanodeRegistration(127.0.0.1:44783, datanodeUuid=38958825-c0b8-4726-8a46-f74de8cb835f, infoPort=40975, infoSecurePort=0, ipcPort=42791, storageInfo=lv=-56;cid=testClusterID;nsid=1609231162;c=0), blocks: 0, hasStaleStorage: true, processing time: 9 msecs
   [junit4]   2> 240495 INFO  (Block report processor) [    ] BlockStateChange BLOCK* processReport 0xb6c7708f2847c: from storage DS-65afb68d-7ed6-448f-bb1c-47f046d1a06a node DatanodeRegistration(127.0.0.1:44783, datanodeUuid=38958825-c0b8-4726-8a46-f74de8cb835f, infoPort=40975, infoSecurePort=0, ipcPort=42791, storageInfo=lv=-56;cid=testClusterID;nsid=1609231162;c=0), blocks: 0, hasStaleStorage: false, processing time: 0 msecs
   [junit4]   2> 240616 INFO  (TEST-MoveReplicaHDFSTest.testNormalMove-seed#[787A96007F702FE8]) [    ] o.a.s.SolrTestCaseJ4 ###Starting testNormalMove
   [junit4]   2> 240616 INFO  (TEST-MoveReplicaHDFSTest.testNormalMove-seed#[787A96007F702FE8]) [    ] o.a.s.c.c.ZkStateReader Updated live nodes from ZooKeeper... (0) -> (4)
   [junit4]   2> 240618 INFO  (TEST-MoveReplicaHDFSTest.testNormalMove-seed#[787A96007F702FE8]) [    ] o.e.j.s.Server jetty-9.3.20.v20170531
   [junit4]   2> 240619 INFO  (TEST-MoveReplicaHDFSTest.testNormalMove-seed#[787A96007F702FE8]) [    ] o.e.j.s.h.ContextHandler Started o.e.j.s.ServletContextHandler@6976e4b5{/solr,null,AVAILABLE}
   [junit4]   2> 240620 INFO  (TEST-MoveReplicaHDFSTest.testNormalMove-seed#[787A96007F702FE8]) [    ] o.e.j.s.AbstractConnector Started ServerConnector@593c3839{SSL,[ssl, http/1.1]}{127.0.0.1:43641}
   [junit4]   2> 240620 INFO  (TEST-MoveReplicaHDFSTest.testNormalMove-seed#[787A96007F702FE8]) [    ] o.e.j.s.Server Started @242503ms
   [junit4]   2> 240620 INFO  (TEST-MoveReplicaHDFSTest.testNormalMove-seed#[787A96007F702FE8]) [    ] o.a.s.c.s.e.JettySolrRunner Jetty properties: {hostContext=/solr, hostPort=43641}
   [junit4]   2> 240620 ERROR (TEST-MoveReplicaHDFSTest.testNormalMove-seed#[787A96007F702FE8]) [    ] o.a.s.u.StartupLoggingUtils Missing Java Option solr.log.dir. Logging may be missing or incomplete.
   [junit4]   2> 240620 INFO  (TEST-MoveReplicaHDFSTest.testNormalMove-seed#[787A96007F702FE8]) [    ] o.a.s.s.SolrDispatchFilter  ___      _       Welcome to Apache Solr? version 7.3.0
   [junit4]   2> 240620 INFO  (TEST-MoveReplicaHDFSTest.testNormalMove-seed#[787A96007F702FE8]) [    ] o.a.s.s.SolrDispatchFilter / __| ___| |_ _   Starting in cloud mode on port null
   [junit4]   2> 240620 INFO  (TEST-MoveReplicaHDFSTest.testNormalMove-seed#[787A96007F702FE8]) [    ] o.a.s.s.SolrDispatchFilter \__ \/ _ \ | '_|  Install dir: null
   [junit4]   2> 240620 INFO  (TEST-MoveReplicaHDFSTest.testNormalMove-seed#[787A96007F702FE8]) [    ] o.a.s.s.SolrDispatchFilter |___/\___/_|_|    Start time: 2018-01-09T16:12:21.429566Z
   [junit4]   2> 240622 INFO  (zkConnectionManagerCallback-371-thread-1) [    ] o.a.s.c.c.ConnectionManager zkClient has connected
   [junit4]   2> 240627 INFO  (TEST-MoveReplicaHDFSTest.testNormalMove-seed#[787A96007F702FE8]) [    ] o.a.s.s.SolrDispatchFilter solr.xml found in ZooKeeper. Loading...
   [junit4]   2> 240645 INFO  (TEST-MoveReplicaHDFSTest.testNormalMove-seed#[787A96007F702FE8]) [    ] o.a.s.c.ZkContainer Zookeeper client=127.0.0.1:46173/solr
   [junit4]   2> 240647 INFO  (zkConnectionManagerCallback-375-thread-1) [    ] o.a.s.c.c.ConnectionManager zkClient has connected
   [junit4]   2> 240651 INFO  (zkConnectionManagerCallback-377-thread-1-processing-n:127.0.0.1:43641_solr) [n:127.0.0.1:43641_solr    ] o.a.s.c.c.ConnectionManager zkClient has connected
   [junit4]   2> 240654 INFO  (TEST-MoveReplicaHDFSTest.testNormalMove-seed#[787A96007F702FE8]) [n:127.0.0.1:43641_solr    ] o.a.s.c.c.ZkStateReader Updated live nodes from ZooKeeper... (0) -> (4)
   [junit4]   2> 240655 INFO  (TEST-MoveReplicaHDFSTest.testNormalMove-seed#[787A96007F702FE8]) [n:127.0.0.1:43641_solr    ] o.a.s.c.Overseer Overseer (id=null) closing
   [junit4]   2> 240656 INFO  (TEST-MoveReplicaHDFSTest.testNormalMove-seed#[787A96007F702FE8]) [n:127.0.0.1:43641_solr    ] o.a.s.c.ZkController Register node as live in ZooKeeper:/live_nodes/127.0.0.1:43641_solr
   [junit4]   2> 240656 INFO  (zkCallback-340-thread-1-processing-n:127.0.0.1:34225_solr) [n:127.0.0.1:34225_solr    ] o.a.s.c.c.ZkStateReader Updated live nodes from ZooKeeper... (4) -> (5)
   [junit4]   2> 240656 INFO  (zkCallback-346-thread-1-processing-n:127.0.0.1:42201_solr) [n:127.0.0.1:42201_solr    ] o.a.s.c.c.ZkStateReader Updated live nodes from ZooKeeper... (4) -> (5)
   [junit4]   2> 240656 INFO  (zkCallback-351-thread-1-processing-n:127.0.0.1:45039_solr) [n:127.0.0.1:45039_solr    ] o.a.s.c.c.ZkStateReader Updated live nodes from ZooKeeper... (4) -> (5)
   [junit4]   2> 240656 INFO  (zkCallback-353-thread-1-processing-n:127.0.0.1:46569_solr) [n:127.0.0.1:46569_solr    ] o.a.s.c.c.ZkStateReader Updated live nodes from ZooKeeper... (4) -> (5)
   [junit4]   2> 240657 INFO  (zkCallback-376-thread-1-processing-n:127.0.0.1:43641_solr) [n:127.0.0.1:43641_solr    ] o.a.s.c.c.ZkStateReader Updated live nodes from ZooKeeper... (4) -> (5)
   [junit4]   2> 240657 INFO  (zkCallback-367-thread-1) [    ] o.a.s.c.c.ZkStateReader Updated live nodes from ZooKeeper... (4) -> (5)
   [junit4]   2> 240657 INFO  (zkCallback-367-thread-2) [    ] o.a.s.c.c.ZkStateReader Updated live nodes from ZooKeeper... (4) -> (5)
   [junit4]   2> 240707 INFO  (TEST-MoveReplicaHDFSTest.testNormalMove-seed#[787A96007F702FE8]) [n:127.0.0.1:43641_solr    ] o.a.s.m.r.SolrJmxReporter JMX monitoring for 'solr_43641.solr.node' (registry 'solr.node') enabled at server: com.sun.jmx.mbeanserver.JmxMBeanServer@16e6c604
   [junit4]   2> 240719 INFO  (TEST-MoveReplicaHDFSTest.testNormalMove-seed#[787A96007F702FE8]) [n:127.0.0.1:43641_solr    ] o.a.s.m.r.SolrJmxReporter JMX monitoring for 'solr_43641.solr.jvm' (registry 'solr.jvm') enabled at server: com.sun.jmx.mbean

[...truncated too long message...]

s/workspace/Lucene-Solr-7.x-Linux/solr/build/solr-solrj/test/J1/temp/solr.client.solrj.request.SchemaTest_C443592F98B8841F-001/tempDir-103/collection1/conf/managed-schema
   [junit4]   2> 135046 INFO  (coreLoadExecutor-1088-thread-1) [    x:collection1] o.a.s.s.ManagedIndexSchemaFactory After upgrading to managed schema, renamed the non-managed schema /home/jenkins/workspace/Lucene-Solr-7.x-Linux/solr/build/solr-solrj/test/J1/temp/solr.client.solrj.request.SchemaTest_C443592F98B8841F-001/tempDir-103/collection1/conf/schema.xml to /home/jenkins/workspace/Lucene-Solr-7.x-Linux/solr/build/solr-solrj/test/J1/temp/solr.client.solrj.request.SchemaTest_C443592F98B8841F-001/tempDir-103/collection1/conf/schema.xml.bak
   [junit4]   2> 135046 INFO  (coreLoadExecutor-1088-thread-1) [    x:collection1] o.a.s.c.CoreContainer Creating SolrCore 'collection1' using configuration from configset /home/jenkins/workspace/Lucene-Solr-7.x-Linux/solr/build/solr-solrj/test/J1/temp/solr.client.solrj.request.SchemaTest_C443592F98B8841F-001/tempDir-103/collection1, trusted=true
   [junit4]   2> 135046 INFO  (coreLoadExecutor-1088-thread-1) [    x:collection1] o.a.s.m.r.SolrJmxReporter JMX monitoring for 'solr.core.collection1' (registry 'solr.core.collection1') enabled at server: com.sun.jmx.mbeanserver.JmxMBeanServer@259aec23
   [junit4]   2> 135047 INFO  (coreLoadExecutor-1088-thread-1) [    x:collection1] o.a.s.c.SolrCore solr.RecoveryStrategy.Builder
   [junit4]   2> 135047 INFO  (coreLoadExecutor-1088-thread-1) [    x:collection1] o.a.s.c.SolrCore [[collection1] ] Opening new SolrCore at [/home/jenkins/workspace/Lucene-Solr-7.x-Linux/solr/build/solr-solrj/test/J1/temp/solr.client.solrj.request.SchemaTest_C443592F98B8841F-001/tempDir-103/collection1], dataDir=[/home/jenkins/workspace/Lucene-Solr-7.x-Linux/solr/build/solr-solrj/test/J1/temp/solr.client.solrj.request.SchemaTest_C443592F98B8841F-001/tempDir-105/cores/core/data/]
   [junit4]   2> 135094 WARN  (coreLoadExecutor-1088-thread-1) [    x:collection1] o.a.s.c.RequestHandlers no default request handler is registered (either '/select' or 'standard')
   [junit4]   2> 135094 INFO  (coreLoadExecutor-1088-thread-1) [    x:collection1] o.a.s.u.CommitTracker Hard AutoCommit: disabled
   [junit4]   2> 135094 INFO  (coreLoadExecutor-1088-thread-1) [    x:collection1] o.a.s.u.CommitTracker Soft AutoCommit: disabled
   [junit4]   2> 135095 INFO  (coreLoadExecutor-1088-thread-1) [    x:collection1] o.a.s.s.SolrIndexSearcher Opening [Searcher@3e20526c[collection1] main]
   [junit4]   2> 135096 INFO  (coreLoadExecutor-1088-thread-1) [    x:collection1] o.a.s.r.ManagedResourceStorage File-based storage initialized to use dir: /home/jenkins/workspace/Lucene-Solr-7.x-Linux/solr/build/solr-solrj/test/J1/temp/solr.client.solrj.request.SchemaTest_C443592F98B8841F-001/tempDir-103/collection1/conf
   [junit4]   2> 135096 INFO  (coreLoadExecutor-1088-thread-1) [    x:collection1] o.a.s.h.ReplicationHandler Commits will be reserved for 10000ms.
   [junit4]   2> 135096 INFO  (TEST-SchemaTest.testDeleteDynamicFieldAccuracy-seed#[C443592F98B8841F]) [    ] o.a.s.SolrJettyTestBase Jetty Assigned Port#45387
   [junit4]   2> 135099 INFO  (searcherExecutor-1089-thread-1-processing-x:collection1) [    x:collection1] o.a.s.c.SolrCore [collection1] Registered new searcher Searcher@3e20526c[collection1] main{ExitableDirectoryReader(UninvertingDirectoryReader())}
   [junit4]   2> 135100 INFO  (qtp663276848-2581) [    x:collection1] o.a.s.s.ManagedIndexSchema Upgraded to managed schema at /home/jenkins/workspace/Lucene-Solr-7.x-Linux/solr/build/solr-solrj/test/J1/temp/solr.client.solrj.request.SchemaTest_C443592F98B8841F-001/tempDir-103/collection1/conf/managed-schema
   [junit4]   2> 135105 INFO  (qtp663276848-2581) [    x:collection1] o.a.s.c.S.Request [collection1]  webapp=/solr path=/schema params={wt=javabin&version=2} status=0 QTime=6
   [junit4]   2> 135106 INFO  (qtp663276848-2582) [    x:collection1] o.a.s.c.S.Request [collection1]  webapp=/solr path=/schema/dynamicfields/*_del params={wt=javabin&version=2} status=0 QTime=0
   [junit4]   2> 135108 INFO  (qtp663276848-2583) [    x:collection1] o.a.s.s.ManagedIndexSchema Upgraded to managed schema at /home/jenkins/workspace/Lucene-Solr-7.x-Linux/solr/build/solr-solrj/test/J1/temp/solr.client.solrj.request.SchemaTest_C443592F98B8841F-001/tempDir-103/collection1/conf/managed-schema
   [junit4]   2> 135113 INFO  (qtp663276848-2583) [    x:collection1] o.a.s.c.S.Request [collection1]  webapp=/solr path=/schema params={wt=javabin&version=2} status=0 QTime=6
   [junit4]   2> 135113 INFO  (qtp663276848-2576) [    x:collection1] o.a.s.c.S.Request [collection1]  webapp=/solr path=/schema/dynamicfields/*_del params={wt=javabin&version=2} status=404 QTime=0
   [junit4]   2> 135114 INFO  (TEST-SchemaTest.testDeleteDynamicFieldAccuracy-seed#[C443592F98B8841F]) [    ] o.e.j.s.AbstractConnector Stopped ServerConnector@62741c79{HTTP/1.1,[http/1.1]}{127.0.0.1:0}
   [junit4]   2> 135114 INFO  (TEST-SchemaTest.testDeleteDynamicFieldAccuracy-seed#[C443592F98B8841F]) [    ] o.a.s.c.CoreContainer Shutting down CoreContainer instance=530522385
   [junit4]   2> 135115 INFO  (TEST-SchemaTest.testDeleteDynamicFieldAccuracy-seed#[C443592F98B8841F]) [    ] o.a.s.m.SolrMetricManager Closing metric reporters for registry=solr.node, tag=null
   [junit4]   2> 135115 INFO  (TEST-SchemaTest.testDeleteDynamicFieldAccuracy-seed#[C443592F98B8841F]) [    ] o.a.s.m.r.SolrJmxReporter Closing reporter [org.apache.solr.metrics.reporters.SolrJmxReporter@58614dc2: rootName = null, domain = solr.node, service url = null, agent id = null] for registry solr.node / com.codahale.metrics.MetricRegistry@3f2b58b0
   [junit4]   2> 135120 INFO  (TEST-SchemaTest.testDeleteDynamicFieldAccuracy-seed#[C443592F98B8841F]) [    ] o.a.s.m.SolrMetricManager Closing metric reporters for registry=solr.jvm, tag=null
   [junit4]   2> 135120 INFO  (TEST-SchemaTest.testDeleteDynamicFieldAccuracy-seed#[C443592F98B8841F]) [    ] o.a.s.m.r.SolrJmxReporter Closing reporter [org.apache.solr.metrics.reporters.SolrJmxReporter@42bcc6b8: rootName = null, domain = solr.jvm, service url = null, agent id = null] for registry solr.jvm / com.codahale.metrics.MetricRegistry@e13ae9f
   [junit4]   2> 135125 INFO  (TEST-SchemaTest.testDeleteDynamicFieldAccuracy-seed#[C443592F98B8841F]) [    ] o.a.s.m.SolrMetricManager Closing metric reporters for registry=solr.jetty, tag=null
   [junit4]   2> 135125 INFO  (TEST-SchemaTest.testDeleteDynamicFieldAccuracy-seed#[C443592F98B8841F]) [    ] o.a.s.m.r.SolrJmxReporter Closing reporter [org.apache.solr.metrics.reporters.SolrJmxReporter@64f3336e: rootName = null, domain = solr.jetty, service url = null, agent id = null] for registry solr.jetty / com.codahale.metrics.MetricRegistry@a2c3b85
   [junit4]   2> 135126 INFO  (coreCloseExecutor-1093-thread-1) [    x:collection1] o.a.s.c.SolrCore [collection1]  CLOSING SolrCore org.apache.solr.core.SolrCore@2394d5c
   [junit4]   2> 135126 INFO  (coreCloseExecutor-1093-thread-1) [    x:collection1] o.a.s.m.SolrMetricManager Closing metric reporters for registry=solr.core.collection1, tag=37309788
   [junit4]   2> 135126 INFO  (coreCloseExecutor-1093-thread-1) [    x:collection1] o.a.s.m.r.SolrJmxReporter Closing reporter [org.apache.solr.metrics.reporters.SolrJmxReporter@473bd37f: rootName = null, domain = solr.core.collection1, service url = null, agent id = null] for registry solr.core.collection1 / com.codahale.metrics.MetricRegistry@5abbfb58
   [junit4]   2> 135135 INFO  (TEST-SchemaTest.testDeleteDynamicFieldAccuracy-seed#[C443592F98B8841F]) [    ] o.e.j.s.h.ContextHandler Stopped o.e.j.s.ServletContextHandler@46849745{/solr,null,UNAVAILABLE}
   [junit4]   2> 135136 INFO  (TEST-SchemaTest.testDeleteDynamicFieldAccuracy-seed#[C443592F98B8841F]) [    ] o.a.s.SolrTestCaseJ4 ###Ending testDeleteDynamicFieldAccuracy
   [junit4]   2> NOTE: leaving temporary files on disk at: /home/jenkins/workspace/Lucene-Solr-7.x-Linux/solr/build/solr-solrj/test/J1/temp/solr.client.solrj.request.SchemaTest_C443592F98B8841F-001
   [junit4]   2> NOTE: test params are: codec=Asserting(Lucene70): {}, docValues:{}, maxPointsInLeafNode=385, maxMBSortInHeap=7.0634150527834265, sim=RandomSimilarity(queryNorm=false): {}, locale=ta-SG, timezone=Europe/Belgrade
   [junit4]   2> NOTE: Linux 4.10.0-40-generic amd64/Oracle Corporation 10-ea (64-bit)/cpus=8,threads=1,free=400550008,total=536870912
   [junit4]   2> NOTE: All tests run in this JVM: [CloudSolrClientMultiConstructorTest, CollectionAdminRequestRequiredParamsTest, TestDocumentObjectBinder, HttpSolrClientSSLAuthConPoolTest, SubtractEvaluatorTest, TestDelegationTokenResponse, HyperbolicCosineEvaluatorTest, RoundEvaluatorTest, JDBCStreamTest, TestFastInputStream, CumulativeProbabilityEvaluatorTest, TestUpdateRequestCodec, StreamExpressionToExpessionTest, TestV2Request, SolrDocumentTest, ConcurrentUpdateSolrClientTest, ConcatOperationTest, SolrZkClientTest, CorrelationEvaluatorTest, GraphTest, LengthEvaluatorTest, SolrPingTest, TestSolrProperties, SolrExampleStreamingTest, SolrExampleStreamingBinaryTest, SolrExampleEmbeddedTest, JettyWebappTest, LargeVolumeEmbeddedTest, TestSpellCheckResponse, LargeVolumeJettyTest, SolrParamTest, MergeIndexesEmbeddedTest, TestEmbeddedSolrServer, QueryResponseTest, TestNamedListCodec, TestJavaBinCodec, SolrQueryTest, TestHash, ModifiableSolrParamsTest, DocumentAnalysisResponseTest, ClientUtilsTest, AnlysisResponseBaseTest, FacetFieldTest, GetByIdTest, SolrSchemalessExampleTest, TestLBHttpSolrClient, TestSolrJErrorHandling, TestPolicy, BasicHttpSolrClientTest, ConcurrentUpdateSolrClientBuilderTest, SelectWithEvaluatorsTest, NormalDistributionEvaluatorTest, OrEvaluatorTest, RawValueEvaluatorTest, RegressionEvaluatorTest, SineEvaluatorTest, TangentEvaluatorTest, UuidEvaluatorTest, SchemaTest]
   [junit4] Completed [142/146 (1!)] on J1 in 12.46s, 35 tests, 8 errors <<< FAILURES!

[...truncated 39989 lines...]

Mime
View raw message