lucene-dev mailing list archives

Site index · List index
Message view « Date » · « Thread »
Top « Date » · « Thread »
From Policeman Jenkins Server <jenk...@thetaphi.de>
Subject [JENKINS] Lucene-Solr-master-Windows (64bit/jdk-9.0.1) - Build # 7092 - Still Unstable!
Date Thu, 04 Jan 2018 08:33:47 GMT
Build: https://jenkins.thetaphi.de/job/Lucene-Solr-master-Windows/7092/
Java: 64bit/jdk-9.0.1 -XX:+UseCompressedOops -XX:+UseParallelGC

6 tests failed.
FAILED:  org.apache.solr.cloud.autoscaling.sim.TestGenericDistributedQueue.testDistributedQueue

Error Message:
Test abandoned because suite timeout was reached.

Stack Trace:
java.lang.Exception: Test abandoned because suite timeout was reached.
	at __randomizedtesting.SeedInfo.seed([EBC06C30F396FC73]:0)


FAILED:  junit.framework.TestSuite.org.apache.solr.cloud.autoscaling.sim.TestGenericDistributedQueue

Error Message:
Suite timeout exceeded (>= 7200000 msec).

Stack Trace:
java.lang.Exception: Suite timeout exceeded (>= 7200000 msec).
	at __randomizedtesting.SeedInfo.seed([EBC06C30F396FC73]:0)


FAILED:  org.apache.solr.handler.TestSQLHandler.doTest

Error Message:


Stack Trace:
java.lang.AssertionError
	at __randomizedtesting.SeedInfo.seed([EBC06C30F396FC73:4C84D4949E2DEFCA]:0)
	at org.apache.solr.handler.TestSQLHandler.testBasicSelect(TestSQLHandler.java:196)
	at org.apache.solr.handler.TestSQLHandler.doTest(TestSQLHandler.java:82)
	at java.base/jdk.internal.reflect.NativeMethodAccessorImpl.invoke0(Native Method)
	at java.base/jdk.internal.reflect.NativeMethodAccessorImpl.invoke(NativeMethodAccessorImpl.java:62)
	at java.base/jdk.internal.reflect.DelegatingMethodAccessorImpl.invoke(DelegatingMethodAccessorImpl.java:43)
	at java.base/java.lang.reflect.Method.invoke(Method.java:564)
	at com.carrotsearch.randomizedtesting.RandomizedRunner.invoke(RandomizedRunner.java:1737)
	at com.carrotsearch.randomizedtesting.RandomizedRunner$8.evaluate(RandomizedRunner.java:934)
	at com.carrotsearch.randomizedtesting.RandomizedRunner$9.evaluate(RandomizedRunner.java:970)
	at com.carrotsearch.randomizedtesting.RandomizedRunner$10.evaluate(RandomizedRunner.java:984)
	at org.apache.solr.BaseDistributedSearchTestCase$ShardsRepeatRule$ShardsFixedStatement.callStatement(BaseDistributedSearchTestCase.java:993)
	at org.apache.solr.BaseDistributedSearchTestCase$ShardsRepeatRule$ShardsStatement.evaluate(BaseDistributedSearchTestCase.java:968)
	at com.carrotsearch.randomizedtesting.rules.SystemPropertiesRestoreRule$1.evaluate(SystemPropertiesRestoreRule.java:57)
	at org.apache.lucene.util.TestRuleSetupTeardownChained$1.evaluate(TestRuleSetupTeardownChained.java:49)
	at org.apache.lucene.util.AbstractBeforeAfterRule$1.evaluate(AbstractBeforeAfterRule.java:45)
	at org.apache.lucene.util.TestRuleThreadAndTestName$1.evaluate(TestRuleThreadAndTestName.java:48)
	at org.apache.lucene.util.TestRuleIgnoreAfterMaxFailures$1.evaluate(TestRuleIgnoreAfterMaxFailures.java:64)
	at org.apache.lucene.util.TestRuleMarkFailure$1.evaluate(TestRuleMarkFailure.java:47)
	at com.carrotsearch.randomizedtesting.rules.StatementAdapter.evaluate(StatementAdapter.java:36)
	at com.carrotsearch.randomizedtesting.ThreadLeakControl$StatementRunner.run(ThreadLeakControl.java:368)
	at com.carrotsearch.randomizedtesting.ThreadLeakControl.forkTimeoutingTask(ThreadLeakControl.java:817)
	at com.carrotsearch.randomizedtesting.ThreadLeakControl$3.evaluate(ThreadLeakControl.java:468)
	at com.carrotsearch.randomizedtesting.RandomizedRunner.runSingleTest(RandomizedRunner.java:943)
	at com.carrotsearch.randomizedtesting.RandomizedRunner$5.evaluate(RandomizedRunner.java:829)
	at com.carrotsearch.randomizedtesting.RandomizedRunner$6.evaluate(RandomizedRunner.java:879)
	at com.carrotsearch.randomizedtesting.RandomizedRunner$7.evaluate(RandomizedRunner.java:890)
	at com.carrotsearch.randomizedtesting.rules.StatementAdapter.evaluate(StatementAdapter.java:36)
	at com.carrotsearch.randomizedtesting.rules.SystemPropertiesRestoreRule$1.evaluate(SystemPropertiesRestoreRule.java:57)
	at org.apache.lucene.util.AbstractBeforeAfterRule$1.evaluate(AbstractBeforeAfterRule.java:45)
	at com.carrotsearch.randomizedtesting.rules.StatementAdapter.evaluate(StatementAdapter.java:36)
	at org.apache.lucene.util.TestRuleStoreClassName$1.evaluate(TestRuleStoreClassName.java:41)
	at com.carrotsearch.randomizedtesting.rules.NoShadowingOrOverridesOnMethodsRule$1.evaluate(NoShadowingOrOverridesOnMethodsRule.java:40)
	at com.carrotsearch.randomizedtesting.rules.NoShadowingOrOverridesOnMethodsRule$1.evaluate(NoShadowingOrOverridesOnMethodsRule.java:40)
	at com.carrotsearch.randomizedtesting.rules.StatementAdapter.evaluate(StatementAdapter.java:36)
	at com.carrotsearch.randomizedtesting.rules.StatementAdapter.evaluate(StatementAdapter.java:36)
	at org.apache.lucene.util.TestRuleAssertionsRequired$1.evaluate(TestRuleAssertionsRequired.java:53)
	at org.apache.lucene.util.TestRuleMarkFailure$1.evaluate(TestRuleMarkFailure.java:47)
	at org.apache.lucene.util.TestRuleIgnoreAfterMaxFailures$1.evaluate(TestRuleIgnoreAfterMaxFailures.java:64)
	at org.apache.lucene.util.TestRuleIgnoreTestSuites$1.evaluate(TestRuleIgnoreTestSuites.java:54)
	at com.carrotsearch.randomizedtesting.rules.StatementAdapter.evaluate(StatementAdapter.java:36)
	at com.carrotsearch.randomizedtesting.ThreadLeakControl$StatementRunner.run(ThreadLeakControl.java:368)
	at java.base/java.lang.Thread.run(Thread.java:844)


FAILED:  junit.framework.TestSuite.org.apache.solr.rest.schema.TestBulkSchemaAPI

Error Message:
Could not remove the following files (in the order of attempts):    C:\Users\jenkins\workspace\Lucene-Solr-master-Windows\solr\build\solr-core\test\J0\temp\solr.rest.schema.TestBulkSchemaAPI_EBC06C30F396FC73-001\tempDir-013\collection1: java.nio.file.DirectoryNotEmptyException: C:\Users\jenkins\workspace\Lucene-Solr-master-Windows\solr\build\solr-core\test\J0\temp\solr.rest.schema.TestBulkSchemaAPI_EBC06C30F396FC73-001\tempDir-013\collection1    C:\Users\jenkins\workspace\Lucene-Solr-master-Windows\solr\build\solr-core\test\J0\temp\solr.rest.schema.TestBulkSchemaAPI_EBC06C30F396FC73-001\tempDir-013: java.nio.file.DirectoryNotEmptyException: C:\Users\jenkins\workspace\Lucene-Solr-master-Windows\solr\build\solr-core\test\J0\temp\solr.rest.schema.TestBulkSchemaAPI_EBC06C30F396FC73-001\tempDir-013 

Stack Trace:
java.io.IOException: Could not remove the following files (in the order of attempts):
   C:\Users\jenkins\workspace\Lucene-Solr-master-Windows\solr\build\solr-core\test\J0\temp\solr.rest.schema.TestBulkSchemaAPI_EBC06C30F396FC73-001\tempDir-013\collection1: java.nio.file.DirectoryNotEmptyException: C:\Users\jenkins\workspace\Lucene-Solr-master-Windows\solr\build\solr-core\test\J0\temp\solr.rest.schema.TestBulkSchemaAPI_EBC06C30F396FC73-001\tempDir-013\collection1
   C:\Users\jenkins\workspace\Lucene-Solr-master-Windows\solr\build\solr-core\test\J0\temp\solr.rest.schema.TestBulkSchemaAPI_EBC06C30F396FC73-001\tempDir-013: java.nio.file.DirectoryNotEmptyException: C:\Users\jenkins\workspace\Lucene-Solr-master-Windows\solr\build\solr-core\test\J0\temp\solr.rest.schema.TestBulkSchemaAPI_EBC06C30F396FC73-001\tempDir-013

	at __randomizedtesting.SeedInfo.seed([EBC06C30F396FC73]:0)
	at org.apache.lucene.util.IOUtils.rm(IOUtils.java:329)
	at org.apache.lucene.util.TestRuleTemporaryFilesCleanup.afterAlways(TestRuleTemporaryFilesCleanup.java:216)
	at com.carrotsearch.randomizedtesting.rules.TestRuleAdapter$1.afterAlways(TestRuleAdapter.java:31)
	at com.carrotsearch.randomizedtesting.rules.StatementAdapter.evaluate(StatementAdapter.java:43)
	at com.carrotsearch.randomizedtesting.rules.StatementAdapter.evaluate(StatementAdapter.java:36)
	at org.apache.lucene.util.TestRuleAssertionsRequired$1.evaluate(TestRuleAssertionsRequired.java:53)
	at org.apache.lucene.util.TestRuleMarkFailure$1.evaluate(TestRuleMarkFailure.java:47)
	at org.apache.lucene.util.TestRuleIgnoreAfterMaxFailures$1.evaluate(TestRuleIgnoreAfterMaxFailures.java:64)
	at org.apache.lucene.util.TestRuleIgnoreTestSuites$1.evaluate(TestRuleIgnoreTestSuites.java:54)
	at com.carrotsearch.randomizedtesting.rules.StatementAdapter.evaluate(StatementAdapter.java:36)
	at com.carrotsearch.randomizedtesting.ThreadLeakControl$StatementRunner.run(ThreadLeakControl.java:368)
	at java.base/java.lang.Thread.run(Thread.java:844)


FAILED:  junit.framework.TestSuite.org.apache.solr.update.TestAtomicUpdateErrorCases

Error Message:
Could not remove the following files (in the order of attempts):    C:\Users\jenkins\workspace\Lucene-Solr-master-Windows\solr\build\solr-core\test\J0\temp\solr.update.TestAtomicUpdateErrorCases_EBC06C30F396FC73-001\init-core-data-001: java.nio.file.DirectoryNotEmptyException: C:\Users\jenkins\workspace\Lucene-Solr-master-Windows\solr\build\solr-core\test\J0\temp\solr.update.TestAtomicUpdateErrorCases_EBC06C30F396FC73-001\init-core-data-001    C:\Users\jenkins\workspace\Lucene-Solr-master-Windows\solr\build\solr-core\test\J0\temp\solr.update.TestAtomicUpdateErrorCases_EBC06C30F396FC73-001\init-core-data-001\tlog: java.nio.file.AccessDeniedException: C:\Users\jenkins\workspace\Lucene-Solr-master-Windows\solr\build\solr-core\test\J0\temp\solr.update.TestAtomicUpdateErrorCases_EBC06C30F396FC73-001\init-core-data-001\tlog    C:\Users\jenkins\workspace\Lucene-Solr-master-Windows\solr\build\solr-core\test\J0\temp\solr.update.TestAtomicUpdateErrorCases_EBC06C30F396FC73-001: java.nio.file.DirectoryNotEmptyException: C:\Users\jenkins\workspace\Lucene-Solr-master-Windows\solr\build\solr-core\test\J0\temp\solr.update.TestAtomicUpdateErrorCases_EBC06C30F396FC73-001 

Stack Trace:
java.io.IOException: Could not remove the following files (in the order of attempts):
   C:\Users\jenkins\workspace\Lucene-Solr-master-Windows\solr\build\solr-core\test\J0\temp\solr.update.TestAtomicUpdateErrorCases_EBC06C30F396FC73-001\init-core-data-001: java.nio.file.DirectoryNotEmptyException: C:\Users\jenkins\workspace\Lucene-Solr-master-Windows\solr\build\solr-core\test\J0\temp\solr.update.TestAtomicUpdateErrorCases_EBC06C30F396FC73-001\init-core-data-001
   C:\Users\jenkins\workspace\Lucene-Solr-master-Windows\solr\build\solr-core\test\J0\temp\solr.update.TestAtomicUpdateErrorCases_EBC06C30F396FC73-001\init-core-data-001\tlog: java.nio.file.AccessDeniedException: C:\Users\jenkins\workspace\Lucene-Solr-master-Windows\solr\build\solr-core\test\J0\temp\solr.update.TestAtomicUpdateErrorCases_EBC06C30F396FC73-001\init-core-data-001\tlog
   C:\Users\jenkins\workspace\Lucene-Solr-master-Windows\solr\build\solr-core\test\J0\temp\solr.update.TestAtomicUpdateErrorCases_EBC06C30F396FC73-001: java.nio.file.DirectoryNotEmptyException: C:\Users\jenkins\workspace\Lucene-Solr-master-Windows\solr\build\solr-core\test\J0\temp\solr.update.TestAtomicUpdateErrorCases_EBC06C30F396FC73-001

	at __randomizedtesting.SeedInfo.seed([EBC06C30F396FC73]:0)
	at org.apache.lucene.util.IOUtils.rm(IOUtils.java:329)
	at org.apache.lucene.util.TestRuleTemporaryFilesCleanup.afterAlways(TestRuleTemporaryFilesCleanup.java:216)
	at com.carrotsearch.randomizedtesting.rules.TestRuleAdapter$1.afterAlways(TestRuleAdapter.java:31)
	at com.carrotsearch.randomizedtesting.rules.StatementAdapter.evaluate(StatementAdapter.java:43)
	at com.carrotsearch.randomizedtesting.rules.StatementAdapter.evaluate(StatementAdapter.java:36)
	at org.apache.lucene.util.TestRuleAssertionsRequired$1.evaluate(TestRuleAssertionsRequired.java:53)
	at org.apache.lucene.util.TestRuleMarkFailure$1.evaluate(TestRuleMarkFailure.java:47)
	at org.apache.lucene.util.TestRuleIgnoreAfterMaxFailures$1.evaluate(TestRuleIgnoreAfterMaxFailures.java:64)
	at org.apache.lucene.util.TestRuleIgnoreTestSuites$1.evaluate(TestRuleIgnoreTestSuites.java:54)
	at com.carrotsearch.randomizedtesting.rules.StatementAdapter.evaluate(StatementAdapter.java:36)
	at com.carrotsearch.randomizedtesting.ThreadLeakControl$StatementRunner.run(ThreadLeakControl.java:368)
	at java.base/java.lang.Thread.run(Thread.java:844)


FAILED:  junit.framework.TestSuite.org.apache.solr.update.processor.TestOpenNLPExtractNamedEntitiesUpdateProcessorFactory

Error Message:
Could not remove the following files (in the order of attempts):    C:\Users\jenkins\workspace\Lucene-Solr-master-Windows\solr\build\contrib\solr-analysis-extras\test\J0\temp\solr.update.processor.TestOpenNLPExtractNamedEntitiesUpdateProcessorFactory_D2A10452A460FB1E-001\tempDir-001\collection1\conf: java.nio.file.DirectoryNotEmptyException: C:\Users\jenkins\workspace\Lucene-Solr-master-Windows\solr\build\contrib\solr-analysis-extras\test\J0\temp\solr.update.processor.TestOpenNLPExtractNamedEntitiesUpdateProcessorFactory_D2A10452A460FB1E-001\tempDir-001\collection1\conf    C:\Users\jenkins\workspace\Lucene-Solr-master-Windows\solr\build\contrib\solr-analysis-extras\test\J0\temp\solr.update.processor.TestOpenNLPExtractNamedEntitiesUpdateProcessorFactory_D2A10452A460FB1E-001\tempDir-001\collection1: java.nio.file.DirectoryNotEmptyException: C:\Users\jenkins\workspace\Lucene-Solr-master-Windows\solr\build\contrib\solr-analysis-extras\test\J0\temp\solr.update.processor.TestOpenNLPExtractNamedEntitiesUpdateProcessorFactory_D2A10452A460FB1E-001\tempDir-001\collection1    C:\Users\jenkins\workspace\Lucene-Solr-master-Windows\solr\build\contrib\solr-analysis-extras\test\J0\temp\solr.update.processor.TestOpenNLPExtractNamedEntitiesUpdateProcessorFactory_D2A10452A460FB1E-001\tempDir-001: java.nio.file.DirectoryNotEmptyException: C:\Users\jenkins\workspace\Lucene-Solr-master-Windows\solr\build\contrib\solr-analysis-extras\test\J0\temp\solr.update.processor.TestOpenNLPExtractNamedEntitiesUpdateProcessorFactory_D2A10452A460FB1E-001\tempDir-001    C:\Users\jenkins\workspace\Lucene-Solr-master-Windows\solr\build\contrib\solr-analysis-extras\test\J0\temp\solr.update.processor.TestOpenNLPExtractNamedEntitiesUpdateProcessorFactory_D2A10452A460FB1E-001\tempDir-001\collection1\conf\en-test-ner-person.bin: java.nio.file.AccessDeniedException: C:\Users\jenkins\workspace\Lucene-Solr-master-Windows\solr\build\contrib\solr-analysis-extras\test\J0\temp\solr.update.processor.TestOpenNLPExtractNamedEntitiesUpdateProcessorFactory_D2A10452A460FB1E-001\tempDir-001\collection1\conf\en-test-ner-person.bin    C:\Users\jenkins\workspace\Lucene-Solr-master-Windows\solr\build\contrib\solr-analysis-extras\test\J0\temp\solr.update.processor.TestOpenNLPExtractNamedEntitiesUpdateProcessorFactory_D2A10452A460FB1E-001\tempDir-001\collection1\conf\en-test-sent.bin: java.nio.file.AccessDeniedException: C:\Users\jenkins\workspace\Lucene-Solr-master-Windows\solr\build\contrib\solr-analysis-extras\test\J0\temp\solr.update.processor.TestOpenNLPExtractNamedEntitiesUpdateProcessorFactory_D2A10452A460FB1E-001\tempDir-001\collection1\conf\en-test-sent.bin    C:\Users\jenkins\workspace\Lucene-Solr-master-Windows\solr\build\contrib\solr-analysis-extras\test\J0\temp\solr.update.processor.TestOpenNLPExtractNamedEntitiesUpdateProcessorFactory_D2A10452A460FB1E-001\tempDir-001\collection1\conf\en-test-tokenizer.bin: java.nio.file.AccessDeniedException: C:\Users\jenkins\workspace\Lucene-Solr-master-Windows\solr\build\contrib\solr-analysis-extras\test\J0\temp\solr.update.processor.TestOpenNLPExtractNamedEntitiesUpdateProcessorFactory_D2A10452A460FB1E-001\tempDir-001\collection1\conf\en-test-tokenizer.bin    C:\Users\jenkins\workspace\Lucene-Solr-master-Windows\solr\build\contrib\solr-analysis-extras\test\J0\temp\solr.update.processor.TestOpenNLPExtractNamedEntitiesUpdateProcessorFactory_D2A10452A460FB1E-001: java.nio.file.DirectoryNotEmptyException: C:\Users\jenkins\workspace\Lucene-Solr-master-Windows\solr\build\contrib\solr-analysis-extras\test\J0\temp\solr.update.processor.TestOpenNLPExtractNamedEntitiesUpdateProcessorFactory_D2A10452A460FB1E-001 

Stack Trace:
java.io.IOException: Could not remove the following files (in the order of attempts):
   C:\Users\jenkins\workspace\Lucene-Solr-master-Windows\solr\build\contrib\solr-analysis-extras\test\J0\temp\solr.update.processor.TestOpenNLPExtractNamedEntitiesUpdateProcessorFactory_D2A10452A460FB1E-001\tempDir-001\collection1\conf: java.nio.file.DirectoryNotEmptyException: C:\Users\jenkins\workspace\Lucene-Solr-master-Windows\solr\build\contrib\solr-analysis-extras\test\J0\temp\solr.update.processor.TestOpenNLPExtractNamedEntitiesUpdateProcessorFactory_D2A10452A460FB1E-001\tempDir-001\collection1\conf
   C:\Users\jenkins\workspace\Lucene-Solr-master-Windows\solr\build\contrib\solr-analysis-extras\test\J0\temp\solr.update.processor.TestOpenNLPExtractNamedEntitiesUpdateProcessorFactory_D2A10452A460FB1E-001\tempDir-001\collection1: java.nio.file.DirectoryNotEmptyException: C:\Users\jenkins\workspace\Lucene-Solr-master-Windows\solr\build\contrib\solr-analysis-extras\test\J0\temp\solr.update.processor.TestOpenNLPExtractNamedEntitiesUpdateProcessorFactory_D2A10452A460FB1E-001\tempDir-001\collection1
   C:\Users\jenkins\workspace\Lucene-Solr-master-Windows\solr\build\contrib\solr-analysis-extras\test\J0\temp\solr.update.processor.TestOpenNLPExtractNamedEntitiesUpdateProcessorFactory_D2A10452A460FB1E-001\tempDir-001: java.nio.file.DirectoryNotEmptyException: C:\Users\jenkins\workspace\Lucene-Solr-master-Windows\solr\build\contrib\solr-analysis-extras\test\J0\temp\solr.update.processor.TestOpenNLPExtractNamedEntitiesUpdateProcessorFactory_D2A10452A460FB1E-001\tempDir-001
   C:\Users\jenkins\workspace\Lucene-Solr-master-Windows\solr\build\contrib\solr-analysis-extras\test\J0\temp\solr.update.processor.TestOpenNLPExtractNamedEntitiesUpdateProcessorFactory_D2A10452A460FB1E-001\tempDir-001\collection1\conf\en-test-ner-person.bin: java.nio.file.AccessDeniedException: C:\Users\jenkins\workspace\Lucene-Solr-master-Windows\solr\build\contrib\solr-analysis-extras\test\J0\temp\solr.update.processor.TestOpenNLPExtractNamedEntitiesUpdateProcessorFactory_D2A10452A460FB1E-001\tempDir-001\collection1\conf\en-test-ner-person.bin
   C:\Users\jenkins\workspace\Lucene-Solr-master-Windows\solr\build\contrib\solr-analysis-extras\test\J0\temp\solr.update.processor.TestOpenNLPExtractNamedEntitiesUpdateProcessorFactory_D2A10452A460FB1E-001\tempDir-001\collection1\conf\en-test-sent.bin: java.nio.file.AccessDeniedException: C:\Users\jenkins\workspace\Lucene-Solr-master-Windows\solr\build\contrib\solr-analysis-extras\test\J0\temp\solr.update.processor.TestOpenNLPExtractNamedEntitiesUpdateProcessorFactory_D2A10452A460FB1E-001\tempDir-001\collection1\conf\en-test-sent.bin
   C:\Users\jenkins\workspace\Lucene-Solr-master-Windows\solr\build\contrib\solr-analysis-extras\test\J0\temp\solr.update.processor.TestOpenNLPExtractNamedEntitiesUpdateProcessorFactory_D2A10452A460FB1E-001\tempDir-001\collection1\conf\en-test-tokenizer.bin: java.nio.file.AccessDeniedException: C:\Users\jenkins\workspace\Lucene-Solr-master-Windows\solr\build\contrib\solr-analysis-extras\test\J0\temp\solr.update.processor.TestOpenNLPExtractNamedEntitiesUpdateProcessorFactory_D2A10452A460FB1E-001\tempDir-001\collection1\conf\en-test-tokenizer.bin
   C:\Users\jenkins\workspace\Lucene-Solr-master-Windows\solr\build\contrib\solr-analysis-extras\test\J0\temp\solr.update.processor.TestOpenNLPExtractNamedEntitiesUpdateProcessorFactory_D2A10452A460FB1E-001: java.nio.file.DirectoryNotEmptyException: C:\Users\jenkins\workspace\Lucene-Solr-master-Windows\solr\build\contrib\solr-analysis-extras\test\J0\temp\solr.update.processor.TestOpenNLPExtractNamedEntitiesUpdateProcessorFactory_D2A10452A460FB1E-001

	at __randomizedtesting.SeedInfo.seed([D2A10452A460FB1E]:0)
	at org.apache.lucene.util.IOUtils.rm(IOUtils.java:329)
	at org.apache.lucene.util.TestRuleTemporaryFilesCleanup.afterAlways(TestRuleTemporaryFilesCleanup.java:216)
	at com.carrotsearch.randomizedtesting.rules.TestRuleAdapter$1.afterAlways(TestRuleAdapter.java:31)
	at com.carrotsearch.randomizedtesting.rules.StatementAdapter.evaluate(StatementAdapter.java:43)
	at com.carrotsearch.randomizedtesting.rules.StatementAdapter.evaluate(StatementAdapter.java:36)
	at org.apache.lucene.util.TestRuleAssertionsRequired$1.evaluate(TestRuleAssertionsRequired.java:53)
	at org.apache.lucene.util.TestRuleMarkFailure$1.evaluate(TestRuleMarkFailure.java:47)
	at org.apache.lucene.util.TestRuleIgnoreAfterMaxFailures$1.evaluate(TestRuleIgnoreAfterMaxFailures.java:64)
	at org.apache.lucene.util.TestRuleIgnoreTestSuites$1.evaluate(TestRuleIgnoreTestSuites.java:54)
	at com.carrotsearch.randomizedtesting.rules.StatementAdapter.evaluate(StatementAdapter.java:36)
	at com.carrotsearch.randomizedtesting.ThreadLeakControl$StatementRunner.run(ThreadLeakControl.java:368)
	at java.base/java.lang.Thread.run(Thread.java:844)




Build Log:
[...truncated 11945 lines...]
   [junit4] Suite: org.apache.solr.update.TestAtomicUpdateErrorCases
   [junit4]   2> 237541 INFO  (SUITE-TestAtomicUpdateErrorCases-seed#[EBC06C30F396FC73]-worker) [    ] o.a.s.SolrTestCaseJ4 SecureRandom sanity checks: test.solr.allowed.securerandom=null & java.security.egd=file:/dev/./urandom
   [junit4]   2> Creating dataDir: C:\Users\jenkins\workspace\Lucene-Solr-master-Windows\solr\build\solr-core\test\J0\temp\solr.update.TestAtomicUpdateErrorCases_EBC06C30F396FC73-001\init-core-data-001
   [junit4]   2> 237543 WARN  (SUITE-TestAtomicUpdateErrorCases-seed#[EBC06C30F396FC73]-worker) [    ] o.a.s.SolrTestCaseJ4 startTrackingSearchers: numOpens=4 numCloses=4
   [junit4]   2> 237543 INFO  (SUITE-TestAtomicUpdateErrorCases-seed#[EBC06C30F396FC73]-worker) [    ] o.a.s.SolrTestCaseJ4 Using PointFields (NUMERIC_POINTS_SYSPROP=true) w/NUMERIC_DOCVALUES_SYSPROP=false
   [junit4]   2> 237544 INFO  (SUITE-TestAtomicUpdateErrorCases-seed#[EBC06C30F396FC73]-worker) [    ] o.a.s.SolrTestCaseJ4 Randomized ssl (false) and clientAuth (false) via: @org.apache.solr.util.RandomizeSSL(reason="", value=0.0/0.0, ssl=0.0/0.0, clientAuth=0.0/0.0)
   [junit4]   2> 237545 INFO  (TEST-TestAtomicUpdateErrorCases.testUpdateNoTLog-seed#[EBC06C30F396FC73]) [    ] o.a.s.SolrTestCaseJ4 ###Starting testUpdateNoTLog
   [junit4]   2> 237546 INFO  (TEST-TestAtomicUpdateErrorCases.testUpdateNoTLog-seed#[EBC06C30F396FC73]) [    ] o.a.s.SolrTestCaseJ4 ####initCore
   [junit4]   2> 237546 INFO  (TEST-TestAtomicUpdateErrorCases.testUpdateNoTLog-seed#[EBC06C30F396FC73]) [    ] o.a.s.c.SolrResourceLoader [null] Added 2 libs to classloader, from paths: [/C:/Users/jenkins/workspace/Lucene-Solr-master-Windows/solr/core/src/test-files/solr/collection1/lib, /C:/Users/jenkins/workspace/Lucene-Solr-master-Windows/solr/core/src/test-files/solr/collection1/lib/classes]
   [junit4]   2> 237565 INFO  (TEST-TestAtomicUpdateErrorCases.testUpdateNoTLog-seed#[EBC06C30F396FC73]) [    ] o.a.s.c.SolrConfig Using Lucene MatchVersion: 8.0.0
   [junit4]   2> 237576 INFO  (TEST-TestAtomicUpdateErrorCases.testUpdateNoTLog-seed#[EBC06C30F396FC73]) [    ] o.a.s.s.IndexSchema [null] Schema name=test
   [junit4]   2> 237615 INFO  (TEST-TestAtomicUpdateErrorCases.testUpdateNoTLog-seed#[EBC06C30F396FC73]) [    ] o.a.s.s.IndexSchema Loaded schema test/1.6 with uniqueid field id
   [junit4]   2> 237655 INFO  (TEST-TestAtomicUpdateErrorCases.testUpdateNoTLog-seed#[EBC06C30F396FC73]) [    ] o.a.s.m.r.SolrJmxReporter JMX monitoring for 'solr.node' (registry 'solr.node') enabled at server: com.sun.jmx.mbeanserver.JmxMBeanServer@7783480a
   [junit4]   2> 237661 INFO  (TEST-TestAtomicUpdateErrorCases.testUpdateNoTLog-seed#[EBC06C30F396FC73]) [    ] o.a.s.m.r.SolrJmxReporter JMX monitoring for 'solr.jvm' (registry 'solr.jvm') enabled at server: com.sun.jmx.mbeanserver.JmxMBeanServer@7783480a
   [junit4]   2> 237661 INFO  (TEST-TestAtomicUpdateErrorCases.testUpdateNoTLog-seed#[EBC06C30F396FC73]) [    ] o.a.s.m.r.SolrJmxReporter JMX monitoring for 'solr.jetty' (registry 'solr.jetty') enabled at server: com.sun.jmx.mbeanserver.JmxMBeanServer@7783480a
   [junit4]   2> 237663 INFO  (coreLoadExecutor-871-thread-1) [    ] o.a.s.c.TransientSolrCoreCacheDefault Allocating transient cache for 2147483647 transient cores
   [junit4]   2> 237664 INFO  (coreLoadExecutor-871-thread-1) [    x:collection1] o.a.s.c.SolrResourceLoader [null] Added 2 libs to classloader, from paths: [/C:/Users/jenkins/workspace/Lucene-Solr-master-Windows/solr/core/src/test-files/solr/collection1/lib, /C:/Users/jenkins/workspace/Lucene-Solr-master-Windows/solr/core/src/test-files/solr/collection1/lib/classes]
   [junit4]   2> 237682 INFO  (coreLoadExecutor-871-thread-1) [    x:collection1] o.a.s.c.SolrConfig Using Lucene MatchVersion: 8.0.0
   [junit4]   2> 237694 INFO  (coreLoadExecutor-871-thread-1) [    x:collection1] o.a.s.s.IndexSchema [collection1] Schema name=test
   [junit4]   2> 237736 INFO  (coreLoadExecutor-871-thread-1) [    x:collection1] o.a.s.s.IndexSchema Loaded schema test/1.6 with uniqueid field id
   [junit4]   2> 237744 INFO  (coreLoadExecutor-871-thread-1) [    x:collection1] o.a.s.c.CoreContainer Creating SolrCore 'collection1' using configuration from instancedir C:\Users\jenkins\workspace\Lucene-Solr-master-Windows\solr\core\src\test-files\solr\collection1, trusted=true
   [junit4]   2> 237744 INFO  (coreLoadExecutor-871-thread-1) [    x:collection1] o.a.s.m.r.SolrJmxReporter JMX monitoring for 'solr.core.collection1' (registry 'solr.core.collection1') enabled at server: com.sun.jmx.mbeanserver.JmxMBeanServer@7783480a
   [junit4]   2> 237744 INFO  (coreLoadExecutor-871-thread-1) [    x:collection1] o.a.s.c.SolrCore solr.RecoveryStrategy.Builder
   [junit4]   2> 237744 INFO  (coreLoadExecutor-871-thread-1) [    x:collection1] o.a.s.c.SolrCore [[collection1] ] Opening new SolrCore at [C:\Users\jenkins\workspace\Lucene-Solr-master-Windows\solr\core\src\test-files\solr\collection1], dataDir=[C:\Users\jenkins\workspace\Lucene-Solr-master-Windows\solr\build\solr-core\test\J0\temp\solr.update.TestAtomicUpdateErrorCases_EBC06C30F396FC73-001\init-core-data-001\]
   [junit4]   2> 237746 INFO  (coreLoadExecutor-871-thread-1) [    x:collection1] o.a.s.u.RandomMergePolicy RandomMergePolicy wrapping class org.apache.lucene.index.TieredMergePolicy: [TieredMergePolicy: maxMergeAtOnce=45, maxMergeAtOnceExplicit=31, maxMergedSegmentMB=42.791015625, floorSegmentMB=0.791015625, forceMergeDeletesPctAllowed=1.0546117035697444, segmentsPerTier=39.0, maxCFSSegmentSizeMB=8.796093022207999E12, noCFSRatio=1.0
   [junit4]   2> 237803 INFO  (coreLoadExecutor-871-thread-1) [    x:collection1] o.a.s.u.CommitTracker Hard AutoCommit: disabled
   [junit4]   2> 237804 INFO  (coreLoadExecutor-871-thread-1) [    x:collection1] o.a.s.u.CommitTracker Soft AutoCommit: disabled
   [junit4]   2> 237804 INFO  (coreLoadExecutor-871-thread-1) [    x:collection1] o.a.s.u.RandomMergePolicy RandomMergePolicy wrapping class org.apache.lucene.index.TieredMergePolicy: [TieredMergePolicy: maxMergeAtOnce=24, maxMergeAtOnceExplicit=48, maxMergedSegmentMB=89.4443359375, floorSegmentMB=1.7421875, forceMergeDeletesPctAllowed=22.202537706744284, segmentsPerTier=50.0, maxCFSSegmentSizeMB=8.796093022207999E12, noCFSRatio=0.0
   [junit4]   2> 237804 INFO  (coreLoadExecutor-871-thread-1) [    x:collection1] o.a.s.s.SolrIndexSearcher Opening [Searcher@5c8a9ce[collection1] main]
   [junit4]   2> 237805 INFO  (coreLoadExecutor-871-thread-1) [    x:collection1] o.a.s.h.c.SpellCheckComponent Initializing spell checkers
   [junit4]   2> 237811 INFO  (coreLoadExecutor-871-thread-1) [    x:collection1] o.a.s.s.DirectSolrSpellChecker init: {name=direct,classname=DirectSolrSpellChecker,field=lowerfilt,minQueryLength=3}
   [junit4]   2> 237838 INFO  (coreLoadExecutor-871-thread-1) [    x:collection1] o.a.s.h.ReplicationHandler Commits will be reserved for 10000ms.
   [junit4]   2> 237838 INFO  (searcherExecutor-872-thread-1-processing-x:collection1) [    x:collection1] o.a.s.h.c.SpellCheckComponent Loading spell index for spellchecker: default
   [junit4]   2> 237840 INFO  (searcherExecutor-872-thread-1-processing-x:collection1) [    x:collection1] o.a.s.h.c.SpellCheckComponent Loading spell index for spellchecker: direct
   [junit4]   2> 237840 INFO  (TEST-TestAtomicUpdateErrorCases.testUpdateNoTLog-seed#[EBC06C30F396FC73]) [    ] o.a.s.SolrTestCaseJ4 ####initCore end
   [junit4]   2> 237840 INFO  (searcherExecutor-872-thread-1-processing-x:collection1) [    x:collection1] o.a.s.h.c.SpellCheckComponent Loading spell index for spellchecker: wordbreak
   [junit4]   2> 237840 INFO  (searcherExecutor-872-thread-1-processing-x:collection1) [    x:collection1] o.a.s.h.c.SpellCheckComponent Loading spell index for spellchecker: multipleFields
   [junit4]   2> 237840 INFO  (searcherExecutor-872-thread-1-processing-x:collection1) [    x:collection1] o.a.s.h.c.SpellCheckComponent Loading spell index for spellchecker: jarowinkler
   [junit4]   2> 237841 INFO  (searcherExecutor-872-thread-1-processing-x:collection1) [    x:collection1] o.a.s.h.c.SpellCheckComponent Loading spell index for spellchecker: external
   [junit4]   2> 237841 INFO  (TEST-TestAtomicUpdateErrorCases.testUpdateNoTLog-seed#[EBC06C30F396FC73]) [    ] o.a.s.u.p.LogUpdateProcessorFactory [collection1]  webapp=null path=null params={versions=true&wt=json&indent=true}{add=[1]} 0 1
   [junit4]   2> 237841 INFO  (TEST-TestAtomicUpdateErrorCases.testUpdateNoTLog-seed#[EBC06C30F396FC73]) [    ] o.a.s.u.DirectUpdateHandler2 start commit{,optimize=false,openSearcher=true,waitSearcher=true,expungeDeletes=false,softCommit=false,prepareCommit=false}
   [junit4]   2> 237841 INFO  (TEST-TestAtomicUpdateErrorCases.testUpdateNoTLog-seed#[EBC06C30F396FC73]) [    ] o.a.s.u.SolrIndexWriter Calling setCommitData with IW:org.apache.solr.update.SolrIndexWriter@20d83161 commitCommandVersion:0
   [junit4]   2> 237842 INFO  (searcherExecutor-872-thread-1-processing-x:collection1) [    x:collection1] o.a.s.h.c.SpellCheckComponent Loading spell index for spellchecker: freq
   [junit4]   2> 237842 INFO  (searcherExecutor-872-thread-1-processing-x:collection1) [    x:collection1] o.a.s.h.c.SpellCheckComponent Loading spell index for spellchecker: fqcn
   [junit4]   2> 237843 INFO  (searcherExecutor-872-thread-1-processing-x:collection1) [    x:collection1] o.a.s.h.c.SpellCheckComponent Loading spell index for spellchecker: perDict
   [junit4]   2> 237844 INFO  (searcherExecutor-872-thread-1-processing-x:collection1) [    x:collection1] o.a.s.c.SolrCore [collection1] Registered new searcher Searcher@5c8a9ce[collection1] main{ExitableDirectoryReader(UninvertingDirectoryReader())}
   [junit4]   2> 237846 INFO  (TEST-TestAtomicUpdateErrorCases.testUpdateNoTLog-seed#[EBC06C30F396FC73]) [    ] o.a.s.s.SolrIndexSearcher Opening [Searcher@2330bc61[collection1] main]
   [junit4]   2> 237846 INFO  (TEST-TestAtomicUpdateErrorCases.testUpdateNoTLog-seed#[EBC06C30F396FC73]) [    ] o.a.s.u.DirectUpdateHandler2 end_commit_flush
   [junit4]   2> 237847 INFO  (searcherExecutor-872-thread-1) [    ] o.a.s.c.SolrCore [collection1] Registered new searcher Searcher@2330bc61[collection1] main{ExitableDirectoryReader(UninvertingDirectoryReader(Uninverting(_0(8.0.0):c1)))}
   [junit4]   2> 237847 INFO  (TEST-TestAtomicUpdateErrorCases.testUpdateNoTLog-seed#[EBC06C30F396FC73]) [    ] o.a.s.u.p.LogUpdateProcessorFactory [collection1]  webapp=null path=null params={}{commit=} 0 6
   [junit4]   2> 237849 INFO  (TEST-TestAtomicUpdateErrorCases.testUpdateNoTLog-seed#[EBC06C30F396FC73]) [    ] o.a.s.u.p.LogUpdateProcessorFactory [collection1]  webapp=null path=null params={versions=true&wt=json&indent=true}{} 0 0
   [junit4]   2> 237849 INFO  (TEST-TestAtomicUpdateErrorCases.testUpdateNoTLog-seed#[EBC06C30F396FC73]) [    ] o.a.s.h.RequestHandlerBase Ignoring exception matching updateLog
   [junit4]   2> 237849 INFO  (TEST-TestAtomicUpdateErrorCases.testUpdateNoTLog-seed#[EBC06C30F396FC73]) [    ] o.a.s.SolrTestCaseJ4 ###deleteCore
   [junit4]   2> 237849 INFO  (TEST-TestAtomicUpdateErrorCases.testUpdateNoTLog-seed#[EBC06C30F396FC73]) [    ] o.a.s.c.CoreContainer Shutting down CoreContainer instance=2081356862
   [junit4]   2> 237849 INFO  (TEST-TestAtomicUpdateErrorCases.testUpdateNoTLog-seed#[EBC06C30F396FC73]) [    ] o.a.s.m.SolrMetricManager Closing metric reporters for registry=solr.node, tag=null
   [junit4]   2> 237849 INFO  (TEST-TestAtomicUpdateErrorCases.testUpdateNoTLog-seed#[EBC06C30F396FC73]) [    ] o.a.s.m.r.SolrJmxReporter Closing reporter [org.apache.solr.metrics.reporters.SolrJmxReporter@196551a7: rootName = null, domain = solr.node, service url = null, agent id = null] for registry solr.node / com.codahale.metrics.MetricRegistry@65f53942
   [junit4]   2> 237853 INFO  (TEST-TestAtomicUpdateErrorCases.testUpdateNoTLog-seed#[EBC06C30F396FC73]) [    ] o.a.s.m.SolrMetricManager Closing metric reporters for registry=solr.jvm, tag=null
   [junit4]   2> 237853 INFO  (TEST-TestAtomicUpdateErrorCases.testUpdateNoTLog-seed#[EBC06C30F396FC73]) [    ] o.a.s.m.r.SolrJmxReporter Closing reporter [org.apache.solr.metrics.reporters.SolrJmxReporter@35738285: rootName = null, domain = solr.jvm, service url = null, agent id = null] for registry solr.jvm / com.codahale.metrics.MetricRegistry@12ca28fe
   [junit4]   2> 237856 INFO  (TEST-TestAtomicUpdateErrorCases.testUpdateNoTLog-seed#[EBC06C30F396FC73]) [    ] o.a.s.m.SolrMetricManager Closing metric reporters for registry=solr.jetty, tag=null
   [junit4]   2> 237856 INFO  (TEST-TestAtomicUpdateErrorCases.testUpdateNoTLog-seed#[EBC06C30F396FC73]) [    ] o.a.s.m.r.SolrJmxReporter Closing reporter [org.apache.solr.metrics.reporters.SolrJmxReporter@75966ec5: rootName = null, domain = solr.jetty, service url = null, agent id = null] for registry solr.jetty / com.codahale.metrics.MetricRegistry@1a86e068
   [junit4]   2> 237857 INFO  (coreCloseExecutor-876-thread-1) [    x:collection1] o.a.s.c.SolrCore [collection1]  CLOSING SolrCore org.apache.solr.core.SolrCore@785269a5
   [junit4]   2> 237857 INFO  (coreCloseExecutor-876-thread-1) [    x:collection1] o.a.s.m.SolrMetricManager Closing metric reporters for registry=solr.core.collection1, tag=2018666917
   [junit4]   2> 237857 INFO  (coreCloseExecutor-876-thread-1) [    x:collection1] o.a.s.m.r.SolrJmxReporter Closing reporter [org.apache.solr.metrics.reporters.SolrJmxReporter@23a25bf6: rootName = null, domain = solr.core.collection1, service url = null, agent id = null] for registry solr.core.collection1 / com.codahale.metrics.MetricRegistry@52cef265
   [junit4]   2> 237870 INFO  (TEST-TestAtomicUpdateErrorCases.testUpdateNoTLog-seed#[EBC06C30F396FC73]) [    ] o.a.s.SolrTestCaseJ4 ###Ending testUpdateNoTLog
   [junit4]   2> 237872 INFO  (TEST-TestAtomicUpdateErrorCases.testUpdateNoDistribProcessor-seed#[EBC06C30F396FC73]) [    ] o.a.s.SolrTestCaseJ4 ###Starting testUpdateNoDistribProcessor
   [junit4]   2> 237872 INFO  (TEST-TestAtomicUpdateErrorCases.testUpdateNoDistribProcessor-seed#[EBC06C30F396FC73]) [    ] o.a.s.SolrTestCaseJ4 ####initCore
   [junit4]   2> 237872 INFO  (TEST-TestAtomicUpdateErrorCases.testUpdateNoDistribProcessor-seed#[EBC06C30F396FC73]) [    ] o.a.s.c.SolrResourceLoader [null] Added 2 libs to classloader, from paths: [/C:/Users/jenkins/workspace/Lucene-Solr-master-Windows/solr/core/src/test-files/solr/collection1/lib, /C:/Users/jenkins/workspace/Lucene-Solr-master-Windows/solr/core/src/test-files/solr/collection1/lib/classes]
   [junit4]   2> 237892 INFO  (TEST-TestAtomicUpdateErrorCases.testUpdateNoDistribProcessor-seed#[EBC06C30F396FC73]) [    ] o.a.s.c.SolrConfig Using Lucene MatchVersion: 8.0.0
   [junit4]   2> 237904 INFO  (TEST-TestAtomicUpdateErrorCases.testUpdateNoDistribProcessor-seed#[EBC06C30F396FC73]) [    ] o.a.s.s.IndexSchema [null] Schema name=test
   [junit4]   2> 237939 INFO  (TEST-TestAtomicUpdateErrorCases.testUpdateNoDistribProcessor-seed#[EBC06C30F396FC73]) [    ] o.a.s.s.IndexSchema Loaded schema test/1.6 with uniqueid field id
   [junit4]   2> 237976 INFO  (TEST-TestAtomicUpdateErrorCases.testUpdateNoDistribProcessor-seed#[EBC06C30F396FC73]) [    ] o.a.s.m.r.SolrJmxReporter JMX monitoring for 'solr.node' (registry 'solr.node') enabled at server: com.sun.jmx.mbeanserver.JmxMBeanServer@7783480a
   [junit4]   2> 237982 INFO  (TEST-TestAtomicUpdateErrorCases.testUpdateNoDistribProcessor-seed#[EBC06C30F396FC73]) [    ] o.a.s.m.r.SolrJmxReporter JMX monitoring for 'solr.jvm' (registry 'solr.jvm') enabled at server: com.sun.jmx.mbeanserver.JmxMBeanServer@7783480a
   [junit4]   2> 237982 INFO  (TEST-TestAtomicUpdateErrorCases.testUpdateNoDistribProcessor-seed#[EBC06C30F396FC73]) [    ] o.a.s.m.r.SolrJmxReporter JMX monitoring for 'solr.jetty' (registry 'solr.jetty') enabled at server: com.sun.jmx.mbeanserver.JmxMBeanServer@7783480a
   [junit4]   2> 237984 INFO  (coreLoadExecutor-883-thread-1) [    ] o.a.s.c.TransientSolrCoreCacheDefault Allocating transient cache for 2147483647 transient cores
   [junit4]   2> 237984 INFO  (coreLoadExecutor-883-thread-1) [    x:collection1] o.a.s.c.SolrResourceLoader [null] Added 2 libs to classloader, from paths: [/C:/Users/jenkins/workspace/Lucene-Solr-master-Windows/solr/core/src/test-files/solr/collection1/lib, /C:/Users/jenkins/workspace/Lucene-Solr-master-Windows/solr/core/src/test-files/solr/collection1/lib/classes]
   [junit4]   2> 238006 INFO  (coreLoadExecutor-883-thread-1) [    x:collection1] o.a.s.c.SolrConfig Using Lucene MatchVersion: 8.0.0
   [junit4]   2> 238013 INFO  (coreLoadExecutor-883-thread-1) [    x:collection1] o.a.s.s.IndexSchema [collection1] Schema name=test
   [junit4]   2> 238048 INFO  (coreLoadExecutor-883-thread-1) [    x:collection1] o.a.s.s.IndexSchema Loaded schema test/1.6 with uniqueid field id
   [junit4]   2> 238056 INFO  (coreLoadExecutor-883-thread-1) [    x:collection1] o.a.s.c.CoreContainer Creating SolrCore 'collection1' using configuration from instancedir C:\Users\jenkins\workspace\Lucene-Solr-master-Windows\solr\core\src\test-files\solr\collection1, trusted=true
   [junit4]   2> 238056 INFO  (coreLoadExecutor-883-thread-1) [    x:collection1] o.a.s.m.r.SolrJmxReporter JMX monitoring for 'solr.core.collection1' (registry 'solr.core.collection1') enabled at server: com.sun.jmx.mbeanserver.JmxMBeanServer@7783480a
   [junit4]   2> 238056 INFO  (coreLoadExecutor-883-thread-1) [    x:collection1] o.a.s.c.SolrCore solr.RecoveryStrategy.Builder
   [junit4]   2> 238056 INFO  (coreLoadExecutor-883-thread-1) [    x:collection1] o.a.s.c.SolrCore [[collection1] ] Opening new SolrCore at [C:\Users\jenkins\workspace\Lucene-Solr-master-Windows\solr\core\src\test-files\solr\collection1], dataDir=[C:\Users\jenkins\workspace\Lucene-Solr-master-Windows\solr\build\solr-core\test\J0\temp\solr.update.TestAtomicUpdateErrorCases_EBC06C30F396FC73-001\init-core-data-001\]
   [junit4]   2> 238057 INFO  (coreLoadExecutor-883-thread-1) [    x:collection1] o.a.s.u.RandomMergePolicy RandomMergePolicy wrapping class org.apache.lucene.index.TieredMergePolicy: [TieredMergePolicy: maxMergeAtOnce=45, maxMergeAtOnceExplicit=31, maxMergedSegmentMB=42.791015625, floorSegmentMB=0.791015625, forceMergeDeletesPctAllowed=1.0546117035697444, segmentsPerTier=39.0, maxCFSSegmentSizeMB=8.796093022207999E12, noCFSRatio=1.0
   [junit4]   2> 238059 WARN  (coreLoadExecutor-883-thread-1) [    x:collection1] o.a.s.c.RequestHandlers INVALID paramSet a in requestHandler {type = requestHandler,name = /dump,class = DumpRequestHandler,attributes = {initParams=a, name=/dump, class=DumpRequestHandler},args = {defaults={a=A,b=B}}}
   [junit4]   2> 238106 INFO  (coreLoadExecutor-883-thread-1) [    x:collection1] o.a.s.u.UpdateHandler Using UpdateLog implementation: org.apache.solr.update.UpdateLog
   [junit4]   2> 238106 INFO  (coreLoadExecutor-883-thread-1) [    x:collection1] o.a.s.u.UpdateLog Initializing UpdateLog: dataDir= defaultSyncLevel=FLUSH numRecordsToKeep=100 maxNumLogsToKeep=10 numVersionBuckets=65536
   [junit4]   2> 238107 INFO  (coreLoadExecutor-883-thread-1) [    x:collection1] o.a.s.u.CommitTracker Hard AutoCommit: disabled
   [junit4]   2> 238107 INFO  (coreLoadExecutor-883-thread-1) [    x:collection1] o.a.s.u.CommitTracker Soft AutoCommit: disabled
   [junit4]   2> 238108 INFO  (coreLoadExecutor-883-thread-1) [    x:collection1] o.a.s.u.RandomMergePolicy RandomMergePolicy wrapping class org.apache.lucene.index.TieredMergePolicy: [TieredMergePolicy: maxMergeAtOnce=24, maxMergeAtOnceExplicit=48, maxMergedSegmentMB=89.4443359375, floorSegmentMB=1.7421875, forceMergeDeletesPctAllowed=22.202537706744284, segmentsPerTier=50.0, maxCFSSegmentSizeMB=8.796093022207999E12, noCFSRatio=0.0
   [junit4]   2> 238109 INFO  (coreLoadExecutor-883-thread-1) [    x:collection1] o.a.s.s.SolrIndexSearcher Opening [Searcher@57b210c8[collection1] main]
   [junit4]   2> 238109 WARN  (coreLoadExecutor-883-thread-1) [    x:collection1] o.a.s.r.ManagedResourceStorage Cannot write to config directory C:\Users\jenkins\workspace\Lucene-Solr-master-Windows\solr\core\src\test-files\solr\collection1\conf; switching to use InMemory storage instead.
   [junit4]   2> 238110 INFO  (coreLoadExecutor-883-thread-1) [    x:collection1] o.a.s.h.ReplicationHandler Commits will be reserved for 10000ms.
   [junit4]   2> 238110 INFO  (searcherExecutor-884-thread-1-processing-x:collection1) [    x:collection1] o.a.s.c.SolrCore [collection1] Registered new searcher Searcher@57b210c8[collection1] main{ExitableDirectoryReader(UninvertingDirectoryReader())}
   [junit4]   2> 238110 INFO  (coreLoadExecutor-883-thread-1) [    x:collection1] o.a.s.u.UpdateLog Could not find max version in index or recent updates, using new clock 1588638754040446976
   [junit4]   2> 238113 INFO  (TEST-TestAtomicUpdateErrorCases.testUpdateNoDistribProcessor-seed#[EBC06C30F396FC73]) [    ] o.a.s.SolrTestCaseJ4 ####initCore end
   [junit4]   2> 238115 INFO  (TEST-TestAtomicUpdateErrorCases.testUpdateNoDistribProcessor-seed#[EBC06C30F396FC73]) [    ] o.a.s.c.S.Request [collection1]  webapp=null path=null params={update.chain=nodistrib&versions=true&wt=json&indent=true} status=0 QTime=2
   [junit4]   2> 238116 INFO  (TEST-TestAtomicUpdateErrorCases.testUpdateNoDistribProcessor-seed#[EBC06C30F396FC73]) [    ] o.a.s.u.DirectUpdateHandler2 start commit{_version_=1588638754046738432,optimize=false,openSearcher=true,waitSearcher=true,expungeDeletes=false,softCommit=false,prepareCommit=false}
   [junit4]   2> 238116 INFO  (TEST-TestAtomicUpdateErrorCases.testUpdateNoDistribProcessor-seed#[EBC06C30F396FC73]) [    ] o.a.s.u.SolrIndexWriter Calling setCommitData with IW:org.apache.solr.update.SolrIndexWriter@58b3c72d commitCommandVersion:1588638754046738432
   [junit4]   2> 238120 INFO  (TEST-TestAtomicUpdateErrorCases.testUpdateNoDistribProcessor-seed#[EBC06C30F396FC73]) [    ] o.a.s.s.SolrIndexSearcher Opening [Searcher@3ad83b7f[collection1] main]
   [junit4]   2> 238120 INFO  (TEST-TestAtomicUpdateErrorCases.testUpdateNoDistribProcessor-seed#[EBC06C30F396FC73]) [    ] o.a.s.u.DirectUpdateHandler2 end_commit_flush
   [junit4]   2> 238121 INFO  (searcherExecutor-884-thread-1) [    ] o.a.s.c.SolrCore [collection1] Registered new searcher Searcher@3ad83b7f[collection1] main{ExitableDirectoryReader(UninvertingDirectoryReader(Uninverting(_0(8.0.0):c1)))}
   [junit4]   2> 238121 INFO  (TEST-TestAtomicUpdateErrorCases.testUpdateNoDistribProcessor-seed#[EBC06C30F396FC73]) [    ] o.a.s.u.p.LogUpdateProcessorFactory [collection1]  webapp=null path=null params={}{commit=} 0 5
   [junit4]   2> 238122 INFO  (TEST-TestAtomicUpdateErrorCases.testUpdateNoDistribProcessor-seed#[EBC06C30F396FC73]) [    ] o.a.s.h.RequestHandlerBase Ignoring exception matching DistributedUpdateProcessorFactory
   [junit4]   2> 238122 INFO  (TEST-TestAtomicUpdateErrorCases.testUpdateNoDistribProcessor-seed#[EBC06C30F396FC73]) [    ] o.a.s.c.S.Request [collection1]  webapp=null path=null params={update.chain=nodistrib&versions=true&wt=json&indent=true} status=400 QTime=0
   [junit4]   2> 238122 INFO  (TEST-TestAtomicUpdateErrorCases.testUpdateNoDistribProcessor-seed#[EBC06C30F396FC73]) [    ] o.a.s.SolrTestCaseJ4 ###deleteCore
   [junit4]   2> 238122 INFO  (TEST-TestAtomicUpdateErrorCases.testUpdateNoDistribProcessor-seed#[EBC06C30F396FC73]) [    ] o.a.s.c.CoreContainer Shutting down CoreContainer instance=1180126407
   [junit4]   2> 238122 INFO  (TEST-TestAtomicUpdateErrorCases.testUpdateNoDistribProcessor-seed#[EBC06C30F396FC73]) [    ] o.a.s.m.SolrMetricManager Closing metric reporters for registry=solr.node, tag=null
   [junit4]   2> 238122 INFO  (TEST-TestAtomicUpdateErrorCases.testUpdateNoDistribProcessor-seed#[EBC06C30F396FC73]) [    ] o.a.s.m.r.SolrJmxReporter Closing reporter [org.apache.solr.metrics.reporters.SolrJmxReporter@7748cf15: rootName = null, domain = solr.node, service url = null, agent id = null] for registry solr.node / com.codahale.metrics.MetricRegistry@7b1a12f5
   [junit4]   2> 238126 INFO  (TEST-TestAtomicUpdateErrorCases.testUpdateNoDistribProcessor-seed#[EBC06C30F396FC73]) [    ] o.a.s.m.SolrMetricManager Closing metric reporters for registry=solr.jvm, tag=null
   [junit4]   2> 238126 INFO  (TEST-TestAtomicUpdateErrorCases.testUpdateNoDistribProcessor-seed#[EBC06C30F396FC73]) [    ] o.a.s.m.r.SolrJmxReporter Closing reporter [org.apache.solr.metrics.reporters.SolrJmxReporter@1f5c7253: rootName = null, domain = solr.jvm, service url = null, agent id = null] for registry solr.jvm / com.codahale.metrics.MetricRegistry@12ca28fe
   [junit4]   2> 238128 INFO  (TEST-TestAtomicUpdateErrorCases.testUpdateNoDistribProcessor-seed#[EBC06C30F396FC73]) [    ] o.a.s.m.SolrMetricManager Closing metric reporters for registry=solr.jetty, tag=null
   [junit4]   2> 238128 INFO  (TEST-TestAtomicUpdateErrorCases.testUpdateNoDistribProcessor-seed#[EBC06C30F396FC73]) [    ] o.a.s.m.r.SolrJmxReporter Closing reporter [org.apache.solr.metrics.reporters.SolrJmxReporter@265759fb: rootName = null, domain = solr.jetty, service url = null, agent id = null] for registry solr.jetty / com.codahale.metrics.MetricRegistry@1a86e068
   [junit4]   2> 238131 INFO  (coreCloseExecutor-889-thread-1) [    x:collection1] o.a.s.c.SolrCore [collection1]  CLOSING SolrCore org.apache.solr.core.SolrCore@675b2eba
   [junit4]   2> 238131 INFO  (coreCloseExecutor-889-thread-1) [    x:collection1] o.a.s.m.SolrMetricManager Closing metric reporters for registry=solr.core.collection1, tag=1734028986
   [junit4]   2> 238131 INFO  (coreCloseExecutor-889-thread-1) [    x:collection1] o.a.s.m.r.SolrJmxReporter Closing reporter [org.apache.solr.metrics.reporters.SolrJmxReporter@18bc9954: rootName = null, domain = solr.core.collection1, service url = null, agent id = null] for registry solr.core.collection1 / com.codahale.metrics.MetricRegistry@38c6ed21
   [junit4]   2> 238139 INFO  (TEST-TestAtomicUpdateErrorCases.testUpdateNoDistribProcessor-seed#[EBC06C30F396FC73]) [    ] o.a.s.SolrTestCaseJ4 ###Ending testUpdateNoDistribProcessor
   [junit4]   2> 238140 INFO  (SUITE-TestAtomicUpdateErrorCases-seed#[EBC06C30F396FC73]-worker) [    ] o.a.s.SolrTestCaseJ4 ------------------------------------------------------- Done waiting for tracked resources to be released
   [junit4]   2> NOTE: test params are: codec=Asserting(Lucene70): {id=Lucene50(blocksize=128)}, docValues:{}, maxPointsInLeafNode=2009, maxMBSortInHeap=5.283336501745572, sim=Asserting(org.apache.lucene.search.similarities.AssertingSimilarity@76ff199c), locale=hi, timezone=Pacific/Pitcairn
   [junit4]   2> NOTE: Windows 10 10.0 amd64/Oracle Corporation 9.0.1 (64-bit)/cpus=3,threads=1,free=179041928,total=305659904
   [junit4]   2> NOTE: All tests run in this JVM: [TestQuerySenderListener, TestSchemaManager, LeaderElectionTest, TestFreeTextSuggestions, VersionInfoTest, CdcrUpdateLogTest, TestPhraseSuggestions, TestWriterPerf, UnloadDistributedZkTest, CircularListTest, BaseCdcrDistributedZkTest, TestFieldCacheVsDocValues, BadCopyFieldTest, TestCollapseQParserPlugin, TestUtilizeNode, RequestLoggingTest, ExplicitHLLTest, TestLeaderInitiatedRecoveryThread, PrimUtilsTest, TestSlowCompositeReaderWrapper, TestZkAclsWithHadoopAuth, TestSurroundQueryParser, BJQParserTest, ChaosMonkeySafeLeaderWithPullReplicasTest, TestBlendedInfixSuggestions, TestUseDocValuesAsStored, CdcrVersionReplicationTest, TestComputePlanAction, PrimitiveFieldTypeTest, CreateCollectionCleanupTest, DistanceFunctionTest, TestAtomicUpdateErrorCases]
   [junit4]   2> NOTE: reproduce with: ant test  -Dtestcase=TestAtomicUpdateErrorCases -Dtests.seed=EBC06C30F396FC73 -Dtests.slow=true -Dtests.locale=hi -Dtests.timezone=Pacific/Pitcairn -Dtests.asserts=true -Dtests.file.encoding=Cp1252
   [junit4] ERROR   0.00s J0 | TestAtomicUpdateErrorCases (suite) <<<
   [junit4]    > Throwable #1: java.io.IOException: Could not remove the following files (in the order of attempts):
   [junit4]    >    C:\Users\jenkins\workspace\Lucene-Solr-master-Windows\solr\build\solr-core\test\J0\temp\solr.update.TestAtomicUpdateErrorCases_EBC06C30F396FC73-001\init-core-data-001: java.nio.file.DirectoryNotEmptyException: C:\Users\jenkins\workspace\Lucene-Solr-master-Windows\solr\build\solr-core\test\J0\temp\solr.update.TestAtomicUpdateErrorCases_EBC06C30F396FC73-001\init-core-data-001
   [junit4]    >    C:\Users\jenkins\workspace\Lucene-Solr-master-Windows\solr\build\solr-core\test\J0\temp\solr.update.TestAtomicUpdateErrorCases_EBC06C30F396FC73-001\init-core-data-001\tlog: java.nio.file.AccessDeniedException: C:\Users\jenkins\workspace\Lucene-Solr-master-Windows\solr\build\solr-core\test\J0\temp\solr.update.TestAtomicUpdateErrorCases_EBC06C30F396FC73-001\init-core-data-001\tlog
   [junit4]    >    C:\Users\jenkins\workspace\Lucene-Solr-master-Windows\solr\build\solr-core\test\J0\temp\solr.update.TestAtomicUpdateErrorCases_EBC06C30F396FC73-001: java.nio.file.DirectoryNotEmptyException: C:\Users\jenkins\workspace\Lucene-Solr-master-Windows\solr\build\solr-core\test\J0\temp\solr.update.TestAtomicUpdateErrorCases_EBC06C30F396FC73-001
   [junit4]    > 	at __randomizedtesting.SeedInfo.seed([EBC06C30F396FC73]:0)
   [junit4]    > 	at org.apache.lucene.util.IOUtils.rm(IOUtils.java:329)
   [junit4]    > 	at java.base/java.lang.Thread.run(Thread.java:844)
   [junit4] Completed [89/765 (1!)] on J0 in 0.62s, 2 tests, 1 error <<< FAILURES!

[...truncated 1823 lines...]
   [junit4] Suite: org.apache.solr.handler.TestSQLHandler
   [junit4]   2> Creating dataDir: C:\Users\jenkins\workspace\Lucene-Solr-master-Windows\solr\build\solr-core\test\J0\temp\solr.handler.TestSQLHandler_EBC06C30F396FC73-001\init-core-data-001
   [junit4]   2> 3376650 WARN  (SUITE-TestSQLHandler-seed#[EBC06C30F396FC73]-worker) [    ] o.a.s.SolrTestCaseJ4 startTrackingSearchers: numOpens=10 numCloses=10
   [junit4]   2> 3376650 INFO  (SUITE-TestSQLHandler-seed#[EBC06C30F396FC73]-worker) [    ] o.a.s.SolrTestCaseJ4 Using PointFields (NUMERIC_POINTS_SYSPROP=true) w/NUMERIC_DOCVALUES_SYSPROP=false
   [junit4]   2> 3376650 INFO  (SUITE-TestSQLHandler-seed#[EBC06C30F396FC73]-worker) [    ] o.a.s.SolrTestCaseJ4 Randomized ssl (true) and clientAuth (false) via: @org.apache.solr.util.RandomizeSSL(reason="", value=0.0/0.0, ssl=0.0/0.0, clientAuth=0.0/0.0)
   [junit4]   2> 3376668 INFO  (SUITE-TestSQLHandler-seed#[EBC06C30F396FC73]-worker) [    ] o.a.s.SolrTestCaseJ4 SecureRandom sanity checks: test.solr.allowed.securerandom=null & java.security.egd=file:/dev/./urandom
   [junit4]   2> 3376668 INFO  (SUITE-TestSQLHandler-seed#[EBC06C30F396FC73]-worker) [    ] o.a.s.BaseDistributedSearchTestCase Setting hostContext system property: /
   [junit4]   2> 3376670 INFO  (TEST-TestSQLHandler.doTest-seed#[EBC06C30F396FC73]) [    ] o.a.s.c.ZkTestServer STARTING ZK TEST SERVER
   [junit4]   2> 3376672 INFO  (Thread-6250) [    ] o.a.s.c.ZkTestServer client port:0.0.0.0/0.0.0.0:0
   [junit4]   2> 3376672 INFO  (Thread-6250) [    ] o.a.s.c.ZkTestServer Starting server
   [junit4]   2> 3376675 ERROR (Thread-6250) [    ] o.a.z.s.ZooKeeperServer ZKShutdownHandler is not registered, so ZooKeeper server won't take any action on ERROR or SHUTDOWN server state changes
   [junit4]   2> 3376771 INFO  (TEST-TestSQLHandler.doTest-seed#[EBC06C30F396FC73]) [    ] o.a.s.c.ZkTestServer start zk server on port:61355
   [junit4]   2> 3376776 INFO  (zkConnectionManagerCallback-7669-thread-1) [    ] o.a.s.c.c.ConnectionManager zkClient has connected
   [junit4]   2> 3376784 INFO  (zkConnectionManagerCallback-7671-thread-1) [    ] o.a.s.c.c.ConnectionManager zkClient has connected
   [junit4]   2> 3376795 INFO  (TEST-TestSQLHandler.doTest-seed#[EBC06C30F396FC73]) [    ] o.a.s.c.AbstractZkTestCase put C:\Users\jenkins\workspace\Lucene-Solr-master-Windows\solr\core\src\test-files\solr\collection1\conf\solrconfig-sql.xml to /configs/conf1/solrconfig.xml
   [junit4]   2> 3376798 INFO  (TEST-TestSQLHandler.doTest-seed#[EBC06C30F396FC73]) [    ] o.a.s.c.AbstractZkTestCase put C:\Users\jenkins\workspace\Lucene-Solr-master-Windows\solr\core\src\test-files\solr\collection1\conf\schema-sql.xml to /configs/conf1/schema.xml
   [junit4]   2> 3376800 INFO  (TEST-TestSQLHandler.doTest-seed#[EBC06C30F396FC73]) [    ] o.a.s.c.AbstractZkTestCase put C:\Users\jenkins\workspace\Lucene-Solr-master-Windows\solr\core\src\test-files\solr\collection1\conf\solrconfig.snippet.randomindexconfig.xml to /configs/conf1/solrconfig.snippet.randomindexconfig.xml
   [junit4]   2> 3376803 INFO  (TEST-TestSQLHandler.doTest-seed#[EBC06C30F396FC73]) [    ] o.a.s.c.AbstractZkTestCase put C:\Users\jenkins\workspace\Lucene-Solr-master-Windows\solr\core\src\test-files\solr\collection1\conf\stopwords.txt to /configs/conf1/stopwords.txt
   [junit4]   2> 3376805 INFO  (TEST-TestSQLHandler.doTest-seed#[EBC06C30F396FC73]) [    ] o.a.s.c.AbstractZkTestCase put C:\Users\jenkins\workspace\Lucene-Solr-master-Windows\solr\core\src\test-files\solr\collection1\conf\protwords.txt to /configs/conf1/protwords.txt
   [junit4]   2> 3376807 INFO  (TEST-TestSQLHandler.doTest-seed#[EBC06C30F396FC73]) [    ] o.a.s.c.AbstractZkTestCase put C:\Users\jenkins\workspace\Lucene-Solr-master-Windows\solr\core\src\test-files\solr\collection1\conf\currency.xml to /configs/conf1/currency.xml
   [junit4]   2> 3376809 INFO  (TEST-TestSQLHandler.doTest-seed#[EBC06C30F396FC73]) [    ] o.a.s.c.AbstractZkTestCase put C:\Users\jenkins\workspace\Lucene-Solr-master-Windows\solr\core\src\test-files\solr\collection1\conf\enumsConfig.xml to /configs/conf1/enumsConfig.xml
   [junit4]   2> 3376824 INFO  (TEST-TestSQLHandler.doTest-seed#[EBC06C30F396FC73]) [    ] o.a.s.c.AbstractZkTestCase put C:\Users\jenkins\workspace\Lucene-Solr-master-Windows\solr\core\src\test-files\solr\collection1\conf\open-exchange-rates.json to /configs/conf1/open-exchange-rates.json
   [junit4]   2> 3376826 INFO  (TEST-TestSQLHandler.doTest-seed#[EBC06C30F396FC73]) [    ] o.a.s.c.AbstractZkTestCase put C:\Users\jenkins\workspace\Lucene-Solr-master-Windows\solr\core\src\test-files\solr\collection1\conf\mapping-ISOLatin1Accent.txt to /configs/conf1/mapping-ISOLatin1Accent.txt
   [junit4]   2> 3376828 INFO  (TEST-TestSQLHandler.doTest-seed#[EBC06C30F396FC73]) [    ] o.a.s.c.AbstractZkTestCase put C:\Users\jenkins\workspace\Lucene-Solr-master-Windows\solr\core\src\test-files\solr\collection1\conf\old_synonyms.txt to /configs/conf1/old_synonyms.txt
   [junit4]   2> 3376830 INFO  (TEST-TestSQLHandler.doTest-seed#[EBC06C30F396FC73]) [    ] o.a.s.c.AbstractZkTestCase put C:\Users\jenkins\workspace\Lucene-Solr-master-Windows\solr\core\src\test-files\solr\collection1\conf\synonyms.txt to /configs/conf1/synonyms.txt
   [junit4]   2> 3376839 INFO  (zkConnectionManagerCallback-7674-thread-1) [    ] o.a.s.c.c.ConnectionManager zkClient has connected
   [junit4]   2> 3376842 INFO  (TEST-TestSQLHandler.doTest-seed#[EBC06C30F396FC73]) [    ] o.a.s.c.AbstractFullDistribZkTestBase Will use NRT replicas unless explicitly asked otherwise
   [junit4]   2> 3377471 INFO  (TEST-TestSQLHandler.doTest-seed#[EBC06C30F396FC73]) [    ] o.e.j.s.Server jetty-9.3.20.v20170531
   [junit4]   2> 3377471 INFO  (TEST-TestSQLHandler.doTest-seed#[EBC06C30F396FC73]) [    ] o.e.j.s.h.ContextHandler Started o.e.j.s.ServletContextHandler@75df30b3{/,null,AVAILABLE}
   [junit4]   2> 3377474 INFO  (TEST-TestSQLHandler.doTest-seed#[EBC06C30F396FC73]) [    ] o.e.j.s.AbstractConnector Started ServerConnector@1d7a057e{SSL,[ssl, http/1.1]}{127.0.0.1:61365}
   [junit4]   2> 3377474 INFO  (TEST-TestSQLHandler.doTest-seed#[EBC06C30F396FC73]) [    ] o.e.j.s.Server Started @3388123ms
   [junit4]   2> 3377474 INFO  (TEST-TestSQLHandler.doTest-seed#[EBC06C30F396FC73]) [    ] o.a.s.c.s.e.JettySolrRunner Jetty properties: {hostContext=/, solr.data.dir=C:\Users\jenkins\workspace\Lucene-Solr-master-Windows\solr\build\solr-core\test\J0\temp\solr.handler.TestSQLHandler_EBC06C30F396FC73-001\tempDir-001/control/data, hostPort=61365, coreRootDirectory=C:\Users\jenkins\workspace\Lucene-Solr-master-Windows\solr\build\solr-core\test\J0\temp\solr.handler.TestSQLHandler_EBC06C30F396FC73-001\control-001\cores, replicaType=NRT}
   [junit4]   2> 3377474 ERROR (TEST-TestSQLHandler.doTest-seed#[EBC06C30F396FC73]) [    ] o.a.s.u.StartupLoggingUtils Missing Java Option solr.log.dir. Logging may be missing or incomplete.
   [junit4]   2> 3377474 INFO  (TEST-TestSQLHandler.doTest-seed#[EBC06C30F396FC73]) [    ] o.a.s.s.SolrDispatchFilter  ___      _       Welcome to Apache Solr™ version 8.0.0
   [junit4]   2> 3377474 INFO  (TEST-TestSQLHandler.doTest-seed#[EBC06C30F396FC73]) [    ] o.a.s.s.SolrDispatchFilter / __| ___| |_ _   Starting in cloud mode on port null
   [junit4]   2> 3377474 INFO  (TEST-TestSQLHandler.doTest-seed#[EBC06C30F396FC73]) [    ] o.a.s.s.SolrDispatchFilter \__ \/ _ \ | '_|  Install dir: null
   [junit4]   2> 3377474 INFO  (TEST-TestSQLHandler.doTest-seed#[EBC06C30F396FC73]) [    ] o.a.s.s.SolrDispatchFilter |___/\___/_|_|    Start time: 2018-01-04T06:25:17.140820900Z
   [junit4]   2> 3377479 INFO  (zkConnectionManagerCallback-7676-thread-1) [    ] o.a.s.c.c.ConnectionManager zkClient has connected
   [junit4]   2> 3377485 WARN  (NIOServerCxn.Factory:0.0.0.0/0.0.0.0:0) [    ] o.a.z.s.NIOServerCnxn caught end of stream exception
   [junit4]   2> EndOfStreamException: Unable to read additional data from client sessionid 0x160bfd85e350003, likely client has closed socket
   [junit4]   2> 	at org.apache.zookeeper.server.NIOServerCnxn.doIO(NIOServerCnxn.java:239)
   [junit4]   2> 	at org.apache.zookeeper.server.NIOServerCnxnFactory.run(NIOServerCnxnFactory.java:203)
   [junit4]   2> 	at java.base/java.lang.Thread.run(Thread.java:844)
   [junit4]   2> 3377485 INFO  (TEST-TestSQLHandler.doTest-seed#[EBC06C30F396FC73]) [    ] o.a.s.s.SolrDispatchFilter Loading solr.xml from SolrHome (not found in ZooKeeper)
   [junit4]   2> 3377486 INFO  (TEST-TestSQLHandler.doTest-seed#[EBC06C30F396FC73]) [    ] o.a.s.c.SolrXmlConfig Loading container configuration from C:\Users\jenkins\workspace\Lucene-Solr-master-Windows\solr\build\solr-core\test\J0\temp\solr.handler.TestSQLHandler_EBC06C30F396FC73-001\control-001\solr.xml
   [junit4]   2> 3377489 INFO  (TEST-TestSQLHandler.doTest-seed#[EBC06C30F396FC73]) [    ] o.a.s.c.SolrXmlConfig Configuration parameter autoReplicaFailoverWorkLoopDelay is ignored
   [junit4]   2> 3377489 INFO  (TEST-TestSQLHandler.doTest-seed#[EBC06C30F396FC73]) [    ] o.a.s.c.SolrXmlConfig Configuration parameter autoReplicaFailoverBadNodeExpiration is ignored
   [junit4]   2> 3377490 INFO  (TEST-TestSQLHandler.doTest-seed#[EBC06C30F396FC73]) [    ] o.a.s.c.SolrXmlConfig MBean server found: com.sun.jmx.mbeanserver.JmxMBeanServer@7783480a, but no JMX reporters were configured - adding default JMX reporter.
   [junit4]   2> 3377494 INFO  (TEST-TestSQLHandler.doTest-seed#[EBC06C30F396FC73]) [    ] o.a.s.c.ZkContainer Zookeeper client=127.0.0.1:61355/solr
   [junit4]   2> 3377498 INFO  (zkConnectionManagerCallback-7680-thread-1) [    ] o.a.s.c.c.ConnectionManager zkClient has connected
   [junit4]   2> 3377511 INFO  (zkConnectionManagerCallback-7682-thread-1-processing-n:127.0.0.1:61365_) [n:127.0.0.1:61365_    ] o.a.s.c.c.ConnectionManager zkClient has connected
   [junit4]   2> 3378013 INFO  (TEST-TestSQLHandler.doTest-seed#[EBC06C30F396FC73]) [n:127.0.0.1:61365_    ] o.a.s.c.Overseer Overseer (id=null) closing
   [junit4]   2> 3378014 INFO  (TEST-TestSQLHandler.doTest-seed#[EBC06C30F396FC73]) [n:127.0.0.1:61365_    ] o.a.s.c.OverseerElectionContext I am going to be the leader 127.0.0.1:61365_
   [junit4]   2> 3378015 INFO  (TEST-TestSQLHandler.doTest-seed#[EBC06C30F396FC73]) [n:127.0.0.1:61365_    ] o.a.s.c.Overseer Overseer (id=99290127816523781-127.0.0.1:61365_-n_0000000000) starting
   [junit4]   2> 3378038 INFO  (TEST-TestSQLHandler.doTest-seed#[EBC06C30F396FC73]) [n:127.0.0.1:61365_    ] o.a.s.c.ZkController Register node as live in ZooKeeper:/live_nodes/127.0.0.1:61365_
   [junit4]   2> 3378041 INFO  (OverseerStateUpdate-99290127816523781-127.0.0.1:61365_-n_0000000000) [n:127.0.0.1:61365_    ] o.a.s.c.c.ZkStateReader Updated live nodes from ZooKeeper... (0) -> (1)
   [junit4]   2> 3378158 INFO  (TEST-TestSQLHandler.doTest-seed#[EBC06C30F396FC73]) [n:127.0.0.1:61365_    ] o.a.s.m.r.SolrJmxReporter JMX monitoring for 'solr.node' (registry 'solr.node') enabled at server: com.sun.jmx.mbeanserver.JmxMBeanServer@7783480a
   [junit4]   2> 3378174 INFO  (TEST-TestSQLHandler.doTest-seed#[EBC06C30F396FC73]) [n:127.0.0.1:61365_    ] o.a.s.m.r.SolrJmxReporter JMX monitoring for 'solr.jvm' (registry 'solr.jvm') enabled at server: com.sun.jmx.mbeanserver.JmxMBeanServer@7783480a
   [junit4]   2> 3378174 INFO  (TEST-TestSQLHandler.doTest-seed#[EBC06C30F396FC73]) [n:127.0.0.1:61365_    ] o.a.s.m.r.SolrJmxReporter JMX monitoring for 'solr.jetty' (registry 'solr.jetty') enabled at server: com.sun.jmx.mbeanserver.JmxMBeanServer@7783480a
   [junit4]   2> 3378177 INFO  (TEST-TestSQLHandler.doTest-seed#[EBC06C30F396FC73]) [n:127.0.0.1:61365_    ] o.a.s.c.CorePropertiesLocator Found 0 core definitions underneath C:\Users\jenkins\workspace\Lucene-Solr-master-Windows\solr\build\solr-core\test\J0\temp\solr.handler.TestSQLHandler_EBC06C30F396FC73-001\control-001\cores
   [junit4]   2> 3378217 INFO  (zkConnectionManagerCallback-7688-thread-1) [    ] o.a.s.c.c.ConnectionManager zkClient has connected
   [junit4]   2> 3378219 INFO  (TEST-TestSQLHandler.doTest-seed#[EBC06C30F396FC73]) [    ] o.a.s.c.c.ZkStateReader Updated live nodes from ZooKeeper... (0) -> (1)
   [junit4]   2> 3378224 INFO  (TEST-TestSQLHandler.doTest-seed#[EBC06C30F396FC73]) [    ] o.a.s.c.s.i.ZkClientClusterStateProvider Cluster at 127.0.0.1:61355/solr ready
   [junit4]   2> 3378247 INFO  (qtp754190060-34540) [n:127.0.0.1:61365_    ] o.a.s.h.a.CollectionsHandler Invoked Collection Action :create with params replicationFactor=1&collection.configName=conf1&name=control_collection&nrtReplicas=1&action=CREATE&numShards=1&createNodeSet=127.0.0.1:61365_&wt=javabin&version=2 and sendToOCPQueue=true
   [junit4]   2> 3378251 INFO  (OverseerThreadFactory-12073-thread-1-processing-n:127.0.0.1:61365_) [n:127.0.0.1:61365_    ] o.a.s.c.CreateCollectionCmd Create collection control_collection
   [junit4]   2> 3378391 INFO  (qtp754190060-34533) [n:127.0.0.1:61365_    ] o.a.s.h.a.CoreAdminOperation core create command qt=/admin/cores&collection.configName=conf1&newCollection=true&name=control_collection_shard1_replica_n1&action=CREATE&numShards=1&collection=control_collection&shard=shard1&wt=javabin&version=2&replicaType=NRT
   [junit4]   2> 3378392 INFO  (qtp754190060-34533) [n:127.0.0.1:61365_    ] o.a.s.c.TransientSolrCoreCacheDefault Allocating transient cache for 4 transient cores
   [junit4]   2> 3378501 INFO  (zkCallback-7681-thread-1-processing-n:127.0.0.1:61365_) [n:127.0.0.1:61365_    ] o.a.s.c.c.ZkStateReader A cluster state change: [WatchedEvent state:SyncConnected type:NodeDataChanged path:/collections/control_collection/state.json] for collection [control_collection] has occurred - updating... (live nodes size: [1])
   [junit4]   2> 3379452 INFO  (qtp754190060-34533) [n:127.0.0.1:61365_ c:control_collection s:shard1  x:control_collection_shard1_replica_n1] o.a.s.c.SolrConfig Using Lucene MatchVersion: 8.0.0
   [junit4]   2> 3379469 INFO  (qtp754190060-34533) [n:127.0.0.1:61365_ c:control_collection s:shard1  x:control_collection_shard1_replica_n1] o.a.s.s.IndexSchema [control_collection_shard1_replica_n1] Schema name=test
   [junit4]   2> 3379541 WARN  (qtp754190060-34533) [n:127.0.0.1:61365_ c:control_collection s:shard1  x:control_collection_shard1_replica_n1] o.a.s.s.IndexSchema Field lowerfilt1and2 is not multivalued and destination for multiple copyFields (2)
   [junit4]   2> 3379541 WARN  (qtp754190060-34533) [n:127.0.0.1:61365_ c:control_collection s:shard1  x:control_collection_shard1_replica_n1] o.a.s.s.IndexSchema Field text is not multivalued and destination for multiple copyFields (3)
   [junit4]   2> 3379541 INFO  (qtp754190060-34533) [n:127.0.0.1:61365_ c:control_collection s:shard1  x:control_collection_shard1_replica_n1] o.a.s.s.IndexSchema Loaded schema test/1.6 with uniqueid field id
   [junit4]   2> 3379542 INFO  (qtp754190060-34533) [n:127.0.0.1:61365_ c:control_collection s:shard1  x:control_collection_shard1_replica_n1] o.a.s.c.CoreContainer Creating SolrCore 'control_collection_shard1_replica_n1' using configuration from collection control_collection, trusted=true
   [junit4]   2> 3379542 INFO  (qtp754190060-34533) [n:127.0.0.1:61365_ c:control_collection s:shard1  x:control_collection_shard1_replica_n1] o.a.s.m.r.SolrJmxReporter JMX monitoring for 'solr.core.control_collection.shard1.replica_n1' (registry 'solr.core.control_collection.shard1.replica_n1') enabled at server: com.sun.jmx.mbeanserver.JmxMBeanServer@7783480a
   [junit4]   2> 3379543 INFO  (qtp754190060-34533) [n:127.0.0.1:61365_ c:control_collection s:shard1  x:control_collection_shard1_replica_n1] o.a.s.c.SolrCore solr.RecoveryStrategy.Builder
   [junit4]   2> 3379543 INFO  (qtp754190060-34533) [n:127.0.0.1:61365_ c:control_collection s:shard1  x:control_collection_shard1_replica_n1] o.a.s.c.SolrCore [[control_collection_shard1_replica_n1] ] Opening new SolrCore at [C:\Users\jenkins\workspace\Lucene-Solr-master-Windows\solr\build\solr-core\test\J0\temp\solr.handler.TestSQLHandler_EBC06C30F396FC73-001\control-001\cores\control_collection_shard1_replica_n1], dataDir=[C:\Users\jenkins\workspace\Lucene-Solr-master-Windows\solr\build\solr-core\test\J0\temp\solr.handler.TestSQLHandler_EBC06C30F396FC73-001\control-001\cores\control_collection_shard1_replica_n1\data\]
   [junit4]   2> 3379630 INFO  (qtp754190060-34533) [n:127.0.0.1:61365_ c:control_collection s:shard1  x:control_collection_shard1_replica_n1] o.a.s.u.UpdateHandler Using UpdateLog implementation: org.apache.solr.update.UpdateLog
   [junit4]   2> 3379630 INFO  (qtp754190060-34533) [n:127.0.0.1:61365_ c:control_collection s:shard1  x:control_collection_shard1_replica_n1] o.a.s.u.UpdateLog Initializing UpdateLog: dataDir= defaultSyncLevel=FLUSH numRecordsToKeep=100 maxNumLogsToKeep=10 numVersionBuckets=65536
   [junit4]   2> 3379634 INFO  (qtp754190060-34533) [n:127.0.0.1:61365_ c:control_collection s:shard1  x:control_collection_shard1_replica_n1] o.a.s.u.CommitTracker Hard AutoCommit: disabled
   [junit4]   2> 3379635 INFO  (qtp754190060-34533) [n:127.0.0.1:61365_ c:control_collection s:shard1  x:control_collection_shard1_replica_n1] o.a.s.u.CommitTracker Soft AutoCommit: disabled
   [junit4]   2> 3379636 INFO  (qtp754190060-34533) [n:127.0.0.1:61365_ c:control_collection s:shard1  x:control_collection_shard1_replica_n1] o.a.s.s.SolrIndexSearcher Opening [Searcher@4167067f[control_collection_shard1_replica_n1] main]
   [junit4]   2> 3379638 INFO  (qtp754190060-34533) [n:127.0.0.1:61365_ c:control_collection s:shard1  x:control_collection_shard1_replica_n1] o.a.s.r.ManagedResourceStorage Configured ZooKeeperStorageIO with znodeBase: /configs/conf1
   [junit4]   2> 3379638 INFO  (qtp754190060-34533) [n:127.0.0.1:61365_ c:control_collection s:shard1  x:control_collection_shard1_replica_n1] o.a.s.r.ManagedResourceStorage Loaded null at path _rest_managed.json using ZooKeeperStorageIO:path=/configs/conf1
   [junit4]   2> 3379640 INFO  (searcherExecutor-12076-thread-1-processing-n:127.0.0.1:61365_ x:control_collection_shard1_replica_n1 s:shard1 c:control_collection) [n:127.0.0.1:61365_ c:control_collection s:shard1  x:control_collection_shard1_replica_n1] o.a.s.c.SolrCore [control_collection_shard1_replica_n1] Registered new searcher Searcher@4167067f[control_collection_shard1_replica_n1] main{ExitableDirectoryReader(UninvertingDirectoryReader())}
   [junit4]   2> 3379640 INFO  (qtp754190060-34533) [n:127.0.0.1:61365_ c:control_collection s:shard1  x:control_collection_shard1_replica_n1] o.a.s.u.UpdateLog Could not find max version in index or recent updates, using new clock 1588642048173408256
   [junit4]   2> 3379650 INFO  (qtp754190060-34533) [n:127.0.0.1:61365_ c:control_collection s:shard1  x:control_collection_shard1_replica_n1] o.a.s.c.ShardLeaderElectionContext Enough replicas found to continue.
   [junit4]   2> 3379650 INFO  (qtp754190060-34533) [n:127.0.0.1:61365_ c:control_collection s:shard1  x:control_collection_shard1_replica_n1] o.a.s.c.ShardLeaderElectionContext I may be the new leader - try and sync
   [junit4]   2> 3379650 INFO  (qtp754190060-34533) [n:127.0.0.1:61365_ c:control_collection s:shard1  x:control_collection_shard1_replica_n1] o.a.s.c.SyncStrategy Sync replicas to https://127.0.0.1:61365/control_collection_shard1_replica_n1/
   [junit4]   2> 3379650 INFO  (qtp754190060-34533) [n:127.0.0.1:61365_ c:control_collection s:shard1  x:control_collection_shard1_replica_n1] o.a.s.c.SyncStrategy Sync Success - now sync replicas to me
   [junit4]   2> 3379650 INFO  (qtp754190060-34533) [n:127.0.0.1:61365_ c:control_collection s:shard1  x:control_collection_shard1_replica_n1] o.a.s.c.SyncStrategy https://127.0.0.1:61365/control_collection_shard1_replica_n1/ has no replicas
   [junit4]   2> 3379650 INFO  (qtp754190060-34533) [n:127.0.0.1:61365_ c:control_collection s:shard1  x:control_collection_shard1_replica_n1] o.a.s.c.ShardLeaderElectionContext Found all replicas participating in election, clear LIR
   [junit4]   2> 3379660 INFO  (qtp754190060-34533) [n:127.0.0.1:61365_ c:control_collection s:shard1  x:control_collection_shard1_replica_n1] o.a.s.c.ShardLeaderElectionContext I am the new leader: https://127.0.0.1:61365/control_collection_shard1_replica_n1/ shard1
   [junit4]   2> 3379791 INFO  (zkCallback-7681-thread-2-processing-n:127.0.0.1:61365_) [n:127.0.0.1:61365_    ] o.a.s.c.c.ZkStateReader A cluster state change: [WatchedEvent state:SyncConnected type:NodeDataChanged path:/collections/control_collection/state.json] for collection [control_collection] has occurred - updating... (live nodes size: [1])
   [junit4]   2> 3379839 INFO  (qtp754190060-34533) [n:127.0.0.1:61365_ c:control_collection s:shard1  x:control_collection_shard1_replica_n1] o.a.s.c.ZkController I am the leader, no recovery necessary
   [junit4]   2> 3379846 INFO  (qtp754190060-34533) [n:127.0.0.1:61365_ c:control_collection s:shard1  x:control_collection_shard1_replica_n1] o.a.s.s.HttpSolrCall [admin] webapp=null path=/admin/cores params={qt=/admin/cores&collection.configName=conf1&newCollection=true&name=control_collection_shard1_replica_n1&action=CREATE&numShards=1&collection=control_collection&shard=shard1&wt=javabin&version=2&replicaType=NRT} status=0 QTime=1454
   [junit4]   2> 3379863 INFO  (qtp754190060-34540) [n:127.0.0.1:61365_    ] o.a.s.h.a.CollectionsHandler Wait for new collection to be active for at most 30 seconds. Check all shard replicas
   [junit4]   2> 3379957 INFO  (zkCallback-7681-thread-2-processing-n:127.0.0.1:61365_) [n:127.0.0.1:61365_    ] o.a.s.c.c.ZkStateReader A cluster state change: [WatchedEvent state:SyncConnected type:NodeDataChanged path:/collections/control_collection/state.json] for collection [control_collection] has occurred - updating... (live nodes size: [1])
   [junit4]   2> 3380257 INFO  (OverseerCollectionConfigSetProcessor-99290127816523781-127.0.0.1:61365_-n_0000000000) [n:127.0.0.1:61365_    ] o.a.s.c.OverseerTaskQueue Response ZK path: /overseer/collection-queue-work/qnr-0000000000 doesn't exist.  Requestor may have disconnected from ZooKeeper
   [junit4]   2> 3380863 INFO  (qtp754190060-34540) [n:127.0.0.1:61365_    ] o.a.s.s.HttpSolrCall [admin] webapp=null path=/admin/collections params={replicationFactor=1&collection.configName=conf1&name=control_collection&nrtReplicas=1&action=CREATE&numShards=1&createNodeSet=127.0.0.1:61365_&wt=javabin&version=2} status=0 QTime=2614
   [junit4]   2> 3380867 INFO  (zkConnectionManagerCallback-7692-thread-1) [    ] o.a.s.c.c.ConnectionManager zkClient has connected
   [junit4]   2> 3380869 INFO  (TEST-TestSQLHandler.doTest-seed#[EBC06C30F396FC73]) [    ] o.a.s.c.c.ZkStateReader Updated live nodes from ZooKeeper... (0) -> (1)
   [junit4]   2> 3380870 INFO  (TEST-TestSQLHandler.doTest-seed#[EBC06C30F396FC73]) [    ] o.a.s.c.s.i.ZkClientClusterStateProvider Cluster at 127.0.0.1:61355/solr ready
   [junit4]   2> 3380870 INFO  (TEST-TestSQLHandler.doTest-seed#[EBC06C30F396FC73]) [    ] o.a.s.c.ChaosMonkey monkey: init - expire sessions:false cause connection loss:false
   [junit4]   2> 3380872 INFO  (qtp754190060-34537) [n:127.0.0.1:61365_    ] o.a.s.h.a.CollectionsHandler Invoked Collection Action :create with params replicationFactor=1&collection.configName=conf1&name=collection1&nrtReplicas=1&action=CREATE&numShards=2&createNodeSet=&stateFormat=1&wt=javabin&version=2 and sendToOCPQueue=true
   [junit4]   2> 3380874 INFO  (OverseerThreadFactory-12073-thread-2-processing-n:127.0.0.1:61365_) [n:127.0.0.1:61365_    ] o.a.s.c.CreateCollectionCmd Create collection collection1
   [junit4]   2> 3380876 WARN  (OverseerThreadFactory-12073-thread-2-processing-n:127.0.0.1:61365_) [n:127.0.0.1:61365_    ] o.a.s.c.CreateCollectionCmd It is unusual to create a collection (collection1) without cores.
   [junit4]   2> 3381080 INFO  (qtp754190060-34537) [n:127.0.0.1:61365_    ] o.a.s.h.a.CollectionsHandler Wait for new collection to be active for at most 30 seconds. Check all shard replicas
   [junit4]   2> 3381080 INFO  (qtp754190060-34537) [n:127.0.0.1:61365_    ] o.a.s.s.HttpSolrCall [admin] webapp=null path=/admin/collections params={replicationFactor=1&collection.configName=conf1&name=collection1&nrtReplicas=1&action=CREATE&numShards=2&createNodeSet=&stateFormat=1&wt=javabin&version=2} status=0 QTime=207
   [junit4]   2> 3381490 INFO  (TEST-TestSQLHandler.doTest-seed#[EBC06C30F396FC73]) [    ] o.a.s.c.AbstractFullDistribZkTestBase create jetty 1 in directory C:\Users\jenkins\workspace\Lucene-Solr-master-Windows\solr\build\solr-core\test\J0\temp\solr.handler.TestSQLHandler_EBC06C30F396FC73-001\shard-1-001 of type NRT
   [junit4]   2> 3381491 INFO  (TEST-TestSQLHandler.doTest-seed#[EBC06C30F396FC73]) [    ] o.e.j.s.Server jetty-9.3.20.v20170531
   [junit4]   2> 3381492 INFO  (TEST-TestSQLHandler.doTest-seed#[EBC06C30F396FC73]) [    ] o.e.j.s.h.ContextHandler Started o.e.j.s.ServletContextHandler@157a299e{/,null,AVAILABLE}
   [junit4]   2> 3381493 INFO  (TEST-TestSQLHandler.doTest-seed#[EBC06C30F396FC73]) [    ] o.e.j.s.AbstractConnector Started ServerConnector@7d44664e{SSL,[ssl, http/1.1]}{127.0.0.1:61386}
   [junit4]   2> 3381493 INFO  (TEST-TestSQLHandler.doTest-seed#[EBC06C30F396FC73]) [    ] o.e.j.s.Server Started @3392142ms
   [junit4]   2> 3381493 INFO  (TEST-TestSQLHandler.doTest-seed#[EBC06C30F396FC73]) [    ] o.a.s.c.s.e.JettySolrRunner Jetty properties: {hostContext=/, solrconfig=solrconfig.xml, solr.data.dir=C:\Users\jenkins\workspace\Lucene-Solr-master-Windows\solr\build\solr-core\test\J0\temp\solr.handler.TestSQLHandler_EBC06C30F396FC73-001\tempDir-001/jetty1, hostPort=61386, coreRootDirectory=C:\Users\jenkins\workspace\Lucene-Solr-master-Windows\solr\build\solr-core\test\J0\temp\solr.handler.TestSQLHandler_EBC06C30F396FC73-001\shard-1-001\cores, replicaType=NRT}
   [junit4]   2> 3381493 ERROR (TEST-TestSQLHandler.doTest-seed#[EBC06C30F396FC73]) [    ] o.a.s.u.StartupLoggingUtils Missing Java Option solr.log.dir. Logging may be missing or incomplete.
   [junit4]   2> 3381494 INFO  (TEST-TestSQLHandler.doTest-seed#[EBC06C30F396FC73]) [    ] o.a.s.s.SolrDispatchFilter  ___      _       Welcome to Apache Solr™ version 8.0.0
   [junit4]   2> 3381494 INFO  (TEST-TestSQLHandler.doTest-seed#[EBC06C30F396FC73]) [    ] o.a.s.s.SolrDispatchFilter / __| ___| |_ _   Starting in cloud mode on port null
   [junit4]   2> 3381494 INFO  (TEST-TestSQLHandler.doTest-seed#[EBC06C30F396FC73]) [    ] o.a.s.s.SolrDispatchFilter \__ \/ _ \ | '_|  Install dir: null
   [junit4]   2> 3381494 INFO  (TEST-TestSQLHandler.doTest-seed#[EBC06C30F396FC73]) [    ] o.a.s.s.SolrDispatchFilter |___/\___/_|_|    Start time: 2018-01-04T06:25:21.160566700Z
   [junit4]   2> 3381496 INFO  (zkConnectionManagerCallback-7694-thread-1) [    ] o.a.s.c.c.ConnectionManager zkClient has connected
   [junit4]   2> 3381497 WARN  (NIOServerCxn.Factory:0.0.0.0/0.0.0.0:0) [    ] o.a.z.s.NIOServerCnxn caught end of stream exception
   [junit4]   2> EndOfStreamException: Unable to read additional data from client sessionid 0x160bfd85e350008, likely client has closed socket
   [junit4]   2> 	at org.apache.zookeeper.server.NIOServerCnxn.doIO(NIOServerCnxn.java:239)
   [junit4]   2> 	at org.apache.zookeeper.server.NIOServerCnxnFactory.run(NIOServerCnxnFactory.java:203)
   [junit4]   2> 	at java.base/java.lang.Thread.run(Thread.java:844)
   [junit4]   2> 3381498 INFO  (TEST-TestSQLHandler.doTest-seed#[EBC06C30F396FC73]) [    ] o.a.s.s.SolrDispatchFilter Loading solr.xml from SolrHome (not found in ZooKeeper)
   [junit4]   2> 3381498 INFO  (TEST-TestSQLHandler.doTest-seed#[EBC06C30F396FC73]) [    ] o.a.s.c.SolrXmlConfig Loading container configuration from C:\Users\jenkins\workspace\Lucene-Solr-master-Windows\solr\build\solr-core\test\J0\temp\solr.handler.TestSQLHandler_EBC06C30F396FC73-001\shard-1-001\solr.xml
   [junit4]   2> 3381501 INFO  (TEST-TestSQLHandler.doTest-seed#[EBC06C30F396FC73]) [    ] o.a.s.c.SolrXmlConfig Configuration parameter autoReplicaFailoverWorkLoopDelay is ignored
   [junit4]   2> 3381501 INFO  (TEST-TestSQLHandler.doTest-seed#[EBC06C30F396FC73]) [    ] o.a.s.c.SolrXmlConfig Configuration parameter autoReplicaFailoverBadNodeExpiration is ignored
   [junit4]   2> 3381502 INFO  (TEST-TestSQLHandler.doTest-seed#[EBC06C30F396FC73]) [    ] o.a.s.c.SolrXmlConfig MBean server found: com.sun.jmx.mbeanserver.JmxMBeanServer@7783480a, but no JMX reporters were configured - adding default JMX reporter.
   [junit4]   2> 3381505 INFO  (TEST-TestSQLHandler.doTest-seed#[EBC06C30F396FC73]) [    ] o.a.s.c.ZkContainer Zookeeper client=127.0.0.1:61355/solr
   [junit4]   2> 3381507 INFO  (zkConnectionManagerCallback-7698-thread-1) [    ] o.a.s.c.c.ConnectionManager zkClient has connected
   [junit4]   2> 3381511 INFO  (zkConnectionManagerCallback-7700-thread-1-processing-n:127.0.0.1:61386_) [n:127.0.0.1:61386_    ] o.a.s.c.c.ConnectionManager zkClient has connected
   [junit4]   2> 3381518 INFO  (TEST-TestSQLHandler.doTest-seed#[EBC06C30F396FC73]) [n:127.0.0.1:61386_    ] o.a.s.c.c.ZkStateReader Updated live nodes from ZooKeeper... (0) -> (1)
   [junit4]   2> 3381521 INFO  (TEST-TestSQLHandler.doTest-seed#[EBC06C30F396FC73]) [n:127.0.0.1:61386_    ] o.a.s.c.Overseer Overseer (id=null) closing
   [junit4]   2> 3381523 INFO  (TEST-TestSQLHandler.doTest-seed#[EBC06C30F396FC73]) [n:127.0.0.1:61386_    ] o.a.s.c.ZkController Register node as live in ZooKeeper:/live_nodes/127.0.0.1:61386_
   [junit4]   2> 3381525 INFO  (zkCallback-7691-thread-1) [    ] o.a.s.c.c.ZkStateReader Updated live nodes from ZooKeeper... (1) -> (2)
   [junit4]   2> 3381525 INFO  (zkCallback-7681-thread-2-processing-n:127.0.0.1:61365_) [n:127.0.0.1:61365_    ] o.a.s.c.c.ZkStateReader Updated live nodes from ZooKeeper... (1) -> (2)
   [junit4]   2> 3381525 INFO  (zkCallback-7699-thread-1-processing-n:127.0.0.1:61386_) [n:127.0.0.1:61386_    ] o.a.s.c.c.ZkStateReader Updated live nodes from ZooKeeper... (1) -> (2)
   [junit4]   2> 3381574 INFO  (TEST-TestSQLHandler.doTest-seed#[EBC06C30F396FC73]) [n:127.0.0.1:61386_    ] o.a.s.m.r.SolrJmxReporter JMX monitoring for 'solr.node' (registry 'solr.node') enabled at server: com.sun.jmx.mbeanserver.JmxMBeanServer@7783480a
   [junit4]   2> 3381582 INFO  (TEST-TestSQLHandler.doTest-seed#[EBC06C30F396FC73]) [n:127.0.0.1:61386_    ] o.a.s.m.r.SolrJmxReporter JMX monitoring for 'solr.jvm' (registry 'solr.jvm') enabled at server: com.sun.jmx.mbeanserver.JmxMBeanServer@7783480a
   [junit4]   2> 3381583 INFO  (TEST-TestSQLHandler.doTest-seed#[EBC06C30F396FC73]) [n:127.0.0.1:61386_    ] o.a.s.m.r.SolrJmxReporter JMX monitoring for 'solr.jetty' (registry 'solr.jetty') enabled at server: com.sun.jmx.mbeanserver.JmxMBeanServer@7783480a
   [junit4]   2> 3381584 INFO  (TEST-TestSQLHandler.doTest-seed#[EBC06C30F396FC73]) [n:127.0.0.1:61386_    ] o.a.s.c.CorePropertiesLocator Found 0 core definitions underneath C:\Users\jenkins\workspace\Lucene-Solr-master-Windows\solr\build\solr-core\test\J0\temp\solr.handler.TestSQLHandler_EBC06C30F396FC73-001\shard-1-001\cores
   [junit4]   2> 3381615 INFO  (qtp754190060-34534) [n:127.0.0.1:61365_    ] o.a.s.h.a.CollectionsHandler Invoked Collection Action :addreplica with params node=127.0.0.1:61386_&action=ADDREPLICA&collection=collection1&shard=shard2&type=NRT&wt=javabin&version=2 and sendToOCPQueue=true
   [junit4]   2> 3381618 INFO  (OverseerCollectionConfigSetProcessor-99290127816523781-127.0.0.1:61365_-n_0000000000) [n:127.0.0.1:61365_    ] o.a.s.c.OverseerTaskQueue Response ZK path: /overseer/collection-queue-work/qnr-0000000002 doesn't exist.  Requestor may have disconnected from ZooKeeper
   [junit4]   2> 3381618 INFO  (OverseerThreadFactory-12073-thread-3-processing-n:127.0.0.1:61365_) [n:127.0.0.1:61365_    ] o.a.s.c.AddReplicaCmd Node Identified 127.0.0.1:61386_ for creating new replica
   [junit4]   2> 3381639 INFO  (qtp1225423324-34591) [n:127.0.0.1:61386_    ] o.a.s.h.a.CoreAdminOperation core create command qt=/admin/cores&collection.configName=conf1&name=collection1_shard2_replica_n41&action=CREATE&collection=collection1&shard=shard2&wt=javabin&version=2&replicaType=NRT
   [junit4]   2> 3381639 INFO  (qtp1225423324-34591) [n:127.0.0.1:61386_    ] o.a.s.c.TransientSolrCoreCacheDefault Allocating transient cache for 4 transient cores
   [junit4]   2> 3382651 INFO  (qtp1225423324-34591) [n:127.0.0.1:61386_ c:collection1 s:shard2  x:collection1_shard2_replica_n41] o.a.s.c.SolrConfig Using Lucene MatchVersion: 8.0.0
   [junit4]   2> 3382660 INFO  (qtp1225423324-34591) [n:127.0.0.1:61386_ c:collection1 s:shard2  x:collection1_shard2_replica_n41] o.a.s.s.IndexSchema [collection1_shard2_replica_n41] Schema name=test
   [junit4]   2> 3382712 WARN  (qtp1225423324-34591) [n:127.0.0.1:61386_ c:collection1 s:shard2  x:collection1_shard2_replica_n41] o.a.s.s.IndexSchema Field lowerfilt1and2 is not multivalued and destination for multiple copyFields (2)
   [junit4]   2> 3382712 WARN  (qtp1225423324-34591) [n:127.0.0.1:61386_ c:collection1 s:shard2  x:collection1_shard2_replica_n41] o.a.s.s.IndexSchema Field text is not multivalued and destination for multiple copyFields (3)
   [junit4]   2> 3382712 INFO  (qtp1225423324-34591) [n:127.0.0.1:61386_ c:collection1 s:shard2  x:collection1_shard2_replica_n41] o.a.s.s.IndexSchema Loaded schema test/1.6 with uniqueid field id
   [junit4]   2> 3382713 INFO  (qtp1225423324-34591) [n:127.0.0.1:61386_ c:collection1 s:shard2  x:collection1_shard2_replica_n41] o.a.s.c.CoreContainer Creating SolrCore 'collection1_shard2_replica_n41' using configuration from collection collection1, trusted=true
   [junit4]   2> 3382713 INFO  (qtp1225423324-34591) [n:127.0.0.1:61386_ c:collection1 s:shard2  x:collection1_shard2_replica_n41] o.a.s.m.r.SolrJmxReporter JMX monitoring for 'solr.core.collection1.shard2.replica_n41' (registry 'solr.core.collection1.shard2.replica_n41') enabled at server: com.sun.jmx.mbeanserver.JmxMBeanServer@7783480a
   [junit4]   2> 3382713 INFO  (qtp1225423324-34591) [n:127.0.0.1:61386_ c:collection1 s:shard2  x:collection1_shard2_replica_n41] o.a.s.c.SolrCore solr.RecoveryStrategy.Builder
   [junit4]   2> 3382713 INFO  (qtp1225423324-34591) [n:127.0.0.1:61386_ c:collection1 s:shard2  x:collection1_shard2_replica_n41] o.a.s.c.SolrCore [[collection1_shard2_replica_n41] ] Opening new SolrCore at [C:\Users\jenkins\workspace\Lucene-Solr-master-Windows\solr\build\solr-core\test\J0\temp\solr.handler.TestSQLHandler_EBC06C30F396FC73-001\shard-1-001\cores\collection1_shard2_replica_n41], dataDir=[C:\Users\jenkins\workspace\Lucene-Solr-master-Windows\solr\build\solr-core\test\J0\temp\solr.handler.TestSQLHandler_EBC06C30F396FC73-001\shard-1-001\cores\collection1_shard2_replica_n41\data\]
   [junit4]   2> 3382780 INFO  (qtp1225423324-34591) [n:127.0.0.1:61386_ c:collection1 s:shard2  x:collection1_shard2_replica_n41] o.a.s.u.UpdateHandler Using UpdateLog implementation: org.apache.solr.update.UpdateLog
   [junit4]   2> 3382780 INFO  (qtp1225423324-34591) [n:127.0.0.1:61386_ c:collection1 s:shard2  x:collection1_shard2_replica_n41] o.a.s.u.UpdateLog Initializing UpdateLog: dataDir= defaultSyncLevel=FLUSH numRecordsToKeep=100 maxNumLogsToKeep=10 numVersionBuckets=65536
   [junit4]   2> 3382782 INFO  (qtp1225423324-34591) [n:127.0.0.1:61386_ c:collection1 s:shard2  x:collection1_shard2_replica_n41] o.a.s.u.CommitTracker Hard AutoCommit: disabled
   [junit4]   2> 3382783 INFO  (qtp1225423324-34591) [n:127.0.0.1:61386_ c:collection1 s:shard2  x:collection1_shard2_replica_n41] o.a.s.u.CommitTracker Soft AutoCommit: disabled
   [junit4]   2> 3382784 INFO  (qtp1225423324-34591) [n:127.0.0.1:61386_ c:collection1 s:shard2  x:collection1_shard2_replica_n41] o.a.s.s.SolrIndexSearcher Opening [Searcher@2e9c617b[collection1_shard2_replica_n41] main]
   [junit4]   2> 3382786 INFO  (qtp1225423324-34591) [n:127.0.0.1:61386_ c:collection1 s:shard2  x:collection1_shard2_replica_n41] o.a.s.r.ManagedResourceStorage Configured ZooKeeperStorageIO with znodeBase: /configs/conf1
   [junit4]   2> 3382786 INFO  (qtp1225423324-34591) [n:127.0.0.1:61386_ c:collection1 s:shard2  x:collection1_shard2_replica_n41] o.a.s.r.ManagedResourceStorage Loaded null at path _rest_managed.json using ZooKeeperStorageIO:path=/configs/conf1
   [junit4]   2> 3382787 INFO  (qtp1225423324-34591) [n:127.0.0.1:61386_ c:collection1 s:shard2  x:collection1_shard2_replica_n41] o.a.s.u.UpdateLog Could not find max version in index or recent updates, using new clock 1588642051473276928
   [junit4]   2> 3382788 INFO  (searcherExecutor-12086-thread-1-processing-n:127.0.0.1:61386_ x:collection1_shard2_replica_n41 s:shard2 c:collection1) [n:127.0.0.1:61386_ c:collection1 s:shard2  x:collection1_shard2_replica_n41] o.a.s.c.SolrCore [collection1_shard2_replica_n41] Registered new searcher Searcher@2e9c617b[collection1_shard2_replica_n41] main{ExitableDirectoryReader(UninvertingDirectoryReader())}
   [junit4]   2> 3382792 INFO  (qtp1225423324-34591) [n:127.0.0.1:61386_ c:collection1 s:shard2  x:collection1_shard2_replica_n41] o.a.s.c.ShardLeaderElectionContext Enough replicas found to continue.
   [junit4]   2> 3382792 INFO  (qtp1225423324-34591) [n:127.0.0.1:61386_ c:collection1 s:shard2  x:collection1_shard2_replica_n41] o.a.s.c.ShardLeaderElectionContext I may be the new leader - try and sync
   [junit4]   2> 3382792 INFO  (qtp1225423324-34591) [n:127.0.0.1:61386_ c:collection1 s:shard2  x:collection1_shard2_replica_n41] o.a.s.c.SyncStrategy Sync replicas to https://127.0.0.1:61386/collection1_shard2_replica_n41/
   [junit4]   2> 3382792 INFO  (qtp1225423324-34591) [n:127.0.0.1:61386_ c:collection1 s:shard2  x:collection1_shard2_replica_n41] o.a.s.c.SyncStrategy Sync Success - now sync replicas to me
   [junit4]   2> 3382792 INFO  (qtp1225423324-34591) [n:127.0.0.1:61386_ c:collection1 s:shard2  x:collection1_shard2_replica_n41] o.a.s.c.SyncStrategy https://127.0.0.1:61386/collection1_shard2_replica_n41/ has no replicas
   [junit4]   2> 3382792 INFO  (qtp1225423324-34591) [n:127.0.0.1:61386_ c:collection1 s:shard2  x:collection1_shard2_replica_n41] o.a.s.c.ShardLeaderElectionContext Found all replicas participating in election, clear LIR
   [junit4]   2> 3382796 INFO  (qtp1225423324-34591) [n:127.0.0.1:61386_ c:collection1 s:shard2  x:collection1_shard2_replica_n41] o.a.s.c.ShardLeaderElectionContext I am the new leader: https://127.0.0.1:61386/collection1_shard2_replica_n41/ shard2
   [junit4]   2> 3382949 INFO  (qtp1225423324-34591) [n:127.0.0.1:61386_ c:collection1 s:shard2  x:collection1_shard2_replica_n41] o.a.s.c.ZkController I am the leader, no recovery necessary
   [junit4]   2> 3382950 INFO  (qtp1225423324-34591) [n:127.0.0.1:61386_ c:collection1 s:shard2  x:collection1_shard2_replica_n41] o.a.s.s.HttpSolrCall [admin] webapp=null path=/admin/cores params={qt=/admin/cores&collection.configName=conf1&name=collection1_shard2_replica_n41&action=CREATE&collection=collection1&shard=shard2&wt=javabin&version=2&replicaType=NRT} status=0 QTime=1311
   [junit4]   2> 3382952 INFO  (qtp754190060-34534) [n:127.0.0.1:61365_    ] o.a.s.s.HttpSolrCall [admin] webapp=null path=/admin/collections params={node=127.0.0.1:61386_&action=ADDREPLICA&collection=collection1&shard=shard2&type=NRT&wt=javabin&version=2} status=0 QTime=1336
   [junit4]   2> 3383267 INFO  (TEST-TestSQLHandler.doTest-seed#[EBC06C30F396FC73]) [    ] o.a.s.c.AbstractFullDistribZkTestBase create jetty 2 in directory C:\Users\jenkins\workspace\Lucene-Solr-master-Windows\solr\build\solr-core\test\J0\temp\solr.handler.TestSQLHandler_EBC06C30F396FC73-001\shard-2-001 of type NRT
   [junit4]   2> 3383268 INFO  (TEST-TestSQLHandler.doTest-seed#[EBC06C30F396FC73]) [    ] o.e.j.s.Server jetty-9.3.20.v20170531
   [junit4]   2> 3383269 INFO  (TEST-TestSQLHandler.doTest-seed#[EBC06C30F396FC73]) [    ] o.e.j.s.h.ContextHand

[...truncated too long message...]

ikeThisHandlerTest, TestDocTermOrds, SolrIndexSplitterTest, RulesTest, TestIntervalFaceting, CurrencyFieldTypeTest, TestValueSourceCache, TestZkChroot, TestJsonRequest, DeleteLastCustomShardedReplicaTest, ImplicitSnitchTest, ChaosMonkeySafeLeaderTest, LeaderElectionIntegrationTest, ShardRoutingTest, BasicZkTest, FullSolrCloudDistribCmdsTest, TestRandomFaceting, ZkCLITest, TestDistributedGrouping, TestRecovery, TestHashPartitioner, TestRealTimeGet, TestJoin, TestStressVersions, DistributedTermsComponentTest, TestRangeQuery, StatsComponentTest, ConvertedLegacyTest, TestSort, TestFiltering, TestFunctionQuery, TestIndexSearcher, ShowFileRequestHandlerTest, SimplePostToolTest, TestCoreDiscovery, SignatureUpdateProcessorFactoryTest, TestExtendedDismaxParser, SpellCheckCollatorTest, SuggesterFSTTest, SolrRequestParserTest, DocValuesTest, SuggesterTSTTest, SuggesterTest, SpatialFilterTest, NoCacheHeaderTest, WordBreakSolrSpellCheckerTest, TestPseudoReturnFields, DirectUpdateHandlerOptimizeTest, DefaultValueUpdateProcessorTest, StatelessScriptUpdateProcessorFactoryTest, TestRemoteStreaming, SolrInfoBeanTest, DebugComponentTest, CacheHeaderTest, LukeRequestHandlerTest, TestQueryUtils, DirectSolrSpellCheckerTest, TestReversedWildcardFilterFactory, DocumentAnalysisRequestHandlerTest, TestQueryTypes, TestOmitPositions, FileBasedSpellCheckerTest, TermsComponentTest, PathHierarchyTokenizerFactoryTest, TermVectorComponentTest, TestIndexingPerformance, FieldAnalysisRequestHandlerTest, FastVectorHighlighterTest, LoggingHandlerTest, SolrPluginUtilsTest, IndexSchemaTest, TestCSVResponseWriter, MBeansHandlerTest, QueryParsingTest, UniqFieldsUpdateProcessorFactoryTest, JsonLoaderTest, TestPartialUpdateDeduplication, CSVRequestHandlerTest, TestComponentsName, SearchHandlerTest, UpdateParamsTest, TestQuerySenderNoQuery, CopyFieldTest, BadComponentTest, TestStressRecovery, MultiTermTest, SampleTest, TestDocSet, NumericFieldsTest, TestElisionMultitermQuery, TestFuzzyAnalyzedSuggestions, TestSolrCoreProperties, NotRequiredUniqueKeyTest, TestLuceneMatchVersion, TestCodecSupport, TestDFRSimilarityFactory, TestLMDirichletSimilarityFactory, TestIBSimilarityFactory, TestBM25SimilarityFactory, TestFastWriter, TimeZoneUtilsTest, ScriptEngineTest, OpenExchangeRatesOrgProviderTest, URLClassifyProcessorTest, PluginInfoTest, TestFastLRUCache, DateMathParserTest, ChaosMonkeyNothingIsSafeTest, PreAnalyzedFieldTest, TestSuggestSpellingConverter, DOMUtilTest, RAMDirectoryFactoryTest, ClusterStateTest, TestDocumentBuilder, ZkNodePropsTest, SliceStateTest, UUIDFieldTest, FileUtilsTest, DistributedMLTComponentTest, TestRTGBase, CursorPagingTest, TestCrossCoreJoin, TestDistributedMissingSort, TestTolerantSearch, TestLuceneIndexBackCompat, TestEmbeddedSolrServerSchemaAPI, TestJettySolrRunner, ConnectionReuseTest, AddReplicaTest, AliasIntegrationTest, AssignBackwardCompatibilityTest, AssignTest, ChaosMonkeyNothingIsSafeWithPullReplicasTest, CloudExitableDirectoryReaderTest, CollectionTooManyReplicasTest, CollectionsAPIAsyncDistributedZkTest, ConfigSetsAPITest, ConnectionManagerTest, DeleteReplicaTest, DeleteStatusTest, DistribJoinFromCollectionTest, DocValuesNotIndexedTest, ForceLeaderTest, MissingSegmentRecoveryTest, MoveReplicaTest, RestartWhileUpdatingTest, SSLMigrationTest, SaslZkACLProviderTest, ShardSplitTest, TestPullReplicaErrorHandling, TestSizeLimitedDistributedMap, TestSolrCloudWithKerberosAlt, TestSolrCloudWithSecureImpersonation, TestStressCloudBlindAtomicUpdates, TestTolerantUpdateProcessorCloud, TlogReplayBufferedWhileIndexingTest, TriLevelCompositeIdRoutingTest, VMParamsZkACLAndCredentialsProvidersTest, ZkFailoverTest, AutoAddReplicasPlanActionTest, AutoScalingHandlerTest, ExecutePlanActionTest, HdfsAutoAddReplicasIntegrationTest, HttpTriggerListenerTest, NodeLostTriggerTest, TestPolicyCloud, TestClusterStateProvider, TestDistribStateManager, TestExecutePlanAction, TestGenericDistributedQueue]
   [junit4]   2> NOTE: reproduce with: ant test  -Dtestcase=TestGenericDistributedQueue -Dtests.seed=EBC06C30F396FC73 -Dtests.slow=true -Dtests.locale=en-IM -Dtests.timezone=America/Dominica -Dtests.asserts=true -Dtests.file.encoding=Cp1252
   [junit4] ERROR   0.00s J1 | TestGenericDistributedQueue (suite) <<<
   [junit4]    > Throwable #1: java.lang.Exception: Suite timeout exceeded (>= 7200000 msec).
   [junit4]    > 	at __randomizedtesting.SeedInfo.seed([EBC06C30F396FC73]:0)
   [junit4] Completed [765/765 (4!)] on J1 in 7220.26s, 4 tests, 2 errors <<< FAILURES!

[...truncated 2379 lines...]
   [junit4] Suite: org.apache.solr.update.processor.TestOpenNLPExtractNamedEntitiesUpdateProcessorFactory
   [junit4]   2> Creating dataDir: C:\Users\jenkins\workspace\Lucene-Solr-master-Windows\solr\build\contrib\solr-analysis-extras\test\J0\temp\solr.update.processor.TestOpenNLPExtractNamedEntitiesUpdateProcessorFactory_D2A10452A460FB1E-001\init-core-data-001
   [junit4]   2> NOTE: test params are: codec=Asserting(Lucene70): {}, docValues:{}, maxPointsInLeafNode=562, maxMBSortInHeap=6.091626707318478, sim=Asserting(org.apache.lucene.search.similarities.AssertingSimilarity@6531e214), locale=sr-Cyrl-ME, timezone=Etc/GMT-8
   [junit4]   2> NOTE: Windows 10 10.0 amd64/Oracle Corporation 9.0.1 (64-bit)/cpus=3,threads=1,free=59150072,total=152043520
   [junit4]   2> NOTE: All tests run in this JVM: [TestICUCollationFieldDocValues, TestICUCollationField, TestOpenNLPExtractNamedEntitiesUpdateProcessorFactory]
   [junit4]   2> NOTE: reproduce with: ant test  -Dtestcase=TestOpenNLPExtractNamedEntitiesUpdateProcessorFactory -Dtests.seed=D2A10452A460FB1E -Dtests.slow=true -Dtests.locale=sr-Cyrl-ME -Dtests.timezone=Etc/GMT-8 -Dtests.asserts=true -Dtests.file.encoding=ISO-8859-1
   [junit4] ERROR   0.00s J0 | TestOpenNLPExtractNamedEntitiesUpdateProcessorFactory (suite) <<<
   [junit4]    > Throwable #1: java.io.IOException: Could not remove the following files (in the order of attempts):
   [junit4]    >    C:\Users\jenkins\workspace\Lucene-Solr-master-Windows\solr\build\contrib\solr-analysis-extras\test\J0\temp\solr.update.processor.TestOpenNLPExtractNamedEntitiesUpdateProcessorFactory_D2A10452A460FB1E-001\tempDir-001\collection1\conf: java.nio.file.DirectoryNotEmptyException: C:\Users\jenkins\workspace\Lucene-Solr-master-Windows\solr\build\contrib\solr-analysis-extras\test\J0\temp\solr.update.processor.TestOpenNLPExtractNamedEntitiesUpdateProcessorFactory_D2A10452A460FB1E-001\tempDir-001\collection1\conf
   [junit4]    >    C:\Users\jenkins\workspace\Lucene-Solr-master-Windows\solr\build\contrib\solr-analysis-extras\test\J0\temp\solr.update.processor.TestOpenNLPExtractNamedEntitiesUpdateProcessorFactory_D2A10452A460FB1E-001\tempDir-001\collection1: java.nio.file.DirectoryNotEmptyException: C:\Users\jenkins\workspace\Lucene-Solr-master-Windows\solr\build\contrib\solr-analysis-extras\test\J0\temp\solr.update.processor.TestOpenNLPExtractNamedEntitiesUpdateProcessorFactory_D2A10452A460FB1E-001\tempDir-001\collection1
   [junit4]    >    C:\Users\jenkins\workspace\Lucene-Solr-master-Windows\solr\build\contrib\solr-analysis-extras\test\J0\temp\solr.update.processor.TestOpenNLPExtractNamedEntitiesUpdateProcessorFactory_D2A10452A460FB1E-001\tempDir-001: java.nio.file.DirectoryNotEmptyException: C:\Users\jenkins\workspace\Lucene-Solr-master-Windows\solr\build\contrib\solr-analysis-extras\test\J0\temp\solr.update.processor.TestOpenNLPExtractNamedEntitiesUpdateProcessorFactory_D2A10452A460FB1E-001\tempDir-001
   [junit4]    >    C:\Users\jenkins\workspace\Lucene-Solr-master-Windows\solr\build\contrib\solr-analysis-extras\test\J0\temp\solr.update.processor.TestOpenNLPExtractNamedEntitiesUpdateProcessorFactory_D2A10452A460FB1E-001\tempDir-001\collection1\conf\en-test-ner-person.bin: java.nio.file.AccessDeniedException: C:\Users\jenkins\workspace\Lucene-Solr-master-Windows\solr\build\contrib\solr-analysis-extras\test\J0\temp\solr.update.processor.TestOpenNLPExtractNamedEntitiesUpdateProcessorFactory_D2A10452A460FB1E-001\tempDir-001\collection1\conf\en-test-ner-person.bin
   [junit4]    >    C:\Users\jenkins\workspace\Lucene-Solr-master-Windows\solr\build\contrib\solr-analysis-extras\test\J0\temp\solr.update.processor.TestOpenNLPExtractNamedEntitiesUpdateProcessorFactory_D2A10452A460FB1E-001\tempDir-001\collection1\conf\en-test-sent.bin: java.nio.file.AccessDeniedException: C:\Users\jenkins\workspace\Lucene-Solr-master-Windows\solr\build\contrib\solr-analysis-extras\test\J0\temp\solr.update.processor.TestOpenNLPExtractNamedEntitiesUpdateProcessorFactory_D2A10452A460FB1E-001\tempDir-001\collection1\conf\en-test-sent.bin
   [junit4]    >    C:\Users\jenkins\workspace\Lucene-Solr-master-Windows\solr\build\contrib\solr-analysis-extras\test\J0\temp\solr.update.processor.TestOpenNLPExtractNamedEntitiesUpdateProcessorFactory_D2A10452A460FB1E-001\tempDir-001\collection1\conf\en-test-tokenizer.bin: java.nio.file.AccessDeniedException: C:\Users\jenkins\workspace\Lucene-Solr-master-Windows\solr\build\contrib\solr-analysis-extras\test\J0\temp\solr.update.processor.TestOpenNLPExtractNamedEntitiesUpdateProcessorFactory_D2A10452A460FB1E-001\tempDir-001\collection1\conf\en-test-tokenizer.bin
   [junit4]    >    C:\Users\jenkins\workspace\Lucene-Solr-master-Windows\solr\build\contrib\solr-analysis-extras\test\J0\temp\solr.update.processor.TestOpenNLPExtractNamedEntitiesUpdateProcessorFactory_D2A10452A460FB1E-001: java.nio.file.DirectoryNotEmptyException: C:\Users\jenkins\workspace\Lucene-Solr-master-Windows\solr\build\contrib\solr-analysis-extras\test\J0\temp\solr.update.processor.TestOpenNLPExtractNamedEntitiesUpdateProcessorFactory_D2A10452A460FB1E-001
   [junit4]    > 	at __randomizedtesting.SeedInfo.seed([D2A10452A460FB1E]:0)
   [junit4]    > 	at org.apache.lucene.util.IOUtils.rm(IOUtils.java:329)
   [junit4]    > 	at java.base/java.lang.Thread.run(Thread.java:844)
   [junit4] Completed [5/5 (1!)] on J0 in 0.56s, 8 tests, 1 error <<< FAILURES!

[...truncated 38413 lines...]

Mime
View raw message