lucene-dev mailing list archives

Site index · List index
Message view « Date » · « Thread »
Top « Date » · « Thread »
From Policeman Jenkins Server <jenk...@thetaphi.de>
Subject [JENKINS] Lucene-Solr-7.x-Windows (32bit/jdk1.8.0_144) - Build # 392 - Still Unstable!
Date Wed, 10 Jan 2018 02:58:03 GMT
Build: https://jenkins.thetaphi.de/job/Lucene-Solr-7.x-Windows/392/
Java: 32bit/jdk1.8.0_144 -client -XX:+UseConcMarkSweepGC

3 tests failed.
FAILED:  org.apache.solr.cloud.CollectionsAPIDistributedZkTest.testCollectionsAPI

Error Message:
Error from server at https://127.0.0.1:53597/solr/awhollynewcollection_0_shard1_replica_n1: ClusterState says we are the leader (https://127.0.0.1:53597/solr/awhollynewcollection_0_shard1_replica_n1), but locally we don't think so. Request came from null

Stack Trace:
org.apache.solr.client.solrj.impl.CloudSolrClient$RouteException: Error from server at https://127.0.0.1:53597/solr/awhollynewcollection_0_shard1_replica_n1: ClusterState says we are the leader (https://127.0.0.1:53597/solr/awhollynewcollection_0_shard1_replica_n1), but locally we don't think so. Request came from null
	at __randomizedtesting.SeedInfo.seed([CEB6E716F57A0337:86C393A2F3492CA2]:0)
	at org.apache.solr.client.solrj.impl.CloudSolrClient.directUpdate(CloudSolrClient.java:550)
	at org.apache.solr.client.solrj.impl.CloudSolrClient.sendRequest(CloudSolrClient.java:1013)
	at org.apache.solr.client.solrj.impl.CloudSolrClient.requestWithRetryOnStaleState(CloudSolrClient.java:884)
	at org.apache.solr.client.solrj.impl.CloudSolrClient.requestWithRetryOnStaleState(CloudSolrClient.java:946)
	at org.apache.solr.client.solrj.impl.CloudSolrClient.requestWithRetryOnStaleState(CloudSolrClient.java:946)
	at org.apache.solr.client.solrj.impl.CloudSolrClient.requestWithRetryOnStaleState(CloudSolrClient.java:946)
	at org.apache.solr.client.solrj.impl.CloudSolrClient.requestWithRetryOnStaleState(CloudSolrClient.java:946)
	at org.apache.solr.client.solrj.impl.CloudSolrClient.requestWithRetryOnStaleState(CloudSolrClient.java:946)
	at org.apache.solr.client.solrj.impl.CloudSolrClient.request(CloudSolrClient.java:817)
	at org.apache.solr.client.solrj.SolrRequest.process(SolrRequest.java:194)
	at org.apache.solr.client.solrj.request.UpdateRequest.commit(UpdateRequest.java:233)
	at org.apache.solr.cloud.CollectionsAPIDistributedZkTest.testCollectionsAPI(CollectionsAPIDistributedZkTest.java:460)
	at sun.reflect.NativeMethodAccessorImpl.invoke0(Native Method)
	at sun.reflect.NativeMethodAccessorImpl.invoke(NativeMethodAccessorImpl.java:62)
	at sun.reflect.DelegatingMethodAccessorImpl.invoke(DelegatingMethodAccessorImpl.java:43)
	at java.lang.reflect.Method.invoke(Method.java:498)
	at com.carrotsearch.randomizedtesting.RandomizedRunner.invoke(RandomizedRunner.java:1737)
	at com.carrotsearch.randomizedtesting.RandomizedRunner$8.evaluate(RandomizedRunner.java:934)
	at com.carrotsearch.randomizedtesting.RandomizedRunner$9.evaluate(RandomizedRunner.java:970)
	at com.carrotsearch.randomizedtesting.RandomizedRunner$10.evaluate(RandomizedRunner.java:984)
	at com.carrotsearch.randomizedtesting.rules.SystemPropertiesRestoreRule$1.evaluate(SystemPropertiesRestoreRule.java:57)
	at org.apache.lucene.util.TestRuleSetupTeardownChained$1.evaluate(TestRuleSetupTeardownChained.java:49)
	at org.apache.lucene.util.AbstractBeforeAfterRule$1.evaluate(AbstractBeforeAfterRule.java:45)
	at org.apache.lucene.util.TestRuleThreadAndTestName$1.evaluate(TestRuleThreadAndTestName.java:48)
	at org.apache.lucene.util.TestRuleIgnoreAfterMaxFailures$1.evaluate(TestRuleIgnoreAfterMaxFailures.java:64)
	at org.apache.lucene.util.TestRuleMarkFailure$1.evaluate(TestRuleMarkFailure.java:47)
	at com.carrotsearch.randomizedtesting.rules.StatementAdapter.evaluate(StatementAdapter.java:36)
	at com.carrotsearch.randomizedtesting.ThreadLeakControl$StatementRunner.run(ThreadLeakControl.java:368)
	at com.carrotsearch.randomizedtesting.ThreadLeakControl.forkTimeoutingTask(ThreadLeakControl.java:817)
	at com.carrotsearch.randomizedtesting.ThreadLeakControl$3.evaluate(ThreadLeakControl.java:468)
	at com.carrotsearch.randomizedtesting.RandomizedRunner.runSingleTest(RandomizedRunner.java:943)
	at com.carrotsearch.randomizedtesting.RandomizedRunner$5.evaluate(RandomizedRunner.java:829)
	at com.carrotsearch.randomizedtesting.RandomizedRunner$6.evaluate(RandomizedRunner.java:879)
	at com.carrotsearch.randomizedtesting.RandomizedRunner$7.evaluate(RandomizedRunner.java:890)
	at com.carrotsearch.randomizedtesting.rules.StatementAdapter.evaluate(StatementAdapter.java:36)
	at com.carrotsearch.randomizedtesting.rules.SystemPropertiesRestoreRule$1.evaluate(SystemPropertiesRestoreRule.java:57)
	at org.apache.lucene.util.AbstractBeforeAfterRule$1.evaluate(AbstractBeforeAfterRule.java:45)
	at com.carrotsearch.randomizedtesting.rules.StatementAdapter.evaluate(StatementAdapter.java:36)
	at org.apache.lucene.util.TestRuleStoreClassName$1.evaluate(TestRuleStoreClassName.java:41)
	at com.carrotsearch.randomizedtesting.rules.NoShadowingOrOverridesOnMethodsRule$1.evaluate(NoShadowingOrOverridesOnMethodsRule.java:40)
	at com.carrotsearch.randomizedtesting.rules.NoShadowingOrOverridesOnMethodsRule$1.evaluate(NoShadowingOrOverridesOnMethodsRule.java:40)
	at com.carrotsearch.randomizedtesting.rules.StatementAdapter.evaluate(StatementAdapter.java:36)
	at com.carrotsearch.randomizedtesting.rules.StatementAdapter.evaluate(StatementAdapter.java:36)
	at com.carrotsearch.randomizedtesting.rules.StatementAdapter.evaluate(StatementAdapter.java:36)
	at org.apache.lucene.util.TestRuleAssertionsRequired$1.evaluate(TestRuleAssertionsRequired.java:53)
	at org.apache.lucene.util.TestRuleMarkFailure$1.evaluate(TestRuleMarkFailure.java:47)
	at org.apache.lucene.util.TestRuleIgnoreAfterMaxFailures$1.evaluate(TestRuleIgnoreAfterMaxFailures.java:64)
	at org.apache.lucene.util.TestRuleIgnoreTestSuites$1.evaluate(TestRuleIgnoreTestSuites.java:54)
	at com.carrotsearch.randomizedtesting.rules.StatementAdapter.evaluate(StatementAdapter.java:36)
	at com.carrotsearch.randomizedtesting.ThreadLeakControl$StatementRunner.run(ThreadLeakControl.java:368)
	at java.lang.Thread.run(Thread.java:748)
Caused by: org.apache.solr.client.solrj.impl.HttpSolrClient$RemoteSolrException: Error from server at https://127.0.0.1:53597/solr/awhollynewcollection_0_shard1_replica_n1: ClusterState says we are the leader (https://127.0.0.1:53597/solr/awhollynewcollection_0_shard1_replica_n1), but locally we don't think so. Request came from null
	at org.apache.solr.client.solrj.impl.HttpSolrClient.executeMethod(HttpSolrClient.java:643)
	at org.apache.solr.client.solrj.impl.HttpSolrClient.request(HttpSolrClient.java:255)
	at org.apache.solr.client.solrj.impl.HttpSolrClient.request(HttpSolrClient.java:244)
	at org.apache.solr.client.solrj.impl.LBHttpSolrClient.doRequest(LBHttpSolrClient.java:483)
	at org.apache.solr.client.solrj.impl.LBHttpSolrClient.request(LBHttpSolrClient.java:413)
	at org.apache.solr.client.solrj.impl.CloudSolrClient.lambda$directUpdate$0(CloudSolrClient.java:527)
	at java.util.concurrent.FutureTask.run(FutureTask.java:266)
	at org.apache.solr.common.util.ExecutorUtil$MDCAwareThreadPoolExecutor.lambda$execute$0(ExecutorUtil.java:188)
	at java.util.concurrent.ThreadPoolExecutor.runWorker(ThreadPoolExecutor.java:1149)
	at java.util.concurrent.ThreadPoolExecutor$Worker.run(ThreadPoolExecutor.java:624)
	... 1 more


FAILED:  junit.framework.TestSuite.org.apache.solr.cloud.OverseerTaskQueueTest

Error Message:
Could not remove the following files (in the order of attempts):    C:\Users\jenkins\workspace\Lucene-Solr-7.x-Windows\solr\build\solr-core\test\J1\temp\solr.cloud.OverseerTaskQueueTest_CEB6E716F57A0337-001\zkData-007: java.nio.file.DirectoryNotEmptyException: C:\Users\jenkins\workspace\Lucene-Solr-7.x-Windows\solr\build\solr-core\test\J1\temp\solr.cloud.OverseerTaskQueueTest_CEB6E716F57A0337-001\zkData-007 

Stack Trace:
java.io.IOException: Could not remove the following files (in the order of attempts):
   C:\Users\jenkins\workspace\Lucene-Solr-7.x-Windows\solr\build\solr-core\test\J1\temp\solr.cloud.OverseerTaskQueueTest_CEB6E716F57A0337-001\zkData-007: java.nio.file.DirectoryNotEmptyException: C:\Users\jenkins\workspace\Lucene-Solr-7.x-Windows\solr\build\solr-core\test\J1\temp\solr.cloud.OverseerTaskQueueTest_CEB6E716F57A0337-001\zkData-007

	at __randomizedtesting.SeedInfo.seed([CEB6E716F57A0337]:0)
	at org.apache.lucene.util.IOUtils.rm(IOUtils.java:329)
	at org.apache.lucene.util.TestRuleTemporaryFilesCleanup.afterAlways(TestRuleTemporaryFilesCleanup.java:216)
	at com.carrotsearch.randomizedtesting.rules.TestRuleAdapter$1.afterAlways(TestRuleAdapter.java:31)
	at com.carrotsearch.randomizedtesting.rules.StatementAdapter.evaluate(StatementAdapter.java:43)
	at com.carrotsearch.randomizedtesting.rules.StatementAdapter.evaluate(StatementAdapter.java:36)
	at org.apache.lucene.util.TestRuleAssertionsRequired$1.evaluate(TestRuleAssertionsRequired.java:53)
	at org.apache.lucene.util.TestRuleMarkFailure$1.evaluate(TestRuleMarkFailure.java:47)
	at org.apache.lucene.util.TestRuleIgnoreAfterMaxFailures$1.evaluate(TestRuleIgnoreAfterMaxFailures.java:64)
	at org.apache.lucene.util.TestRuleIgnoreTestSuites$1.evaluate(TestRuleIgnoreTestSuites.java:54)
	at com.carrotsearch.randomizedtesting.rules.StatementAdapter.evaluate(StatementAdapter.java:36)
	at com.carrotsearch.randomizedtesting.ThreadLeakControl$StatementRunner.run(ThreadLeakControl.java:368)
	at java.lang.Thread.run(Thread.java:748)


FAILED:  junit.framework.TestSuite.org.apache.solr.update.processor.TestOpenNLPExtractNamedEntitiesUpdateProcessorFactory

Error Message:
Could not remove the following files (in the order of attempts):    C:\Users\jenkins\workspace\Lucene-Solr-7.x-Windows\solr\build\contrib\solr-analysis-extras\test\J1\temp\solr.update.processor.TestOpenNLPExtractNamedEntitiesUpdateProcessorFactory_44EB82350E6EB80-001\tempDir-001\collection1\conf: java.nio.file.DirectoryNotEmptyException: C:\Users\jenkins\workspace\Lucene-Solr-7.x-Windows\solr\build\contrib\solr-analysis-extras\test\J1\temp\solr.update.processor.TestOpenNLPExtractNamedEntitiesUpdateProcessorFactory_44EB82350E6EB80-001\tempDir-001\collection1\conf    C:\Users\jenkins\workspace\Lucene-Solr-7.x-Windows\solr\build\contrib\solr-analysis-extras\test\J1\temp\solr.update.processor.TestOpenNLPExtractNamedEntitiesUpdateProcessorFactory_44EB82350E6EB80-001\tempDir-001\collection1: java.nio.file.DirectoryNotEmptyException: C:\Users\jenkins\workspace\Lucene-Solr-7.x-Windows\solr\build\contrib\solr-analysis-extras\test\J1\temp\solr.update.processor.TestOpenNLPExtractNamedEntitiesUpdateProcessorFactory_44EB82350E6EB80-001\tempDir-001\collection1    C:\Users\jenkins\workspace\Lucene-Solr-7.x-Windows\solr\build\contrib\solr-analysis-extras\test\J1\temp\solr.update.processor.TestOpenNLPExtractNamedEntitiesUpdateProcessorFactory_44EB82350E6EB80-001\tempDir-001: java.nio.file.DirectoryNotEmptyException: C:\Users\jenkins\workspace\Lucene-Solr-7.x-Windows\solr\build\contrib\solr-analysis-extras\test\J1\temp\solr.update.processor.TestOpenNLPExtractNamedEntitiesUpdateProcessorFactory_44EB82350E6EB80-001\tempDir-001    C:\Users\jenkins\workspace\Lucene-Solr-7.x-Windows\solr\build\contrib\solr-analysis-extras\test\J1\temp\solr.update.processor.TestOpenNLPExtractNamedEntitiesUpdateProcessorFactory_44EB82350E6EB80-001\tempDir-001\collection1\conf\en-test-tokenizer.bin: java.nio.file.AccessDeniedException: C:\Users\jenkins\workspace\Lucene-Solr-7.x-Windows\solr\build\contrib\solr-analysis-extras\test\J1\temp\solr.update.processor.TestOpenNLPExtractNamedEntitiesUpdateProcessorFactory_44EB82350E6EB80-001\tempDir-001\collection1\conf\en-test-tokenizer.bin    C:\Users\jenkins\workspace\Lucene-Solr-7.x-Windows\solr\build\contrib\solr-analysis-extras\test\J1\temp\solr.update.processor.TestOpenNLPExtractNamedEntitiesUpdateProcessorFactory_44EB82350E6EB80-001\tempDir-001\collection1\conf\en-test-ner-person.bin: java.nio.file.AccessDeniedException: C:\Users\jenkins\workspace\Lucene-Solr-7.x-Windows\solr\build\contrib\solr-analysis-extras\test\J1\temp\solr.update.processor.TestOpenNLPExtractNamedEntitiesUpdateProcessorFactory_44EB82350E6EB80-001\tempDir-001\collection1\conf\en-test-ner-person.bin    C:\Users\jenkins\workspace\Lucene-Solr-7.x-Windows\solr\build\contrib\solr-analysis-extras\test\J1\temp\solr.update.processor.TestOpenNLPExtractNamedEntitiesUpdateProcessorFactory_44EB82350E6EB80-001\tempDir-001\collection1\conf\en-test-sent.bin: java.nio.file.AccessDeniedException: C:\Users\jenkins\workspace\Lucene-Solr-7.x-Windows\solr\build\contrib\solr-analysis-extras\test\J1\temp\solr.update.processor.TestOpenNLPExtractNamedEntitiesUpdateProcessorFactory_44EB82350E6EB80-001\tempDir-001\collection1\conf\en-test-sent.bin    C:\Users\jenkins\workspace\Lucene-Solr-7.x-Windows\solr\build\contrib\solr-analysis-extras\test\J1\temp\solr.update.processor.TestOpenNLPExtractNamedEntitiesUpdateProcessorFactory_44EB82350E6EB80-001: java.nio.file.DirectoryNotEmptyException: C:\Users\jenkins\workspace\Lucene-Solr-7.x-Windows\solr\build\contrib\solr-analysis-extras\test\J1\temp\solr.update.processor.TestOpenNLPExtractNamedEntitiesUpdateProcessorFactory_44EB82350E6EB80-001 

Stack Trace:
java.io.IOException: Could not remove the following files (in the order of attempts):
   C:\Users\jenkins\workspace\Lucene-Solr-7.x-Windows\solr\build\contrib\solr-analysis-extras\test\J1\temp\solr.update.processor.TestOpenNLPExtractNamedEntitiesUpdateProcessorFactory_44EB82350E6EB80-001\tempDir-001\collection1\conf: java.nio.file.DirectoryNotEmptyException: C:\Users\jenkins\workspace\Lucene-Solr-7.x-Windows\solr\build\contrib\solr-analysis-extras\test\J1\temp\solr.update.processor.TestOpenNLPExtractNamedEntitiesUpdateProcessorFactory_44EB82350E6EB80-001\tempDir-001\collection1\conf
   C:\Users\jenkins\workspace\Lucene-Solr-7.x-Windows\solr\build\contrib\solr-analysis-extras\test\J1\temp\solr.update.processor.TestOpenNLPExtractNamedEntitiesUpdateProcessorFactory_44EB82350E6EB80-001\tempDir-001\collection1: java.nio.file.DirectoryNotEmptyException: C:\Users\jenkins\workspace\Lucene-Solr-7.x-Windows\solr\build\contrib\solr-analysis-extras\test\J1\temp\solr.update.processor.TestOpenNLPExtractNamedEntitiesUpdateProcessorFactory_44EB82350E6EB80-001\tempDir-001\collection1
   C:\Users\jenkins\workspace\Lucene-Solr-7.x-Windows\solr\build\contrib\solr-analysis-extras\test\J1\temp\solr.update.processor.TestOpenNLPExtractNamedEntitiesUpdateProcessorFactory_44EB82350E6EB80-001\tempDir-001: java.nio.file.DirectoryNotEmptyException: C:\Users\jenkins\workspace\Lucene-Solr-7.x-Windows\solr\build\contrib\solr-analysis-extras\test\J1\temp\solr.update.processor.TestOpenNLPExtractNamedEntitiesUpdateProcessorFactory_44EB82350E6EB80-001\tempDir-001
   C:\Users\jenkins\workspace\Lucene-Solr-7.x-Windows\solr\build\contrib\solr-analysis-extras\test\J1\temp\solr.update.processor.TestOpenNLPExtractNamedEntitiesUpdateProcessorFactory_44EB82350E6EB80-001\tempDir-001\collection1\conf\en-test-tokenizer.bin: java.nio.file.AccessDeniedException: C:\Users\jenkins\workspace\Lucene-Solr-7.x-Windows\solr\build\contrib\solr-analysis-extras\test\J1\temp\solr.update.processor.TestOpenNLPExtractNamedEntitiesUpdateProcessorFactory_44EB82350E6EB80-001\tempDir-001\collection1\conf\en-test-tokenizer.bin
   C:\Users\jenkins\workspace\Lucene-Solr-7.x-Windows\solr\build\contrib\solr-analysis-extras\test\J1\temp\solr.update.processor.TestOpenNLPExtractNamedEntitiesUpdateProcessorFactory_44EB82350E6EB80-001\tempDir-001\collection1\conf\en-test-ner-person.bin: java.nio.file.AccessDeniedException: C:\Users\jenkins\workspace\Lucene-Solr-7.x-Windows\solr\build\contrib\solr-analysis-extras\test\J1\temp\solr.update.processor.TestOpenNLPExtractNamedEntitiesUpdateProcessorFactory_44EB82350E6EB80-001\tempDir-001\collection1\conf\en-test-ner-person.bin
   C:\Users\jenkins\workspace\Lucene-Solr-7.x-Windows\solr\build\contrib\solr-analysis-extras\test\J1\temp\solr.update.processor.TestOpenNLPExtractNamedEntitiesUpdateProcessorFactory_44EB82350E6EB80-001\tempDir-001\collection1\conf\en-test-sent.bin: java.nio.file.AccessDeniedException: C:\Users\jenkins\workspace\Lucene-Solr-7.x-Windows\solr\build\contrib\solr-analysis-extras\test\J1\temp\solr.update.processor.TestOpenNLPExtractNamedEntitiesUpdateProcessorFactory_44EB82350E6EB80-001\tempDir-001\collection1\conf\en-test-sent.bin
   C:\Users\jenkins\workspace\Lucene-Solr-7.x-Windows\solr\build\contrib\solr-analysis-extras\test\J1\temp\solr.update.processor.TestOpenNLPExtractNamedEntitiesUpdateProcessorFactory_44EB82350E6EB80-001: java.nio.file.DirectoryNotEmptyException: C:\Users\jenkins\workspace\Lucene-Solr-7.x-Windows\solr\build\contrib\solr-analysis-extras\test\J1\temp\solr.update.processor.TestOpenNLPExtractNamedEntitiesUpdateProcessorFactory_44EB82350E6EB80-001

	at __randomizedtesting.SeedInfo.seed([44EB82350E6EB80]:0)
	at org.apache.lucene.util.IOUtils.rm(IOUtils.java:329)
	at org.apache.lucene.util.TestRuleTemporaryFilesCleanup.afterAlways(TestRuleTemporaryFilesCleanup.java:216)
	at com.carrotsearch.randomizedtesting.rules.TestRuleAdapter$1.afterAlways(TestRuleAdapter.java:31)
	at com.carrotsearch.randomizedtesting.rules.StatementAdapter.evaluate(StatementAdapter.java:43)
	at com.carrotsearch.randomizedtesting.rules.StatementAdapter.evaluate(StatementAdapter.java:36)
	at org.apache.lucene.util.TestRuleAssertionsRequired$1.evaluate(TestRuleAssertionsRequired.java:53)
	at org.apache.lucene.util.TestRuleMarkFailure$1.evaluate(TestRuleMarkFailure.java:47)
	at org.apache.lucene.util.TestRuleIgnoreAfterMaxFailures$1.evaluate(TestRuleIgnoreAfterMaxFailures.java:64)
	at org.apache.lucene.util.TestRuleIgnoreTestSuites$1.evaluate(TestRuleIgnoreTestSuites.java:54)
	at com.carrotsearch.randomizedtesting.rules.StatementAdapter.evaluate(StatementAdapter.java:36)
	at com.carrotsearch.randomizedtesting.ThreadLeakControl$StatementRunner.run(ThreadLeakControl.java:368)
	at java.lang.Thread.run(Thread.java:748)




Build Log:
[...truncated 11771 lines...]
   [junit4] Suite: org.apache.solr.cloud.OverseerTaskQueueTest
   [junit4]   2> 101983 INFO  (SUITE-OverseerTaskQueueTest-seed#[CEB6E716F57A0337]-worker) [    ] o.a.s.SolrTestCaseJ4 SecureRandom sanity checks: test.solr.allowed.securerandom=null & java.security.egd=file:/dev/./urandom
   [junit4]   2> Creating dataDir: C:\Users\jenkins\workspace\Lucene-Solr-7.x-Windows\solr\build\solr-core\test\J1\temp\solr.cloud.OverseerTaskQueueTest_CEB6E716F57A0337-001\init-core-data-001
   [junit4]   2> 101985 INFO  (SUITE-OverseerTaskQueueTest-seed#[CEB6E716F57A0337]-worker) [    ] o.a.s.SolrTestCaseJ4 Using TrieFields (NUMERIC_POINTS_SYSPROP=false) w/NUMERIC_DOCVALUES_SYSPROP=true
   [junit4]   2> 101989 INFO  (SUITE-OverseerTaskQueueTest-seed#[CEB6E716F57A0337]-worker) [    ] o.a.s.SolrTestCaseJ4 Randomized ssl (true) and clientAuth (true) via: @org.apache.solr.util.RandomizeSSL(reason=, value=NaN, ssl=NaN, clientAuth=NaN)
   [junit4]   2> 101995 INFO  (TEST-OverseerTaskQueueTest.testLeakChildWatcher-seed#[CEB6E716F57A0337]) [    ] o.a.s.SolrTestCaseJ4 ###Starting testLeakChildWatcher
   [junit4]   2> 101996 INFO  (TEST-OverseerTaskQueueTest.testLeakChildWatcher-seed#[CEB6E716F57A0337]) [    ] o.a.s.c.ZkTestServer STARTING ZK TEST SERVER
   [junit4]   2> 101997 INFO  (Thread-156) [    ] o.a.s.c.ZkTestServer client port:0.0.0.0/0.0.0.0:0
   [junit4]   2> 101997 INFO  (Thread-156) [    ] o.a.s.c.ZkTestServer Starting server
   [junit4]   2> 101999 ERROR (Thread-156) [    ] o.a.z.s.ZooKeeperServer ZKShutdownHandler is not registered, so ZooKeeper server won't take any action on ERROR or SHUTDOWN server state changes
   [junit4]   2> 102096 INFO  (TEST-OverseerTaskQueueTest.testLeakChildWatcher-seed#[CEB6E716F57A0337]) [    ] o.a.s.c.ZkTestServer start zk server on port:60308
   [junit4]   2> 102102 INFO  (zkConnectionManagerCallback-166-thread-1) [    ] o.a.s.c.c.ConnectionManager zkClient has connected
   [junit4]   2> 102242 INFO  (TEST-OverseerTaskQueueTest.testLeakChildWatcher-seed#[CEB6E716F57A0337]) [    ] o.a.s.SolrTestCaseJ4 ###Ending testLeakChildWatcher
   [junit4]   2> 102243 ERROR (TEST-OverseerTaskQueueTest.testLeakChildWatcher-seed#[CEB6E716F57A0337]) [    ] o.a.z.s.ZooKeeperServer ZKShutdownHandler is not registered, so ZooKeeper server won't take any action on ERROR or SHUTDOWN server state changes
   [junit4]   2> 102244 INFO  (TEST-OverseerTaskQueueTest.testLeakChildWatcher-seed#[CEB6E716F57A0337]) [    ] o.a.s.c.ZkTestServer connecting to 127.0.0.1:60308 60308
   [junit4]   2> 102245 INFO  (Thread-156) [    ] o.a.s.c.ZkTestServer connecting to 127.0.0.1:60308 60308
   [junit4]   2> 102249 INFO  (TEST-OverseerTaskQueueTest.testDistributedQueue-seed#[CEB6E716F57A0337]) [    ] o.a.s.SolrTestCaseJ4 ###Starting testDistributedQueue
   [junit4]   2> 102250 INFO  (TEST-OverseerTaskQueueTest.testDistributedQueue-seed#[CEB6E716F57A0337]) [    ] o.a.s.c.ZkTestServer STARTING ZK TEST SERVER
   [junit4]   2> 102251 INFO  (Thread-157) [    ] o.a.s.c.ZkTestServer client port:0.0.0.0/0.0.0.0:0
   [junit4]   2> 102251 INFO  (Thread-157) [    ] o.a.s.c.ZkTestServer Starting server
   [junit4]   2> 102254 ERROR (Thread-157) [    ] o.a.z.s.ZooKeeperServer ZKShutdownHandler is not registered, so ZooKeeper server won't take any action on ERROR or SHUTDOWN server state changes
   [junit4]   2> 102352 INFO  (TEST-OverseerTaskQueueTest.testDistributedQueue-seed#[CEB6E716F57A0337]) [    ] o.a.s.c.ZkTestServer start zk server on port:60314
   [junit4]   2> 102357 INFO  (zkConnectionManagerCallback-169-thread-1) [    ] o.a.s.c.c.ConnectionManager zkClient has connected
   [junit4]   2> 104391 INFO  (TEST-OverseerTaskQueueTest.testDistributedQueue-seed#[CEB6E716F57A0337]) [    ] o.a.s.SolrTestCaseJ4 ###Ending testDistributedQueue
   [junit4]   2> 104393 ERROR (TEST-OverseerTaskQueueTest.testDistributedQueue-seed#[CEB6E716F57A0337]) [    ] o.a.z.s.ZooKeeperServer ZKShutdownHandler is not registered, so ZooKeeper server won't take any action on ERROR or SHUTDOWN server state changes
   [junit4]   2> 104395 INFO  (TEST-OverseerTaskQueueTest.testDistributedQueue-seed#[CEB6E716F57A0337]) [    ] o.a.s.c.ZkTestServer connecting to 127.0.0.1:60314 60314
   [junit4]   2> 104396 INFO  (Thread-157) [    ] o.a.s.c.ZkTestServer connecting to 127.0.0.1:60314 60314
   [junit4]   2> 104402 INFO  (TEST-OverseerTaskQueueTest.testContainsTaskWithRequestId-seed#[CEB6E716F57A0337]) [    ] o.a.s.SolrTestCaseJ4 ###Starting testContainsTaskWithRequestId
   [junit4]   2> 104403 INFO  (TEST-OverseerTaskQueueTest.testContainsTaskWithRequestId-seed#[CEB6E716F57A0337]) [    ] o.a.s.c.ZkTestServer STARTING ZK TEST SERVER
   [junit4]   2> 104405 INFO  (Thread-160) [    ] o.a.s.c.ZkTestServer client port:0.0.0.0/0.0.0.0:0
   [junit4]   2> 104405 INFO  (Thread-160) [    ] o.a.s.c.ZkTestServer Starting server
   [junit4]   2> 104412 ERROR (Thread-160) [    ] o.a.z.s.ZooKeeperServer ZKShutdownHandler is not registered, so ZooKeeper server won't take any action on ERROR or SHUTDOWN server state changes
   [junit4]   2> 104505 INFO  (TEST-OverseerTaskQueueTest.testContainsTaskWithRequestId-seed#[CEB6E716F57A0337]) [    ] o.a.s.c.ZkTestServer start zk server on port:60321
   [junit4]   2> 104510 INFO  (zkConnectionManagerCallback-172-thread-1) [    ] o.a.s.c.c.ConnectionManager zkClient has connected
   [junit4]   2> 104525 INFO  (TEST-OverseerTaskQueueTest.testContainsTaskWithRequestId-seed#[CEB6E716F57A0337]) [    ] o.a.s.SolrTestCaseJ4 ###Ending testContainsTaskWithRequestId
   [junit4]   2> 104530 WARN  (NIOServerCxn.Factory:0.0.0.0/0.0.0.0:0) [    ] o.a.z.s.NIOServerCnxn caught end of stream exception
   [junit4]   2> EndOfStreamException: Unable to read additional data from client sessionid 0x160ddb814050000, likely client has closed socket
   [junit4]   2> 	at org.apache.zookeeper.server.NIOServerCnxn.doIO(NIOServerCnxn.java:239)
   [junit4]   2> 	at org.apache.zookeeper.server.NIOServerCnxnFactory.run(NIOServerCnxnFactory.java:203)
   [junit4]   2> 	at java.lang.Thread.run(Thread.java:748)
   [junit4]   2> 104531 ERROR (TEST-OverseerTaskQueueTest.testContainsTaskWithRequestId-seed#[CEB6E716F57A0337]) [    ] o.a.z.s.ZooKeeperServer ZKShutdownHandler is not registered, so ZooKeeper server won't take any action on ERROR or SHUTDOWN server state changes
   [junit4]   2> 104532 INFO  (TEST-OverseerTaskQueueTest.testContainsTaskWithRequestId-seed#[CEB6E716F57A0337]) [    ] o.a.s.c.ZkTestServer connecting to 127.0.0.1:60321 60321
   [junit4]   2> 104533 INFO  (Thread-160) [    ] o.a.s.c.ZkTestServer connecting to 127.0.0.1:60321 60321
   [junit4]   2> 104536 INFO  (TEST-OverseerTaskQueueTest.testLocallyOffer-seed#[CEB6E716F57A0337]) [    ] o.a.s.SolrTestCaseJ4 ###Starting testLocallyOffer
   [junit4]   2> 104537 INFO  (TEST-OverseerTaskQueueTest.testLocallyOffer-seed#[CEB6E716F57A0337]) [    ] o.a.s.c.ZkTestServer STARTING ZK TEST SERVER
   [junit4]   2> 104538 INFO  (Thread-161) [    ] o.a.s.c.ZkTestServer client port:0.0.0.0/0.0.0.0:0
   [junit4]   2> 104538 INFO  (Thread-161) [    ] o.a.s.c.ZkTestServer Starting server
   [junit4]   2> 104541 ERROR (Thread-161) [    ] o.a.z.s.ZooKeeperServer ZKShutdownHandler is not registered, so ZooKeeper server won't take any action on ERROR or SHUTDOWN server state changes
   [junit4]   2> 104637 INFO  (TEST-OverseerTaskQueueTest.testLocallyOffer-seed#[CEB6E716F57A0337]) [    ] o.a.s.c.ZkTestServer start zk server on port:60327
   [junit4]   2> 104642 INFO  (zkConnectionManagerCallback-175-thread-1) [    ] o.a.s.c.c.ConnectionManager zkClient has connected
   [junit4]   2> 105118 INFO  (TEST-OverseerTaskQueueTest.testLocallyOffer-seed#[CEB6E716F57A0337]) [    ] o.a.s.SolrTestCaseJ4 ###Ending testLocallyOffer
   [junit4]   2> 105118 WARN  (NIOServerCxn.Factory:0.0.0.0/0.0.0.0:0) [    ] o.a.z.s.NIOServerCnxn caught end of stream exception
   [junit4]   2> EndOfStreamException: Unable to read additional data from client sessionid 0x160ddb814880000, likely client has closed socket
   [junit4]   2> 	at org.apache.zookeeper.server.NIOServerCnxn.doIO(NIOServerCnxn.java:239)
   [junit4]   2> 	at org.apache.zookeeper.server.NIOServerCnxnFactory.run(NIOServerCnxnFactory.java:203)
   [junit4]   2> 	at java.lang.Thread.run(Thread.java:748)
   [junit4]   2> 105119 ERROR (TEST-OverseerTaskQueueTest.testLocallyOffer-seed#[CEB6E716F57A0337]) [    ] o.a.z.s.ZooKeeperServer ZKShutdownHandler is not registered, so ZooKeeper server won't take any action on ERROR or SHUTDOWN server state changes
   [junit4]   2> 105120 INFO  (TEST-OverseerTaskQueueTest.testLocallyOffer-seed#[CEB6E716F57A0337]) [    ] o.a.s.c.ZkTestServer connecting to 127.0.0.1:60327 60327
   [junit4]   2> 105121 INFO  (Thread-161) [    ] o.a.s.c.ZkTestServer connecting to 127.0.0.1:60327 60327
   [junit4]   2> 105126 INFO  (TEST-OverseerTaskQueueTest.testPeekElements-seed#[CEB6E716F57A0337]) [    ] o.a.s.SolrTestCaseJ4 ###Starting testPeekElements
   [junit4]   2> 105127 INFO  (TEST-OverseerTaskQueueTest.testPeekElements-seed#[CEB6E716F57A0337]) [    ] o.a.s.c.ZkTestServer STARTING ZK TEST SERVER
   [junit4]   2> 105128 INFO  (Thread-162) [    ] o.a.s.c.ZkTestServer client port:0.0.0.0/0.0.0.0:0
   [junit4]   2> 105128 INFO  (Thread-162) [    ] o.a.s.c.ZkTestServer Starting server
   [junit4]   2> 105131 ERROR (Thread-162) [    ] o.a.z.s.ZooKeeperServer ZKShutdownHandler is not registered, so ZooKeeper server won't take any action on ERROR or SHUTDOWN server state changes
   [junit4]   2> 105228 INFO  (TEST-OverseerTaskQueueTest.testPeekElements-seed#[CEB6E716F57A0337]) [    ] o.a.s.c.ZkTestServer start zk server on port:60333
   [junit4]   2> 105236 INFO  (zkConnectionManagerCallback-178-thread-1) [    ] o.a.s.c.c.ConnectionManager zkClient has connected
   [junit4]   2> 106755 INFO  (TEST-OverseerTaskQueueTest.testPeekElements-seed#[CEB6E716F57A0337]) [    ] o.a.s.SolrTestCaseJ4 ###Ending testPeekElements
   [junit4]   2> 106757 ERROR (TEST-OverseerTaskQueueTest.testPeekElements-seed#[CEB6E716F57A0337]) [    ] o.a.z.s.ZooKeeperServer ZKShutdownHandler is not registered, so ZooKeeper server won't take any action on ERROR or SHUTDOWN server state changes
   [junit4]   2> 106757 INFO  (TEST-OverseerTaskQueueTest.testPeekElements-seed#[CEB6E716F57A0337]) [    ] o.a.s.c.ZkTestServer connecting to 127.0.0.1:60333 60333
   [junit4]   2> 106758 INFO  (Thread-162) [    ] o.a.s.c.ZkTestServer connecting to 127.0.0.1:60333 60333
   [junit4]   2> 106762 INFO  (TEST-OverseerTaskQueueTest.testDistributedQueueBlocking-seed#[CEB6E716F57A0337]) [    ] o.a.s.SolrTestCaseJ4 ###Starting testDistributedQueueBlocking
   [junit4]   2> 106764 INFO  (TEST-OverseerTaskQueueTest.testDistributedQueueBlocking-seed#[CEB6E716F57A0337]) [    ] o.a.s.c.ZkTestServer STARTING ZK TEST SERVER
   [junit4]   2> 106764 INFO  (Thread-163) [    ] o.a.s.c.ZkTestServer client port:0.0.0.0/0.0.0.0:0
   [junit4]   2> 106764 INFO  (Thread-163) [    ] o.a.s.c.ZkTestServer Starting server
   [junit4]   2> 106767 ERROR (Thread-163) [    ] o.a.z.s.ZooKeeperServer ZKShutdownHandler is not registered, so ZooKeeper server won't take any action on ERROR or SHUTDOWN server state changes
   [junit4]   2> 106865 INFO  (TEST-OverseerTaskQueueTest.testDistributedQueueBlocking-seed#[CEB6E716F57A0337]) [    ] o.a.s.c.ZkTestServer start zk server on port:60339
   [junit4]   2> 106870 INFO  (zkConnectionManagerCallback-181-thread-1) [    ] o.a.s.c.c.ConnectionManager zkClient has connected
   [junit4]   2> 108083 WARN  (zkConnectionManagerCallback-181-thread-1) [    ] o.a.s.c.c.ConnectionManager Watcher org.apache.solr.common.cloud.ConnectionManager@4bb2f6 name: ZooKeeperConnection Watcher:127.0.0.1:60339/solr got event WatchedEvent state:Disconnected type:None path:null path: null type: None
   [junit4]   2> 108083 WARN  (zkConnectionManagerCallback-181-thread-1) [    ] o.a.s.c.c.ConnectionManager zkClient has disconnected
   [junit4]   2> 109253 WARN  (TEST-OverseerTaskQueueTest.testDistributedQueueBlocking-seed#[CEB6E716F57A0337]-SendThread(127.0.0.1:60339)) [    ] o.a.z.ClientCnxn Unable to reconnect to ZooKeeper service, session 0x160ddb81d3a0000 has expired
   [junit4]   2> 109253 WARN  (zkConnectionManagerCallback-181-thread-1) [    ] o.a.s.c.c.ConnectionManager Watcher org.apache.solr.common.cloud.ConnectionManager@4bb2f6 name: ZooKeeperConnection Watcher:127.0.0.1:60339/solr got event WatchedEvent state:Expired type:None path:null path: null type: None
   [junit4]   2> 109258 WARN  (zkConnectionManagerCallback-181-thread-1) [    ] o.a.s.c.c.ConnectionManager Our previous ZooKeeper session was expired. Attempting to reconnect to recover relationship with ZooKeeper...
   [junit4]   2> 109260 WARN  (zkConnectionManagerCallback-181-thread-1) [    ] o.a.s.c.c.DefaultConnectionStrategy Connection expired - starting a new one...
   [junit4]   2> 109266 INFO  (zkConnectionManagerCallback-181-thread-1-EventThread) [    ] o.a.s.c.c.ConnectionManager zkClient has connected
   [junit4]   2> 109266 INFO  (zkConnectionManagerCallback-181-thread-1) [    ] o.a.s.c.c.ConnectionManager Connection with ZooKeeper reestablished.
   [junit4]   2> 109266 INFO  (zkConnectionManagerCallback-181-thread-1) [    ] o.a.s.c.c.DefaultConnectionStrategy Reconnected to ZooKeeper
   [junit4]   2> 109266 INFO  (zkConnectionManagerCallback-181-thread-1) [    ] o.a.s.c.c.ConnectionManager zkClient Connected:true
   [junit4]   2> 110422 INFO  (TEST-OverseerTaskQueueTest.testDistributedQueueBlocking-seed#[CEB6E716F57A0337]) [    ] o.a.s.SolrTestCaseJ4 ###Ending testDistributedQueueBlocking
   [junit4]   2> 110423 ERROR (TEST-OverseerTaskQueueTest.testDistributedQueueBlocking-seed#[CEB6E716F57A0337]) [    ] o.a.z.s.ZooKeeperServer ZKShutdownHandler is not registered, so ZooKeeper server won't take any action on ERROR or SHUTDOWN server state changes
   [junit4]   2> 110424 INFO  (TEST-OverseerTaskQueueTest.testDistributedQueueBlocking-seed#[CEB6E716F57A0337]) [    ] o.a.s.c.ZkTestServer connecting to 127.0.0.1:60339 60339
   [junit4]   2> 110426 INFO  (Thread-163) [    ] o.a.s.c.ZkTestServer connecting to 127.0.0.1:60339 60339
   [junit4]   2> 110427 WARN  (Thread-163) [    ] o.a.s.c.ZkTestServer Watch limit violations: 
   [junit4]   2> Maximum concurrent children watches above limit:
   [junit4]   2> 
   [junit4]   2> 	2	/solr/distqueue/test
   [junit4]   2> 
   [junit4]   2> 110431 INFO  (TEST-OverseerTaskQueueTest.testDistributedQueueCache-seed#[CEB6E716F57A0337]) [    ] o.a.s.SolrTestCaseJ4 ###Starting testDistributedQueueCache
   [junit4]   2> 110433 INFO  (TEST-OverseerTaskQueueTest.testDistributedQueueCache-seed#[CEB6E716F57A0337]) [    ] o.a.s.c.ZkTestServer STARTING ZK TEST SERVER
   [junit4]   2> 110434 INFO  (Thread-164) [    ] o.a.s.c.ZkTestServer client port:0.0.0.0/0.0.0.0:0
   [junit4]   2> 110434 INFO  (Thread-164) [    ] o.a.s.c.ZkTestServer Starting server
   [junit4]   2> 110438 ERROR (Thread-164) [    ] o.a.z.s.ZooKeeperServer ZKShutdownHandler is not registered, so ZooKeeper server won't take any action on ERROR or SHUTDOWN server state changes
   [junit4]   2> 110534 INFO  (TEST-OverseerTaskQueueTest.testDistributedQueueCache-seed#[CEB6E716F57A0337]) [    ] o.a.s.c.ZkTestServer start zk server on port:60360
   [junit4]   2> 110540 INFO  (zkConnectionManagerCallback-184-thread-1) [    ] o.a.s.c.c.ConnectionManager zkClient has connected
   [junit4]   2> 110584 INFO  (TEST-OverseerTaskQueueTest.testDistributedQueueCache-seed#[CEB6E716F57A0337]) [    ] o.a.s.SolrTestCaseJ4 ###Ending testDistributedQueueCache
   [junit4]   2> 110585 ERROR (TEST-OverseerTaskQueueTest.testDistributedQueueCache-seed#[CEB6E716F57A0337]) [    ] o.a.z.s.ZooKeeperServer ZKShutdownHandler is not registered, so ZooKeeper server won't take any action on ERROR or SHUTDOWN server state changes
   [junit4]   2> 110586 INFO  (TEST-OverseerTaskQueueTest.testDistributedQueueCache-seed#[CEB6E716F57A0337]) [    ] o.a.s.c.ZkTestServer connecting to 127.0.0.1:60360 60360
   [junit4]   2> 110587 INFO  (Thread-164) [    ] o.a.s.c.ZkTestServer connecting to 127.0.0.1:60360 60360
   [junit4]   2> 110589 INFO  (SUITE-OverseerTaskQueueTest-seed#[CEB6E716F57A0337]-worker) [    ] o.a.s.SolrTestCaseJ4 ------------------------------------------------------- Done waiting for tracked resources to be released
   [junit4]   2> Jan 10, 2018 1:38:42 AM com.carrotsearch.randomizedtesting.ThreadLeakControl checkThreadLeaks
   [junit4]   2> WARNING: Will linger awaiting termination of 3 leaked thread(s).
   [junit4]   2> NOTE: test params are: codec=DummyCompressingStoredFields(storedFieldsFormat=CompressingStoredFieldsFormat(compressionMode=DUMMY, chunkSize=10, maxDocsPerChunk=340, blockSize=5), termVectorsFormat=CompressingTermVectorsFormat(compressionMode=DUMMY, chunkSize=10, blockSize=5)), sim=RandomSimilarity(queryNorm=false): {}, locale=hu, timezone=America/Argentina/Tucuman
   [junit4]   2> NOTE: Windows 10 10.0 x86/Oracle Corporation 1.8.0_144 (32-bit)/cpus=3,threads=1,free=11234944,total=60055552
   [junit4]   2> NOTE: All tests run in this JVM: [FacetPivotSmallTest, TestRemoteStreaming, TestPushWriter, RecoveryAfterSoftCommitTest, CollectionStateFormat2Test, TestScoreJoinQPScore, SuggestComponentTest, TestSolrFieldCacheBean, TestManagedSchemaThreadSafety, AddBlockUpdateTest, SynonymTokenizerTest, ManagedSchemaRoundRobinCloudTest, TestClusterStateMutator, OverseerTaskQueueTest]
   [junit4]   2> NOTE: reproduce with: ant test  -Dtestcase=OverseerTaskQueueTest -Dtests.seed=CEB6E716F57A0337 -Dtests.slow=true -Dtests.locale=hu -Dtests.timezone=America/Argentina/Tucuman -Dtests.asserts=true -Dtests.file.encoding=Cp1252
   [junit4] ERROR   0.00s J1 | OverseerTaskQueueTest (suite) <<<
   [junit4]    > Throwable #1: java.io.IOException: Could not remove the following files (in the order of attempts):
   [junit4]    >    C:\Users\jenkins\workspace\Lucene-Solr-7.x-Windows\solr\build\solr-core\test\J1\temp\solr.cloud.OverseerTaskQueueTest_CEB6E716F57A0337-001\zkData-007: java.nio.file.DirectoryNotEmptyException: C:\Users\jenkins\workspace\Lucene-Solr-7.x-Windows\solr\build\solr-core\test\J1\temp\solr.cloud.OverseerTaskQueueTest_CEB6E716F57A0337-001\zkData-007
   [junit4]    > 	at __randomizedtesting.SeedInfo.seed([CEB6E716F57A0337]:0)
   [junit4]    > 	at org.apache.lucene.util.IOUtils.rm(IOUtils.java:329)
   [junit4]    > 	at java.lang.Thread.run(Thread.java:748)
   [junit4] Completed [27/766 (1!)] on J1 in 8.91s, 7 tests, 1 error <<< FAILURES!

[...truncated 1165 lines...]
   [junit4] Suite: org.apache.solr.cloud.CollectionsAPIDistributedZkTest
   [junit4]   2> 1792519 INFO  (SUITE-CollectionsAPIDistributedZkTest-seed#[CEB6E716F57A0337]-worker) [    ] o.a.s.SolrTestCaseJ4 SecureRandom sanity checks: test.solr.allowed.securerandom=null & java.security.egd=file:/dev/./urandom
   [junit4]   2> Creating dataDir: C:\Users\jenkins\workspace\Lucene-Solr-7.x-Windows\solr\build\solr-core\test\J1\temp\solr.cloud.CollectionsAPIDistributedZkTest_CEB6E716F57A0337-001\init-core-data-001
   [junit4]   2> 1792521 WARN  (SUITE-CollectionsAPIDistributedZkTest-seed#[CEB6E716F57A0337]-worker) [    ] o.a.s.SolrTestCaseJ4 startTrackingSearchers: numOpens=28 numCloses=28
   [junit4]   2> 1792522 INFO  (SUITE-CollectionsAPIDistributedZkTest-seed#[CEB6E716F57A0337]-worker) [    ] o.a.s.SolrTestCaseJ4 Using PointFields (NUMERIC_POINTS_SYSPROP=true) w/NUMERIC_DOCVALUES_SYSPROP=false
   [junit4]   2> 1792529 INFO  (SUITE-CollectionsAPIDistributedZkTest-seed#[CEB6E716F57A0337]-worker) [    ] o.a.s.SolrTestCaseJ4 Randomized ssl (true) and clientAuth (false) via: @org.apache.solr.util.RandomizeSSL(reason=, value=NaN, ssl=NaN, clientAuth=NaN)
   [junit4]   2> 1792533 INFO  (SUITE-CollectionsAPIDistributedZkTest-seed#[CEB6E716F57A0337]-worker) [    ] o.a.s.c.MiniSolrCloudCluster Starting cluster of 4 servers in C:\Users\jenkins\workspace\Lucene-Solr-7.x-Windows\solr\build\solr-core\test\J1\temp\solr.cloud.CollectionsAPIDistributedZkTest_CEB6E716F57A0337-001\tempDir-001
   [junit4]   2> 1792534 INFO  (SUITE-CollectionsAPIDistributedZkTest-seed#[CEB6E716F57A0337]-worker) [    ] o.a.s.c.ZkTestServer STARTING ZK TEST SERVER
   [junit4]   2> 1792534 INFO  (Thread-4105) [    ] o.a.s.c.ZkTestServer client port:0.0.0.0/0.0.0.0:0
   [junit4]   2> 1792534 INFO  (Thread-4105) [    ] o.a.s.c.ZkTestServer Starting server
   [junit4]   2> 1792538 ERROR (Thread-4105) [    ] o.a.z.s.ZooKeeperServer ZKShutdownHandler is not registered, so ZooKeeper server won't take any action on ERROR or SHUTDOWN server state changes
   [junit4]   2> 1792634 INFO  (SUITE-CollectionsAPIDistributedZkTest-seed#[CEB6E716F57A0337]-worker) [    ] o.a.s.c.ZkTestServer start zk server on port:53593
   [junit4]   2> 1792641 INFO  (zkConnectionManagerCallback-3979-thread-1) [    ] o.a.s.c.c.ConnectionManager zkClient has connected
   [junit4]   2> 1792656 INFO  (jetty-launcher-3976-thread-2) [    ] o.e.j.s.Server jetty-9.3.20.v20170531
   [junit4]   2> 1792657 INFO  (jetty-launcher-3976-thread-3) [    ] o.e.j.s.Server jetty-9.3.20.v20170531
   [junit4]   2> 1792657 INFO  (jetty-launcher-3976-thread-2) [    ] o.e.j.s.h.ContextHandler Started o.e.j.s.ServletContextHandler@31fbc4{/solr,null,AVAILABLE}
   [junit4]   2> 1792658 INFO  (jetty-launcher-3976-thread-3) [    ] o.e.j.s.h.ContextHandler Started o.e.j.s.ServletContextHandler@13f7ff1{/solr,null,AVAILABLE}
   [junit4]   2> 1792658 INFO  (jetty-launcher-3976-thread-2) [    ] o.e.j.s.AbstractConnector Started ServerConnector@1b73539{SSL,[ssl, http/1.1]}{127.0.0.1:53597}
   [junit4]   2> 1792659 INFO  (jetty-launcher-3976-thread-2) [    ] o.e.j.s.Server Started @1800463ms
   [junit4]   2> 1792659 INFO  (jetty-launcher-3976-thread-2) [    ] o.a.s.c.s.e.JettySolrRunner Jetty properties: {hostContext=/solr, hostPort=53597}
   [junit4]   2> 1792659 INFO  (jetty-launcher-3976-thread-3) [    ] o.e.j.s.AbstractConnector Started ServerConnector@6cae6e{SSL,[ssl, http/1.1]}{127.0.0.1:53600}
   [junit4]   2> 1792659 INFO  (jetty-launcher-3976-thread-3) [    ] o.e.j.s.Server Started @1800464ms
   [junit4]   2> 1792659 ERROR (jetty-launcher-3976-thread-2) [    ] o.a.s.u.StartupLoggingUtils Missing Java Option solr.log.dir. Logging may be missing or incomplete.
   [junit4]   2> 1792660 INFO  (jetty-launcher-3976-thread-2) [    ] o.a.s.s.SolrDispatchFilter  ___      _       Welcome to Apache Solr™ version 7.3.0
   [junit4]   2> 1792660 INFO  (jetty-launcher-3976-thread-2) [    ] o.a.s.s.SolrDispatchFilter / __| ___| |_ _   Starting in cloud mode on port null
   [junit4]   2> 1792660 INFO  (jetty-launcher-3976-thread-4) [    ] o.e.j.s.Server jetty-9.3.20.v20170531
   [junit4]   2> 1792659 INFO  (jetty-launcher-3976-thread-3) [    ] o.a.s.c.s.e.JettySolrRunner Jetty properties: {hostContext=/solr, hostPort=53600}
   [junit4]   2> 1792660 INFO  (jetty-launcher-3976-thread-2) [    ] o.a.s.s.SolrDispatchFilter \__ \/ _ \ | '_|  Install dir: null
   [junit4]   2> 1792660 INFO  (jetty-launcher-3976-thread-2) [    ] o.a.s.s.SolrDispatchFilter |___/\___/_|_|    Start time: 2018-01-10T02:06:44.928Z
   [junit4]   2> 1792660 ERROR (jetty-launcher-3976-thread-3) [    ] o.a.s.u.StartupLoggingUtils Missing Java Option solr.log.dir. Logging may be missing or incomplete.
   [junit4]   2> 1792660 INFO  (jetty-launcher-3976-thread-4) [    ] o.e.j.s.h.ContextHandler Started o.e.j.s.ServletContextHandler@331d64{/solr,null,AVAILABLE}
   [junit4]   2> 1792661 INFO  (jetty-launcher-3976-thread-3) [    ] o.a.s.s.SolrDispatchFilter  ___      _       Welcome to Apache Solr™ version 7.3.0
   [junit4]   2> 1792662 INFO  (jetty-launcher-3976-thread-4) [    ] o.e.j.s.AbstractConnector Started ServerConnector@51bf58{SSL,[ssl, http/1.1]}{127.0.0.1:53603}
   [junit4]   2> 1792662 INFO  (jetty-launcher-3976-thread-3) [    ] o.a.s.s.SolrDispatchFilter / __| ___| |_ _   Starting in cloud mode on port null
   [junit4]   2> 1792662 INFO  (jetty-launcher-3976-thread-4) [    ] o.e.j.s.Server Started @1800466ms
   [junit4]   2> 1792662 INFO  (jetty-launcher-3976-thread-3) [    ] o.a.s.s.SolrDispatchFilter \__ \/ _ \ | '_|  Install dir: null
   [junit4]   2> 1792662 INFO  (jetty-launcher-3976-thread-4) [    ] o.a.s.c.s.e.JettySolrRunner Jetty properties: {hostContext=/solr, hostPort=53603}
   [junit4]   2> 1792662 INFO  (jetty-launcher-3976-thread-3) [    ] o.a.s.s.SolrDispatchFilter |___/\___/_|_|    Start time: 2018-01-10T02:06:44.930Z
   [junit4]   2> 1792662 ERROR (jetty-launcher-3976-thread-4) [    ] o.a.s.u.StartupLoggingUtils Missing Java Option solr.log.dir. Logging may be missing or incomplete.
   [junit4]   2> 1792663 INFO  (jetty-launcher-3976-thread-4) [    ] o.a.s.s.SolrDispatchFilter  ___      _       Welcome to Apache Solr™ version 7.3.0
   [junit4]   2> 1792663 INFO  (jetty-launcher-3976-thread-4) [    ] o.a.s.s.SolrDispatchFilter / __| ___| |_ _   Starting in cloud mode on port null
   [junit4]   2> 1792663 INFO  (jetty-launcher-3976-thread-4) [    ] o.a.s.s.SolrDispatchFilter \__ \/ _ \ | '_|  Install dir: null
   [junit4]   2> 1792663 INFO  (jetty-launcher-3976-thread-4) [    ] o.a.s.s.SolrDispatchFilter |___/\___/_|_|    Start time: 2018-01-10T02:06:44.931Z
   [junit4]   2> 1792670 INFO  (jetty-launcher-3976-thread-1) [    ] o.e.j.s.Server jetty-9.3.20.v20170531
   [junit4]   2> 1792671 INFO  (jetty-launcher-3976-thread-1) [    ] o.e.j.s.h.ContextHandler Started o.e.j.s.ServletContextHandler@a422ab{/solr,null,AVAILABLE}
   [junit4]   2> 1792681 INFO  (zkConnectionManagerCallback-3985-thread-1) [    ] o.a.s.c.c.ConnectionManager zkClient has connected
   [junit4]   2> 1792683 INFO  (jetty-launcher-3976-thread-4) [    ] o.a.s.s.SolrDispatchFilter solr.xml found in ZooKeeper. Loading...
   [junit4]   2> 1792684 INFO  (jetty-launcher-3976-thread-1) [    ] o.e.j.s.AbstractConnector Started ServerConnector@2970ff{SSL,[ssl, http/1.1]}{127.0.0.1:53615}
   [junit4]   2> 1792684 INFO  (jetty-launcher-3976-thread-1) [    ] o.e.j.s.Server Started @1800489ms
   [junit4]   2> 1792684 INFO  (jetty-launcher-3976-thread-1) [    ] o.a.s.c.s.e.JettySolrRunner Jetty properties: {hostContext=/solr, hostPort=53615}
   [junit4]   2> 1792685 ERROR (jetty-launcher-3976-thread-1) [    ] o.a.s.u.StartupLoggingUtils Missing Java Option solr.log.dir. Logging may be missing or incomplete.
   [junit4]   2> 1792685 INFO  (jetty-launcher-3976-thread-1) [    ] o.a.s.s.SolrDispatchFilter  ___      _       Welcome to Apache Solr™ version 7.3.0
   [junit4]   2> 1792685 INFO  (jetty-launcher-3976-thread-1) [    ] o.a.s.s.SolrDispatchFilter / __| ___| |_ _   Starting in cloud mode on port null
   [junit4]   2> 1792685 INFO  (jetty-launcher-3976-thread-1) [    ] o.a.s.s.SolrDispatchFilter \__ \/ _ \ | '_|  Install dir: null
   [junit4]   2> 1792685 INFO  (jetty-launcher-3976-thread-1) [    ] o.a.s.s.SolrDispatchFilter |___/\___/_|_|    Start time: 2018-01-10T02:06:44.953Z
   [junit4]   2> 1792688 INFO  (zkConnectionManagerCallback-3981-thread-1) [    ] o.a.s.c.c.ConnectionManager zkClient has connected
   [junit4]   2> 1792688 INFO  (zkConnectionManagerCallback-3983-thread-1) [    ] o.a.s.c.c.ConnectionManager zkClient has connected
   [junit4]   2> 1792689 INFO  (jetty-launcher-3976-thread-2) [    ] o.a.s.s.SolrDispatchFilter solr.xml found in ZooKeeper. Loading...
   [junit4]   2> 1792689 INFO  (jetty-launcher-3976-thread-3) [    ] o.a.s.s.SolrDispatchFilter solr.xml found in ZooKeeper. Loading...
   [junit4]   2> 1792696 INFO  (jetty-launcher-3976-thread-4) [    ] o.a.s.c.SolrXmlConfig Configuration parameter autoReplicaFailoverWorkLoopDelay is ignored
   [junit4]   2> 1792696 INFO  (jetty-launcher-3976-thread-4) [    ] o.a.s.c.SolrXmlConfig Configuration parameter autoReplicaFailoverBadNodeExpiration is ignored
   [junit4]   2> 1792696 INFO  (jetty-launcher-3976-thread-2) [    ] o.a.s.c.SolrXmlConfig Configuration parameter autoReplicaFailoverWorkLoopDelay is ignored
   [junit4]   2> 1792696 INFO  (jetty-launcher-3976-thread-2) [    ] o.a.s.c.SolrXmlConfig Configuration parameter autoReplicaFailoverBadNodeExpiration is ignored
   [junit4]   2> 1792696 INFO  (jetty-launcher-3976-thread-3) [    ] o.a.s.c.SolrXmlConfig Configuration parameter autoReplicaFailoverWorkLoopDelay is ignored
   [junit4]   2> 1792697 INFO  (jetty-launcher-3976-thread-3) [    ] o.a.s.c.SolrXmlConfig Configuration parameter autoReplicaFailoverBadNodeExpiration is ignored
   [junit4]   2> 1792699 WARN  (NIOServerCxn.Factory:0.0.0.0/0.0.0.0:0) [    ] o.a.z.s.NIOServerCnxn caught end of stream exception
   [junit4]   2> EndOfStreamException: Unable to read additional data from client sessionid 0x160ddd1d6450001, likely client has closed socket
   [junit4]   2> 	at org.apache.zookeeper.server.NIOServerCnxn.doIO(NIOServerCnxn.java:239)
   [junit4]   2> 	at org.apache.zookeeper.server.NIOServerCnxnFactory.run(NIOServerCnxnFactory.java:203)
   [junit4]   2> 	at java.lang.Thread.run(Thread.java:748)
   [junit4]   2> 1792699 WARN  (NIOServerCxn.Factory:0.0.0.0/0.0.0.0:0) [    ] o.a.z.s.NIOServerCnxn caught end of stream exception
   [junit4]   2> EndOfStreamException: Unable to read additional data from client sessionid 0x160ddd1d6450003, likely client has closed socket
   [junit4]   2> 	at org.apache.zookeeper.server.NIOServerCnxn.doIO(NIOServerCnxn.java:239)
   [junit4]   2> 	at org.apache.zookeeper.server.NIOServerCnxnFactory.run(NIOServerCnxnFactory.java:203)
   [junit4]   2> 	at java.lang.Thread.run(Thread.java:748)
   [junit4]   2> 1792700 WARN  (NIOServerCxn.Factory:0.0.0.0/0.0.0.0:0) [    ] o.a.z.s.NIOServerCnxn caught end of stream exception
   [junit4]   2> EndOfStreamException: Unable to read additional data from client sessionid 0x160ddd1d6450002, likely client has closed socket
   [junit4]   2> 	at org.apache.zookeeper.server.NIOServerCnxn.doIO(NIOServerCnxn.java:239)
   [junit4]   2> 	at org.apache.zookeeper.server.NIOServerCnxnFactory.run(NIOServerCnxnFactory.java:203)
   [junit4]   2> 	at java.lang.Thread.run(Thread.java:748)
   [junit4]   2> 1792704 INFO  (zkConnectionManagerCallback-3987-thread-1) [    ] o.a.s.c.c.ConnectionManager zkClient has connected
   [junit4]   2> 1792705 INFO  (jetty-launcher-3976-thread-3) [    ] o.a.s.c.ZkContainer Zookeeper client=127.0.0.1:53593/solr
   [junit4]   2> 1792706 INFO  (jetty-launcher-3976-thread-2) [    ] o.a.s.c.ZkContainer Zookeeper client=127.0.0.1:53593/solr
   [junit4]   2> 1792706 INFO  (jetty-launcher-3976-thread-4) [    ] o.a.s.c.ZkContainer Zookeeper client=127.0.0.1:53593/solr
   [junit4]   2> 1792707 INFO  (jetty-launcher-3976-thread-1) [    ] o.a.s.s.SolrDispatchFilter solr.xml found in ZooKeeper. Loading...
   [junit4]   2> 1792709 INFO  (zkConnectionManagerCallback-3994-thread-1) [    ] o.a.s.c.c.ConnectionManager zkClient has connected
   [junit4]   2> 1792710 INFO  (zkConnectionManagerCallback-3997-thread-1) [    ] o.a.s.c.c.ConnectionManager zkClient has connected
   [junit4]   2> 1792711 INFO  (zkConnectionManagerCallback-3999-thread-1) [    ] o.a.s.c.c.ConnectionManager zkClient has connected
   [junit4]   2> 1792712 WARN  (NIOServerCxn.Factory:0.0.0.0/0.0.0.0:0) [    ] o.a.z.s.NIOServerCnxn caught end of stream exception
   [junit4]   2> EndOfStreamException: Unable to read additional data from client sessionid 0x160ddd1d6450006, likely client has closed socket
   [junit4]   2> 	at org.apache.zookeeper.server.NIOServerCnxn.doIO(NIOServerCnxn.java:239)
   [junit4]   2> 	at org.apache.zookeeper.server.NIOServerCnxnFactory.run(NIOServerCnxnFactory.java:203)
   [junit4]   2> 	at java.lang.Thread.run(Thread.java:748)
   [junit4]   2> 1792713 INFO  (jetty-launcher-3976-thread-1) [    ] o.a.s.c.SolrXmlConfig Configuration parameter autoReplicaFailoverWorkLoopDelay is ignored
   [junit4]   2> 1792713 INFO  (jetty-launcher-3976-thread-1) [    ] o.a.s.c.SolrXmlConfig Configuration parameter autoReplicaFailoverBadNodeExpiration is ignored
   [junit4]   2> 1792717 INFO  (zkConnectionManagerCallback-4001-thread-1-processing-n:127.0.0.1:53597_solr) [n:127.0.0.1:53597_solr    ] o.a.s.c.c.ConnectionManager zkClient has connected
   [junit4]   2> 1792717 INFO  (zkConnectionManagerCallback-4003-thread-1-processing-n:127.0.0.1:53600_solr) [n:127.0.0.1:53600_solr    ] o.a.s.c.c.ConnectionManager zkClient has connected
   [junit4]   2> 1792718 INFO  (jetty-launcher-3976-thread-1) [    ] o.a.s.c.ZkContainer Zookeeper client=127.0.0.1:53593/solr
   [junit4]   2> 1792720 INFO  (zkConnectionManagerCallback-4005-thread-1-processing-n:127.0.0.1:53603_solr) [n:127.0.0.1:53603_solr    ] o.a.s.c.c.ConnectionManager zkClient has connected
   [junit4]   2> 1792722 INFO  (zkConnectionManagerCallback-4009-thread-1) [    ] o.a.s.c.c.ConnectionManager zkClient has connected
   [junit4]   2> 1792727 INFO  (zkConnectionManagerCallback-4011-thread-1-processing-n:127.0.0.1:53615_solr) [n:127.0.0.1:53615_solr    ] o.a.s.c.c.ConnectionManager zkClient has connected
   [junit4]   2> 1792886 INFO  (jetty-launcher-3976-thread-2) [n:127.0.0.1:53597_solr    ] o.a.s.c.Overseer Overseer (id=null) closing
   [junit4]   2> 1792886 INFO  (jetty-launcher-3976-thread-4) [n:127.0.0.1:53603_solr    ] o.a.s.c.Overseer Overseer (id=null) closing
   [junit4]   2> 1792889 INFO  (jetty-launcher-3976-thread-1) [n:127.0.0.1:53615_solr    ] o.a.s.c.Overseer Overseer (id=null) closing
   [junit4]   2> 1792889 INFO  (jetty-launcher-3976-thread-2) [n:127.0.0.1:53597_solr    ] o.a.s.c.OverseerElectionContext I am going to be the leader 127.0.0.1:53597_solr
   [junit4]   2> 1792890 INFO  (jetty-launcher-3976-thread-4) [n:127.0.0.1:53603_solr    ] o.a.s.c.ZkController Register node as live in ZooKeeper:/live_nodes/127.0.0.1:53603_solr
   [junit4]   2> 1792890 INFO  (jetty-launcher-3976-thread-1) [n:127.0.0.1:53615_solr    ] o.a.s.c.ZkController Register node as live in ZooKeeper:/live_nodes/127.0.0.1:53615_solr
   [junit4]   2> 1792892 INFO  (jetty-launcher-3976-thread-2) [n:127.0.0.1:53597_solr    ] o.a.s.c.Overseer Overseer (id=99323085114900488-127.0.0.1:53597_solr-n_0000000000) starting
   [junit4]   2> 1792912 INFO  (jetty-launcher-3976-thread-2) [n:127.0.0.1:53597_solr    ] o.a.s.c.ZkController Register node as live in ZooKeeper:/live_nodes/127.0.0.1:53597_solr
   [junit4]   2> 1793006 INFO  (jetty-launcher-3976-thread-3) [n:127.0.0.1:53600_solr    ] o.a.s.c.c.ZkStateReader Updated live nodes from ZooKeeper... (0) -> (3)
   [junit4]   2> 1793007 INFO  (jetty-launcher-3976-thread-3) [n:127.0.0.1:53600_solr    ] o.a.s.c.Overseer Overseer (id=null) closing
   [junit4]   2> 1793017 INFO  (jetty-launcher-3976-thread-3) [n:127.0.0.1:53600_solr    ] o.a.s.c.ZkController Register node as live in ZooKeeper:/live_nodes/127.0.0.1:53600_solr
   [junit4]   2> 1793032 INFO  (zkCallback-4010-thread-1-processing-n:127.0.0.1:53615_solr) [n:127.0.0.1:53615_solr    ] o.a.s.c.c.ZkStateReader Updated live nodes from ZooKeeper... (0) -> (4)
   [junit4]   2> 1793037 INFO  (zkCallback-4000-thread-1-processing-n:127.0.0.1:53597_solr) [n:127.0.0.1:53597_solr    ] o.a.s.c.c.ZkStateReader Updated live nodes from ZooKeeper... (0) -> (4)
   [junit4]   2> 1793047 INFO  (zkCallback-4004-thread-1-processing-n:127.0.0.1:53603_solr) [n:127.0.0.1:53603_solr    ] o.a.s.c.c.ZkStateReader Updated live nodes from ZooKeeper... (0) -> (4)
   [junit4]   2> 1793049 INFO  (zkCallback-4002-thread-1-processing-n:127.0.0.1:53600_solr) [n:127.0.0.1:53600_solr    ] o.a.s.c.c.ZkStateReader Updated live nodes from ZooKeeper... (3) -> (4)
   [junit4]   2> 1793077 INFO  (jetty-launcher-3976-thread-4) [n:127.0.0.1:53603_solr    ] o.a.s.m.r.SolrJmxReporter JMX monitoring for 'solr.node' (registry 'solr.node') enabled at server: com.sun.jmx.mbeanserver.JmxMBeanServer@3dbd2a
   [junit4]   2> 1793081 INFO  (jetty-launcher-3976-thread-2) [n:127.0.0.1:53597_solr    ] o.a.s.m.r.SolrJmxReporter JMX monitoring for 'solr.node' (registry 'solr.node') enabled at server: com.sun.jmx.mbeanserver.JmxMBeanServer@3dbd2a
   [junit4]   2> 1793088 INFO  (jetty-launcher-3976-thread-4) [n:127.0.0.1:53603_solr    ] o.a.s.m.r.SolrJmxReporter JMX monitoring for 'solr.jvm' (registry 'solr.jvm') enabled at server: com.sun.jmx.mbeanserver.JmxMBeanServer@3dbd2a
   [junit4]   2> 1793088 INFO  (jetty-launcher-3976-thread-4) [n:127.0.0.1:53603_solr    ] o.a.s.m.r.SolrJmxReporter JMX monitoring for 'solr.jetty' (registry 'solr.jetty') enabled at server: com.sun.jmx.mbeanserver.JmxMBeanServer@3dbd2a
   [junit4]   2> 1793091 INFO  (jetty-launcher-3976-thread-4) [n:127.0.0.1:53603_solr    ] o.a.s.c.CorePropertiesLocator Found 0 core definitions underneath C:\Users\jenkins\workspace\Lucene-Solr-7.x-Windows\solr\build\solr-core\test\J1\temp\solr.cloud.CollectionsAPIDistributedZkTest_CEB6E716F57A0337-001\tempDir-001\node4
   [junit4]   2> 1793112 INFO  (jetty-launcher-3976-thread-1) [n:127.0.0.1:53615_solr    ] o.a.s.m.r.SolrJmxReporter JMX monitoring for 'solr.node' (registry 'solr.node') enabled at server: com.sun.jmx.mbeanserver.JmxMBeanServer@3dbd2a
   [junit4]   2> 1793131 INFO  (jetty-launcher-3976-thread-2) [n:127.0.0.1:53597_solr    ] o.a.s.m.r.SolrJmxReporter JMX monitoring for 'solr.jvm' (registry 'solr.jvm') enabled at server: com.sun.jmx.mbeanserver.JmxMBeanServer@3dbd2a
   [junit4]   2> 1793131 INFO  (jetty-launcher-3976-thread-2) [n:127.0.0.1:53597_solr    ] o.a.s.m.r.SolrJmxReporter JMX monitoring for 'solr.jetty' (registry 'solr.jetty') enabled at server: com.sun.jmx.mbeanserver.JmxMBeanServer@3dbd2a
   [junit4]   2> 1793133 INFO  (jetty-launcher-3976-thread-2) [n:127.0.0.1:53597_solr    ] o.a.s.c.CorePropertiesLocator Found 0 core definitions underneath C:\Users\jenkins\workspace\Lucene-Solr-7.x-Windows\solr\build\solr-core\test\J1\temp\solr.cloud.CollectionsAPIDistributedZkTest_CEB6E716F57A0337-001\tempDir-001\node1
   [junit4]   2> 1793145 INFO  (jetty-launcher-3976-thread-1) [n:127.0.0.1:53615_solr    ] o.a.s.m.r.SolrJmxReporter JMX monitoring for 'solr.jvm' (registry 'solr.jvm') enabled at server: com.sun.jmx.mbeanserver.JmxMBeanServer@3dbd2a
   [junit4]   2> 1793145 INFO  (jetty-launcher-3976-thread-1) [n:127.0.0.1:53615_solr    ] o.a.s.m.r.SolrJmxReporter JMX monitoring for 'solr.jetty' (registry 'solr.jetty') enabled at server: com.sun.jmx.mbeanserver.JmxMBeanServer@3dbd2a
   [junit4]   2> 1793148 INFO  (jetty-launcher-3976-thread-1) [n:127.0.0.1:53615_solr    ] o.a.s.c.CorePropertiesLocator Found 0 core definitions underneath C:\Users\jenkins\workspace\Lucene-Solr-7.x-Windows\solr\build\solr-core\test\J1\temp\solr.cloud.CollectionsAPIDistributedZkTest_CEB6E716F57A0337-001\tempDir-001\node2
   [junit4]   2> 1793248 INFO  (jetty-launcher-3976-thread-3) [n:127.0.0.1:53600_solr    ] o.a.s.m.r.SolrJmxReporter JMX monitoring for 'solr.node' (registry 'solr.node') enabled at server: com.sun.jmx.mbeanserver.JmxMBeanServer@3dbd2a
   [junit4]   2> 1793271 INFO  (jetty-launcher-3976-thread-3) [n:127.0.0.1:53600_solr    ] o.a.s.m.r.SolrJmxReporter JMX monitoring for 'solr.jvm' (registry 'solr.jvm') enabled at server: com.sun.jmx.mbeanserver.JmxMBeanServer@3dbd2a
   [junit4]   2> 1793272 INFO  (jetty-launcher-3976-thread-3) [n:127.0.0.1:53600_solr    ] o.a.s.m.r.SolrJmxReporter JMX monitoring for 'solr.jetty' (registry 'solr.jetty') enabled at server: com.sun.jmx.mbeanserver.JmxMBeanServer@3dbd2a
   [junit4]   2> 1793273 INFO  (jetty-launcher-3976-thread-3) [n:127.0.0.1:53600_solr    ] o.a.s.c.CorePropertiesLocator Found 0 core definitions underneath C:\Users\jenkins\workspace\Lucene-Solr-7.x-Windows\solr\build\solr-core\test\J1\temp\solr.cloud.CollectionsAPIDistributedZkTest_CEB6E716F57A0337-001\tempDir-001\node3
   [junit4]   2> 1793336 INFO  (zkConnectionManagerCallback-4021-thread-1) [    ] o.a.s.c.c.ConnectionManager zkClient has connected
   [junit4]   2> 1793340 INFO  (zkConnectionManagerCallback-4025-thread-1) [    ] o.a.s.c.c.ConnectionManager zkClient has connected
   [junit4]   2> 1793343 INFO  (SUITE-CollectionsAPIDistributedZkTest-seed#[CEB6E716F57A0337]-worker) [    ] o.a.s.c.c.ZkStateReader Updated live nodes from ZooKeeper... (0) -> (4)
   [junit4]   2> 1793345 INFO  (SUITE-CollectionsAPIDistributedZkTest-seed#[CEB6E716F57A0337]-worker) [    ] o.a.s.c.s.i.ZkClientClusterStateProvider Cluster at 127.0.0.1:53593/solr ready
   [junit4]   2> 1793478 INFO  (TEST-CollectionsAPIDistributedZkTest.deletePartiallyCreatedCollection-seed#[CEB6E716F57A0337]) [    ] o.a.s.SolrTestCaseJ4 ###Starting deletePartiallyCreatedCollection
   [junit4]   2> 1793480 INFO  (TEST-CollectionsAPIDistributedZkTest.deletePartiallyCreatedCollection-seed#[CEB6E716F57A0337]) [    ] o.a.s.c.c.ZkStateReader Updated live nodes from ZooKeeper... (0) -> (4)
   [junit4]   2> 1793534 INFO  (qtp26010971-18871) [n:127.0.0.1:53615_solr    ] o.a.s.h.a.CollectionsHandler Invoked Collection Action :create with params replicationFactor=1&collection.configName=conf&name=halfdeletedcollection&nrtReplicas=1&action=CREATE&numShards=2&createNodeSet=&wt=javabin&version=2 and sendToOCPQueue=true
   [junit4]   2> 1793544 INFO  (OverseerThreadFactory-7943-thread-1-processing-n:127.0.0.1:53597_solr) [n:127.0.0.1:53597_solr    ] o.a.s.c.CreateCollectionCmd Create collection halfdeletedcollection
   [junit4]   2> 1793545 WARN  (OverseerThreadFactory-7943-thread-1-processing-n:127.0.0.1:53597_solr) [n:127.0.0.1:53597_solr    ] o.a.s.c.CreateCollectionCmd It is unusual to create a collection (halfdeletedcollection) without cores.
   [junit4]   2> 1793655 INFO  (qtp26010971-18871) [n:127.0.0.1:53615_solr    ] o.a.s.h.a.CollectionsHandler Wait for new collection to be active for at most 30 seconds. Check all shard replicas
   [junit4]   2> 1793656 INFO  (qtp26010971-18871) [n:127.0.0.1:53615_solr    ] o.a.s.s.HttpSolrCall [admin] webapp=null path=/admin/collections params={replicationFactor=1&collection.configName=conf&name=halfdeletedcollection&nrtReplicas=1&action=CREATE&numShards=2&createNodeSet=&wt=javabin&version=2} status=0 QTime=120
   [junit4]   2> 1793660 INFO  (qtp26010971-18870) [n:127.0.0.1:53615_solr    ] o.a.s.h.a.CollectionsHandler Invoked Collection Action :addreplica with params dataDir=C:\Users\jenkins\workspace\Lucene-Solr-7.x-Windows\solr\build\solr-core\test\J1\temp\solr.cloud.CollectionsAPIDistributedZkTest_CEB6E716F57A0337-001\tempDir-002&action=ADDREPLICA&collection=halfdeletedcollection&shard=shard1&type=NRT&wt=javabin&version=2 and sendToOCPQueue=true
   [junit4]   2> 1793662 INFO  (OverseerCollectionConfigSetProcessor-99323085114900488-127.0.0.1:53597_solr-n_0000000000) [n:127.0.0.1:53597_solr    ] o.a.s.c.OverseerTaskQueue Response ZK path: /overseer/collection-queue-work/qnr-0000000000 doesn't exist.  Requestor may have disconnected from ZooKeeper
   [junit4]   2> 1793664 INFO  (OverseerThreadFactory-7943-thread-2-processing-n:127.0.0.1:53597_solr) [n:127.0.0.1:53597_solr    ] o.a.s.c.AddReplicaCmd Node Identified 127.0.0.1:53615_solr for creating new replica
   [junit4]   2> 1793667 INFO  (OverseerStateUpdate-99323085114900488-127.0.0.1:53597_solr-n_0000000000) [n:127.0.0.1:53597_solr    ] o.a.s.c.o.SliceMutator createReplica() {
   [junit4]   2>   "operation":"addreplica",
   [junit4]   2>   "collection":"halfdeletedcollection",
   [junit4]   2>   "shard":"shard1",
   [junit4]   2>   "core":"halfdeletedcollection_shard1_replica_n41",
   [junit4]   2>   "state":"down",
   [junit4]   2>   "base_url":"https://127.0.0.1:53615/solr",
   [junit4]   2>   "node_name":"127.0.0.1:53615_solr",
   [junit4]   2>   "type":"NRT"} 
   [junit4]   2> 1793877 INFO  (qtp26010971-18874) [n:127.0.0.1:53615_solr    ] o.a.s.h.a.CoreAdminOperation core create command qt=/admin/cores&coreNodeName=core_node42&dataDir=C:\Users\jenkins\workspace\Lucene-Solr-7.x-Windows\solr\build\solr-core\test\J1\temp\solr.cloud.CollectionsAPIDistributedZkTest_CEB6E716F57A0337-001\tempDir-002&collection.configName=conf&name=halfdeletedcollection_shard1_replica_n41&action=CREATE&collection=halfdeletedcollection&shard=shard1&wt=javabin&version=2&replicaType=NRT
   [junit4]   2> 1793879 INFO  (qtp26010971-18874) [n:127.0.0.1:53615_solr    ] o.a.s.c.TransientSolrCoreCacheDefault Allocating transient cache for 2147483647 transient cores
   [junit4]   2> 1793907 INFO  (qtp26010971-18874) [n:127.0.0.1:53615_solr c:halfdeletedcollection s:shard1 r:core_node42 x:halfdeletedcollection_shard1_replica_n41] o.a.s.c.SolrConfig Using Lucene MatchVersion: 7.3.0
   [junit4]   2> 1793918 INFO  (qtp26010971-18874) [n:127.0.0.1:53615_solr c:halfdeletedcollection s:shard1 r:core_node42 x:halfdeletedcollection_shard1_replica_n41] o.a.s.s.IndexSchema [halfdeletedcollection_shard1_replica_n41] Schema name=minimal
   [junit4]   2> 1793924 INFO  (qtp26010971-18874) [n:127.0.0.1:53615_solr c:halfdeletedcollection s:shard1 r:core_node42 x:halfdeletedcollection_shard1_replica_n41] o.a.s.s.IndexSchema Loaded schema minimal/1.1 with uniqueid field id
   [junit4]   2> 1793924 INFO  (qtp26010971-18874) [n:127.0.0.1:53615_solr c:halfdeletedcollection s:shard1 r:core_node42 x:halfdeletedcollection_shard1_replica_n41] o.a.s.c.CoreContainer Creating SolrCore 'halfdeletedcollection_shard1_replica_n41' using configuration from collection halfdeletedcollection, trusted=true
   [junit4]   2> 1793925 INFO  (qtp26010971-18874) [n:127.0.0.1:53615_solr c:halfdeletedcollection s:shard1 r:core_node42 x:halfdeletedcollection_shard1_replica_n41] o.a.s.m.r.SolrJmxReporter JMX monitoring for 'solr.core.halfdeletedcollection.shard1.replica_n41' (registry 'solr.core.halfdeletedcollection.shard1.replica_n41') enabled at server: com.sun.jmx.mbeanserver.JmxMBeanServer@3dbd2a
   [junit4]   2> 1793925 INFO  (qtp26010971-18874) [n:127.0.0.1:53615_solr c:halfdeletedcollection s:shard1 r:core_node42 x:halfdeletedcollection_shard1_replica_n41] o.a.s.c.SolrCore solr.RecoveryStrategy.Builder
   [junit4]   2> 1793925 INFO  (qtp26010971-18874) [n:127.0.0.1:53615_solr c:halfdeletedcollection s:shard1 r:core_node42 x:halfdeletedcollection_shard1_replica_n41] o.a.s.c.SolrCore [[halfdeletedcollection_shard1_replica_n41] ] Opening new SolrCore at [C:\Users\jenkins\workspace\Lucene-Solr-7.x-Windows\solr\build\solr-core\test\J1\temp\solr.cloud.CollectionsAPIDistributedZkTest_CEB6E716F57A0337-001\tempDir-001\node2\halfdeletedcollection_shard1_replica_n41], dataDir=[C:\Users\jenkins\workspace\Lucene-Solr-7.x-Windows\solr\build\solr-core\test\J1\temp\solr.cloud.CollectionsAPIDistributedZkTest_CEB6E716F57A0337-001\tempDir-002\]
   [junit4]   2> 1793988 INFO  (zkCallback-4010-thread-1-processing-n:127.0.0.1:53615_solr) [n:127.0.0.1:53615_solr    ] o.a.s.c.c.ZkStateReader A cluster state change: [WatchedEvent state:SyncConnected type:NodeDataChanged path:/collections/halfdeletedcollection/state.json] for collection [halfdeletedcollection] has occurred - updating... (live nodes size: [4])
   [junit4]   2> 1793989 INFO  (zkCallback-4010-thread-2-processing-n:127.0.0.1:53615_solr) [n:127.0.0.1:53615_solr    ] o.a.s.c.c.ZkStateReader A cluster state change: [WatchedEvent state:SyncConnected type:NodeDataChanged path:/collections/halfdeletedcollection/state.json] for collection [halfdeletedcollection] has occurred - updating... (live nodes size: [4])
   [junit4]   2> 1794021 INFO  (qtp26010971-18874) [n:127.0.0.1:53615_solr c:halfdeletedcollection s:shard1 r:core_node42 x:halfdeletedcollection_shard1_replica_n41] o.a.s.u.UpdateHandler Using UpdateLog implementation: org.apache.solr.update.UpdateLog
   [junit4]   2> 1794021 INFO  (qtp26010971-18874) [n:127.0.0.1:53615_solr c:halfdeletedcollection s:shard1 r:core_node42 x:halfdeletedcollection_shard1_replica_n41] o.a.s.u.UpdateLog Initializing UpdateLog: dataDir=null defaultSyncLevel=FLUSH numRecordsToKeep=100 maxNumLogsToKeep=10 numVersionBuckets=65536
   [junit4]   2> 1794021 INFO  (qtp26010971-18874) [n:127.0.0.1:53615_solr c:halfdeletedcollection s:shard1 r:core_node42 x:halfdeletedcollection_shard1_replica_n41] o.a.s.u.CommitTracker Hard AutoCommit: disabled
   [junit4]   2> 1794021 INFO  (qtp26010971-18874) [n:127.0.0.1:53615_solr c:halfdeletedcollection s:shard1 r:core_node42 x:halfdeletedcollection_shard1_replica_n41] o.a.s.u.CommitTracker Soft AutoCommit: disabled
   [junit4]   2> 1794035 INFO  (qtp26010971-18874) [n:127.0.0.1:53615_solr c:halfdeletedcollection s:shard1 r:core_node42 x:halfdeletedcollection_shard1_replica_n41] o.a.s.s.SolrIndexSearcher Opening [Searcher@1b46b8c[halfdeletedcollection_shard1_replica_n41] main]
   [junit4]   2> 1794037 INFO  (qtp26010971-18874) [n:127.0.0.1:53615_solr c:halfdeletedcollection s:shard1 r:core_node42 x:halfdeletedcollection_shard1_replica_n41] o.a.s.r.ManagedResourceStorage Configured ZooKeeperStorageIO with znodeBase: /configs/conf
   [junit4]   2> 1794037 INFO  (qtp26010971-18874) [n:127.0.0.1:53615_solr c:halfdeletedcollection s:shard1 r:core_node42 x:halfdeletedcollection_shard1_replica_n41] o.a.s.r.ManagedResourceStorage Loaded null at path _rest_managed.json using ZooKeeperStorageIO:path=/configs/conf
   [junit4]   2> 1794038 INFO  (qtp26010971-18874) [n:127.0.0.1:53615_solr c:halfdeletedcollection s:shard1 r:core_node42 x:halfdeletedcollection_shard1_replica_n41] o.a.s.h.ReplicationHandler Commits will be reserved for 10000ms.
   [junit4]   2> 1794039 INFO  (searcherExecutor-7949-thread-1-processing-n:127.0.0.1:53615_solr x:halfdeletedcollection_shard1_replica_n41 s:shard1 c:halfdeletedcollection r:core_node42) [n:127.0.0.1:53615_solr c:halfdeletedcollection s:shard1 r:core_node42 x:halfdeletedcollection_shard1_replica_n41] o.a.s.c.SolrCore [halfdeletedcollection_shard1_replica_n41] Registered new searcher Searcher@1b46b8c[halfdeletedcollection_shard1_replica_n41] main{ExitableDirectoryReader(UninvertingDirectoryReader())}
   [junit4]   2> 1794039 INFO  (qtp26010971-18874) [n:127.0.0.1:53615_solr c:halfdeletedcollection s:shard1 r:core_node42 x:halfdeletedcollection_shard1_replica_n41] o.a.s.u.UpdateLog Could not find max version in index or recent updates, using new clock 1589169363413368832
   [junit4]   2> 1794045 INFO  (qtp26010971-18874) [n:127.0.0.1:53615_solr c:halfdeletedcollection s:shard1 r:core_node42 x:halfdeletedcollection_shard1_replica_n41] o.a.s.c.ShardLeaderElectionContext Enough replicas found to continue.
   [junit4]   2> 1794045 INFO  (qtp26010971-18874) [n:127.0.0.1:53615_solr c:halfdeletedcollection s:shard1 r:core_node42 x:halfdeletedcollection_shard1_replica_n41] o.a.s.c.ShardLeaderElectionContext I may be the new leader - try and sync
   [junit4]   2> 1794045 INFO  (qtp26010971-18874) [n:127.0.0.1:53615_solr c:halfdeletedcollection s:shard1 r:core_node42 x:halfdeletedcollection_shard1_replica_n41] o.a.s.c.SyncStrategy Sync replicas to https://127.0.0.1:53615/solr/halfdeletedcollection_shard1_replica_n41/
   [junit4]   2> 1794045 INFO  (qtp26010971-18874) [n:127.0.0.1:53615_solr c:halfdeletedcollection s:shard1 r:core_node42 x:halfdeletedcollection_shard1_replica_n41] o.a.s.c.SyncStrategy Sync Success - now sync replicas to me
   [junit4]   2> 1794045 INFO  (qtp26010971-18874) [n:127.0.0.1:53615_solr c:halfdeletedcollection s:shard1 r:core_node42 x:halfdeletedcollection_shard1_replica_n41] o.a.s.c.SyncStrategy https://127.0.0.1:53615/solr/halfdeletedcollection_shard1_replica_n41/ has no replicas
   [junit4]   2> 1794045 INFO  (qtp26010971-18874) [n:127.0.0.1:53615_solr c:halfdeletedcollection s:shard1 r:core_node42 x:halfdeletedcollection_shard1_replica_n41] o.a.s.c.ShardLeaderElectionContext Found all replicas participating in election, clear LIR
   [junit4]   2> 1794050 INFO  (qtp26010971-18874) [n:127.0.0.1:53615_solr c:halfdeletedcollection s:shard1 r:core_node42 x:halfdeletedcollection_shard1_replica_n41] o.a.s.c.ShardLeaderElectionContext I am the new leader: https://127.0.0.1:53615/solr/halfdeletedcollection_shard1_replica_n41/ shard1
   [junit4]   2> 1794153 INFO  (zkCallback-4010-thread-2-processing-n:127.0.0.1:53615_solr) [n:127.0.0.1:53615_solr    ] o.a.s.c.c.ZkStateReader A cluster state change: [WatchedEvent state:SyncConnected type:NodeDataChanged path:/collections/halfdeletedcollection/state.json] for collection [halfdeletedcollection] has occurred - updating... (live nodes size: [4])
   [junit4]   2> 1794153 INFO  (zkCallback-4010-thread-1-processing-n:127.0.0.1:53615_solr) [n:127.0.0.1:53615_solr    ] o.a.s.c.c.ZkStateReader A cluster state change: [WatchedEvent state:SyncConnected type:NodeDataChanged path:/collections/halfdeletedcollection/state.json] for collection [halfdeletedcollection] has occurred - updating... (live nodes size: [4])
   [junit4]   2> 1794201 INFO  (qtp26010971-18874) [n:127.0.0.1:53615_solr c:halfdeletedcollection s:shard1 r:core_node42 x:halfdeletedcollection_shard1_replica_n41] o.a.s.c.ZkController I am the leader, no recovery necessary
   [junit4]   2> 1794204 INFO  (qtp26010971-18874) [n:127.0.0.1:53615_solr c:halfdeletedcollection s:shard1 r:core_node42 x:halfdeletedcollection_shard1_replica_n41] o.a.s.s.HttpSolrCall [admin] webapp=null path=/admin/cores params={qt=/admin/cores&coreNodeName=core_node42&dataDir=C:\Users\jenkins\workspace\Lucene-Solr-7.x-Windows\solr\build\solr-core\test\J1\temp\solr.cloud.CollectionsAPIDistributedZkTest_CEB6E716F57A0337-001\tempDir-002&collection.configName=conf&name=halfdeletedcollection_shard1_replica_n41&action=CREATE&collection=halfdeletedcollection&shard=shard1&wt=javabin&version=2&replicaType=NRT} status=0 QTime=327
   [junit4]   2> 1794207 INFO  (qtp26010971-18870) [n:127.0.0.1:53615_solr    ] o.a.s.s.HttpSolrCall [admin] webapp=null path=/admin/collections params={dataDir=C:\Users\jenkins\workspace\Lucene-Solr-7.x-Windows\solr\build\solr-core\test\J1\temp\solr.cloud.CollectionsAPIDistributedZkTest_CEB6E716F57A0337-001\tempDir-002&action=ADDREPLICA&collection=halfdeletedcollection&shard=shard1&type=NRT&wt=javabin&version=2} status=0 QTime=547
   [junit4]   2> 1794208 INFO  (qtp26010971-18875) [n:127.0.0.1:53615_solr    ] o.a.s.h.a.CollectionsHandler Invoked Collection Action :delete with params name=halfdeletedcollection&action=DELETE&wt=javabin&version=2 and sendToOCPQueue=true
   [junit4]   2> 1794211 INFO  (OverseerCollectionConfigSetProcessor-99323085114900488-127.0.0.1:53597_solr-n_0000000000) [n:127.0.0.1:53597_solr    ] o.a.s.c.OverseerTaskQueue Response ZK path: /overseer/collection-queue-work/qnr-0000000002 doesn't exist.  Requestor may have disconnected from ZooKeeper
   [junit4]   2> 1794212 INFO  (OverseerThreadFactory-7943-thread-3-processing-n:127.0.0.1:53597_solr) [n:127.0.0.1:53597_solr    ] o.a.s.c.OverseerCollectionMessageHandler Executing Collection Cmd : action=UNLOAD&deleteInstanceDir=true&deleteDataDir=true
   [junit4]   2> 1794214 INFO  (qtp26010971-18873) [n:127.0.0.1:53615_solr    ] o.a.s.m.SolrMetricManager Closing metric reporters for registry=solr.core.halfdeletedcollection.shard1.replica_n41, tag=null
   [junit4]   2> 1794214 INFO  (qtp26010971-18873) [n:127.0.0.1:53615_solr    ] o.a.s.m.r.SolrJmxReporter Closing reporter [org.apache.solr.metrics.reporters.SolrJmxReporter@3ef50d: rootName = null, domain = solr.core.halfdeletedcollection.shard1.replica_n41, service url = null, agent id = null] for registry solr.core.halfdeletedcollection.shard1.replica_n41 / com.codahale.metrics.MetricRegistry@1387911
   [junit4]   2> 1794227 INFO  (qtp26010971-18873) [n:127.0.0.1:53615_solr    ] o.a.s.c.SolrCore [halfdeletedcollection_shard1_replica_n41]  CLOSING SolrCore org.apache.solr.core.SolrCore@3ecea8
   [junit4]   2> 1794227 INFO  (qtp26010971-18873) [n:127.0.0.1:53615_solr    ] o.a.s.m.SolrMetricManager Closing metric reporters for registry=solr.core.halfdeletedcollection.shard1.replica_n41, tag=4116136
   [junit4]   2> 1794227 INFO  (qtp26010971-18873) [n:127.0.0.1:53615_solr    ] o.a.s.m.SolrMetricManager Closing metric reporters for registry=solr.collection.halfdeletedcollection.shard1.leader, tag=4116136
   [junit4]   2> 1794232 INFO  (qtp26010971-18873) [n:127.0.0.1:53615_solr    ] o.a.s.s.HttpSolrCall [admin] webapp=null path=/admin/cores params={deleteInstanceDir=true&core=halfdeletedcollection_shard1_replica_n41&qt=/admin/cores&deleteDataDir=true&action=UNLOAD&wt=javabin&version=2} status=0 QTime=18
   [junit4]   2> 1794942 INFO  (qtp26010971-18875) [n:127.0.0.1:53615_solr    ] o.a.s.s.HttpSolrCall [admin] webapp=null path=/admin/collections params={name=halfdeletedcollection&action=DELETE&wt=javabin&version=2} status=0 QTime=733
   [junit4]   2> 1794946 INFO  (qtp26010971-18871) [n:127.0.0.1:53615_solr    ] o.a.s.h.a.CollectionsHandler Invoked Collection Action :list with params action=LIST&wt=javabin&version=2 and sendToOCPQueue=true
   [junit4]   2> 1794946 INFO  (qtp26010971-18871) [n:127.0.0.1:53615_solr    ] o.a.s.s.HttpSolrCall [admin] webapp=null path=/admin/collections params={action=LIST&wt=javabin&version=2} status=0 QTime=0
   [junit4]   2> 1794947 INFO  (qtp26010971-18877) [n:127.0.0.1:53615_solr    ] o.a.s.h.a.CollectionsHandler Invoked Collection Action :create with params replicationFactor=1&collection.configName=conf&name=halfdeletedcollection&nrtReplicas=1&action=CREATE&numShards=2&wt=javabin&version=2 and sendToOCPQueue=true
   [junit4]   2> 1794950 INFO  (OverseerThreadFactory-7943-thread-4-processing-n:127.0.0.1:53597_solr) [n:127.0.0.1:53597_solr    ] o.a.s.c.CreateCollectionCmd Create collection halfdeletedcollection
   [junit4]   2> 1794951 INFO  (OverseerCollectionConfigSetProcessor-99323085114900488-127.0.0.1:53597_solr-n_0000000000) [n:127.0.0.1:53597_solr    ] o.a.s.c.OverseerTaskQueue Response ZK path: /overseer/collection-queue-work/qnr-0000000004 doesn't exist.  Requestor may have disconnected from ZooKeeper
   [junit4]   2> 1795165 INFO  (OverseerStateUpdate-99323085114900488-127.0.0.1:53597_solr-n_0000000000) [n:127.0.0.1:53597_solr    ] o.a.s.c.o.SliceMutator createReplica() {
   [junit4]   2>   "operation":"ADDREPLICA",
   [junit4]   2>   "collection":"halfdeletedcollection",
   [junit4]   2>   "shard":"shard1",
   [junit4]   2>   "core":"halfdeletedcollection_shard1_replica_n1",
   [junit4]   2>   "state":"down",
   [junit4]   2>   "base_url":"https://127.0.0.1:53603/solr",
   [junit4]   2>   "type":"NRT",
   [junit4]   2>   "waitForFinalState":"false"} 
   [junit4]   2> 1795168 INFO  (OverseerStateUpdate-99323085114900488-127.0.0.1:53597_solr-n_0000000000) [n:127.0.0.1:53597_solr    ] o.a.s.c.o.SliceMutator createReplica() {
   [junit4]   2>   "operation":"ADDREPLICA",
   [junit4]   2>   "collection":"halfdeletedcollection",
   [junit4]   2>   "shard":"shard2",
   [junit4]   2>   "core":"halfdeletedcollection_shard2_replica_n2",
   [junit4]   2>   "state":"down",
   [junit4]   2>   "base_url":"https://127.0.0.1:53615/solr",
   [junit4]   2>   "type":"NRT",
   [junit4]   2>   "waitForFinalState":"false"} 
   [junit4]   2> 1795374 INFO  (qtp26010971-18876) [n:127.0.0.1:53615_solr    ] o.a.s.h.a.CoreAdminOperation core create command qt=/admin/cores&coreNodeName=core_node4&collection.configName=conf&newCollection=true&name=halfdeletedcollection_shard2_replica_n2&action=CREATE&numShards=2&collection=halfdeletedcollection&shard=shard2&wt=javabin&version=2&replicaType=NRT
   [junit4]   2> 1795430 INFO  (qtp21764880-18853) [n:127.0.0.1:53603_solr    ] o.a.s.h.a.CoreAdminOperation core create command qt=/admin/cores&coreNodeName=core_node3&collection.configName=conf&newCollection=true&name=halfdeletedcollection_shard1_replica_n1&action=CREATE&numShards=2&collection=halfdeletedcollection&shard=shard1&wt=javabin&version=2&replicaType=NRT
   [junit4]   2> 1795430 INFO  (qtp21764880-18853) [n:127.0.0.1:53603_solr    ] o.a.s.c.TransientSolrCoreCacheDefault Allocating transient cache for 2147483647 transient cores
   [junit4]   2> 1795539 INFO  (zkCallback-4004-thread-1-processing-n:127.0.0.1:53603_solr) [n:127.0.0.1:53603_solr    ] o.a.s.c.c.ZkStateReader A cluster state change: [WatchedEvent state:SyncConnected type:NodeDataChanged path:/collections/halfdeletedcollection/state.json] for collection [halfdeletedcollection] has occurred - updating... (live nodes size: [4])
   [junit4]   2> 1795539 INFO  (zkCallback-4010-thread-1-processing-n:127.0.0.1:53615_solr) [n:127.0.0.1:53615_solr    ] o.a.s.c.c.ZkStateReader A cluster state change: [WatchedEvent state:SyncConnected type:NodeDataChanged path:/collections/halfdeletedcollection/state.json] for collection [halfdeletedcollection] has occurred - updating... (live nodes size: [4])
   [junit4]   2> 1795539 INFO  (zkCallback-4010-thread-2-processing-n:127.0.0.1:53615_solr) [n:127.0.0.1:53615_solr    ] o.a.s.c.c.ZkStateReader A cluster state change: [WatchedEvent state:SyncConnected type:NodeDataChanged path:/collections/halfdeletedcollection/state.json] for collection [halfdeletedcollection] has occurred - updating... (live nodes size: [4])
   [junit4]   2> 1795540 INFO  (zkCallback-4004-thread-2-processing-n:127.0.0.1:53603_solr) [n:127.0.0.1:53603_solr    ] o.a.s.c.c.ZkStateReader A cluster state change: [WatchedEvent state:SyncConnected type:NodeDataChanged path:/collections/halfdeletedcollection/state.json] for collection [halfdeletedcollection] has occurred - updating... (live nodes size: [4])
   [junit4]   2> 1796435 INFO  (qtp26010971-18876) [n:127.0.0.1:53615_solr c:halfdeletedcollection s:shard2 r:core_node4 x:halfdeletedcollection_shard2_replica_n2] o.a.s.c.SolrConfig Using Lucene MatchVersion: 7.3.0
   [junit4]   2> 1796462 INFO  (qtp26010971-18876) [n:127.0.0.1:53615_solr c:halfdeletedcollection s:shard2 r:core_node4 x:halfdeletedcollection_shard2_replica_n2] o.a.s.s.IndexSchema [halfdeletedcollection_shard2_replica_n2] Schema name=minimal
   [junit4]   2> 1796468 INFO  (qtp21764880-18853) [n:127.0.0.1:53603_solr c:halfdeletedcollection s:shard1 r:core_node3 x:halfdeletedcollection_shard1_replica_n1] o.a.s.c.SolrConfig Using Lucene MatchVersion: 7.3.0
   [junit4]   2> 1796471 INFO  (qtp26010971-18876) [n:127.0.0.1:53615_solr c:halfdeletedcollection s:shard2 r:core_node4 x:halfdeletedcollection_shard2_replica_n2] o.a.s.s.IndexSchema Loaded schema minimal/1.1 with uniqueid field id
   [junit4]   2> 1796471 INFO  (qtp26010971-18876) [n:127.0.0.1:53615_solr c:halfdeletedcollection s:shard2 r:core_node4 x:halfdeletedcollection_shard2_replica_n2] o.a.s.c.CoreContainer Creating SolrCore 'halfdeletedcollection_shard2_replica_n2' using configuration from collection halfdeletedcollection, trusted=true
   [junit4]   2> 1796471 INFO  (qtp26010971-18876) [n:127.0.0.1:53615_solr c:halfdeletedcollection s:shard2 r:core_node4 x:halfdeletedcollection_shard2_replica_n2] o.a.s.m.r.SolrJmxReporter JMX monitoring for 'solr.core.halfdeletedcollection.shard2.replica_n2' (registry 'solr.core.halfdeletedcollection.shard2.replica_n2') enabled at server: com.sun.jmx.mbeanserver.JmxMBeanServer@3dbd2a
   [junit4]   2> 1796471 INFO  (qtp26010971-18876) [n:127.0.0.1:53615_solr c:halfdeletedcollection s:shard2 r:core_node4 x:halfdeletedcollection_shard2_replica_n2] o.a.s.c.SolrCore solr.RecoveryStrategy.Builder
   [junit4]   2> 1796471 INFO  (qtp26010971-18876) [n:127.0.0.1:53615_solr c:halfdeletedcollection s:shard2 r:core_node4 x:halfdeletedcollection_shard2_replica_n2] o.a.s.c.SolrCore [[halfdeletedcollection_shard2_replica_n2] ] Opening new SolrCore at [C:\Users\jenkins\workspace\Lucene-Solr-7.x-Windows\solr\build\solr-core\test\J1\temp\solr.cloud.CollectionsAPIDistributedZkTest_CEB6E716F57A0337-001\tempDir-001\node2\halfdeletedcollection_shard2_replica_n2], dataDir=[C:\Users\jenkins\workspace\Lucene-Solr-7.x-Windows\solr\build\solr-core\test\J1\temp\solr.cloud.CollectionsAPIDistributedZkTest_CEB6E716F57A0337-001\tempDir-001\node2\halfdeletedcollection_shard2_replica_n2\data\]
   [junit4]   2> 1796480 INFO  (qtp21764880-18853) [n:127.0.0.1:53603_solr c:halfdeletedcollection s:shard1 r:core_node3 x:halfdeletedcollection_shard1_replica_n1] o.a.s.s.IndexSchema [halfdeletedcollection_shard1_replica_n1] Schema name=minimal
   [junit4]   2> 1796484 INFO  (qtp21764880-18853) [n:127.0.0.1:53603_solr c:halfdeletedcollection s:shard1 r:core_node3 x:halfdeletedcollection_shard1_replica_n1] o.a.s.s.IndexSchema Loaded schema minimal/1.1 with uniqueid field id
   [junit4]   2> 1796484 INFO  (qtp21764880-18853) [n:127.0.0.1:53603_solr c:halfdeletedcollection s:shard1 r:core_node3 x:halfdeletedcollection_shard1_replica_n1] o.a.s.c.CoreContainer Creating SolrCore 'halfdeletedcollection_shard1_replica_n1' using configuration from collection halfdeletedcollection, trusted=true
   [junit4]   2> 1796485 INFO  (qtp21764880-18853) [n:127.0.0.1:53603_solr c:halfdeletedcollection s:shard1 r:core_node3 x:halfdeletedcollection_shard1_replica_n1] o.a.s.m.r.SolrJmxReporter JMX monitoring for 'solr.core.halfdeletedcollection.shard1.replica_n1' (registry 'solr.core.halfdeletedcollection.shard1.replica_n1') enabled at server: com.sun.jmx.mbeanserver.JmxMBeanServer@3dbd2a
   [junit4]   2> 1796485 INFO  (qtp21764880-18853) [n:127.0.0.1:53603_solr c:halfdeletedcollection s:shard1 r:core_node3 x:halfdeletedcollection_shard1_replica_n1] o.a.s.c.SolrCore solr.RecoveryStrategy.Builder
   [junit4]   2> 1796485 INFO  (qtp21764880-18853) [n:127.0.0.1:53603_solr c:halfdeletedcollection s:shard1 r:core_node3 x:halfdeletedcollection_shard1_replica_n1] o.a.s.c.SolrCore [[halfdeletedcollection_shard1_replica_n1] ] Opening new SolrCore at [C:\Users\jenkins\workspace\Lucene-Solr-7.x-Windows\solr\build\solr-core\test\J1\temp\solr.cloud.CollectionsAPIDistributedZkTest_CEB6E716F57A0337-001\tempDir-001\node4\halfdeletedcollection_shard1_replica_n1], dataDir=[C:\Users\jenkins\workspace\Lucene-Solr-7.x-Windows\solr\build\solr-core\test\J1\temp\solr.cloud.CollectionsAPIDistributedZkTest_CEB6E716F57A0337-001\tempDir-001\node4\halfdeletedcollection_shard1_replica_n1\data\]
   [junit4]   2> 1796627 INFO  (qtp21764880-18853) [n:127.0.0.1:53603_solr c:halfdeletedcollection s:shard1 r:core_node3 x:halfdeletedcollection_shard1_replica_n1] o.a.s.u.UpdateHandler Using UpdateLog implementation: org.apache.solr.update.UpdateLog
   [junit4]   2> 1796628 INFO  (qtp21764880-18853) [n:127.0.0.1:53603_solr c:halfdeletedcollection s:shard1 r:core_node3 x:halfdeletedcollection_shard1_replica_n1] o.a.s.u.UpdateLog Initializing UpdateLog: dataDir=null defaultSyncLevel=FLUSH numRecordsToKeep=100 maxNumLogsToKeep=10 numVersionBuckets=65536
   [junit4]   2> 1796628 INFO  (qtp26010971-18876) [n:127.0.0.1:53615_solr c:halfdeletedcollection s:shard2 r:core_node4 x:halfdeletedcollection_shard2_replica_n2] o.a.s.u.UpdateHandler Using UpdateLog implementation: org.apache.solr.update.UpdateLog
   [junit4]   2> 1796628 INFO  (qtp26010971-18876) [n:127.0.0.1:53615_solr c:halfdeletedcollection s:shard2 r:core_node4 x:halfdeletedcollection_shard2_replica_n2] o.a.s.u.UpdateLog Initializing UpdateLog: dataDir=null defaultSyncLevel=FLUSH numRecordsToKeep=100 maxNumLogsToKeep=10 numVersionBuckets=65536
   [junit4]   2> 1796629 INFO  (qtp21764880-18853) [n:127.0.0.1:53603_solr c:halfdeletedcollection s:shard1 r:core_node3 x:halfdeletedcollection_shard1_replica_n1] o.a.s.u.CommitTracker Hard AutoCommit: disabled
   [junit4]   2> 1796629 INFO  (qtp21764880-18853) [n:127.0.0.1:53603_solr c:halfdeletedcollection s:shard1 r:core_node3 x:halfdeletedcollection_shard1_replica_n1] o.a.s.u.CommitTracker Soft AutoCommit: disabled
   [junit4]   2> 1796632 INFO  (qtp26010971-18876) [n:127.0.0.1:53615_solr c:halfdeletedcollection s:shard2 r:core_node4 x:halfdeletedcollection_shard2_replica_n2] o.a.s.u.CommitTracker Hard AutoCommit: disabled
   [junit4]   2> 1796632 INFO  (qtp26010971-18876) [n:127.0.0.1:53615_solr c:halfdeletedcollection s:shard2 r:core_node4 x:halfdeletedcollection_shard2_replica_n2] o.a.s.u.CommitTracker Soft AutoCommit: disabled
   [junit4]   2> 1796636 INFO  (qtp21764880-18853) [n:127.0.0.1:53603_solr c:halfdeletedcollection s:shard1 r:core_node3 x:halfdeletedcollection_shard1_replica_n1] o.a.s.s.SolrIndexSearcher Opening [Searcher@19e53c[halfdeletedcollection_shard1_replica_n1] main]
   [junit4]   2> 1796638 INFO  (qtp21764880-18853) [n:127.0.0.1:53603_solr c:halfdeletedcollection s:shard1 r:core_node3 x:halfdeletedcollection_shard1_replica_n1] o.a.s.r.ManagedResourceStorage Configured ZooKeeperStorageIO with znodeBase: /configs/conf
   [junit4]   2> 1796638 INFO  (qtp21764880-18853) [n:127.0.0.1:53603_solr c:halfdeletedcollection s:shard1 r:core_node3 x:halfdeletedcollection_shard1_replica_n1] o.a.s.r.ManagedResourceStorage Loaded null at path _rest_managed.json using ZooKeeperStorageIO:path=/configs/conf
   [junit4]   2> 1796638 INFO  (qtp26010971-18876) [n:127.0.0.1:53615_solr c:halfdeletedcollection s:shard2 r:core_node4 x:halfdeletedcollection_shard2_replica_n2] o.a.s.s.SolrIndexSearcher Opening [Searcher@1e76e58[halfdeletedcollection_shard2_replica_n2] main]
   [junit4]   2> 1796639 INFO  (qtp21764880-18853) [n:127.0.0.1:53603_solr c:halfdeletedcollection s:shard1 r:core_node3 x:halfdeletedcollection_shard1_replica_n1] o.a.s.h.ReplicationHandler Commits will be reserved for 10000ms.
   [junit4]   2> 1796641 INFO  (qtp26010971-18876) [n:127.0.0.1:53615_solr c:halfdeletedcollection s:shard2 r:core_node4 x:halfdeletedcollection_shard2_replica_n2] o.a.s.r.ManagedResourceStorage Configured ZooKeeperStorageIO with znodeBase: /configs/conf
   [junit4]   2> 1796641 INFO  (searcherExecutor-7955-thread-1-processing-n:127.0.0.1:53603_solr x:halfdeletedcollection_shard1_replica_n1 s:shard1 c:halfdeletedcollection r:core_node3) [n:127.0.0.1:53603_solr c:halfdeletedcollection s:shard1 r:core_node3 x:halfdeletedcollection_shard1_replica_n1] o.a.s.c.SolrCore [halfdeletedcollection_shard1_replica_n1] Registered new searcher Searcher@19e53c[halfdeletedcollection_shard1_replica_n1] main{ExitableDirectoryReader(UninvertingDirectoryReader())}
   [junit4]   2> 1796641 INFO  (qtp21764880-18853) [n:127.0.0.1:53603_solr c:halfdeletedcollection s:shard1 r:core_node3 x:halfdeletedcollection_shard1_replica_n1] o.a.s.u.UpdateLog Could not find max version in index or recent updates, using new clock 1589169366141763584
   [junit4]   2> 1796641 INFO  (qtp26010971-18876) [n:127.0.0.1:53615_solr c:halfdeletedcollection s:shard2 r:core_node4 x:halfdeletedcollection_shard2_replica_n2] o.a.s.r.ManagedResourceStorage Loaded null at path _rest_managed.json using ZooKeeperStorageIO:path=/configs/conf
   [junit4]   2> 1796643 INFO  (qtp26010971-18876) [n:127.0.0.1:53615_solr c:halfdeletedcollection s:shard2 r:core_node4 x:halfdeletedcollection_shard2_replica_n2] o.a.s.h.ReplicationHandler Commits will be reserved for 10000ms.
   [junit4]   2> 1796645 INFO  (searcherExecutor-7954-thread-1-processing-n:127.0.0.1:53615_solr x:halfdeletedcollection_shard2_replica_n2 s:shard2 c:halfdeletedcollection r:core_node4) [n:127.0.0.1:53615_solr c:halfdeletedcollection s:shard2 r:core_node4 x:halfdeletedcollection_shard2_replica_n2] o.a.s.c.SolrCore [halfdeletedcollection_shard2_replica_n2] Registered new searcher Searcher@1e76e58[halfdeletedcollection_shard2_replica_n2] main{ExitableDirectoryReader(UninvertingDirectoryReader())}
   [junit4]   2> 1796645 INFO  (qtp26010971-18876) [n:127.0.0.1:53615_solr c:halfdeletedcollection s:shard2 r:core_node4 x:halfdeletedcollection_shard2_replica_n2] o.a.s.u.UpdateLog Could not find max version in index or recent updates, using new clock 1589169366145957888
   [junit4]   2> 1796647 INFO  (qtp21764880-18853) [n:127.0.0.1:53603_solr c:halfdeletedcollection s:shard1 r:core_node3 x:halfdeletedcollection_shard1_replica_n1] o.a.s.c.ShardLeaderElectionContext Enough replicas found to continue.
   [junit4]   2> 1796648 INFO  (qtp21764880-18853) [n:127.0.0.1:53603_solr c:halfdeletedcollection s:shard1 r:core_node3 x:halfdeletedcollection_shard1_replica_n1] o.a.s.c.ShardLeaderElectionContext I may be the new leader - try and sync
   [junit4]   2> 1796648 INFO  (qtp21764880-18853) [n:127.0.0.1:53603_solr c:halfdeletedcollection s:shard1 r:core_

[...truncated too long message...]

estSolrFieldCacheBean, TestManagedSchemaThreadSafety, AddBlockUpdateTest, SynonymTokenizerTest, ManagedSchemaRoundRobinCloudTest, TestClusterStateMutator, OverseerTaskQueueTest, TestFastOutputStream, SpatialHeatmapFacetsTest, HdfsAutoAddReplicasIntegrationTest, TestGraphMLResponseWriter, CheckHdfsIndexTest, TestFastWriter, DOMUtilTest, BJQParserTest, SolrShardReporterTest, TestFieldCacheSort, TestRandomCollapseQParserPlugin, UpdateParamsTest, TestLuceneIndexBackCompat, TestManagedStopFilterFactory, TestDistributedMissingSort, TestCollationFieldDocValues, DocValuesNotIndexedTest, TestFieldSortValues, TestNonDefinedSimilarityFactory, BooleanFieldTest, HdfsRecoveryZkTest, TermVectorComponentDistributedTest, ClassificationUpdateProcessorTest, TestPullReplica, TestSchemaNameResource, ConcurrentDeleteAndCreateCollectionTest, AnalyticsMergeStrategyTest, TestLegacyFieldReuse, VersionInfoTest, TestStressVersions, TestFoldingMultitermQuery, AssignTest, QueryResultKeyTest, TestFieldTypeCollectionResource, TestQueryTypes, TestNodeLostTrigger, TestDocSet, TestRandomFaceting, CacheHeaderTest, CustomHighlightComponentTest, ChaosMonkeySafeLeaderTest, MissingSegmentRecoveryTest, CdcrBootstrapTest, RuleEngineTest, SolrIndexConfigTest, IndexSchemaRuntimeFieldTest, TestNRTOpen, TestCollationField, TestRandomFlRTGCloud, TestJettySolrRunner, ActionThrottleTest, TestLeaderElectionWithEmptyReplica, TestDistribDocBasedVersion, TestCloudManagedSchema, LeaderInitiatedRecoveryOnCommitTest, OutOfBoxZkACLAndCredentialsProvidersTest, SolrJmxReporterCloudTest, SchemaVersionSpecificBehaviorTest, TestFieldCacheVsDocValues, TestBulkSchemaAPI, BasicAuthIntegrationTest, TestHdfsUpdateLog, SystemLogListenerTest, TestPayloadScoreQParserPlugin, TestShortCircuitedRequests, TestExactStatsCache, DeleteReplicaTest, CachingDirectoryFactoryTest, ExplicitHLLTest, TestCryptoKeys, BlockJoinFacetRandomTest, TestTolerantUpdateProcessorCloud, TestConfig, ShardRoutingCustomTest, DocumentAnalysisRequestHandlerTest, DistributedQueryComponentOptimizationTest, JSONWriterTest, SpellingQueryConverterTest, BadComponentTest, DeleteLastCustomShardedReplicaTest, GraphQueryTest, TestLRUCache, EchoParamsTest, ComputePlanActionTest, ZkStateWriterTest, TolerantUpdateProcessorTest, DistributedIntervalFacetingTest, TestClusterProperties, AtomicUpdateProcessorFactoryTest, TestApiFramework, TestTestInjection, TestLegacyFieldCache, TestSchemaManager, ExitableDirectoryReaderTest, SpatialRPTFieldTypeTest, LoggingHandlerTest, TestConfigsApi, FullSolrCloudDistribCmdsTest, TestComputePlanAction, TestFieldCollectionResource, MoveReplicaHDFSTest, TestShardHandlerFactory, TestConfigSetProperties, HdfsTlogReplayBufferedWhileIndexingTest, DistributedExpandComponentTest, TestSolr4Spatial2, DistributedMLTComponentTest, TestNamedUpdateProcessors, TestOverriddenPrefixQueryForCustomFieldType, TestCoreBackup, TestFreeTextSuggestions, JvmMetricsTest, TestSolrIndexConfig, TestMultiWordSynonyms, LeaderElectionIntegrationTest, DistributedFacetPivotSmallAdvancedTest, TestLegacyTerms, CursorMarkTest, TestBlobHandler, TestSolrConfigHandler, TestSuggestSpellingConverter, PeerSyncWithIndexFingerprintCachingTest, TestSimpleTrackingShardHandler, TestAnalyzedSuggestions, SparseHLLTest, BlockCacheTest, OverseerCollectionConfigSetProcessorTest, SearchHandlerTest, LegacyCloudClusterPropTest, TestPostingsSolrHighlighter, TestComplexPhraseQParserPlugin, TestSort, OpenCloseCoreStressTest, MetricTriggerTest, TestReplicationHandlerBackup, TestCrossCoreJoin, TestCharFilters, FileBasedSpellCheckerTest, TestCorePropertiesReload, MoreLikeThisHandlerTest, HdfsChaosMonkeySafeLeaderTest, TestInfoStreamLogging, DistanceUnitsTest, BasicDistributedZk2Test, PropertiesRequestHandlerTest, SimpleFacetsTest, TestMaxScoreQueryParser, TestOnReconnectListenerSupport, TestManagedSchema, ResponseHeaderTest, QueryEqualityTest, TestCloudInspectUtil, DocumentBuilderTest, SSLMigrationTest, TestExportWriter, UpdateRequestProcessorFactoryTest, TestPivotHelperCode, TestRequestForwarding, TermVectorComponentTest, TestNumericRangeQuery32, SchemaApiFailureTest, ReplicaListTransformerTest, BaseCdcrDistributedZkTest, TestDistribIDF, TestCloudRecovery, AutoAddReplicasPlanActionTest, TestClassicSimilarityFactory, PeerSyncTest, SoftAutoCommitTest, SolrGangliaReporterTest, ZkNodePropsTest, FieldMutatingUpdateProcessorTest, SolrMetricReporterTest, LeaderFailoverAfterPartitionTest, RestartWhileUpdatingTest, TestGraphTermsQParserPlugin, UnloadDistributedZkTest, CollectionsAPIDistributedZkTest]
   [junit4] Completed [385/766 (2!)] on J1 in 86.32s, 19 tests, 1 error <<< FAILURES!

[...truncated 3738 lines...]
   [junit4] Suite: org.apache.solr.update.processor.TestOpenNLPExtractNamedEntitiesUpdateProcessorFactory
   [junit4]   2> Creating dataDir: C:\Users\jenkins\workspace\Lucene-Solr-7.x-Windows\solr\build\contrib\solr-analysis-extras\test\J1\temp\solr.update.processor.TestOpenNLPExtractNamedEntitiesUpdateProcessorFactory_44EB82350E6EB80-001\init-core-data-001
   [junit4]   2> NOTE: test params are: codec=Asserting(Lucene70): {}, docValues:{}, maxPointsInLeafNode=761, maxMBSortInHeap=7.519771157380311, sim=RandomSimilarity(queryNorm=false): {}, locale=sv-SE, timezone=Australia/ACT
   [junit4]   2> NOTE: Windows 10 10.0 x86/Oracle Corporation 1.8.0_144 (32-bit)/cpus=3,threads=1,free=5084568,total=30969856
   [junit4]   2> NOTE: All tests run in this JVM: [TestICUCollationFieldOptions, TestFoldingMultitermExtrasQuery, TestOpenNLPExtractNamedEntitiesUpdateProcessorFactory]
   [junit4]   2> NOTE: reproduce with: ant test  -Dtestcase=TestOpenNLPExtractNamedEntitiesUpdateProcessorFactory -Dtests.seed=44EB82350E6EB80 -Dtests.slow=true -Dtests.locale=sv-SE -Dtests.timezone=Australia/ACT -Dtests.asserts=true -Dtests.file.encoding=Cp1252
   [junit4] ERROR   0.00s J1 | TestOpenNLPExtractNamedEntitiesUpdateProcessorFactory (suite) <<<
   [junit4]    > Throwable #1: java.io.IOException: Could not remove the following files (in the order of attempts):
   [junit4]    >    C:\Users\jenkins\workspace\Lucene-Solr-7.x-Windows\solr\build\contrib\solr-analysis-extras\test\J1\temp\solr.update.processor.TestOpenNLPExtractNamedEntitiesUpdateProcessorFactory_44EB82350E6EB80-001\tempDir-001\collection1\conf: java.nio.file.DirectoryNotEmptyException: C:\Users\jenkins\workspace\Lucene-Solr-7.x-Windows\solr\build\contrib\solr-analysis-extras\test\J1\temp\solr.update.processor.TestOpenNLPExtractNamedEntitiesUpdateProcessorFactory_44EB82350E6EB80-001\tempDir-001\collection1\conf
   [junit4]    >    C:\Users\jenkins\workspace\Lucene-Solr-7.x-Windows\solr\build\contrib\solr-analysis-extras\test\J1\temp\solr.update.processor.TestOpenNLPExtractNamedEntitiesUpdateProcessorFactory_44EB82350E6EB80-001\tempDir-001\collection1: java.nio.file.DirectoryNotEmptyException: C:\Users\jenkins\workspace\Lucene-Solr-7.x-Windows\solr\build\contrib\solr-analysis-extras\test\J1\temp\solr.update.processor.TestOpenNLPExtractNamedEntitiesUpdateProcessorFactory_44EB82350E6EB80-001\tempDir-001\collection1
   [junit4]    >    C:\Users\jenkins\workspace\Lucene-Solr-7.x-Windows\solr\build\contrib\solr-analysis-extras\test\J1\temp\solr.update.processor.TestOpenNLPExtractNamedEntitiesUpdateProcessorFactory_44EB82350E6EB80-001\tempDir-001: java.nio.file.DirectoryNotEmptyException: C:\Users\jenkins\workspace\Lucene-Solr-7.x-Windows\solr\build\contrib\solr-analysis-extras\test\J1\temp\solr.update.processor.TestOpenNLPExtractNamedEntitiesUpdateProcessorFactory_44EB82350E6EB80-001\tempDir-001
   [junit4]    >    C:\Users\jenkins\workspace\Lucene-Solr-7.x-Windows\solr\build\contrib\solr-analysis-extras\test\J1\temp\solr.update.processor.TestOpenNLPExtractNamedEntitiesUpdateProcessorFactory_44EB82350E6EB80-001\tempDir-001\collection1\conf\en-test-tokenizer.bin: java.nio.file.AccessDeniedException: C:\Users\jenkins\workspace\Lucene-Solr-7.x-Windows\solr\build\contrib\solr-analysis-extras\test\J1\temp\solr.update.processor.TestOpenNLPExtractNamedEntitiesUpdateProcessorFactory_44EB82350E6EB80-001\tempDir-001\collection1\conf\en-test-tokenizer.bin
   [junit4]    >    C:\Users\jenkins\workspace\Lucene-Solr-7.x-Windows\solr\build\contrib\solr-analysis-extras\test\J1\temp\solr.update.processor.TestOpenNLPExtractNamedEntitiesUpdateProcessorFactory_44EB82350E6EB80-001\tempDir-001\collection1\conf\en-test-ner-person.bin: java.nio.file.AccessDeniedException: C:\Users\jenkins\workspace\Lucene-Solr-7.x-Windows\solr\build\contrib\solr-analysis-extras\test\J1\temp\solr.update.processor.TestOpenNLPExtractNamedEntitiesUpdateProcessorFactory_44EB82350E6EB80-001\tempDir-001\collection1\conf\en-test-ner-person.bin
   [junit4]    >    C:\Users\jenkins\workspace\Lucene-Solr-7.x-Windows\solr\build\contrib\solr-analysis-extras\test\J1\temp\solr.update.processor.TestOpenNLPExtractNamedEntitiesUpdateProcessorFactory_44EB82350E6EB80-001\tempDir-001\collection1\conf\en-test-sent.bin: java.nio.file.AccessDeniedException: C:\Users\jenkins\workspace\Lucene-Solr-7.x-Windows\solr\build\contrib\solr-analysis-extras\test\J1\temp\solr.update.processor.TestOpenNLPExtractNamedEntitiesUpdateProcessorFactory_44EB82350E6EB80-001\tempDir-001\collection1\conf\en-test-sent.bin
   [junit4]    >    C:\Users\jenkins\workspace\Lucene-Solr-7.x-Windows\solr\build\contrib\solr-analysis-extras\test\J1\temp\solr.update.processor.TestOpenNLPExtractNamedEntitiesUpdateProcessorFactory_44EB82350E6EB80-001: java.nio.file.DirectoryNotEmptyException: C:\Users\jenkins\workspace\Lucene-Solr-7.x-Windows\solr\build\contrib\solr-analysis-extras\test\J1\temp\solr.update.processor.TestOpenNLPExtractNamedEntitiesUpdateProcessorFactory_44EB82350E6EB80-001
   [junit4]    > 	at __randomizedtesting.SeedInfo.seed([44EB82350E6EB80]:0)
   [junit4]    > 	at org.apache.lucene.util.IOUtils.rm(IOUtils.java:329)
   [junit4]    > 	at java.lang.Thread.run(Thread.java:748)
   [junit4] Completed [5/5 (1!)] on J1 in 0.97s, 8 tests, 1 error <<< FAILURES!

[...truncated 41513 lines...]

Mime
View raw message