lucene-dev mailing list archives

Site index · List index
Message view « Date » · « Thread »
Top « Date » · « Thread »
From Policeman Jenkins Server <jenk...@thetaphi.de>
Subject [JENKINS] Lucene-Solr-master-Windows (32bit/jdk1.8.0_144) - Build # 7105 - Still unstable!
Date Wed, 10 Jan 2018 12:50:24 GMT
Build: https://jenkins.thetaphi.de/job/Lucene-Solr-master-Windows/7105/
Java: 32bit/jdk1.8.0_144 -client -XX:+UseSerialGC

6 tests failed.
FAILED:  junit.framework.TestSuite.org.apache.solr.core.ResourceLoaderTest

Error Message:
Could not remove the following files (in the order of attempts):    C:\Users\jenkins\workspace\Lucene-Solr-master-Windows\solr\build\solr-core\test\J0\temp\solr.core.ResourceLoaderTest_7F6301270602A436-001\testClassLoaderLibs-001\otherLib: java.nio.file.DirectoryNotEmptyException: C:\Users\jenkins\workspace\Lucene-Solr-master-Windows\solr\build\solr-core\test\J0\temp\solr.core.ResourceLoaderTest_7F6301270602A436-001\testClassLoaderLibs-001\otherLib    C:\Users\jenkins\workspace\Lucene-Solr-master-Windows\solr\build\solr-core\test\J0\temp\solr.core.ResourceLoaderTest_7F6301270602A436-001\testClassLoaderLibs-001: java.nio.file.DirectoryNotEmptyException: C:\Users\jenkins\workspace\Lucene-Solr-master-Windows\solr\build\solr-core\test\J0\temp\solr.core.ResourceLoaderTest_7F6301270602A436-001\testClassLoaderLibs-001    C:\Users\jenkins\workspace\Lucene-Solr-master-Windows\solr\build\solr-core\test\J0\temp\solr.core.ResourceLoaderTest_7F6301270602A436-001\testClassLoaderLibs-001\otherLib\jar3.jar: java.nio.file.AccessDeniedException: C:\Users\jenkins\workspace\Lucene-Solr-master-Windows\solr\build\solr-core\test\J0\temp\solr.core.ResourceLoaderTest_7F6301270602A436-001\testClassLoaderLibs-001\otherLib\jar3.jar    C:\Users\jenkins\workspace\Lucene-Solr-master-Windows\solr\build\solr-core\test\J0\temp\solr.core.ResourceLoaderTest_7F6301270602A436-001: java.nio.file.DirectoryNotEmptyException: C:\Users\jenkins\workspace\Lucene-Solr-master-Windows\solr\build\solr-core\test\J0\temp\solr.core.ResourceLoaderTest_7F6301270602A436-001 

Stack Trace:
java.io.IOException: Could not remove the following files (in the order of attempts):
   C:\Users\jenkins\workspace\Lucene-Solr-master-Windows\solr\build\solr-core\test\J0\temp\solr.core.ResourceLoaderTest_7F6301270602A436-001\testClassLoaderLibs-001\otherLib: java.nio.file.DirectoryNotEmptyException: C:\Users\jenkins\workspace\Lucene-Solr-master-Windows\solr\build\solr-core\test\J0\temp\solr.core.ResourceLoaderTest_7F6301270602A436-001\testClassLoaderLibs-001\otherLib
   C:\Users\jenkins\workspace\Lucene-Solr-master-Windows\solr\build\solr-core\test\J0\temp\solr.core.ResourceLoaderTest_7F6301270602A436-001\testClassLoaderLibs-001: java.nio.file.DirectoryNotEmptyException: C:\Users\jenkins\workspace\Lucene-Solr-master-Windows\solr\build\solr-core\test\J0\temp\solr.core.ResourceLoaderTest_7F6301270602A436-001\testClassLoaderLibs-001
   C:\Users\jenkins\workspace\Lucene-Solr-master-Windows\solr\build\solr-core\test\J0\temp\solr.core.ResourceLoaderTest_7F6301270602A436-001\testClassLoaderLibs-001\otherLib\jar3.jar: java.nio.file.AccessDeniedException: C:\Users\jenkins\workspace\Lucene-Solr-master-Windows\solr\build\solr-core\test\J0\temp\solr.core.ResourceLoaderTest_7F6301270602A436-001\testClassLoaderLibs-001\otherLib\jar3.jar
   C:\Users\jenkins\workspace\Lucene-Solr-master-Windows\solr\build\solr-core\test\J0\temp\solr.core.ResourceLoaderTest_7F6301270602A436-001: java.nio.file.DirectoryNotEmptyException: C:\Users\jenkins\workspace\Lucene-Solr-master-Windows\solr\build\solr-core\test\J0\temp\solr.core.ResourceLoaderTest_7F6301270602A436-001

	at __randomizedtesting.SeedInfo.seed([7F6301270602A436]:0)
	at org.apache.lucene.util.IOUtils.rm(IOUtils.java:329)
	at org.apache.lucene.util.TestRuleTemporaryFilesCleanup.afterAlways(TestRuleTemporaryFilesCleanup.java:216)
	at com.carrotsearch.randomizedtesting.rules.TestRuleAdapter$1.afterAlways(TestRuleAdapter.java:31)
	at com.carrotsearch.randomizedtesting.rules.StatementAdapter.evaluate(StatementAdapter.java:43)
	at com.carrotsearch.randomizedtesting.rules.StatementAdapter.evaluate(StatementAdapter.java:36)
	at org.apache.lucene.util.TestRuleAssertionsRequired$1.evaluate(TestRuleAssertionsRequired.java:53)
	at org.apache.lucene.util.TestRuleMarkFailure$1.evaluate(TestRuleMarkFailure.java:47)
	at org.apache.lucene.util.TestRuleIgnoreAfterMaxFailures$1.evaluate(TestRuleIgnoreAfterMaxFailures.java:64)
	at org.apache.lucene.util.TestRuleIgnoreTestSuites$1.evaluate(TestRuleIgnoreTestSuites.java:54)
	at com.carrotsearch.randomizedtesting.rules.StatementAdapter.evaluate(StatementAdapter.java:36)
	at com.carrotsearch.randomizedtesting.ThreadLeakControl$StatementRunner.run(ThreadLeakControl.java:368)
	at java.lang.Thread.run(Thread.java:748)


FAILED:  junit.framework.TestSuite.org.apache.solr.handler.admin.CoreAdminCreateDiscoverTest

Error Message:
Could not remove the following files (in the order of attempts):    C:\Users\jenkins\workspace\Lucene-Solr-master-Windows\solr\build\solr-core\test\J1\temp\solr.handler.admin.CoreAdminCreateDiscoverTest_7F6301270602A436-001\tempDir-001\sys_props: java.nio.file.DirectoryNotEmptyException: C:\Users\jenkins\workspace\Lucene-Solr-master-Windows\solr\build\solr-core\test\J1\temp\solr.handler.admin.CoreAdminCreateDiscoverTest_7F6301270602A436-001\tempDir-001\sys_props    C:\Users\jenkins\workspace\Lucene-Solr-master-Windows\solr\build\solr-core\test\J1\temp\solr.handler.admin.CoreAdminCreateDiscoverTest_7F6301270602A436-001\tempDir-001: java.nio.file.DirectoryNotEmptyException: C:\Users\jenkins\workspace\Lucene-Solr-master-Windows\solr\build\solr-core\test\J1\temp\solr.handler.admin.CoreAdminCreateDiscoverTest_7F6301270602A436-001\tempDir-001 

Stack Trace:
java.io.IOException: Could not remove the following files (in the order of attempts):
   C:\Users\jenkins\workspace\Lucene-Solr-master-Windows\solr\build\solr-core\test\J1\temp\solr.handler.admin.CoreAdminCreateDiscoverTest_7F6301270602A436-001\tempDir-001\sys_props: java.nio.file.DirectoryNotEmptyException: C:\Users\jenkins\workspace\Lucene-Solr-master-Windows\solr\build\solr-core\test\J1\temp\solr.handler.admin.CoreAdminCreateDiscoverTest_7F6301270602A436-001\tempDir-001\sys_props
   C:\Users\jenkins\workspace\Lucene-Solr-master-Windows\solr\build\solr-core\test\J1\temp\solr.handler.admin.CoreAdminCreateDiscoverTest_7F6301270602A436-001\tempDir-001: java.nio.file.DirectoryNotEmptyException: C:\Users\jenkins\workspace\Lucene-Solr-master-Windows\solr\build\solr-core\test\J1\temp\solr.handler.admin.CoreAdminCreateDiscoverTest_7F6301270602A436-001\tempDir-001

	at __randomizedtesting.SeedInfo.seed([7F6301270602A436]:0)
	at org.apache.lucene.util.IOUtils.rm(IOUtils.java:329)
	at org.apache.lucene.util.TestRuleTemporaryFilesCleanup.afterAlways(TestRuleTemporaryFilesCleanup.java:216)
	at com.carrotsearch.randomizedtesting.rules.TestRuleAdapter$1.afterAlways(TestRuleAdapter.java:31)
	at com.carrotsearch.randomizedtesting.rules.StatementAdapter.evaluate(StatementAdapter.java:43)
	at com.carrotsearch.randomizedtesting.rules.StatementAdapter.evaluate(StatementAdapter.java:36)
	at org.apache.lucene.util.TestRuleAssertionsRequired$1.evaluate(TestRuleAssertionsRequired.java:53)
	at org.apache.lucene.util.TestRuleMarkFailure$1.evaluate(TestRuleMarkFailure.java:47)
	at org.apache.lucene.util.TestRuleIgnoreAfterMaxFailures$1.evaluate(TestRuleIgnoreAfterMaxFailures.java:64)
	at org.apache.lucene.util.TestRuleIgnoreTestSuites$1.evaluate(TestRuleIgnoreTestSuites.java:54)
	at com.carrotsearch.randomizedtesting.rules.StatementAdapter.evaluate(StatementAdapter.java:36)
	at com.carrotsearch.randomizedtesting.ThreadLeakControl$StatementRunner.run(ThreadLeakControl.java:368)
	at java.lang.Thread.run(Thread.java:748)


FAILED:  junit.framework.TestSuite.org.apache.solr.response.JSONWriterTest

Error Message:
Could not remove the following files (in the order of attempts):    C:\Users\jenkins\workspace\Lucene-Solr-master-Windows\solr\build\solr-core\test\J0\temp\solr.response.JSONWriterTest_7F6301270602A436-001\init-core-data-001\spellchecker3: java.nio.file.DirectoryNotEmptyException: C:\Users\jenkins\workspace\Lucene-Solr-master-Windows\solr\build\solr-core\test\J0\temp\solr.response.JSONWriterTest_7F6301270602A436-001\init-core-data-001\spellchecker3    C:\Users\jenkins\workspace\Lucene-Solr-master-Windows\solr\build\solr-core\test\J0\temp\solr.response.JSONWriterTest_7F6301270602A436-001\init-core-data-001: java.nio.file.DirectoryNotEmptyException: C:\Users\jenkins\workspace\Lucene-Solr-master-Windows\solr\build\solr-core\test\J0\temp\solr.response.JSONWriterTest_7F6301270602A436-001\init-core-data-001    C:\Users\jenkins\workspace\Lucene-Solr-master-Windows\solr\build\solr-core\test\J0\temp\solr.response.JSONWriterTest_7F6301270602A436-001\init-core-data-001\spellchecker3\write.lock: java.nio.file.AccessDeniedException: C:\Users\jenkins\workspace\Lucene-Solr-master-Windows\solr\build\solr-core\test\J0\temp\solr.response.JSONWriterTest_7F6301270602A436-001\init-core-data-001\spellchecker3\write.lock    C:\Users\jenkins\workspace\Lucene-Solr-master-Windows\solr\build\solr-core\test\J0\temp\solr.response.JSONWriterTest_7F6301270602A436-001: java.nio.file.DirectoryNotEmptyException: C:\Users\jenkins\workspace\Lucene-Solr-master-Windows\solr\build\solr-core\test\J0\temp\solr.response.JSONWriterTest_7F6301270602A436-001 

Stack Trace:
java.io.IOException: Could not remove the following files (in the order of attempts):
   C:\Users\jenkins\workspace\Lucene-Solr-master-Windows\solr\build\solr-core\test\J0\temp\solr.response.JSONWriterTest_7F6301270602A436-001\init-core-data-001\spellchecker3: java.nio.file.DirectoryNotEmptyException: C:\Users\jenkins\workspace\Lucene-Solr-master-Windows\solr\build\solr-core\test\J0\temp\solr.response.JSONWriterTest_7F6301270602A436-001\init-core-data-001\spellchecker3
   C:\Users\jenkins\workspace\Lucene-Solr-master-Windows\solr\build\solr-core\test\J0\temp\solr.response.JSONWriterTest_7F6301270602A436-001\init-core-data-001: java.nio.file.DirectoryNotEmptyException: C:\Users\jenkins\workspace\Lucene-Solr-master-Windows\solr\build\solr-core\test\J0\temp\solr.response.JSONWriterTest_7F6301270602A436-001\init-core-data-001
   C:\Users\jenkins\workspace\Lucene-Solr-master-Windows\solr\build\solr-core\test\J0\temp\solr.response.JSONWriterTest_7F6301270602A436-001\init-core-data-001\spellchecker3\write.lock: java.nio.file.AccessDeniedException: C:\Users\jenkins\workspace\Lucene-Solr-master-Windows\solr\build\solr-core\test\J0\temp\solr.response.JSONWriterTest_7F6301270602A436-001\init-core-data-001\spellchecker3\write.lock
   C:\Users\jenkins\workspace\Lucene-Solr-master-Windows\solr\build\solr-core\test\J0\temp\solr.response.JSONWriterTest_7F6301270602A436-001: java.nio.file.DirectoryNotEmptyException: C:\Users\jenkins\workspace\Lucene-Solr-master-Windows\solr\build\solr-core\test\J0\temp\solr.response.JSONWriterTest_7F6301270602A436-001

	at __randomizedtesting.SeedInfo.seed([7F6301270602A436]:0)
	at org.apache.lucene.util.IOUtils.rm(IOUtils.java:329)
	at org.apache.lucene.util.TestRuleTemporaryFilesCleanup.afterAlways(TestRuleTemporaryFilesCleanup.java:216)
	at com.carrotsearch.randomizedtesting.rules.TestRuleAdapter$1.afterAlways(TestRuleAdapter.java:31)
	at com.carrotsearch.randomizedtesting.rules.StatementAdapter.evaluate(StatementAdapter.java:43)
	at com.carrotsearch.randomizedtesting.rules.StatementAdapter.evaluate(StatementAdapter.java:36)
	at org.apache.lucene.util.TestRuleAssertionsRequired$1.evaluate(TestRuleAssertionsRequired.java:53)
	at org.apache.lucene.util.TestRuleMarkFailure$1.evaluate(TestRuleMarkFailure.java:47)
	at org.apache.lucene.util.TestRuleIgnoreAfterMaxFailures$1.evaluate(TestRuleIgnoreAfterMaxFailures.java:64)
	at org.apache.lucene.util.TestRuleIgnoreTestSuites$1.evaluate(TestRuleIgnoreTestSuites.java:54)
	at com.carrotsearch.randomizedtesting.rules.StatementAdapter.evaluate(StatementAdapter.java:36)
	at com.carrotsearch.randomizedtesting.ThreadLeakControl$StatementRunner.run(ThreadLeakControl.java:368)
	at java.lang.Thread.run(Thread.java:748)


FAILED:  junit.framework.TestSuite.org.apache.lucene.store.TestMultiMMap

Error Message:
Could not remove the following files (in the order of attempts):    C:\Users\jenkins\workspace\Lucene-Solr-master-Windows\lucene\build\core\test\J0\temp\lucene.store.TestMultiMMap_8157EE5210AD88CF-001\testSeekSliceZero-021: java.nio.file.DirectoryNotEmptyException: C:\Users\jenkins\workspace\Lucene-Solr-master-Windows\lucene\build\core\test\J0\temp\lucene.store.TestMultiMMap_8157EE5210AD88CF-001\testSeekSliceZero-021 

Stack Trace:
java.io.IOException: Could not remove the following files (in the order of attempts):
   C:\Users\jenkins\workspace\Lucene-Solr-master-Windows\lucene\build\core\test\J0\temp\lucene.store.TestMultiMMap_8157EE5210AD88CF-001\testSeekSliceZero-021: java.nio.file.DirectoryNotEmptyException: C:\Users\jenkins\workspace\Lucene-Solr-master-Windows\lucene\build\core\test\J0\temp\lucene.store.TestMultiMMap_8157EE5210AD88CF-001\testSeekSliceZero-021

	at __randomizedtesting.SeedInfo.seed([8157EE5210AD88CF]:0)
	at org.apache.lucene.util.IOUtils.rm(IOUtils.java:329)
	at org.apache.lucene.util.TestRuleTemporaryFilesCleanup.afterAlways(TestRuleTemporaryFilesCleanup.java:216)
	at com.carrotsearch.randomizedtesting.rules.TestRuleAdapter$1.afterAlways(TestRuleAdapter.java:31)
	at com.carrotsearch.randomizedtesting.rules.StatementAdapter.evaluate(StatementAdapter.java:43)
	at com.carrotsearch.randomizedtesting.rules.StatementAdapter.evaluate(StatementAdapter.java:36)
	at org.apache.lucene.util.TestRuleAssertionsRequired$1.evaluate(TestRuleAssertionsRequired.java:53)
	at org.apache.lucene.util.TestRuleMarkFailure$1.evaluate(TestRuleMarkFailure.java:47)
	at org.apache.lucene.util.TestRuleIgnoreAfterMaxFailures$1.evaluate(TestRuleIgnoreAfterMaxFailures.java:64)
	at org.apache.lucene.util.TestRuleIgnoreTestSuites$1.evaluate(TestRuleIgnoreTestSuites.java:54)
	at com.carrotsearch.randomizedtesting.rules.StatementAdapter.evaluate(StatementAdapter.java:36)
	at com.carrotsearch.randomizedtesting.ThreadLeakControl$StatementRunner.run(ThreadLeakControl.java:368)
	at java.lang.Thread.run(Thread.java:748)


FAILED:  org.apache.solr.update.processor.TimeRoutedAliasUpdateProcessorTest.testParse

Error Message:
Error from server at http://127.0.0.1:53232/solr: Collection : myalias_2017-10-24 is part of alias myalias remove or modify the alias before removing this collection.

Stack Trace:
org.apache.solr.client.solrj.impl.HttpSolrClient$RemoteSolrException: Error from server at http://127.0.0.1:53232/solr: Collection : myalias_2017-10-24 is part of alias myalias remove or modify the alias before removing this collection.
	at __randomizedtesting.SeedInfo.seed([7F6301270602A436:10E64A7FBA7497D9]:0)
	at org.apache.solr.client.solrj.impl.HttpSolrClient.executeMethod(HttpSolrClient.java:643)
	at org.apache.solr.client.solrj.impl.HttpSolrClient.request(HttpSolrClient.java:255)
	at org.apache.solr.client.solrj.impl.HttpSolrClient.request(HttpSolrClient.java:244)
	at org.apache.solr.client.solrj.impl.LBHttpSolrClient.doRequest(LBHttpSolrClient.java:483)
	at org.apache.solr.client.solrj.impl.LBHttpSolrClient.request(LBHttpSolrClient.java:413)
	at org.apache.solr.client.solrj.impl.CloudSolrClient.sendRequest(CloudSolrClient.java:1104)
	at org.apache.solr.client.solrj.impl.CloudSolrClient.requestWithRetryOnStaleState(CloudSolrClient.java:884)
	at org.apache.solr.client.solrj.impl.CloudSolrClient.request(CloudSolrClient.java:817)
	at org.apache.solr.client.solrj.SolrRequest.process(SolrRequest.java:194)
	at org.apache.solr.client.solrj.SolrRequest.process(SolrRequest.java:211)
	at org.apache.solr.update.processor.TimeRoutedAliasUpdateProcessorTest.doBefore(TimeRoutedAliasUpdateProcessorTest.java:84)
	at sun.reflect.NativeMethodAccessorImpl.invoke0(Native Method)
	at sun.reflect.NativeMethodAccessorImpl.invoke(NativeMethodAccessorImpl.java:62)
	at sun.reflect.DelegatingMethodAccessorImpl.invoke(DelegatingMethodAccessorImpl.java:43)
	at java.lang.reflect.Method.invoke(Method.java:498)
	at com.carrotsearch.randomizedtesting.RandomizedRunner.invoke(RandomizedRunner.java:1737)
	at com.carrotsearch.randomizedtesting.RandomizedRunner$9.evaluate(RandomizedRunner.java:968)
	at com.carrotsearch.randomizedtesting.RandomizedRunner$10.evaluate(RandomizedRunner.java:984)
	at com.carrotsearch.randomizedtesting.rules.SystemPropertiesRestoreRule$1.evaluate(SystemPropertiesRestoreRule.java:57)
	at org.apache.lucene.util.TestRuleSetupTeardownChained$1.evaluate(TestRuleSetupTeardownChained.java:49)
	at org.apache.lucene.util.AbstractBeforeAfterRule$1.evaluate(AbstractBeforeAfterRule.java:45)
	at org.apache.lucene.util.TestRuleThreadAndTestName$1.evaluate(TestRuleThreadAndTestName.java:48)
	at org.apache.lucene.util.TestRuleIgnoreAfterMaxFailures$1.evaluate(TestRuleIgnoreAfterMaxFailures.java:64)
	at org.apache.lucene.util.TestRuleMarkFailure$1.evaluate(TestRuleMarkFailure.java:47)
	at com.carrotsearch.randomizedtesting.rules.StatementAdapter.evaluate(StatementAdapter.java:36)
	at com.carrotsearch.randomizedtesting.ThreadLeakControl$StatementRunner.run(ThreadLeakControl.java:368)
	at com.carrotsearch.randomizedtesting.ThreadLeakControl.forkTimeoutingTask(ThreadLeakControl.java:817)
	at com.carrotsearch.randomizedtesting.ThreadLeakControl$3.evaluate(ThreadLeakControl.java:468)
	at com.carrotsearch.randomizedtesting.RandomizedRunner.runSingleTest(RandomizedRunner.java:943)
	at com.carrotsearch.randomizedtesting.RandomizedRunner$5.evaluate(RandomizedRunner.java:829)
	at com.carrotsearch.randomizedtesting.RandomizedRunner$6.evaluate(RandomizedRunner.java:879)
	at com.carrotsearch.randomizedtesting.RandomizedRunner$7.evaluate(RandomizedRunner.java:890)
	at com.carrotsearch.randomizedtesting.rules.StatementAdapter.evaluate(StatementAdapter.java:36)
	at com.carrotsearch.randomizedtesting.rules.SystemPropertiesRestoreRule$1.evaluate(SystemPropertiesRestoreRule.java:57)
	at org.apache.lucene.util.AbstractBeforeAfterRule$1.evaluate(AbstractBeforeAfterRule.java:45)
	at com.carrotsearch.randomizedtesting.rules.StatementAdapter.evaluate(StatementAdapter.java:36)
	at org.apache.lucene.util.TestRuleStoreClassName$1.evaluate(TestRuleStoreClassName.java:41)
	at com.carrotsearch.randomizedtesting.rules.NoShadowingOrOverridesOnMethodsRule$1.evaluate(NoShadowingOrOverridesOnMethodsRule.java:40)
	at com.carrotsearch.randomizedtesting.rules.NoShadowingOrOverridesOnMethodsRule$1.evaluate(NoShadowingOrOverridesOnMethodsRule.java:40)
	at com.carrotsearch.randomizedtesting.rules.StatementAdapter.evaluate(StatementAdapter.java:36)
	at com.carrotsearch.randomizedtesting.rules.StatementAdapter.evaluate(StatementAdapter.java:36)
	at com.carrotsearch.randomizedtesting.rules.StatementAdapter.evaluate(StatementAdapter.java:36)
	at org.apache.lucene.util.TestRuleAssertionsRequired$1.evaluate(TestRuleAssertionsRequired.java:53)
	at org.apache.lucene.util.TestRuleMarkFailure$1.evaluate(TestRuleMarkFailure.java:47)
	at org.apache.lucene.util.TestRuleIgnoreAfterMaxFailures$1.evaluate(TestRuleIgnoreAfterMaxFailures.java:64)
	at org.apache.lucene.util.TestRuleIgnoreTestSuites$1.evaluate(TestRuleIgnoreTestSuites.java:54)
	at com.carrotsearch.randomizedtesting.rules.StatementAdapter.evaluate(StatementAdapter.java:36)
	at com.carrotsearch.randomizedtesting.ThreadLeakControl$StatementRunner.run(ThreadLeakControl.java:368)
	at java.lang.Thread.run(Thread.java:748)


FAILED:  junit.framework.TestSuite.org.apache.solr.update.processor.TestOpenNLPExtractNamedEntitiesUpdateProcessorFactory

Error Message:
Could not remove the following files (in the order of attempts):    C:\Users\jenkins\workspace\Lucene-Solr-master-Windows\solr\build\contrib\solr-analysis-extras\test\J1\temp\solr.update.processor.TestOpenNLPExtractNamedEntitiesUpdateProcessorFactory_A9C09B2183C6CEA1-001\tempDir-001\collection1\conf: java.nio.file.DirectoryNotEmptyException: C:\Users\jenkins\workspace\Lucene-Solr-master-Windows\solr\build\contrib\solr-analysis-extras\test\J1\temp\solr.update.processor.TestOpenNLPExtractNamedEntitiesUpdateProcessorFactory_A9C09B2183C6CEA1-001\tempDir-001\collection1\conf    C:\Users\jenkins\workspace\Lucene-Solr-master-Windows\solr\build\contrib\solr-analysis-extras\test\J1\temp\solr.update.processor.TestOpenNLPExtractNamedEntitiesUpdateProcessorFactory_A9C09B2183C6CEA1-001\tempDir-001\collection1: java.nio.file.DirectoryNotEmptyException: C:\Users\jenkins\workspace\Lucene-Solr-master-Windows\solr\build\contrib\solr-analysis-extras\test\J1\temp\solr.update.processor.TestOpenNLPExtractNamedEntitiesUpdateProcessorFactory_A9C09B2183C6CEA1-001\tempDir-001\collection1    C:\Users\jenkins\workspace\Lucene-Solr-master-Windows\solr\build\contrib\solr-analysis-extras\test\J1\temp\solr.update.processor.TestOpenNLPExtractNamedEntitiesUpdateProcessorFactory_A9C09B2183C6CEA1-001\tempDir-001: java.nio.file.DirectoryNotEmptyException: C:\Users\jenkins\workspace\Lucene-Solr-master-Windows\solr\build\contrib\solr-analysis-extras\test\J1\temp\solr.update.processor.TestOpenNLPExtractNamedEntitiesUpdateProcessorFactory_A9C09B2183C6CEA1-001\tempDir-001    C:\Users\jenkins\workspace\Lucene-Solr-master-Windows\solr\build\contrib\solr-analysis-extras\test\J1\temp\solr.update.processor.TestOpenNLPExtractNamedEntitiesUpdateProcessorFactory_A9C09B2183C6CEA1-001\tempDir-001\collection1\conf\en-test-sent.bin: java.nio.file.AccessDeniedException: C:\Users\jenkins\workspace\Lucene-Solr-master-Windows\solr\build\contrib\solr-analysis-extras\test\J1\temp\solr.update.processor.TestOpenNLPExtractNamedEntitiesUpdateProcessorFactory_A9C09B2183C6CEA1-001\tempDir-001\collection1\conf\en-test-sent.bin    C:\Users\jenkins\workspace\Lucene-Solr-master-Windows\solr\build\contrib\solr-analysis-extras\test\J1\temp\solr.update.processor.TestOpenNLPExtractNamedEntitiesUpdateProcessorFactory_A9C09B2183C6CEA1-001\tempDir-001\collection1\conf\en-test-tokenizer.bin: java.nio.file.AccessDeniedException: C:\Users\jenkins\workspace\Lucene-Solr-master-Windows\solr\build\contrib\solr-analysis-extras\test\J1\temp\solr.update.processor.TestOpenNLPExtractNamedEntitiesUpdateProcessorFactory_A9C09B2183C6CEA1-001\tempDir-001\collection1\conf\en-test-tokenizer.bin    C:\Users\jenkins\workspace\Lucene-Solr-master-Windows\solr\build\contrib\solr-analysis-extras\test\J1\temp\solr.update.processor.TestOpenNLPExtractNamedEntitiesUpdateProcessorFactory_A9C09B2183C6CEA1-001\tempDir-001\collection1\conf\en-test-ner-person.bin: java.nio.file.AccessDeniedException: C:\Users\jenkins\workspace\Lucene-Solr-master-Windows\solr\build\contrib\solr-analysis-extras\test\J1\temp\solr.update.processor.TestOpenNLPExtractNamedEntitiesUpdateProcessorFactory_A9C09B2183C6CEA1-001\tempDir-001\collection1\conf\en-test-ner-person.bin    C:\Users\jenkins\workspace\Lucene-Solr-master-Windows\solr\build\contrib\solr-analysis-extras\test\J1\temp\solr.update.processor.TestOpenNLPExtractNamedEntitiesUpdateProcessorFactory_A9C09B2183C6CEA1-001: java.nio.file.DirectoryNotEmptyException: C:\Users\jenkins\workspace\Lucene-Solr-master-Windows\solr\build\contrib\solr-analysis-extras\test\J1\temp\solr.update.processor.TestOpenNLPExtractNamedEntitiesUpdateProcessorFactory_A9C09B2183C6CEA1-001 

Stack Trace:
java.io.IOException: Could not remove the following files (in the order of attempts):
   C:\Users\jenkins\workspace\Lucene-Solr-master-Windows\solr\build\contrib\solr-analysis-extras\test\J1\temp\solr.update.processor.TestOpenNLPExtractNamedEntitiesUpdateProcessorFactory_A9C09B2183C6CEA1-001\tempDir-001\collection1\conf: java.nio.file.DirectoryNotEmptyException: C:\Users\jenkins\workspace\Lucene-Solr-master-Windows\solr\build\contrib\solr-analysis-extras\test\J1\temp\solr.update.processor.TestOpenNLPExtractNamedEntitiesUpdateProcessorFactory_A9C09B2183C6CEA1-001\tempDir-001\collection1\conf
   C:\Users\jenkins\workspace\Lucene-Solr-master-Windows\solr\build\contrib\solr-analysis-extras\test\J1\temp\solr.update.processor.TestOpenNLPExtractNamedEntitiesUpdateProcessorFactory_A9C09B2183C6CEA1-001\tempDir-001\collection1: java.nio.file.DirectoryNotEmptyException: C:\Users\jenkins\workspace\Lucene-Solr-master-Windows\solr\build\contrib\solr-analysis-extras\test\J1\temp\solr.update.processor.TestOpenNLPExtractNamedEntitiesUpdateProcessorFactory_A9C09B2183C6CEA1-001\tempDir-001\collection1
   C:\Users\jenkins\workspace\Lucene-Solr-master-Windows\solr\build\contrib\solr-analysis-extras\test\J1\temp\solr.update.processor.TestOpenNLPExtractNamedEntitiesUpdateProcessorFactory_A9C09B2183C6CEA1-001\tempDir-001: java.nio.file.DirectoryNotEmptyException: C:\Users\jenkins\workspace\Lucene-Solr-master-Windows\solr\build\contrib\solr-analysis-extras\test\J1\temp\solr.update.processor.TestOpenNLPExtractNamedEntitiesUpdateProcessorFactory_A9C09B2183C6CEA1-001\tempDir-001
   C:\Users\jenkins\workspace\Lucene-Solr-master-Windows\solr\build\contrib\solr-analysis-extras\test\J1\temp\solr.update.processor.TestOpenNLPExtractNamedEntitiesUpdateProcessorFactory_A9C09B2183C6CEA1-001\tempDir-001\collection1\conf\en-test-sent.bin: java.nio.file.AccessDeniedException: C:\Users\jenkins\workspace\Lucene-Solr-master-Windows\solr\build\contrib\solr-analysis-extras\test\J1\temp\solr.update.processor.TestOpenNLPExtractNamedEntitiesUpdateProcessorFactory_A9C09B2183C6CEA1-001\tempDir-001\collection1\conf\en-test-sent.bin
   C:\Users\jenkins\workspace\Lucene-Solr-master-Windows\solr\build\contrib\solr-analysis-extras\test\J1\temp\solr.update.processor.TestOpenNLPExtractNamedEntitiesUpdateProcessorFactory_A9C09B2183C6CEA1-001\tempDir-001\collection1\conf\en-test-tokenizer.bin: java.nio.file.AccessDeniedException: C:\Users\jenkins\workspace\Lucene-Solr-master-Windows\solr\build\contrib\solr-analysis-extras\test\J1\temp\solr.update.processor.TestOpenNLPExtractNamedEntitiesUpdateProcessorFactory_A9C09B2183C6CEA1-001\tempDir-001\collection1\conf\en-test-tokenizer.bin
   C:\Users\jenkins\workspace\Lucene-Solr-master-Windows\solr\build\contrib\solr-analysis-extras\test\J1\temp\solr.update.processor.TestOpenNLPExtractNamedEntitiesUpdateProcessorFactory_A9C09B2183C6CEA1-001\tempDir-001\collection1\conf\en-test-ner-person.bin: java.nio.file.AccessDeniedException: C:\Users\jenkins\workspace\Lucene-Solr-master-Windows\solr\build\contrib\solr-analysis-extras\test\J1\temp\solr.update.processor.TestOpenNLPExtractNamedEntitiesUpdateProcessorFactory_A9C09B2183C6CEA1-001\tempDir-001\collection1\conf\en-test-ner-person.bin
   C:\Users\jenkins\workspace\Lucene-Solr-master-Windows\solr\build\contrib\solr-analysis-extras\test\J1\temp\solr.update.processor.TestOpenNLPExtractNamedEntitiesUpdateProcessorFactory_A9C09B2183C6CEA1-001: java.nio.file.DirectoryNotEmptyException: C:\Users\jenkins\workspace\Lucene-Solr-master-Windows\solr\build\contrib\solr-analysis-extras\test\J1\temp\solr.update.processor.TestOpenNLPExtractNamedEntitiesUpdateProcessorFactory_A9C09B2183C6CEA1-001

	at __randomizedtesting.SeedInfo.seed([A9C09B2183C6CEA1]:0)
	at org.apache.lucene.util.IOUtils.rm(IOUtils.java:329)
	at org.apache.lucene.util.TestRuleTemporaryFilesCleanup.afterAlways(TestRuleTemporaryFilesCleanup.java:216)
	at com.carrotsearch.randomizedtesting.rules.TestRuleAdapter$1.afterAlways(TestRuleAdapter.java:31)
	at com.carrotsearch.randomizedtesting.rules.StatementAdapter.evaluate(StatementAdapter.java:43)
	at com.carrotsearch.randomizedtesting.rules.StatementAdapter.evaluate(StatementAdapter.java:36)
	at org.apache.lucene.util.TestRuleAssertionsRequired$1.evaluate(TestRuleAssertionsRequired.java:53)
	at org.apache.lucene.util.TestRuleMarkFailure$1.evaluate(TestRuleMarkFailure.java:47)
	at org.apache.lucene.util.TestRuleIgnoreAfterMaxFailures$1.evaluate(TestRuleIgnoreAfterMaxFailures.java:64)
	at org.apache.lucene.util.TestRuleIgnoreTestSuites$1.evaluate(TestRuleIgnoreTestSuites.java:54)
	at com.carrotsearch.randomizedtesting.rules.StatementAdapter.evaluate(StatementAdapter.java:36)
	at com.carrotsearch.randomizedtesting.ThreadLeakControl$StatementRunner.run(ThreadLeakControl.java:368)
	at java.lang.Thread.run(Thread.java:748)




Build Log:
[...truncated 552 lines...]
   [junit4] Suite: org.apache.lucene.store.TestMultiMMap
   [junit4]   2> NOTE: test params are: codec=Asserting(Lucene70): {docid=PostingsFormat(name=LuceneVarGapFixedInterval), junk=TestBloomFilteredLucenePostings(BloomFilteringPostingsFormat(Lucene50(blocksize=128)))}, docValues:{}, maxPointsInLeafNode=201, maxMBSortInHeap=7.96514273433764, sim=Asserting(org.apache.lucene.search.similarities.AssertingSimilarity@151b7b7), locale=es-CL, timezone=Hongkong
   [junit4]   2> NOTE: Windows 10 10.0 x86/Oracle Corporation 1.8.0_144 (32-bit)/cpus=3,threads=1,free=38541264,total=71380992
   [junit4]   2> NOTE: All tests run in this JVM: [TestQueryBuilder, TestReaderClosed, TestSpanBoostQuery, TestOneMergeWrappingMergePolicy, TestCharArrayMap, TestSnapshotDeletionPolicy, TestLucene50StoredFieldsFormat, TestAddIndexes, TestBlockPostingsFormat2, TestFlushByRamOrCountsPolicy, TestByteBlockPool, Test2BBKDPoints, TestField, TestMixedDocValuesUpdates, TestCollectionUtil, TestUnicodeUtil, TestSearchWithThreads, Test2BPoints, TestOperations, TestDoubleValuesSource, TestDirectory, TestDocInverterPerFieldErrorInfo, TestFixedLengthBytesRefArray, TestTermQuery, TestFieldInvertState, TestTieredMergePolicy, TestSort, TestCachingTokenFilter, TestHighCompressionMode, TestParallelLeafReader, TestTimeLimitingCollector, TestBasicModelG, TestDirectMonotonic, TestBagOfPositions, TestIndexInput, TestIndexWriterMergePolicy, TestRoaringDocIdSet, TestDocIdSetBuilder, TestDoc, TestDocValuesIndexing, TestMultiLevelSkipList, TestUsageTrackingFilterCachingPolicy, TestIntroSelector, TestLRUQueryCache, TestUTF32ToUTF8, TestQueryRescorer, TestSwappedIndexFiles, TestSpanExplanationsOfNonMatches, TestIndexWriterDeleteByQuery, TestSmallFloat, TestParallelCompositeReader, TestIndexWriterWithThreads, TestIntBlockPool, Test2BSortedDocValuesOrds, TestPolygon, TestPointValues, TestIndexCommit, TestScorerPerf, TestBoostQuery, TestFieldCacheRewriteMethod, TestNeverDelete, TestAssertions, TestRAMDirectory, Test2BBinaryDocValues, TestNumericUtils, TestIndexSorting, TestComplexExplanations, Test2BPagedBytes, TestParallelReaderEmptyIndex, TestLevenshteinAutomata, TestSpanTermQuery, TestMultiMMap]
   [junit4]   2> NOTE: reproduce with: ant test  -Dtestcase=TestMultiMMap -Dtests.seed=8157EE5210AD88CF -Dtests.slow=true -Dtests.locale=es-CL -Dtests.timezone=Hongkong -Dtests.asserts=true -Dtests.file.encoding=Cp1252
   [junit4] ERROR   0.00s J0 | TestMultiMMap (suite) <<<
   [junit4]    > Throwable #1: java.io.IOException: Could not remove the following files (in the order of attempts):
   [junit4]    >    C:\Users\jenkins\workspace\Lucene-Solr-master-Windows\lucene\build\core\test\J0\temp\lucene.store.TestMultiMMap_8157EE5210AD88CF-001\testSeekSliceZero-021: java.nio.file.DirectoryNotEmptyException: C:\Users\jenkins\workspace\Lucene-Solr-master-Windows\lucene\build\core\test\J0\temp\lucene.store.TestMultiMMap_8157EE5210AD88CF-001\testSeekSliceZero-021
   [junit4]    > 	at __randomizedtesting.SeedInfo.seed([8157EE5210AD88CF]:0)
   [junit4]    > 	at org.apache.lucene.util.IOUtils.rm(IOUtils.java:329)
   [junit4]    > 	at java.lang.Thread.run(Thread.java:748)
   [junit4] Completed [99/476 (1!)] on J0 in 4.54s, 54 tests, 1 error <<< FAILURES!

[...truncated 12048 lines...]
   [junit4] Suite: org.apache.solr.handler.admin.CoreAdminCreateDiscoverTest
   [junit4]   2> Creating dataDir: C:\Users\jenkins\workspace\Lucene-Solr-master-Windows\solr\build\solr-core\test\J1\temp\solr.handler.admin.CoreAdminCreateDiscoverTest_7F6301270602A436-001\init-core-data-001
   [junit4]   2> 1093448 WARN  (SUITE-CoreAdminCreateDiscoverTest-seed#[7F6301270602A436]-worker) [    ] o.a.s.SolrTestCaseJ4 startTrackingSearchers: numOpens=27 numCloses=27
   [junit4]   2> 1093452 INFO  (SUITE-CoreAdminCreateDiscoverTest-seed#[7F6301270602A436]-worker) [    ] o.a.s.SolrTestCaseJ4 Using PointFields (NUMERIC_POINTS_SYSPROP=true) w/NUMERIC_DOCVALUES_SYSPROP=true
   [junit4]   2> 1093459 INFO  (SUITE-CoreAdminCreateDiscoverTest-seed#[7F6301270602A436]-worker) [    ] o.a.s.SolrTestCaseJ4 Randomized ssl (false) and clientAuth (false) via: @org.apache.solr.util.RandomizeSSL(reason=, value=NaN, ssl=NaN, clientAuth=NaN)
   [junit4]   2> 1093459 INFO  (SUITE-CoreAdminCreateDiscoverTest-seed#[7F6301270602A436]-worker) [    ] o.a.s.SolrTestCaseJ4 SecureRandom sanity checks: test.solr.allowed.securerandom=null & java.security.egd=file:/dev/./urandom
   [junit4]   2> 1093463 INFO  (SUITE-CoreAdminCreateDiscoverTest-seed#[7F6301270602A436]-worker) [    ] o.a.s.c.SolrXmlConfig Loading container configuration from C:\Users\jenkins\workspace\Lucene-Solr-master-Windows\solr\build\solr-core\test\J1\temp\solr.handler.admin.CoreAdminCreateDiscoverTest_7F6301270602A436-001\tempDir-001\solr.xml
   [junit4]   2> 1093479 INFO  (SUITE-CoreAdminCreateDiscoverTest-seed#[7F6301270602A436]-worker) [    ] o.a.s.c.SolrXmlConfig MBean server found: com.sun.jmx.mbeanserver.JmxMBeanServer@b5a292, but no JMX reporters were configured - adding default JMX reporter.
   [junit4]   2> 1093655 INFO  (SUITE-CoreAdminCreateDiscoverTest-seed#[7F6301270602A436]-worker) [    ] o.a.s.m.r.SolrJmxReporter JMX monitoring for 'solr.node' (registry 'solr.node') enabled at server: com.sun.jmx.mbeanserver.JmxMBeanServer@b5a292
   [junit4]   2> 1093671 INFO  (SUITE-CoreAdminCreateDiscoverTest-seed#[7F6301270602A436]-worker) [    ] o.a.s.m.r.SolrJmxReporter JMX monitoring for 'solr.jvm' (registry 'solr.jvm') enabled at server: com.sun.jmx.mbeanserver.JmxMBeanServer@b5a292
   [junit4]   2> 1093672 INFO  (SUITE-CoreAdminCreateDiscoverTest-seed#[7F6301270602A436]-worker) [    ] o.a.s.m.r.SolrJmxReporter JMX monitoring for 'solr.jetty' (registry 'solr.jetty') enabled at server: com.sun.jmx.mbeanserver.JmxMBeanServer@b5a292
   [junit4]   2> 1093675 INFO  (SUITE-CoreAdminCreateDiscoverTest-seed#[7F6301270602A436]-worker) [    ] o.a.s.c.CorePropertiesLocator Found 0 core definitions underneath C:\Users\jenkins\workspace\Lucene-Solr-master-Windows\solr\build\solr-core\test\J1\temp\solr.handler.admin.CoreAdminCreateDiscoverTest_7F6301270602A436-001\tempDir-001
   [junit4]   2> 1093688 INFO  (TEST-CoreAdminCreateDiscoverTest.testCannotCreateTwoCoresWithSameInstanceDir-seed#[7F6301270602A436]) [    ] o.a.s.SolrTestCaseJ4 ###Starting testCannotCreateTwoCoresWithSameInstanceDir
   [junit4]   2> 1093699 INFO  (TEST-CoreAdminCreateDiscoverTest.testCannotCreateTwoCoresWithSameInstanceDir-seed#[7F6301270602A436]) [    ] o.a.s.c.TransientSolrCoreCacheDefault Allocating transient cache for 2147483647 transient cores
   [junit4]   2> 1093699 INFO  (TEST-CoreAdminCreateDiscoverTest.testCannotCreateTwoCoresWithSameInstanceDir-seed#[7F6301270602A436]) [    ] o.a.s.h.a.CoreAdminOperation core create command schema=schema_ren.xml&dataDir=C:\Users\jenkins\workspace\Lucene-Solr-master-Windows\solr\build\solr-core\test\J1\temp\solr.handler.admin.CoreAdminCreateDiscoverTest_7F6301270602A436-001\tempDir-001\duplicate\data&name=duplicate&action=CREATE&instanceDir=C:\Users\jenkins\workspace\Lucene-Solr-master-Windows\solr\build\solr-core\test\J1\temp\solr.handler.admin.CoreAdminCreateDiscoverTest_7F6301270602A436-001\tempDir-001\duplicate&config=solrconfig_ren.xml&wt=xml
   [junit4]   2> 1093778 INFO  (TEST-CoreAdminCreateDiscoverTest.testCannotCreateTwoCoresWithSameInstanceDir-seed#[7F6301270602A436]) [    x:duplicate] o.a.s.c.SolrConfig Using Lucene MatchVersion: 8.0.0
   [junit4]   2> 1093793 INFO  (TEST-CoreAdminCreateDiscoverTest.testCannotCreateTwoCoresWithSameInstanceDir-seed#[7F6301270602A436]) [    x:duplicate] o.a.s.s.IndexSchema [duplicate] Schema name=tiny
   [junit4]   2> 1093803 INFO  (TEST-CoreAdminCreateDiscoverTest.testCannotCreateTwoCoresWithSameInstanceDir-seed#[7F6301270602A436]) [    x:duplicate] o.a.s.s.IndexSchema Loaded schema tiny/1.1 with uniqueid field id
   [junit4]   2> 1093804 INFO  (TEST-CoreAdminCreateDiscoverTest.testCannotCreateTwoCoresWithSameInstanceDir-seed#[7F6301270602A436]) [    x:duplicate] o.a.s.c.CoreContainer Creating SolrCore 'duplicate' using configuration from instancedir C:\Users\jenkins\workspace\Lucene-Solr-master-Windows\solr\build\solr-core\test\J1\temp\solr.handler.admin.CoreAdminCreateDiscoverTest_7F6301270602A436-001\tempDir-001\duplicate, trusted=true
   [junit4]   2> 1093804 INFO  (TEST-CoreAdminCreateDiscoverTest.testCannotCreateTwoCoresWithSameInstanceDir-seed#[7F6301270602A436]) [    x:duplicate] o.a.s.m.r.SolrJmxReporter JMX monitoring for 'solr.core.duplicate' (registry 'solr.core.duplicate') enabled at server: com.sun.jmx.mbeanserver.JmxMBeanServer@b5a292
   [junit4]   2> 1093804 INFO  (TEST-CoreAdminCreateDiscoverTest.testCannotCreateTwoCoresWithSameInstanceDir-seed#[7F6301270602A436]) [    x:duplicate] o.a.s.c.SolrCore solr.RecoveryStrategy.Builder
   [junit4]   2> 1093805 INFO  (TEST-CoreAdminCreateDiscoverTest.testCannotCreateTwoCoresWithSameInstanceDir-seed#[7F6301270602A436]) [    x:duplicate] o.a.s.c.SolrCore [[duplicate] ] Opening new SolrCore at [C:\Users\jenkins\workspace\Lucene-Solr-master-Windows\solr\build\solr-core\test\J1\temp\solr.handler.admin.CoreAdminCreateDiscoverTest_7F6301270602A436-001\tempDir-001\duplicate], dataDir=[C:\Users\jenkins\workspace\Lucene-Solr-master-Windows\solr\build\solr-core\test\J1\temp\solr.handler.admin.CoreAdminCreateDiscoverTest_7F6301270602A436-001\tempDir-001\duplicate\data\]
   [junit4]   2> 1093816 INFO  (TEST-CoreAdminCreateDiscoverTest.testCannotCreateTwoCoresWithSameInstanceDir-seed#[7F6301270602A436]) [    x:duplicate] o.a.s.u.RandomMergePolicy RandomMergePolicy wrapping class org.apache.lucene.index.LogDocMergePolicy: [LogDocMergePolicy: minMergeSize=1000, mergeFactor=46, maxMergeSize=9223372036854775807, maxMergeSizeForForcedMerge=9223372036854775807, calibrateSizeByDeletes=false, maxMergeDocs=2147483647, maxCFSSegmentSizeMB=8.796093022207999E12, noCFSRatio=0.2177359182475696]
   [junit4]   2> 1093986 INFO  (TEST-CoreAdminCreateDiscoverTest.testCannotCreateTwoCoresWithSameInstanceDir-seed#[7F6301270602A436]) [    x:duplicate] o.a.s.u.CommitTracker Hard AutoCommit: disabled
   [junit4]   2> 1093986 INFO  (TEST-CoreAdminCreateDiscoverTest.testCannotCreateTwoCoresWithSameInstanceDir-seed#[7F6301270602A436]) [    x:duplicate] o.a.s.u.CommitTracker Soft AutoCommit: disabled
   [junit4]   2> 1093989 INFO  (TEST-CoreAdminCreateDiscoverTest.testCannotCreateTwoCoresWithSameInstanceDir-seed#[7F6301270602A436]) [    x:duplicate] o.a.s.u.RandomMergePolicy RandomMergePolicy wrapping class org.apache.lucene.index.LogDocMergePolicy: [LogDocMergePolicy: minMergeSize=1000, mergeFactor=47, maxMergeSize=9223372036854775807, maxMergeSizeForForcedMerge=9223372036854775807, calibrateSizeByDeletes=false, maxMergeDocs=2147483647, maxCFSSegmentSizeMB=8.796093022207999E12, noCFSRatio=0.0]
   [junit4]   2> 1093989 INFO  (TEST-CoreAdminCreateDiscoverTest.testCannotCreateTwoCoresWithSameInstanceDir-seed#[7F6301270602A436]) [    x:duplicate] o.a.s.s.SolrIndexSearcher Opening [Searcher@1bf51e7[duplicate] main]
   [junit4]   2> 1093991 INFO  (TEST-CoreAdminCreateDiscoverTest.testCannotCreateTwoCoresWithSameInstanceDir-seed#[7F6301270602A436]) [    x:duplicate] o.a.s.r.ManagedResourceStorage File-based storage initialized to use dir: C:\Users\jenkins\workspace\Lucene-Solr-master-Windows\solr\build\solr-core\test\J1\temp\solr.handler.admin.CoreAdminCreateDiscoverTest_7F6301270602A436-001\tempDir-001\duplicate\conf
   [junit4]   2> 1093994 INFO  (TEST-CoreAdminCreateDiscoverTest.testCannotCreateTwoCoresWithSameInstanceDir-seed#[7F6301270602A436]) [    x:duplicate] o.a.s.h.ReplicationHandler Commits will be reserved for 10000ms.
   [junit4]   2> 1093996 INFO  (searcherExecutor-4219-thread-1-processing-x:duplicate) [    x:duplicate] o.a.s.c.SolrCore [duplicate] Registered new searcher Searcher@1bf51e7[duplicate] main{ExitableDirectoryReader(UninvertingDirectoryReader())}
   [junit4]   2> 1093997 INFO  (TEST-CoreAdminCreateDiscoverTest.testCannotCreateTwoCoresWithSameInstanceDir-seed#[7F6301270602A436]) [    x:duplicate] o.a.s.h.a.CoreAdminOperation core create command schema=schema_ren.xml&dataDir=C:\Users\jenkins\workspace\Lucene-Solr-master-Windows\solr\build\solr-core\test\J1\temp\solr.handler.admin.CoreAdminCreateDiscoverTest_7F6301270602A436-001\tempDir-001\duplicate\data&name=different_name_core&action=CREATE&instanceDir=C:\Users\jenkins\workspace\Lucene-Solr-master-Windows\solr\build\solr-core\test\J1\temp\solr.handler.admin.CoreAdminCreateDiscoverTest_7F6301270602A436-001\tempDir-001\duplicate&config=solrconfig_ren.xml&wt=xml
   [junit4]   2> 1094001 INFO  (TEST-CoreAdminCreateDiscoverTest.testCannotCreateTwoCoresWithSameInstanceDir-seed#[7F6301270602A436]) [    x:duplicate] o.a.s.SolrTestCaseJ4 ###Ending testCannotCreateTwoCoresWithSameInstanceDir
   [junit4]   2> 1094012 INFO  (TEST-CoreAdminCreateDiscoverTest.testCreateSavesRegProps-seed#[7F6301270602A436]) [    x:duplicate] o.a.s.SolrTestCaseJ4 ###Starting testCreateSavesRegProps
   [junit4]   2> 1094022 INFO  (TEST-CoreAdminCreateDiscoverTest.testCreateSavesRegProps-seed#[7F6301270602A436]) [    x:duplicate] o.a.s.h.a.CoreAdminOperation core create command schema=schema_ren.xml&dataDir=C:\Users\jenkins\workspace\Lucene-Solr-master-Windows\solr\build\solr-core\test\J1\temp\solr.handler.admin.CoreAdminCreateDiscoverTest_7F6301270602A436-001\tempDir-001\normal\data&name=normal&action=CREATE&instanceDir=C:\Users\jenkins\workspace\Lucene-Solr-master-Windows\solr\build\solr-core\test\J1\temp\solr.handler.admin.CoreAdminCreateDiscoverTest_7F6301270602A436-001\tempDir-001\normal&config=solrconfig_ren.xml&wt=xml
   [junit4]   2> 1094085 INFO  (TEST-CoreAdminCreateDiscoverTest.testCreateSavesRegProps-seed#[7F6301270602A436]) [    x:duplicate] o.a.s.c.SolrConfig Using Lucene MatchVersion: 8.0.0
   [junit4]   2> 1094112 INFO  (TEST-CoreAdminCreateDiscoverTest.testCreateSavesRegProps-seed#[7F6301270602A436]) [    x:duplicate] o.a.s.s.IndexSchema [normal] Schema name=tiny
   [junit4]   2> 1094123 INFO  (TEST-CoreAdminCreateDiscoverTest.testCreateSavesRegProps-seed#[7F6301270602A436]) [    x:duplicate] o.a.s.s.IndexSchema Loaded schema tiny/1.1 with uniqueid field id
   [junit4]   2> 1094123 INFO  (TEST-CoreAdminCreateDiscoverTest.testCreateSavesRegProps-seed#[7F6301270602A436]) [    x:duplicate] o.a.s.c.CoreContainer Creating SolrCore 'normal' using configuration from instancedir C:\Users\jenkins\workspace\Lucene-Solr-master-Windows\solr\build\solr-core\test\J1\temp\solr.handler.admin.CoreAdminCreateDiscoverTest_7F6301270602A436-001\tempDir-001\normal, trusted=true
   [junit4]   2> 1094124 INFO  (TEST-CoreAdminCreateDiscoverTest.testCreateSavesRegProps-seed#[7F6301270602A436]) [    x:duplicate] o.a.s.m.r.SolrJmxReporter JMX monitoring for 'solr.core.normal' (registry 'solr.core.normal') enabled at server: com.sun.jmx.mbeanserver.JmxMBeanServer@b5a292
   [junit4]   2> 1094124 INFO  (TEST-CoreAdminCreateDiscoverTest.testCreateSavesRegProps-seed#[7F6301270602A436]) [    x:duplicate] o.a.s.c.SolrCore solr.RecoveryStrategy.Builder
   [junit4]   2> 1094124 INFO  (TEST-CoreAdminCreateDiscoverTest.testCreateSavesRegProps-seed#[7F6301270602A436]) [    x:duplicate] o.a.s.c.SolrCore [[normal] ] Opening new SolrCore at [C:\Users\jenkins\workspace\Lucene-Solr-master-Windows\solr\build\solr-core\test\J1\temp\solr.handler.admin.CoreAdminCreateDiscoverTest_7F6301270602A436-001\tempDir-001\normal], dataDir=[C:\Users\jenkins\workspace\Lucene-Solr-master-Windows\solr\build\solr-core\test\J1\temp\solr.handler.admin.CoreAdminCreateDiscoverTest_7F6301270602A436-001\tempDir-001\normal\data\]
   [junit4]   2> 1094134 INFO  (TEST-CoreAdminCreateDiscoverTest.testCreateSavesRegProps-seed#[7F6301270602A436]) [    x:duplicate] o.a.s.u.RandomMergePolicy RandomMergePolicy wrapping class org.apache.lucene.index.TieredMergePolicy: [TieredMergePolicy: maxMergeAtOnce=35, maxMergeAtOnceExplicit=42, maxMergedSegmentMB=50.45703125, floorSegmentMB=0.3232421875, forceMergeDeletesPctAllowed=0.9129243167198597, segmentsPerTier=15.0, maxCFSSegmentSizeMB=8.796093022207999E12, noCFSRatio=1.0
   [junit4]   2> 1094305 INFO  (TEST-CoreAdminCreateDiscoverTest.testCreateSavesRegProps-seed#[7F6301270602A436]) [    x:duplicate] o.a.s.u.CommitTracker Hard AutoCommit: disabled
   [junit4]   2> 1094305 INFO  (TEST-CoreAdminCreateDiscoverTest.testCreateSavesRegProps-seed#[7F6301270602A436]) [    x:duplicate] o.a.s.u.CommitTracker Soft AutoCommit: disabled
   [junit4]   2> 1094308 INFO  (TEST-CoreAdminCreateDiscoverTest.testCreateSavesRegProps-seed#[7F6301270602A436]) [    x:duplicate] o.a.s.u.RandomMergePolicy RandomMergePolicy wrapping class org.apache.lucene.index.TieredMergePolicy: [TieredMergePolicy: maxMergeAtOnce=40, maxMergeAtOnceExplicit=46, maxMergedSegmentMB=67.0068359375, floorSegmentMB=2.12109375, forceMergeDeletesPctAllowed=7.468557632906201, segmentsPerTier=15.0, maxCFSSegmentSizeMB=8.796093022207999E12, noCFSRatio=1.0
   [junit4]   2> 1094309 INFO  (TEST-CoreAdminCreateDiscoverTest.testCreateSavesRegProps-seed#[7F6301270602A436]) [    x:duplicate] o.a.s.s.SolrIndexSearcher Opening [Searcher@c407a2[normal] main]
   [junit4]   2> 1094309 INFO  (TEST-CoreAdminCreateDiscoverTest.testCreateSavesRegProps-seed#[7F6301270602A436]) [    x:duplicate] o.a.s.r.ManagedResourceStorage File-based storage initialized to use dir: C:\Users\jenkins\workspace\Lucene-Solr-master-Windows\solr\build\solr-core\test\J1\temp\solr.handler.admin.CoreAdminCreateDiscoverTest_7F6301270602A436-001\tempDir-001\normal\conf
   [junit4]   2> 1094311 INFO  (TEST-CoreAdminCreateDiscoverTest.testCreateSavesRegProps-seed#[7F6301270602A436]) [    x:duplicate] o.a.s.h.ReplicationHandler Commits will be reserved for 10000ms.
   [junit4]   2> 1094313 INFO  (searcherExecutor-4223-thread-1-processing-x:duplicate) [    x:duplicate] o.a.s.c.SolrCore [normal] Registered new searcher Searcher@c407a2[normal] main{ExitableDirectoryReader(UninvertingDirectoryReader())}
   [junit4]   2> 1094314 INFO  (TEST-CoreAdminCreateDiscoverTest.testCreateSavesRegProps-seed#[7F6301270602A436]) [    x:duplicate] o.a.s.SolrTestCaseJ4 ###Ending testCreateSavesRegProps
   [junit4]   2> 1094331 INFO  (TEST-CoreAdminCreateDiscoverTest.testInstanceDirAsPropertyParam-seed#[7F6301270602A436]) [    x:duplicate] o.a.s.SolrTestCaseJ4 ###Starting testInstanceDirAsPropertyParam
   [junit4]   2> 1094342 INFO  (TEST-CoreAdminCreateDiscoverTest.testInstanceDirAsPropertyParam-seed#[7F6301270602A436]) [    x:duplicate] o.a.s.h.a.CoreAdminOperation core create command schema=schema_ren.xml&dataDir=C:\Users\jenkins\workspace\Lucene-Solr-master-Windows\solr\build\solr-core\test\J1\temp\solr.handler.admin.CoreAdminCreateDiscoverTest_7F6301270602A436-001\tempDir-001\testInstanceDirAsPropertyParam-XYZ\data&name=testInstanceDirAsPropertyParam&action=CREATE&config=solrconfig_ren.xml&wt=xml&property.instanceDir=C:\Users\jenkins\workspace\Lucene-Solr-master-Windows\solr\build\solr-core\test\J1\temp\solr.handler.admin.CoreAdminCreateDiscoverTest_7F6301270602A436-001\tempDir-001\testInstanceDirAsPropertyParam-XYZ
   [junit4]   2> 1094408 INFO  (TEST-CoreAdminCreateDiscoverTest.testInstanceDirAsPropertyParam-seed#[7F6301270602A436]) [    x:duplicate] o.a.s.c.SolrConfig Using Lucene MatchVersion: 8.0.0
   [junit4]   2> 1094422 INFO  (TEST-CoreAdminCreateDiscoverTest.testInstanceDirAsPropertyParam-seed#[7F6301270602A436]) [    x:duplicate] o.a.s.s.IndexSchema [testInstanceDirAsPropertyParam] Schema name=tiny
   [junit4]   2> 1094427 INFO  (TEST-CoreAdminCreateDiscoverTest.testInstanceDirAsPropertyParam-seed#[7F6301270602A436]) [    x:duplicate] o.a.s.s.IndexSchema Loaded schema tiny/1.1 with uniqueid field id
   [junit4]   2> 1094427 INFO  (TEST-CoreAdminCreateDiscoverTest.testInstanceDirAsPropertyParam-seed#[7F6301270602A436]) [    x:duplicate] o.a.s.c.CoreContainer Creating SolrCore 'testInstanceDirAsPropertyParam' using configuration from instancedir C:\Users\jenkins\workspace\Lucene-Solr-master-Windows\solr\build\solr-core\test\J1\temp\solr.handler.admin.CoreAdminCreateDiscoverTest_7F6301270602A436-001\tempDir-001\testInstanceDirAsPropertyParam-XYZ, trusted=true
   [junit4]   2> 1094431 INFO  (TEST-CoreAdminCreateDiscoverTest.testInstanceDirAsPropertyParam-seed#[7F6301270602A436]) [    x:duplicate] o.a.s.m.r.SolrJmxReporter JMX monitoring for 'solr.core.testInstanceDirAsPropertyParam' (registry 'solr.core.testInstanceDirAsPropertyParam') enabled at server: com.sun.jmx.mbeanserver.JmxMBeanServer@b5a292
   [junit4]   2> 1094431 INFO  (TEST-CoreAdminCreateDiscoverTest.testInstanceDirAsPropertyParam-seed#[7F6301270602A436]) [    x:duplicate] o.a.s.c.SolrCore solr.RecoveryStrategy.Builder
   [junit4]   2> 1094431 INFO  (TEST-CoreAdminCreateDiscoverTest.testInstanceDirAsPropertyParam-seed#[7F6301270602A436]) [    x:duplicate] o.a.s.c.SolrCore [[testInstanceDirAsPropertyParam] ] Opening new SolrCore at [C:\Users\jenkins\workspace\Lucene-Solr-master-Windows\solr\build\solr-core\test\J1\temp\solr.handler.admin.CoreAdminCreateDiscoverTest_7F6301270602A436-001\tempDir-001\testInstanceDirAsPropertyParam-XYZ], dataDir=[C:\Users\jenkins\workspace\Lucene-Solr-master-Windows\solr\build\solr-core\test\J1\temp\solr.handler.admin.CoreAdminCreateDiscoverTest_7F6301270602A436-001\tempDir-001\testInstanceDirAsPropertyParam-XYZ\data\]
   [junit4]   2> 1094440 INFO  (TEST-CoreAdminCreateDiscoverTest.testInstanceDirAsPropertyParam-seed#[7F6301270602A436]) [    x:duplicate] o.a.s.u.RandomMergePolicy RandomMergePolicy wrapping class org.apache.lucene.index.TieredMergePolicy: [TieredMergePolicy: maxMergeAtOnce=23, maxMergeAtOnceExplicit=17, maxMergedSegmentMB=29.8681640625, floorSegmentMB=1.44140625, forceMergeDeletesPctAllowed=23.378598854740975, segmentsPerTier=45.0, maxCFSSegmentSizeMB=8.796093022207999E12, noCFSRatio=0.772687404897533
   [junit4]   2> 1094646 INFO  (TEST-CoreAdminCreateDiscoverTest.testInstanceDirAsPropertyParam-seed#[7F6301270602A436]) [    x:duplicate] o.a.s.u.CommitTracker Hard AutoCommit: disabled
   [junit4]   2> 1094646 INFO  (TEST-CoreAdminCreateDiscoverTest.testInstanceDirAsPropertyParam-seed#[7F6301270602A436]) [    x:duplicate] o.a.s.u.CommitTracker Soft AutoCommit: disabled
   [junit4]   2> 1094648 INFO  (TEST-CoreAdminCreateDiscoverTest.testInstanceDirAsPropertyParam-seed#[7F6301270602A436]) [    x:duplicate] o.a.s.u.RandomMergePolicy RandomMergePolicy wrapping class org.apache.lucene.index.LogDocMergePolicy: [LogDocMergePolicy: minMergeSize=1000, mergeFactor=17, maxMergeSize=9223372036854775807, maxMergeSizeForForcedMerge=9223372036854775807, calibrateSizeByDeletes=false, maxMergeDocs=2147483647, maxCFSSegmentSizeMB=8.796093022207999E12, noCFSRatio=0.0]
   [junit4]   2> 1094650 INFO  (TEST-CoreAdminCreateDiscoverTest.testInstanceDirAsPropertyParam-seed#[7F6301270602A436]) [    x:duplicate] o.a.s.s.SolrIndexSearcher Opening [Searcher@1c7be0e[testInstanceDirAsPropertyParam] main]
   [junit4]   2> 1094652 INFO  (TEST-CoreAdminCreateDiscoverTest.testInstanceDirAsPropertyParam-seed#[7F6301270602A436]) [    x:duplicate] o.a.s.r.ManagedResourceStorage File-based storage initialized to use dir: C:\Users\jenkins\workspace\Lucene-Solr-master-Windows\solr\build\solr-core\test\J1\temp\solr.handler.admin.CoreAdminCreateDiscoverTest_7F6301270602A436-001\tempDir-001\testInstanceDirAsPropertyParam-XYZ\conf
   [junit4]   2> 1094653 INFO  (TEST-CoreAdminCreateDiscoverTest.testInstanceDirAsPropertyParam-seed#[7F6301270602A436]) [    x:duplicate] o.a.s.h.ReplicationHandler Commits will be reserved for 10000ms.
   [junit4]   2> 1094655 INFO  (searcherExecutor-4227-thread-1-processing-x:duplicate) [    x:duplicate] o.a.s.c.SolrCore [testInstanceDirAsPropertyParam] Registered new searcher Searcher@1c7be0e[testInstanceDirAsPropertyParam] main{ExitableDirectoryReader(UninvertingDirectoryReader())}
   [junit4]   2> 1094656 INFO  (TEST-CoreAdminCreateDiscoverTest.testInstanceDirAsPropertyParam-seed#[7F6301270602A436]) [    x:duplicate] o.a.s.SolrTestCaseJ4 ###Ending testInstanceDirAsPropertyParam
   [junit4]   2> 1094674 INFO  (TEST-CoreAdminCreateDiscoverTest.testCreateSavesSysProps-seed#[7F6301270602A436]) [    x:duplicate] o.a.s.SolrTestCaseJ4 ###Starting testCreateSavesSysProps
   [junit4]   2> 1094685 INFO  (TEST-CoreAdminCreateDiscoverTest.testCreateSavesSysProps-seed#[7F6301270602A436]) [    x:duplicate] o.a.s.h.a.CoreAdminOperation core create command schema=${SCHEMA_TEST}&dataDir=${DATA_TEST}&name=sys_props&action=CREATE&instanceDir=${INSTDIR_TEST}&config=${CONFIG_TEST}&wt=xml
   [junit4]   2> 1094748 INFO  (TEST-CoreAdminCreateDiscoverTest.testCreateSavesSysProps-seed#[7F6301270602A436]) [    x:duplicate] o.a.s.c.SolrConfig Using Lucene MatchVersion: 8.0.0
   [junit4]   2> 1094762 INFO  (TEST-CoreAdminCreateDiscoverTest.testCreateSavesSysProps-seed#[7F6301270602A436]) [    x:duplicate] o.a.s.s.IndexSchema [sys_props] Schema name=tiny
   [junit4]   2> 1094772 INFO  (TEST-CoreAdminCreateDiscoverTest.testCreateSavesSysProps-seed#[7F6301270602A436]) [    x:duplicate] o.a.s.s.IndexSchema Loaded schema tiny/1.1 with uniqueid field id
   [junit4]   2> 1094772 INFO  (TEST-CoreAdminCreateDiscoverTest.testCreateSavesSysProps-seed#[7F6301270602A436]) [    x:duplicate] o.a.s.c.CoreContainer Creating SolrCore 'sys_props' using configuration from instancedir C:\Users\jenkins\workspace\Lucene-Solr-master-Windows\solr\build\solr-core\test\J1\temp\solr.handler.admin.CoreAdminCreateDiscoverTest_7F6301270602A436-001\tempDir-001\sys_props, trusted=true
   [junit4]   2> 1094773 INFO  (TEST-CoreAdminCreateDiscoverTest.testCreateSavesSysProps-seed#[7F6301270602A436]) [    x:duplicate] o.a.s.m.r.SolrJmxReporter JMX monitoring for 'solr.core.sys_props' (registry 'solr.core.sys_props') enabled at server: com.sun.jmx.mbeanserver.JmxMBeanServer@b5a292
   [junit4]   2> 1094773 INFO  (TEST-CoreAdminCreateDiscoverTest.testCreateSavesSysProps-seed#[7F6301270602A436]) [    x:duplicate] o.a.s.c.SolrCore solr.RecoveryStrategy.Builder
   [junit4]   2> 1094773 INFO  (TEST-CoreAdminCreateDiscoverTest.testCreateSavesSysProps-seed#[7F6301270602A436]) [    x:duplicate] o.a.s.c.SolrCore [[sys_props] ] Opening new SolrCore at [C:\Users\jenkins\workspace\Lucene-Solr-master-Windows\solr\build\solr-core\test\J1\temp\solr.handler.admin.CoreAdminCreateDiscoverTest_7F6301270602A436-001\tempDir-001\sys_props], dataDir=[C:\Users\jenkins\workspace\Lucene-Solr-master-Windows\solr\build\solr-core\test\J1\temp\solr.handler.admin.CoreAdminCreateDiscoverTest_7F6301270602A436-001\tempDir-001\sys_props\data_diff\]
   [junit4]   2> 1094784 INFO  (TEST-CoreAdminCreateDiscoverTest.testCreateSavesSysProps-seed#[7F6301270602A436]) [    x:duplicate] o.a.s.u.RandomMergePolicy RandomMergePolicy wrapping class org.apache.lucene.index.LogByteSizeMergePolicy: [LogByteSizeMergePolicy: minMergeSize=1677721, mergeFactor=48, maxMergeSize=2147483648, maxMergeSizeForForcedMerge=9223372036854775807, calibrateSizeByDeletes=true, maxMergeDocs=2147483647, maxCFSSegmentSizeMB=8.796093022207999E12, noCFSRatio=0.28778535285445883]
   [junit4]   2> 1094946 INFO  (TEST-CoreAdminCreateDiscoverTest.testCreateSavesSysProps-seed#[7F6301270602A436]) [    x:duplicate] o.a.s.u.CommitTracker Hard AutoCommit: disabled
   [junit4]   2> 1094947 INFO  (TEST-CoreAdminCreateDiscoverTest.testCreateSavesSysProps-seed#[7F6301270602A436]) [    x:duplicate] o.a.s.u.CommitTracker Soft AutoCommit: disabled
   [junit4]   2> 1094949 INFO  (TEST-CoreAdminCreateDiscoverTest.testCreateSavesSysProps-seed#[7F6301270602A436]) [    x:duplicate] o.a.s.u.RandomMergePolicy RandomMergePolicy wrapping class org.apache.lucene.index.TieredMergePolicy: [TieredMergePolicy: maxMergeAtOnce=30, maxMergeAtOnceExplicit=49, maxMergedSegmentMB=68.5615234375, floorSegmentMB=0.58984375, forceMergeDeletesPctAllowed=10.313154706876983, segmentsPerTier=30.0, maxCFSSegmentSizeMB=8.796093022207999E12, noCFSRatio=0.0
   [junit4]   2> 1094950 INFO  (TEST-CoreAdminCreateDiscoverTest.testCreateSavesSysProps-seed#[7F6301270602A436]) [    x:duplicate] o.a.s.s.SolrIndexSearcher Opening [Searcher@1195863[sys_props] main]
   [junit4]   2> 1094952 INFO  (TEST-CoreAdminCreateDiscoverTest.testCreateSavesSysProps-seed#[7F6301270602A436]) [    x:duplicate] o.a.s.r.ManagedResourceStorage File-based storage initialized to use dir: C:\Users\jenkins\workspace\Lucene-Solr-master-Windows\solr\build\solr-core\test\J1\temp\solr.handler.admin.CoreAdminCreateDiscoverTest_7F6301270602A436-001\tempDir-001\sys_props\conf
   [junit4]   2> 1094954 INFO  (TEST-CoreAdminCreateDiscoverTest.testCreateSavesSysProps-seed#[7F6301270602A436]) [    x:duplicate] o.a.s.h.ReplicationHandler Commits will be reserved for 10000ms.
   [junit4]   2> 1094957 INFO  (searcherExecutor-4231-thread-1-processing-x:duplicate) [    x:duplicate] o.a.s.c.SolrCore [sys_props] Registered new searcher Searcher@1195863[sys_props] main{ExitableDirectoryReader(UninvertingDirectoryReader())}
   [junit4]   2> 1094957 INFO  (TEST-CoreAdminCreateDiscoverTest.testCreateSavesSysProps-seed#[7F6301270602A436]) [    x:duplicate] o.a.s.SolrTestCaseJ4 ###Ending testCreateSavesSysProps
   [junit4]   2> 1094958 INFO  (SUITE-CoreAdminCreateDiscoverTest-seed#[7F6301270602A436]-worker) [    x:duplicate] o.a.s.SolrTestCaseJ4 ###deleteCore
   [junit4]   2> 1094958 INFO  (SUITE-CoreAdminCreateDiscoverTest-seed#[7F6301270602A436]-worker) [    x:duplicate] o.a.s.c.CoreContainer Shutting down CoreContainer instance=1033595
   [junit4]   2> 1094959 INFO  (SUITE-CoreAdminCreateDiscoverTest-seed#[7F6301270602A436]-worker) [    x:duplicate] o.a.s.m.SolrMetricManager Closing metric reporters for registry=solr.node, tag=null
   [junit4]   2> 1094959 INFO  (SUITE-CoreAdminCreateDiscoverTest-seed#[7F6301270602A436]-worker) [    x:duplicate] o.a.s.m.r.SolrJmxReporter Closing reporter [org.apache.solr.metrics.reporters.SolrJmxReporter@8b216: rootName = null, domain = solr.node, service url = null, agent id = null] for registry solr.node / com.codahale.metrics.MetricRegistry@fcf0cb
   [junit4]   2> 1094966 INFO  (SUITE-CoreAdminCreateDiscoverTest-seed#[7F6301270602A436]-worker) [    x:duplicate] o.a.s.m.SolrMetricManager Closing metric reporters for registry=solr.jvm, tag=null
   [junit4]   2> 1094966 INFO  (SUITE-CoreAdminCreateDiscoverTest-seed#[7F6301270602A436]-worker) [    x:duplicate] o.a.s.m.r.SolrJmxReporter Closing reporter [org.apache.solr.metrics.reporters.SolrJmxReporter@b4456e: rootName = null, domain = solr.jvm, service url = null, agent id = null] for registry solr.jvm / com.codahale.metrics.MetricRegistry@db2a83
   [junit4]   2> 1094978 INFO  (SUITE-CoreAdminCreateDiscoverTest-seed#[7F6301270602A436]-worker) [    x:duplicate] o.a.s.m.SolrMetricManager Closing metric reporters for registry=solr.jetty, tag=null
   [junit4]   2> 1094979 INFO  (SUITE-CoreAdminCreateDiscoverTest-seed#[7F6301270602A436]-worker) [    x:duplicate] o.a.s.m.r.SolrJmxReporter Closing reporter [org.apache.solr.metrics.reporters.SolrJmxReporter@1a8601d: rootName = null, domain = solr.jetty, service url = null, agent id = null] for registry solr.jetty / com.codahale.metrics.MetricRegistry@f41804
   [junit4]   2> 1094980 INFO  (coreCloseExecutor-4235-thread-1-processing-x:duplicate) [    x:duplicate] o.a.s.c.SolrCore [duplicate]  CLOSING SolrCore org.apache.solr.core.SolrCore@77b51e
   [junit4]   2> 1094980 INFO  (coreCloseExecutor-4235-thread-2-processing-x:duplicate) [    x:normal] o.a.s.c.SolrCore [normal]  CLOSING SolrCore org.apache.solr.core.SolrCore@18e8bee
   [junit4]   2> 1094981 INFO  (coreCloseExecutor-4235-thread-1-processing-x:duplicate) [    x:duplicate] o.a.s.m.SolrMetricManager Closing metric reporters for registry=solr.core.duplicate, tag=7845150
   [junit4]   2> 1094981 INFO  (coreCloseExecutor-4235-thread-1-processing-x:duplicate) [    x:duplicate] o.a.s.m.r.SolrJmxReporter Closing reporter [org.apache.solr.metrics.reporters.SolrJmxReporter@17cfb8a: rootName = null, domain = solr.core.duplicate, service url = null, agent id = null] for registry solr.core.duplicate / com.codahale.metrics.MetricRegistry@175b51a
   [junit4]   2> 1094981 INFO  (coreCloseExecutor-4235-thread-3-processing-x:duplicate) [    x:testInstanceDirAsPropertyParam] o.a.s.c.SolrCore [testInstanceDirAsPropertyParam]  CLOSING SolrCore org.apache.solr.core.SolrCore@9d9512
   [junit4]   2> 1094981 INFO  (coreCloseExecutor-4235-thread-4-processing-x:duplicate) [    x:sys_props] o.a.s.c.SolrCore [sys_props]  CLOSING SolrCore org.apache.solr.core.SolrCore@1597a91
   [junit4]   2> 1095013 INFO  (coreCloseExecutor-4235-thread-2-processing-x:duplicate) [    x:normal] o.a.s.m.SolrMetricManager Closing metric reporters for registry=solr.core.normal, tag=26119150
   [junit4]   2> 1095013 INFO  (coreCloseExecutor-4235-thread-2-processing-x:duplicate) [    x:normal] o.a.s.m.r.SolrJmxReporter Closing reporter [org.apache.solr.metrics.reporters.SolrJmxReporter@1c7874d: rootName = null, domain = solr.core.normal, service url = null, agent id = null] for registry solr.core.normal / com.codahale.metrics.MetricRegistry@36a6cf
   [junit4]   2> 1095023 INFO  (coreCloseExecutor-4235-thread-3-processing-x:duplicate) [    x:testInstanceDirAsPropertyParam] o.a.s.m.SolrMetricManager Closing metric reporters for registry=solr.core.testInstanceDirAsPropertyParam, tag=10327314
   [junit4]   2> 1095025 INFO  (coreCloseExecutor-4235-thread-3-processing-x:duplicate) [    x:testInstanceDirAsPropertyParam] o.a.s.m.r.SolrJmxReporter Closing reporter [org.apache.solr.metrics.reporters.SolrJmxReporter@5459ab: rootName = null, domain = solr.core.testInstanceDirAsPropertyParam, service url = null, agent id = null] for registry solr.core.testInstanceDirAsPropertyParam / com.codahale.metrics.MetricRegistry@ee788b
   [junit4]   2> 1095040 INFO  (coreCloseExecutor-4235-thread-4-processing-x:duplicate) [    x:sys_props] o.a.s.m.SolrMetricManager Closing metric reporters for registry=solr.core.sys_props, tag=22641297
   [junit4]   2> 1095042 INFO  (coreCloseExecutor-4235-thread-4-processing-x:duplicate) [    x:sys_props] o.a.s.m.r.SolrJmxReporter Closing reporter [org.apache.solr.metrics.reporters.SolrJmxReporter@161ee: rootName = null, domain = solr.core.sys_props, service url = null, agent id = null] for registry solr.core.sys_props / com.codahale.metrics.MetricRegistry@5ee07
   [junit4]   2> 1095062 INFO  (SUITE-CoreAdminCreateDiscoverTest-seed#[7F6301270602A436]-worker) [    x:duplicate] o.a.s.SolrTestCaseJ4 ------------------------------------------------------- Done waiting for tracked resources to be released
   [junit4]   2> NOTE: test params are: codec=HighCompressionCompressingStoredFields(storedFieldsFormat=CompressingStoredFieldsFormat(compressionMode=HIGH_COMPRESSION, chunkSize=7552, maxDocsPerChunk=174, blockSize=774), termVectorsFormat=CompressingTermVectorsFormat(compressionMode=HIGH_COMPRESSION, chunkSize=7552, blockSize=774)), sim=Asserting(org.apache.lucene.search.similarities.AssertingSimilarity@b48955), locale=lv-LV, timezone=Australia/LHI
   [junit4]   2> NOTE: Windows 10 10.0 x86/Oracle Corporation 1.8.0_144 (32-bit)/cpus=3,threads=1,free=110980200,total=294744064
   [junit4]   2> NOTE: All tests run in this JVM: [UpdateRequestProcessorFactoryTest, TestSQLHandler, HdfsDirectoryFactoryTest, TestElisionMultitermQuery, SolrJmxReporterTest, TestAuthorizationFramework, TestLRUCache, BasicZkTest, HdfsBasicDistributedZk2Test, TestFilteredDocIdSet, TestGroupingSearch, TestBackupRepositoryFactory, TestIndexSearcher, StatsReloadRaceTest, TestDistributedMissingSort, TestCloudJSONFacetJoinDomain, AssignTest, NodeAddedTriggerTest, TestConfigSetsAPI, TemplateUpdateProcessorTest, HdfsThreadLeakTest, TestAddFieldRealTimeGet, TestSolrXml, DataDrivenBlockJoinTest, RemoteQueryErrorTest, FullHLLTest, MoveReplicaTest, TestFieldCacheReopen, ShardRoutingCustomTest, FieldMutatingUpdateProcessorTest, V2StandaloneTest, TestReplicaProperties, ConfigureRecoveryStrategyTest, TestFastWriter, BlockJoinFacetSimpleTest, SearchRateTriggerTest, TestCloudDeleteByQuery, ChaosMonkeyNothingIsSafeWithPullReplicasTest, TestMissingGroups, TestStressInPlaceUpdates, DeleteLastCustomShardedReplicaTest, TestFaceting, MoreLikeThisHandlerTest, HttpSolrCallGetCoreTest, TestCustomSort, SolrMetricsIntegrationTest, TermVectorComponentTest, BadComponentTest, CloneFieldUpdateProcessorFactoryTest, TestJsonRequest, TestSolrConfigHandlerCloud, OpenExchangeRatesOrgProviderTest, TestInPlaceUpdatesDistrib, TestConfigSetImmutable, SolrIndexSplitterTest, MBeansHandlerTest, SolrGraphiteReporterTest, TestReqParamsAPI, TestNumericRangeQuery64, TestSolrJ, SpellingQueryConverterTest, HdfsChaosMonkeyNothingIsSafeTest, TestSuggestSpellingConverter, NumberUtilsTest, DOMUtilTest, TestRandomFaceting, CoreMergeIndexesAdminHandlerTest, SecurityConfHandlerTest, PreAnalyzedUpdateProcessorTest, LeaderInitiatedRecoveryOnShardRestartTest, TestQueryWrapperFilter, StatelessScriptUpdateProcessorFactoryTest, TestSlowCompositeReaderWrapper, TestDefaultStatsCache, TestConfigSets, AutoScalingHandlerTest, TestFieldCacheWithThreads, SimpleFacetsTest, CdcrRequestHandlerTest, LeaderElectionContextKeyTest, TestLegacyNumericRangeQueryBuilder, TestConfigSetsAPIZkFailure, TestTriggerIntegration, TestChildDocTransformer, TestJavabinTupleStreamParser, EnumFieldTest, TestUninvertingReader, TestTrieFacet, TestPolicyCloud, SolrIndexConfigTest, TestSubQueryTransformerCrossCore, SolrIndexMetricsTest, TestSolrQueryParser, TestHashPartitioner, TestExtendedDismaxParser, HdfsCollectionsAPIDistributedZkTest, TestReload, TestCopyFieldCollectionResource, CdcrBidirectionalTest, DistributedFacetExistsSmallTest, TestLuceneIndexBackCompat, DistributedQueueTest, TestFastLRUCache, DistributedSuggestComponentTest, FileBasedSpellCheckerTest, TermsComponentTest, ConcurrentDeleteAndCreateCollectionTest, RankQueryTest, ChaosMonkeySafeLeaderTest, TestStandardQParsers, TestLeaderElectionZkExpiry, SearchHandlerTest, TestTrackingShardHandlerFactory, TestSystemIdResolver, TestSolrCloudWithHadoopAuthPlugin, BlockJoinFacetDistribTest, TestManagedSynonymFilterFactory, SolrMetricManagerTest, AnalyticsQueryTest, RulesTest, PolyFieldTest, FullSolrCloudDistribCmdsTest, TestMinMaxOnMultiValuedField, AtomicUpdatesTest, TestExactSharedStatsCache, CoreAdminCreateDiscoverTest]
   [junit4]   2> NOTE: reproduce with: ant test  -Dtestcase=CoreAdminCreateDiscoverTest -Dtests.seed=7F6301270602A436 -Dtests.slow=true -Dtests.locale=lv-LV -Dtests.timezone=Australia/LHI -Dtests.asserts=true -Dtests.file.encoding=Cp1252
   [junit4] ERROR   0.00s J1 | CoreAdminCreateDiscoverTest (suite) <<<
   [junit4]    > Throwable #1: java.io.IOException: Could not remove the following files (in the order of attempts):
   [junit4]    >    C:\Users\jenkins\workspace\Lucene-Solr-master-Windows\solr\build\solr-core\test\J1\temp\solr.handler.admin.CoreAdminCreateDiscoverTest_7F6301270602A436-001\tempDir-001\sys_props: java.nio.file.DirectoryNotEmptyException: C:\Users\jenkins\workspace\Lucene-Solr-master-Windows\solr\build\solr-core\test\J1\temp\solr.handler.admin.CoreAdminCreateDiscoverTest_7F6301270602A436-001\tempDir-001\sys_props
   [junit4]    >    C:\Users\jenkins\workspace\Lucene-Solr-master-Windows\solr\build\solr-core\test\J1\temp\solr.handler.admin.CoreAdminCreateDiscoverTest_7F6301270602A436-001\tempDir-001: java.nio.file.DirectoryNotEmptyException: C:\Users\jenkins\workspace\Lucene-Solr-master-Windows\solr\build\solr-core\test\J1\temp\solr.handler.admin.CoreAdminCreateDiscoverTest_7F6301270602A436-001\tempDir-001
   [junit4]    > 	at __randomizedtesting.SeedInfo.seed([7F6301270602A436]:0)
   [junit4]    > 	at org.apache.lucene.util.IOUtils.rm(IOUtils.java:329)
   [junit4]    > 	at java.lang.Thread.run(Thread.java:748)
   [junit4] Completed [259/767 (1!)] on J1 in 1.69s, 4 tests, 1 error <<< FAILURES!

[...truncated 112 lines...]
   [junit4] Suite: org.apache.solr.core.ResourceLoaderTest
   [junit4]   2> Creating dataDir: C:\Users\jenkins\workspace\Lucene-Solr-master-Windows\solr\build\solr-core\test\J0\temp\solr.core.ResourceLoaderTest_7F6301270602A436-001\init-core-data-001
   [junit4]   2> 1300351 WARN  (SUITE-ResourceLoaderTest-seed#[7F6301270602A436]-worker) [    ] o.a.s.SolrTestCaseJ4 startTrackingSearchers: numOpens=1 numCloses=1
   [junit4]   2> 1300352 INFO  (SUITE-ResourceLoaderTest-seed#[7F6301270602A436]-worker) [    ] o.a.s.SolrTestCaseJ4 Using PointFields (NUMERIC_POINTS_SYSPROP=true) w/NUMERIC_DOCVALUES_SYSPROP=true
   [junit4]   2> 1300355 INFO  (SUITE-ResourceLoaderTest-seed#[7F6301270602A436]-worker) [    ] o.a.s.SolrTestCaseJ4 Randomized ssl (false) and clientAuth (false) via: @org.apache.solr.util.RandomizeSSL(reason=, value=NaN, ssl=NaN, clientAuth=NaN)
   [junit4]   2> 1300355 INFO  (SUITE-ResourceLoaderTest-seed#[7F6301270602A436]-worker) [    ] o.a.s.SolrTestCaseJ4 SecureRandom sanity checks: test.solr.allowed.securerandom=null & java.security.egd=file:/dev/./urandom
   [junit4]   2> 1300358 INFO  (TEST-ResourceLoaderTest.testInstanceDir-seed#[7F6301270602A436]) [    ] o.a.s.SolrTestCaseJ4 ###Starting testInstanceDir
   [junit4]   2> 1300359 INFO  (TEST-ResourceLoaderTest.testInstanceDir-seed#[7F6301270602A436]) [    ] o.a.s.SolrTestCaseJ4 ###Ending testInstanceDir
   [junit4]   2> 1300361 INFO  (TEST-ResourceLoaderTest.testAwareCompatibility-seed#[7F6301270602A436]) [    ] o.a.s.SolrTestCaseJ4 ###Starting testAwareCompatibility
   [junit4]   2> 1300364 INFO  (TEST-ResourceLoaderTest.testAwareCompatibility-seed#[7F6301270602A436]) [    ] o.a.s.SolrTestCaseJ4 ###Ending testAwareCompatibility
   [junit4]   2> 1300366 INFO  (TEST-ResourceLoaderTest.testWrongEncoding-seed#[7F6301270602A436]) [    ] o.a.s.SolrTestCaseJ4 ###Starting testWrongEncoding
   [junit4]   2> 1300367 INFO  (TEST-ResourceLoaderTest.testWrongEncoding-seed#[7F6301270602A436]) [    ] o.a.s.c.SolrResourceLoader [null] Added 2 libs to classloader, from paths: [/C:/Users/jenkins/workspace/Lucene-Solr-master-Windows/solr/core/src/test-files/solr/collection1/lib, /C:/Users/jenkins/workspace/Lucene-Solr-master-Windows/solr/core/src/test-files/solr/collection1/lib/classes]
   [junit4]   2> 1300398 INFO  (TEST-ResourceLoaderTest.testWrongEncoding-seed#[7F6301270602A436]) [    ] o.a.s.SolrTestCaseJ4 ###Ending testWrongEncoding
   [junit4]   2> 1300399 INFO  (TEST-ResourceLoaderTest.testEscapeInstanceDir-seed#[7F6301270602A436]) [    ] o.a.s.SolrTestCaseJ4 ###Starting testEscapeInstanceDir
   [junit4]   2> 1300403 INFO  (TEST-ResourceLoaderTest.testEscapeInstanceDir-seed#[7F6301270602A436]) [    ] o.a.s.SolrTestCaseJ4 ###Ending testEscapeInstanceDir
   [junit4]   2> 1300404 INFO  (TEST-ResourceLoaderTest.testClassLoaderLibs-seed#[7F6301270602A436]) [    ] o.a.s.SolrTestCaseJ4 ###Starting testClassLoaderLibs
   [junit4]   2> 1300412 INFO  (TEST-ResourceLoaderTest.testClassLoaderLibs-seed#[7F6301270602A436]) [    ] o.a.s.c.SolrResourceLoader [null] Added 1 libs to classloader, from paths: [/C:/Users/jenkins/workspace/Lucene-Solr-master-Windows/solr/build/solr-core/test/J0/temp/solr.core.ResourceLoaderTest_7F6301270602A436-001/testClassLoaderLibs-001/lib]
   [junit4]   2> 1300428 INFO  (TEST-ResourceLoaderTest.testClassLoaderLibs-seed#[7F6301270602A436]) [    ] o.a.s.c.SolrResourceLoader [null] Added 1 libs to classloader, from paths: [/C:/Users/jenkins/workspace/Lucene-Solr-master-Windows/solr/build/solr-core/test/J0/temp/solr.core.ResourceLoaderTest_7F6301270602A436-001/testClassLoaderLibs-001/otherLib]
   [junit4]   2> 1300433 INFO  (TEST-ResourceLoaderTest.testClassLoaderLibs-seed#[7F6301270602A436]) [    ] o.a.s.c.SolrResourceLoader [null] Added 2 libs to classloader, from paths: [/C:/Users/jenkins/workspace/Lucene-Solr-master-Windows/solr/build/solr-core/test/J0/temp/solr.core.ResourceLoaderTest_7F6301270602A436-001/testClassLoaderLibs-001/otherLib]
   [junit4]   2> 1300434 INFO  (TEST-ResourceLoaderTest.testClassLoaderLibs-seed#[7F6301270602A436]) [    ] o.a.s.SolrTestCaseJ4 ###Ending testClassLoaderLibs
   [junit4]   2> 1300436 INFO  (TEST-ResourceLoaderTest.testLoadDeprecatedFactory-seed#[7F6301270602A436]) [    ] o.a.s.SolrTestCaseJ4 ###Starting testLoadDeprecatedFactory
   [junit4]   2> 1300437 WARN  (TEST-ResourceLoaderTest.testLoadDeprecatedFactory-seed#[7F6301270602A436]) [    ] o.a.s.c.SolrResourceLoader Solr loaded a deprecated plugin/analysis class [org.apache.solr.core.ResourceLoaderTest$DeprecatedTokenFilterFactory]. Please consult documentation how to replace it accordingly.
   [junit4]   2> 1300437 INFO  (TEST-ResourceLoaderTest.testLoadDeprecatedFactory-seed#[7F6301270602A436]) [    ] o.a.s.SolrTestCaseJ4 ###Ending testLoadDeprecatedFactory
   [junit4]   2> 1300438 INFO  (TEST-ResourceLoaderTest.testBOMMarkers-seed#[7F6301270602A436]) [    ] o.a.s.SolrTestCaseJ4 ###Starting testBOMMarkers
   [junit4]   2> 1300440 INFO  (TEST-ResourceLoaderTest.testBOMMarkers-seed#[7F6301270602A436]) [    ] o.a.s.c.SolrResourceLoader [null] Added 2 libs to classloader, from paths: [/C:/Users/jenkins/workspace/Lucene-Solr-master-Windows/solr/core/src/test-files/solr/collection1/lib, /C:/Users/jenkins/workspace/Lucene-Solr-master-Windows/solr/core/src/test-files/solr/collection1/lib/classes]
   [junit4]   2> 1300454 INFO  (TEST-ResourceLoaderTest.testBOMMarkers-seed#[7F6301270602A436]) [    ] o.a.s.SolrTestCaseJ4 ###Ending testBOMMarkers
   [junit4]   2> 1300455 INFO  (SUITE-ResourceLoaderTest-seed#[7F6301270602A436]-worker) [    ] o.a.s.SolrTestCaseJ4 ------------------------------------------------------- Done waiting for tracked resources to be released
   [junit4]   2> NOTE: test params are: codec=Asserting(Lucene70), sim=Asserting(org.apache.lucene.search.similarities.AssertingSimilarity@524e37), locale=ar-YE, timezone=Antarctica/Davis
   [junit4]   2> NOTE: Windows 10 10.0 x86/Oracle Corporation 1.8.0_144 (32-bit)/cpus=3,threads=1,free=85860216,total=328085504
   [junit4]   2> NOTE: All tests run in this JVM: [TestLegacyTerms, TestUnifiedSolrHighlighter, TestWriterPerf, HdfsRecoveryZkTest, LegacyCloudClusterPropTest, DistributedVersionInfoTest, TestCollectionsAPIViaSolrCloudCluster, SparseHLLTest, TriggerIntegrationTest, ShardRoutingTest, ShowFileRequestHandlerTest, CreateCollectionCleanupTest, TestMultiWordSynonyms, TestManagedStopFilterFactory, TestBinaryField, RuleEngineTest, ReplicaListTransformerTest, SuggesterWFSTTest, TestUseDocValuesAsStored, TestExpandComponent, HdfsAutoAddReplicasIntegrationTest, TestSchemaManager, TestSha256AuthenticationProvider, DirectUpdateHandlerTest, TestMaxScoreQueryParser, TestClusterProperties, HLLSerializationTest, SSLMigrationTest, ClusterStateTest, ExplicitHLLTest, TestNestedDocsSort, CursorMarkTest, TestCollationFieldDocValues, TestXIncludeConfig, RecoveryZkTest, CdcrReplicationHandlerTest, DistributedSpellCheckComponentTest, CurrencyFieldTypeTest, HdfsTlogReplayBufferedWhileIndexingTest, AddBlockUpdateTest, TestReRankQParserPlugin, TestNonDefinedSimilarityFactory, TestNamedUpdateProcessors, CollectionTooManyReplicasTest, TestSubQueryTransformer, ConfigSetsAPITest, BlockJoinFacetRandomTest, TestCoreDiscovery, TestSchemaNameResource, MultiTermTest, TestPhraseSuggestions, TestFieldCacheSort, TestSkipOverseerOperations, PropertiesRequestHandlerTest, TestDFRSimilarityFactory, DistanceUnitsTest, TestSerializedLuceneMatchVersion, PrimUtilsTest, DisMaxRequestHandlerTest, SortSpecParsingTest, AsyncCallRequestStatusResponseTest, FacetPivotSmallTest, TestFieldCacheVsDocValues, DistanceFunctionTest, TestStressRecovery, RequestLoggingTest, UninvertDocValuesMergePolicyTest, TestFieldCache, TestLegacyFieldReuse, RequestHandlersTest, TestCloudPivotFacet, RequiredFieldsTest, SortByFunctionTest, TestSolrFieldCacheBean, TestPayloadScoreQParserPlugin, TestLazyCores, BigEndianAscendingWordSerializerTest, TestBulkSchemaAPI, ExitableDirectoryReaderTest, TestReversedWildcardFilterFactory, BasicAuthIntegrationTest, SignatureUpdateProcessorFactoryTest, BufferStoreTest, TestDynamicFieldCollectionResource, TestNumericRangeQuery32, TestCSVResponseWriter, TestQuerySenderListener, VersionInfoTest, TestOrdValues, TestJoin, TestBlobHandler, ReplaceNodeTest, DistributedFacetPivotSmallAdvancedTest, ClusterStateUpdateTest, ZkFailoverTest, ManagedSchemaRoundRobinCloudTest, TestJsonFacets, TestAuthenticationFramework, TestLFUCache, TestIntervalFaceting, DeleteNodeTest, HdfsChaosMonkeySafeLeaderTest, PeerSyncWithIndexFingerprintCachingTest, AnalyticsMergeStrategyTest, TestNRTOpen, TestConfigSetProperties, BaseCdcrDistributedZkTest, TestSolrDeletionPolicy2, TestTolerantUpdateProcessorCloud, RegexBoostProcessorTest, CollectionReloadTest, TestSolrCloudWithKerberosAlt, AutoscalingHistoryHandlerTest, QueryResultKeyTest, HdfsWriteToMultipleCollectionsTest, OverseerRolesTest, ComputePlanActionTest, CheckHdfsIndexTest, TestShortCircuitedRequests, ChaosMonkeySafeLeaderWithPullReplicasTest, ClassificationUpdateProcessorTest, BinaryUpdateRequestHandlerTest, TestRequestForwarding, TestSolrQueryResponse, StatsComponentTest, OverseerTest, CleanupOldIndexTest, TestNodeLostTrigger, TestRandomCollapseQParserPlugin, NumericFieldsTest, SolrCloudExampleTest, BlockCacheTest, TestSolrCoreProperties, WordBreakSolrSpellCheckerTest, TestXmlQParser, TestComputePlanAction, DistributedTermsComponentTest, DefaultValueUpdateProcessorTest, TestBinaryResponseWriter, ResponseLogComponentTest, LeaderInitiatedRecoveryOnCommitTest, ParsingFieldUpdateProcessorsTest, TestSolrCloudSnapshots, OverseerTaskQueueTest, TestSchemaSimilarityResource, RAMDirectoryFactoryTest, TestSQLHandlerNonCloud, ResourceLoaderTest]
   [junit4]   2> NOTE: reproduce with: ant test  -Dtestcase=ResourceLoaderTest -Dtests.seed=7F6301270602A436 -Dtests.slow=true -Dtests.locale=ar-YE -Dtests.timezone=Antarctica/Davis -Dtests.asserts=true -Dtests.file.encoding=Cp1252
   [junit4] ERROR   0.00s J0 | ResourceLoaderTest (suite) <<<
   [junit4]    > Throwable #1: java.io.IOException: Could not remove the following files (in the order of attempts):
   [junit4]    >    C:\Users\jenkins\workspace\Lucene-Solr-master-Windows\solr\build\solr-core\test\J0\temp\solr.core.ResourceLoaderTest_7F6301270602A436-001\testClassLoaderLibs-001\otherLib: java.nio.file.DirectoryNotEmptyException: C:\Users\jenkins\workspace\Lucene-Solr-master-Windows\solr\build\solr-core\test\J0\temp\solr.core.ResourceLoaderTest_7F6301270602A436-001\testClassLoaderLibs-001\otherLib
   [junit4]    >    C:\Users\jenkins\workspace\Lucene-Solr-master-Windows\solr\build\solr-core\test\J0\temp\solr.core.ResourceLoaderTest_7F6301270602A436-001\testClassLoaderLibs-001: java.nio.file.DirectoryNotEmptyException: C:\Users\jenkins\workspace\Lucene-Solr-master-Windows\solr\build\solr-core\test\J0\temp\solr.core.ResourceLoaderTest_7F6301270602A436-001\testClassLoaderLibs-001
   [junit4]    >    C:\Users\jenkins\workspace\Lucene-Solr-master-Windows\solr\build\solr-core\test\J0\temp\solr.core.ResourceLoaderTest_7F6301270602A436-001\testClassLoaderLibs-001\otherLib\jar3.jar: java.nio.file.AccessDeniedException: C:\Users\jenkins\workspace\Lucene-Solr-master-Windows\solr\build\solr-core\test\J0\temp\solr.core.ResourceLoaderTest_7F6301270602A436-001\testClassLoaderLibs-001\otherLib\jar3.jar
   [junit4]    >    C:\Users\jenkins\workspace\Lucene-Solr-master-Windows\solr\build\solr-core\test\J0\temp\solr.core.ResourceLoaderTest_7F6301270602A436-001: java.nio.file.DirectoryNotEmptyException: C:\Users\jenkins\workspace\Lucene-Solr-master-Windows\solr\build\solr-core\test\J0\temp\solr.core.ResourceLoaderTest_7F6301270602A436-001
   [junit4]    > 	at __randomizedtesting.SeedInfo.seed([7F6301270602A436]:0)
   [junit4]    > 	at org.apache.lucene.util.IOUtils.rm(IOUtils.java:329)
   [junit4]    > 	at java.lang.Thread.run(Thread.java:748)
   [junit4] Completed [297/767 (2!)] on J0 in 0.13s, 7 tests, 1 error <<< FAILURES!

[...truncated 16 lines...]
   [junit4] Suite: org.apache.solr.response.JSONWriterTest
   [junit4]   2> Creating dataDir: C:\Users\jenkins\workspace\Lucene-Solr-master-Windows\solr\build\solr-core\test\J0\temp\solr.response.JSONWriterTest_7F6301270602A436-001\init-core-data-001
   [junit4]   2> 1361135 WARN  (SUITE-JSONWriterTest-seed#[7F6301270602A436]-worker) [    ] o.a.s.SolrTestCaseJ4 startTrackingSearchers: numOpens=7 numCloses=7
   [junit4]   2> 1361135 INFO  (SUITE-JSONWriterTest-seed#[7F6301270602A436]-worker) [    ] o.a.s.SolrTestCaseJ4 Using PointFields (NUMERIC_POINTS_SYSPROP=true) w/NUMERIC_DOCVALUES_SYSPROP=false
   [junit4]   2> 1361141 INFO  (SUITE-JSONWriterTest-seed#[7F6301270602A436]-worker) [    ] o.a.s.SolrTestCaseJ4 Randomized ssl (true) and clientAuth (false) via: @org.apache.solr.util.RandomizeSSL(reason=, value=NaN, ssl=NaN, clientAuth=NaN)
   [junit4]   2> 1361142 INFO  (SUITE-JSONWriterTest-seed#[7F6301270602A436]-worker) [    ] o.a.s.SolrTestCaseJ4 SecureRandom sanity checks: test.solr.allowed.securerandom=null & java.security.egd=file:/dev/./urandom
   [junit4]   2> 1361142 INFO  (SUITE-JSONWriterTest-seed#[7F6301270602A436]-worker) [    ] o.a.s.SolrTestCaseJ4 ####initCore
   [junit4]   2> 1361143 INFO  (SUITE-JSONWriterTest-seed#[7F6301270602A436]-worker) [    ] o.a.s.c.SolrResourceLoader [null] Added 2 libs to classloader, from paths: [/C:/Users/jenkins/workspace/Lucene-Solr-master-Windows/solr/core/src/test-files/solr/collection1/lib, /C:/Users/jenkins/workspace/Lucene-Solr-master-Windows/solr/core/src/test-files/solr/collection1/lib/classes]
   [junit4]   2> 1361241 INFO  (SUITE-JSONWriterTest-seed#[7F6301270602A436]-worker) [    ] o.a.s.c.SolrConfig Using Lucene MatchVersion: 8.0.0
   [junit4]   2> 1361279 INFO  (SUITE-JSONWriterTest-seed#[7F6301270602A436]-worker) [    ] o.a.s.s.IndexSchema [null] Schema name=test
   [junit4]   2> 1361454 INFO  (SUITE-JSONWriterTest-seed#[7F6301270602A436]-worker) [    ] o.a.s.s.IndexSchema Loaded schema test/1.0 with uniqueid field id
   [junit4]   2> 1361603 INFO  (SUITE-JSONWriterTest-seed#[7F6301270602A436]-worker) [    ] o.a.s.m.r.SolrJmxReporter JMX monitoring for 'solr.node' (registry 'solr.node') enabled at server: com.sun.jmx.mbeanserver.JmxMBeanServer@1e2ac81
   [junit4]   2> 1361614 INFO  (SUITE-JSONWriterTest-seed#[7F6301270602A436]-worker) [    ] o.a.s.m.r.SolrJmxReporter JMX monitoring for 'solr.jvm' (registry 'solr.jvm') enabled at server: com.sun.jmx.mbeanserver.JmxMBeanServer@1e2ac81
   [junit4]   2> 1361614 INFO  (SUITE-JSONWriterTest-seed#[7F6301270602A436]-worker) [    ] o.a.s.m.r.SolrJmxReporter JMX monitoring for 'solr.jetty' (registry 'solr.jetty') enabled at server: com.sun.jmx.mbeanserver.JmxMBeanServer@1e2ac81
   [junit4]   2> 1361616 INFO  (coreLoadExecutor-5399-thread-1) [    ] o.a.s.c.TransientSolrCoreCacheDefault Allocating transient cache for 2147483647 transient cores
   [junit4]   2> 1361619 INFO  (coreLoadExecutor-5399-thread-1) [    x:collection1] o.a.s.c.SolrResourceLoader [null] Added 2 libs to classloader, from paths: [/C:/Users/jenkins/workspace/Lucene-Solr-master-Windows/solr/core/src/test-files/solr/collection1/lib, /C:/Users/jenkins/workspace/Lucene-Solr-master-Windows/solr/core/src/test-files/solr/collection1/lib/classes]
   [junit4]   2> 1361718 INFO  (coreLoadExecutor-5399-thread-1) [    x:collection1] o.a.s.c.SolrConfig Using Lucene MatchVersion: 8.0.0
   [junit4]   2> 1361760 INFO  (coreLoadExecutor-5399-thread-1) [    x:collection1] o.a.s.s.IndexSchema [collection1] Schema name=test
   [junit4]   2> 1361874 INFO  (coreLoadExecutor-5399-thread-1) [    x:collection1] o.a.s.s.IndexSchema Loaded schema test/1.0 with uniqueid field id
   [junit4]   2> 1361888 INFO  (coreLoadExecutor-5399-thread-1) [    x:collection1] o.a.s.c.CoreContainer Creating SolrCore 'collection1' using configuration from instancedir C:\Users\jenkins\workspace\Lucene-Solr-master-Windows\solr\core\src\test-files\solr\collection1, trusted=true
   [junit4]   2> 1361889 INFO  (coreLoadExecutor-5399-thread-1) [    x:collection1] o.a.s.m.r.SolrJmxReporter JMX monitoring for 'solr.core.collection1' (registry 'solr.core.collection1') enabled at server: com.sun.jmx.mbeanserver.JmxMBeanServer@1e2ac81
   [junit4]   2> 1361890 INFO  (coreLoadExecutor-5399-thread-1) [    x:collection1] o.a.s.c.SolrCore solr.RecoveryStrategy.Builder
   [junit4]   2> 1361890 INFO  (coreLoadExecutor-5399-thread-1) [    x:collection1] o.a.s.c.SolrCore [[collection1] ] Opening new SolrCore at [C:\Users\jenkins\workspace\Lucene-Solr-master-Windows\solr\core\src\test-files\solr\collection1], dataDir=[C:\Users\jenkins\workspace\Lucene-Solr-master-Windows\solr\build\solr-core\test\J0\temp\solr.response.JSONWriterTest_7F6301270602A436-001\init-core-data-001\]
   [junit4]   2> 1361892 INFO  (coreLoadExecutor-5399-thread-1) [    x:collection1] o.a.s.u.RandomMergePolicy RandomMergePolicy wrapping class org.apache.lucene.index.LogByteSizeMergePolicy: [LogByteSizeMergePolicy: minMergeSize=1677721, mergeFactor=24, maxMergeSize=2147483648, maxMergeSizeForForcedMerge=9223372036854775807, calibrateSizeByDeletes=false, maxMergeDocs=2147483647, maxCFSSegmentSizeMB=8.796093022207999E12, noCFSRatio=0.0]
   [junit4]   2> 1362020 INFO  (coreLoadExecutor-5399-thread-1) [    x:collection1] o.a.s.u.UpdateHandler Using UpdateLog implementation: org.apache.solr.update.UpdateLog
   [junit4]   2> 1362021 INFO  (coreLoadExecutor-5399-thread-1) [    x:collection1] o.a.s.u.UpdateLog Initializing UpdateLog: dataDir= defaultSyncLevel=FLUSH numRecordsToKeep=100 maxNumLogsToKeep=10 numVersionBuckets=65536
   [junit4]   2> 1362026 INFO  (coreLoadExecutor-5399-thread-1) [    x:collection1] o.a.s.u.CommitTracker Hard AutoCommit: disabled
   [junit4]   2> 1362026 INFO  (coreLoadExecutor-5399-thread-1) [    x:collection1] o.a.s.u.CommitTracker Soft AutoCommit: disabled
   [junit4]   2> 1362031 INFO  (coreLoadExecutor-5399-thread-1) [    x:collection1] o.a.s.u.RandomMergePolicy RandomMergePolicy wrapping class org.apache.lucene.index.LogByteSizeMergePolicy: [LogByteSizeMergePolicy: minMergeSize=1677721, mergeFactor=28, maxMergeSize=2147483648, maxMergeSizeForForcedMerge=9223372036854775807, calibrateSizeByDeletes=true, maxMergeDocs=2147483647, maxCFSSegmentSizeMB=8.796093022207999E12, noCFSRatio=0.0]
   [junit4]   2> 1362032 INFO  (coreLoadExecutor-5399-thread-1) [    x:collection1] o.a.s.s.SolrIndexSearcher Opening [Searcher@298a1b[collection1] main]
   [junit4]   2> 1362034 INFO  (coreLoadExecutor-5399-thread-1) [    x:collection1] o.a.s.h.c.SpellCheckComponent Initializing spell checkers
   [junit4]   2> 1362042 INFO  (coreLoadExecutor-5399-thread-1) [    x:collection1] o.a.s.s.DirectSolrSpellChecker init: {name=direct,classname=DirectSolrSpellChecker,field=lowerfilt,minQueryLength=3}
   [junit4]   2> 1362081 INFO  (coreLoadExecutor-5399-thread-1) [    x:collection1] o.a.s.h.ReplicationHandler Commits will be reserved for 10000ms.
   [junit4]   2> 1362082 INFO  (searcherExecutor-5400-thread-1-processing-x:collection1) [    x:collection1] o.a.s.h.c.SpellCheckComponent Loading spell index for spellchecker: default
   [junit4]   2> 1362082 INFO  (coreLoadExecutor-5399-thread-1) [    x:collection1] o.a.s.u.UpdateLog Could not find max version in index or recent updates, using new clock 1589206351870951424
   [junit4]   2> 1362082 INFO  (searcherExecutor-5400-thread-1-processing-x:collection1) [    x:collection1] o.a.s.h.c.SpellCheckComponent Loading spell index for spellchecker: direct
   [junit4]   2> 1362082 INFO  (searcherExecutor-5400-thread-1-processing-x:collection1) [    x:collection1] o.a.s.h.c.SpellCheckComponent Loading spell index for spellchecker: wordbreak
   [junit4]   2> 1362082 INFO  (searcherExecutor-5400-thread-1-processing-x:collection1) [    x:collection1] o.a.s.h.c.SpellCheckComponent Loading spell index for spellchecker: multipleFields
   [junit4]   2> 1362083 INFO  (searcherExecutor-5400-thread-1-processing-x:collection1) [    x:collection1] o.a.s.h.c.SpellCheckComponent Loading spell index for spellchecker: jarowinkler
   [junit4]   2> 1362084 INFO  (searcherExecutor-5400-thread-1-processing-x:collection1) [    x:collection1] o.a.s.h.c.SpellCheckComponent Loading spell index for spellchecker: external
   [junit4]   2> 1362084 INFO  (searcherExecutor-5400-thread-1-processing-x:collection1) [    x:collection1] o.a.s.h.c.SpellCheckComponent Loading spell index for spellchecker: freq
   [junit4]   2> 1362084 INFO  (searcherExecutor-5400-thread-1-processing-x:collection1) [    x:collection1] o.a.s.h.c.SpellCheckComponent Loading spell index for spellchecker: fqcn
   [junit4]   2> 1362085 INFO  (searcherExecutor-5400-thread-1-processing-x:collection1) [    x:collection1] o.a.s.h.c.SpellCheckComponent Loading spell index for spellchecker: perDict
   [junit4]   2> 1362086 INFO  (searcherExecutor-5400-thread-1-processing-x:collection1) [    x:collection1] o.a.s.c.SolrCore [collection1] Registered new searcher Searcher@298a1b[collection1] main{ExitableDirectoryReader(UninvertingDirectoryReader())}
   [junit4]   2> 1362087 INFO  (SUITE-JSONWriterTest-seed#[7F6301270602A436]-worker) [    ] o.a.s.SolrTestCaseJ4 ####initCore end
   [junit4]   2> 1362090 INFO  (TEST-JSONWriterTest.testArrntvWriterOverridesAllWrites-seed#[7F6301270602A436]) [    ] o.a.s.SolrTestCaseJ4 ###Starting testArrntvWriterOverridesAllWrites
   [junit4]   2> 1362091 INFO  (TEST-JSONWriterTest.testArrntvWriterOverridesAllWrites-seed#[7F6301270602A436]) [    ] o.a.s.SolrTestCaseJ4 ###Ending testArrntvWriterOverridesAllWrites
   [junit4]   2> 1362093 INFO  (TEST-JSONWriterTest.testTypes-seed#[7F6301270602A436]) [    ] o.a.s.SolrTestCaseJ4 ###Starting testTypes
   [junit4]   2> 1362100 INFO  (TEST-JSONWriterTest.testTypes-seed#[7F6301270602A436]) [    ] o.a.s.SolrTestCaseJ4 ###Ending testTypes
   [junit4]   2> 1362102 INFO  (TEST-JSONWriterTest.testJSON-seed#[7F630

[...truncated too long message...]

ction, TestOverriddenPrefixQueryForCustomFieldType, SyncSliceTest, OutOfBoxZkACLAndCredentialsProvidersTest, SuggesterFSTTest, ShardSplitTest, TestUtils, TestCloudRecovery, TestCryptoKeys, MultiThreadedOCPTest, TestZkAclsWithHadoopAuth, TestPHPSerializedResponseWriter, NodeLostTriggerTest, DirectUpdateHandlerOptimizeTest, SimpleCollectionCreateDeleteTest, BooleanFieldTest, TestConfigSetsAPIExclusivity, TestRebalanceLeaders, SpellCheckCollatorTest, TestDistributedSearch, TermVectorComponentDistributedTest, TestRangeQuery, PeerSyncTest, TestBadConfig, DistributedQueryElevationComponentTest, SolrRequestParserTest, DocValuesTest, SolrCoreCheckLockOnStartupTest, TestUpdate, TestWordDelimiterFilterFactory, TestRemoteStreaming, TestSolrDeletionPolicy1, XsltUpdateRequestHandlerTest, CacheHeaderTest, TestSurroundQueryParser, LukeRequestHandlerTest, TestOmitPositions, TestValueSourceCache, TestIndexingPerformance, IndexSchemaRuntimeFieldTest, SolrPluginUtilsTest, TestJmxIntegration, QueryParsingTest, TestAnalyzedSuggestions, PingRequestHandlerTest, TestMergePolicyConfig, OutputWriterTest, ExternalFileFieldSortTest, DirectSolrConnectionTest, NotRequiredUniqueKeyTest, TestCodecSupport, TestLMDirichletSimilarityFactory, TestIBSimilarityFactory, TimeZoneUtilsTest, URLClassifyProcessorTest, PreAnalyzedFieldTest, TestDocumentBuilder, SystemInfoHandlerTest, UUIDFieldTest, CircularListTest, DistributedMLTComponentTest, DistributedIntervalFacetingTest, TestTolerantSearch, TestEmbeddedSolrServerAdminHandler, TestEmbeddedSolrServerSchemaAPI, TestJettySolrRunner, ConnectionReuseTest, AliasIntegrationTest, CollectionStateFormat2Test, CollectionsAPISolrJTest, DeleteInactiveReplicaTest, DeleteShardTest, DistribJoinFromCollectionTest, HttpPartitionTest, LeaderFailureAfterFreshStartTest, MigrateRouteKeyTest, PeerSyncReplicationTest, SaslZkACLProviderTest, TestCollectionAPI, TestDownShardTolerantSearch, TestHdfsCloudBackupRestore, TestLeaderElectionWithEmptyReplica, TestPullReplica, TestSSLRandomization, TestSegmentSorting, TestSizeLimitedDistributedMap, TestSolrCloudWithDelegationTokens, TestSolrCloudWithSecureImpersonation, TestStressCloudBlindAtomicUpdates, TestStressLiveNodes, TestTolerantUpdateProcessorRandomCloud, VMParamsZkACLAndCredentialsProvidersTest, AutoAddReplicasIntegrationTest, TestClusterStateProvider, TestDistribStateManager, TestGenericDistributedQueue, TestLargeCluster, CdcrReplicationDistributedZkTest, CdcrVersionReplicationTest, BlobRepositoryCloudTest, TestCustomStream, TestImplicitCoreProperties, TestInfoStreamLogging, TestInitParams, TestReloadAndDeleteDocs, TestShardHandlerFactory, TestSimpleTextCodec, TestSolrCoreSnapshots, TestConfigReload, InfoHandlerTest, SegmentsInfoRequestHandlerTest, DistributedDebugComponentTest, DistributedExpandComponentTest, DistributedFacetPivotLargeTest, DistributedFacetPivotWhiteBoxTest, ShufflingReplicaListTransformerTest, SpatialHeatmapFacetsTest, TestHttpShardHandlerFactory, TestPivotHelperCode, JavabinLoaderTest, HighlighterMaxOffsetTest, TestLegacyField, TestNumericTokenStream, JvmMetricsTest, SolrCoreMetricManagerTest, SolrJmxReporterCloudTest, SolrCloudReportersTest, RegexBytesRefFilterTest, SubstringBytesRefFilterTest, TestStreamBody, TestMacroExpander, TestMacros, TestCustomDocTransformer, TestExportWriter, TestGraphMLResponseWriter, TestRawTransformer, TestDynamicFieldResource, TestFieldCollectionResource, TestFieldTypeCollectionResource, TestUniqueKeyFieldResource, BadCopyFieldTest, ChangedSchemaMergeTest, DateRangeFieldTest, DocValuesMissingTest, SpatialRPTFieldTypeTest, TestCloudManagedSchema, TestCloudSchemaless, TestJsonFacetRefinement, BJQParserTest, TestCloudNestedDocsSort, TestClassicSimilarityFactory, TestDFISimilarityFactory, TestPerFieldSimilarityWithDefaultOverride, TestExactStatsCache, BasicAuthStandaloneTest, PKIAuthenticationIntegrationTest, TestPKIAuthenticationPlugin, TestRuleBasedAuthorizationPlugin, TestDelegationWithHadoopAuth, TestImpersonationWithHadoopAuth, ResponseHeaderTest, ConjunctionSolrSpellCheckerTest, SpellCheckCollatorWithCollapseTest, TestAnalyzeInfixSuggestions, TestBlendedInfixSuggestions, TestFileDictionaryLookup, TestFreeTextSuggestions, HdfsDirectoryTest, HdfsLockFactoryTest, TestLegacyFieldCache, AnalysisErrorHandlingTest, CdcrUpdateLogTest, TestDocBasedVersionConstraints, TestHdfsUpdateLog, TestInPlaceUpdatesStandalone, IgnoreCommitOptimizeUpdateProcessorFactoryTest, TimeRoutedAliasUpdateProcessorTest]
   [junit4] Completed [760/767 (4!)] on J0 in 21.97s, 2 tests, 1 error <<< FAILURES!

[...truncated 2378 lines...]
   [junit4] Suite: org.apache.solr.update.processor.TestOpenNLPExtractNamedEntitiesUpdateProcessorFactory
   [junit4]   2> Creating dataDir: C:\Users\jenkins\workspace\Lucene-Solr-master-Windows\solr\build\contrib\solr-analysis-extras\test\J1\temp\solr.update.processor.TestOpenNLPExtractNamedEntitiesUpdateProcessorFactory_A9C09B2183C6CEA1-001\init-core-data-001
   [junit4]   2> NOTE: test params are: codec=Asserting(Lucene70): {}, docValues:{}, maxPointsInLeafNode=1135, maxMBSortInHeap=5.313903463339123, sim=Asserting(org.apache.lucene.search.similarities.AssertingSimilarity@bd48b0), locale=fr, timezone=Europe/Bratislava
   [junit4]   2> NOTE: Windows 10 10.0 x86/Oracle Corporation 1.8.0_144 (32-bit)/cpus=3,threads=1,free=12194816,total=33763328
   [junit4]   2> NOTE: All tests run in this JVM: [TestFoldingMultitermExtrasQuery, TestOpenNLPExtractNamedEntitiesUpdateProcessorFactory]
   [junit4]   2> NOTE: reproduce with: ant test  -Dtestcase=TestOpenNLPExtractNamedEntitiesUpdateProcessorFactory -Dtests.seed=A9C09B2183C6CEA1 -Dtests.slow=true -Dtests.locale=fr -Dtests.timezone=Europe/Bratislava -Dtests.asserts=true -Dtests.file.encoding=UTF-8
   [junit4] ERROR   0.00s J1 | TestOpenNLPExtractNamedEntitiesUpdateProcessorFactory (suite) <<<
   [junit4]    > Throwable #1: java.io.IOException: Could not remove the following files (in the order of attempts):
   [junit4]    >    C:\Users\jenkins\workspace\Lucene-Solr-master-Windows\solr\build\contrib\solr-analysis-extras\test\J1\temp\solr.update.processor.TestOpenNLPExtractNamedEntitiesUpdateProcessorFactory_A9C09B2183C6CEA1-001\tempDir-001\collection1\conf: java.nio.file.DirectoryNotEmptyException: C:\Users\jenkins\workspace\Lucene-Solr-master-Windows\solr\build\contrib\solr-analysis-extras\test\J1\temp\solr.update.processor.TestOpenNLPExtractNamedEntitiesUpdateProcessorFactory_A9C09B2183C6CEA1-001\tempDir-001\collection1\conf
   [junit4]    >    C:\Users\jenkins\workspace\Lucene-Solr-master-Windows\solr\build\contrib\solr-analysis-extras\test\J1\temp\solr.update.processor.TestOpenNLPExtractNamedEntitiesUpdateProcessorFactory_A9C09B2183C6CEA1-001\tempDir-001\collection1: java.nio.file.DirectoryNotEmptyException: C:\Users\jenkins\workspace\Lucene-Solr-master-Windows\solr\build\contrib\solr-analysis-extras\test\J1\temp\solr.update.processor.TestOpenNLPExtractNamedEntitiesUpdateProcessorFactory_A9C09B2183C6CEA1-001\tempDir-001\collection1
   [junit4]    >    C:\Users\jenkins\workspace\Lucene-Solr-master-Windows\solr\build\contrib\solr-analysis-extras\test\J1\temp\solr.update.processor.TestOpenNLPExtractNamedEntitiesUpdateProcessorFactory_A9C09B2183C6CEA1-001\tempDir-001: java.nio.file.DirectoryNotEmptyException: C:\Users\jenkins\workspace\Lucene-Solr-master-Windows\solr\build\contrib\solr-analysis-extras\test\J1\temp\solr.update.processor.TestOpenNLPExtractNamedEntitiesUpdateProcessorFactory_A9C09B2183C6CEA1-001\tempDir-001
   [junit4]    >    C:\Users\jenkins\workspace\Lucene-Solr-master-Windows\solr\build\contrib\solr-analysis-extras\test\J1\temp\solr.update.processor.TestOpenNLPExtractNamedEntitiesUpdateProcessorFactory_A9C09B2183C6CEA1-001\tempDir-001\collection1\conf\en-test-sent.bin: java.nio.file.AccessDeniedException: C:\Users\jenkins\workspace\Lucene-Solr-master-Windows\solr\build\contrib\solr-analysis-extras\test\J1\temp\solr.update.processor.TestOpenNLPExtractNamedEntitiesUpdateProcessorFactory_A9C09B2183C6CEA1-001\tempDir-001\collection1\conf\en-test-sent.bin
   [junit4]    >    C:\Users\jenkins\workspace\Lucene-Solr-master-Windows\solr\build\contrib\solr-analysis-extras\test\J1\temp\solr.update.processor.TestOpenNLPExtractNamedEntitiesUpdateProcessorFactory_A9C09B2183C6CEA1-001\tempDir-001\collection1\conf\en-test-tokenizer.bin: java.nio.file.AccessDeniedException: C:\Users\jenkins\workspace\Lucene-Solr-master-Windows\solr\build\contrib\solr-analysis-extras\test\J1\temp\solr.update.processor.TestOpenNLPExtractNamedEntitiesUpdateProcessorFactory_A9C09B2183C6CEA1-001\tempDir-001\collection1\conf\en-test-tokenizer.bin
   [junit4]    >    C:\Users\jenkins\workspace\Lucene-Solr-master-Windows\solr\build\contrib\solr-analysis-extras\test\J1\temp\solr.update.processor.TestOpenNLPExtractNamedEntitiesUpdateProcessorFactory_A9C09B2183C6CEA1-001\tempDir-001\collection1\conf\en-test-ner-person.bin: java.nio.file.AccessDeniedException: C:\Users\jenkins\workspace\Lucene-Solr-master-Windows\solr\build\contrib\solr-analysis-extras\test\J1\temp\solr.update.processor.TestOpenNLPExtractNamedEntitiesUpdateProcessorFactory_A9C09B2183C6CEA1-001\tempDir-001\collection1\conf\en-test-ner-person.bin
   [junit4]    >    C:\Users\jenkins\workspace\Lucene-Solr-master-Windows\solr\build\contrib\solr-analysis-extras\test\J1\temp\solr.update.processor.TestOpenNLPExtractNamedEntitiesUpdateProcessorFactory_A9C09B2183C6CEA1-001: java.nio.file.DirectoryNotEmptyException: C:\Users\jenkins\workspace\Lucene-Solr-master-Windows\solr\build\contrib\solr-analysis-extras\test\J1\temp\solr.update.processor.TestOpenNLPExtractNamedEntitiesUpdateProcessorFactory_A9C09B2183C6CEA1-001
   [junit4]    > 	at __randomizedtesting.SeedInfo.seed([A9C09B2183C6CEA1]:0)
   [junit4]    > 	at org.apache.lucene.util.IOUtils.rm(IOUtils.java:329)
   [junit4]    > 	at java.lang.Thread.run(Thread.java:748)
   [junit4] Completed [4/5 (1!)] on J1 in 1.58s, 8 tests, 1 error <<< FAILURES!

[...truncated 41450 lines...]

Mime
View raw message