lucene-dev mailing list archives

Site index · List index
Message view « Date » · « Thread »
Top « Date » · « Thread »
From Policeman Jenkins Server <jenk...@thetaphi.de>
Subject [JENKINS] Lucene-Solr-master-MacOSX (64bit/jdk1.8.0) - Build # 4410 - Still Unstable!
Date Sat, 27 Jan 2018 01:32:17 GMT
Build: https://jenkins.thetaphi.de/job/Lucene-Solr-master-MacOSX/4410/
Java: 64bit/jdk1.8.0 -XX:+UseCompressedOops -XX:+UseSerialGC

2 tests failed.
FAILED:  org.apache.solr.cloud.ChaosMonkeySafeLeaderTest.test

Error Message:
shard2 is not consistent.  Got 18 from http://127.0.0.1:65392/collection1_shard2_replica_n41 (previous client) and got 15 from http://127.0.0.1:65402/collection1_shard2_replica_n45

Stack Trace:
java.lang.AssertionError: shard2 is not consistent.  Got 18 from http://127.0.0.1:65392/collection1_shard2_replica_n41 (previous client) and got 15 from http://127.0.0.1:65402/collection1_shard2_replica_n45
	at __randomizedtesting.SeedInfo.seed([2055D7445EB42AE:8A5162AEEB172F56]:0)
	at org.junit.Assert.fail(Assert.java:93)
	at org.apache.solr.cloud.AbstractFullDistribZkTestBase.checkShardConsistency(AbstractFullDistribZkTestBase.java:1330)
	at org.apache.solr.cloud.AbstractFullDistribZkTestBase.checkShardConsistency(AbstractFullDistribZkTestBase.java:1309)
	at org.apache.solr.cloud.ChaosMonkeySafeLeaderTest.test(ChaosMonkeySafeLeaderTest.java:162)
	at sun.reflect.NativeMethodAccessorImpl.invoke0(Native Method)
	at sun.reflect.NativeMethodAccessorImpl.invoke(NativeMethodAccessorImpl.java:62)
	at sun.reflect.DelegatingMethodAccessorImpl.invoke(DelegatingMethodAccessorImpl.java:43)
	at java.lang.reflect.Method.invoke(Method.java:498)
	at com.carrotsearch.randomizedtesting.RandomizedRunner.invoke(RandomizedRunner.java:1737)
	at com.carrotsearch.randomizedtesting.RandomizedRunner$8.evaluate(RandomizedRunner.java:934)
	at com.carrotsearch.randomizedtesting.RandomizedRunner$9.evaluate(RandomizedRunner.java:970)
	at com.carrotsearch.randomizedtesting.RandomizedRunner$10.evaluate(RandomizedRunner.java:984)
	at org.apache.solr.BaseDistributedSearchTestCase$ShardsRepeatRule$ShardsFixedStatement.callStatement(BaseDistributedSearchTestCase.java:993)
	at org.apache.solr.BaseDistributedSearchTestCase$ShardsRepeatRule$ShardsStatement.evaluate(BaseDistributedSearchTestCase.java:968)
	at com.carrotsearch.randomizedtesting.rules.SystemPropertiesRestoreRule$1.evaluate(SystemPropertiesRestoreRule.java:57)
	at org.apache.lucene.util.TestRuleSetupTeardownChained$1.evaluate(TestRuleSetupTeardownChained.java:49)
	at org.apache.lucene.util.AbstractBeforeAfterRule$1.evaluate(AbstractBeforeAfterRule.java:45)
	at org.apache.lucene.util.TestRuleThreadAndTestName$1.evaluate(TestRuleThreadAndTestName.java:48)
	at org.apache.lucene.util.TestRuleIgnoreAfterMaxFailures$1.evaluate(TestRuleIgnoreAfterMaxFailures.java:64)
	at org.apache.lucene.util.TestRuleMarkFailure$1.evaluate(TestRuleMarkFailure.java:47)
	at com.carrotsearch.randomizedtesting.rules.StatementAdapter.evaluate(StatementAdapter.java:36)
	at com.carrotsearch.randomizedtesting.ThreadLeakControl$StatementRunner.run(ThreadLeakControl.java:368)
	at com.carrotsearch.randomizedtesting.ThreadLeakControl.forkTimeoutingTask(ThreadLeakControl.java:817)
	at com.carrotsearch.randomizedtesting.ThreadLeakControl$3.evaluate(ThreadLeakControl.java:468)
	at com.carrotsearch.randomizedtesting.RandomizedRunner.runSingleTest(RandomizedRunner.java:943)
	at com.carrotsearch.randomizedtesting.RandomizedRunner$5.evaluate(RandomizedRunner.java:829)
	at com.carrotsearch.randomizedtesting.RandomizedRunner$6.evaluate(RandomizedRunner.java:879)
	at com.carrotsearch.randomizedtesting.RandomizedRunner$7.evaluate(RandomizedRunner.java:890)
	at com.carrotsearch.randomizedtesting.rules.StatementAdapter.evaluate(StatementAdapter.java:36)
	at com.carrotsearch.randomizedtesting.rules.SystemPropertiesRestoreRule$1.evaluate(SystemPropertiesRestoreRule.java:57)
	at org.apache.lucene.util.AbstractBeforeAfterRule$1.evaluate(AbstractBeforeAfterRule.java:45)
	at com.carrotsearch.randomizedtesting.rules.StatementAdapter.evaluate(StatementAdapter.java:36)
	at org.apache.lucene.util.TestRuleStoreClassName$1.evaluate(TestRuleStoreClassName.java:41)
	at com.carrotsearch.randomizedtesting.rules.NoShadowingOrOverridesOnMethodsRule$1.evaluate(NoShadowingOrOverridesOnMethodsRule.java:40)
	at com.carrotsearch.randomizedtesting.rules.NoShadowingOrOverridesOnMethodsRule$1.evaluate(NoShadowingOrOverridesOnMethodsRule.java:40)
	at com.carrotsearch.randomizedtesting.rules.StatementAdapter.evaluate(StatementAdapter.java:36)
	at com.carrotsearch.randomizedtesting.rules.StatementAdapter.evaluate(StatementAdapter.java:36)
	at com.carrotsearch.randomizedtesting.rules.StatementAdapter.evaluate(StatementAdapter.java:36)
	at org.apache.lucene.util.TestRuleAssertionsRequired$1.evaluate(TestRuleAssertionsRequired.java:53)
	at org.apache.lucene.util.TestRuleMarkFailure$1.evaluate(TestRuleMarkFailure.java:47)
	at org.apache.lucene.util.TestRuleIgnoreAfterMaxFailures$1.evaluate(TestRuleIgnoreAfterMaxFailures.java:64)
	at org.apache.lucene.util.TestRuleIgnoreTestSuites$1.evaluate(TestRuleIgnoreTestSuites.java:54)
	at com.carrotsearch.randomizedtesting.rules.StatementAdapter.evaluate(StatementAdapter.java:36)
	at com.carrotsearch.randomizedtesting.ThreadLeakControl$StatementRunner.run(ThreadLeakControl.java:368)
	at java.lang.Thread.run(Thread.java:748)


FAILED:  org.apache.solr.cloud.autoscaling.TriggerIntegrationTest.testNodeLostTrigger

Error Message:


Stack Trace:
java.lang.AssertionError
	at __randomizedtesting.SeedInfo.seed([2055D7445EB42AE:6FBF4667F21C034]:0)
	at org.junit.Assert.fail(Assert.java:92)
	at org.junit.Assert.assertTrue(Assert.java:43)
	at org.junit.Assert.assertTrue(Assert.java:54)
	at org.apache.solr.cloud.autoscaling.TriggerIntegrationTest.testNodeLostTrigger(TriggerIntegrationTest.java:521)
	at sun.reflect.NativeMethodAccessorImpl.invoke0(Native Method)
	at sun.reflect.NativeMethodAccessorImpl.invoke(NativeMethodAccessorImpl.java:62)
	at sun.reflect.DelegatingMethodAccessorImpl.invoke(DelegatingMethodAccessorImpl.java:43)
	at java.lang.reflect.Method.invoke(Method.java:498)
	at com.carrotsearch.randomizedtesting.RandomizedRunner.invoke(RandomizedRunner.java:1737)
	at com.carrotsearch.randomizedtesting.RandomizedRunner$8.evaluate(RandomizedRunner.java:934)
	at com.carrotsearch.randomizedtesting.RandomizedRunner$9.evaluate(RandomizedRunner.java:970)
	at com.carrotsearch.randomizedtesting.RandomizedRunner$10.evaluate(RandomizedRunner.java:984)
	at com.carrotsearch.randomizedtesting.rules.SystemPropertiesRestoreRule$1.evaluate(SystemPropertiesRestoreRule.java:57)
	at org.apache.lucene.util.TestRuleSetupTeardownChained$1.evaluate(TestRuleSetupTeardownChained.java:49)
	at org.apache.lucene.util.AbstractBeforeAfterRule$1.evaluate(AbstractBeforeAfterRule.java:45)
	at org.apache.lucene.util.TestRuleThreadAndTestName$1.evaluate(TestRuleThreadAndTestName.java:48)
	at org.apache.lucene.util.TestRuleIgnoreAfterMaxFailures$1.evaluate(TestRuleIgnoreAfterMaxFailures.java:64)
	at org.apache.lucene.util.TestRuleMarkFailure$1.evaluate(TestRuleMarkFailure.java:47)
	at com.carrotsearch.randomizedtesting.rules.StatementAdapter.evaluate(StatementAdapter.java:36)
	at com.carrotsearch.randomizedtesting.ThreadLeakControl$StatementRunner.run(ThreadLeakControl.java:368)
	at com.carrotsearch.randomizedtesting.ThreadLeakControl.forkTimeoutingTask(ThreadLeakControl.java:817)
	at com.carrotsearch.randomizedtesting.ThreadLeakControl$3.evaluate(ThreadLeakControl.java:468)
	at com.carrotsearch.randomizedtesting.RandomizedRunner.runSingleTest(RandomizedRunner.java:943)
	at com.carrotsearch.randomizedtesting.RandomizedRunner$5.evaluate(RandomizedRunner.java:829)
	at com.carrotsearch.randomizedtesting.RandomizedRunner$6.evaluate(RandomizedRunner.java:879)
	at com.carrotsearch.randomizedtesting.RandomizedRunner$7.evaluate(RandomizedRunner.java:890)
	at com.carrotsearch.randomizedtesting.rules.StatementAdapter.evaluate(StatementAdapter.java:36)
	at com.carrotsearch.randomizedtesting.rules.SystemPropertiesRestoreRule$1.evaluate(SystemPropertiesRestoreRule.java:57)
	at org.apache.lucene.util.AbstractBeforeAfterRule$1.evaluate(AbstractBeforeAfterRule.java:45)
	at com.carrotsearch.randomizedtesting.rules.StatementAdapter.evaluate(StatementAdapter.java:36)
	at org.apache.lucene.util.TestRuleStoreClassName$1.evaluate(TestRuleStoreClassName.java:41)
	at com.carrotsearch.randomizedtesting.rules.NoShadowingOrOverridesOnMethodsRule$1.evaluate(NoShadowingOrOverridesOnMethodsRule.java:40)
	at com.carrotsearch.randomizedtesting.rules.NoShadowingOrOverridesOnMethodsRule$1.evaluate(NoShadowingOrOverridesOnMethodsRule.java:40)
	at com.carrotsearch.randomizedtesting.rules.StatementAdapter.evaluate(StatementAdapter.java:36)
	at com.carrotsearch.randomizedtesting.rules.StatementAdapter.evaluate(StatementAdapter.java:36)
	at com.carrotsearch.randomizedtesting.rules.StatementAdapter.evaluate(StatementAdapter.java:36)
	at org.apache.lucene.util.TestRuleAssertionsRequired$1.evaluate(TestRuleAssertionsRequired.java:53)
	at org.apache.lucene.util.TestRuleMarkFailure$1.evaluate(TestRuleMarkFailure.java:47)
	at org.apache.lucene.util.TestRuleIgnoreAfterMaxFailures$1.evaluate(TestRuleIgnoreAfterMaxFailures.java:64)
	at org.apache.lucene.util.TestRuleIgnoreTestSuites$1.evaluate(TestRuleIgnoreTestSuites.java:54)
	at com.carrotsearch.randomizedtesting.rules.StatementAdapter.evaluate(StatementAdapter.java:36)
	at com.carrotsearch.randomizedtesting.ThreadLeakControl$StatementRunner.run(ThreadLeakControl.java:368)
	at java.lang.Thread.run(Thread.java:748)




Build Log:
[...truncated 12271 lines...]
   [junit4] Suite: org.apache.solr.cloud.ChaosMonkeySafeLeaderTest
   [junit4]   2> 1340893 INFO  (SUITE-ChaosMonkeySafeLeaderTest-seed#[2055D7445EB42AE]-worker) [    ] o.a.s.SolrTestCaseJ4 SecureRandom sanity checks: test.solr.allowed.securerandom=null & java.security.egd=file:/dev/./urandom
   [junit4]   2> Creating dataDir: /Users/jenkins/workspace/Lucene-Solr-master-MacOSX/solr/build/solr-core/test/J1/temp/solr.cloud.ChaosMonkeySafeLeaderTest_2055D7445EB42AE-001/init-core-data-001
   [junit4]   2> 1340894 WARN  (SUITE-ChaosMonkeySafeLeaderTest-seed#[2055D7445EB42AE]-worker) [    ] o.a.s.SolrTestCaseJ4 startTrackingSearchers: numOpens=9 numCloses=9
   [junit4]   2> 1340894 INFO  (SUITE-ChaosMonkeySafeLeaderTest-seed#[2055D7445EB42AE]-worker) [    ] o.a.s.SolrTestCaseJ4 Using PointFields (NUMERIC_POINTS_SYSPROP=true) w/NUMERIC_DOCVALUES_SYSPROP=true
   [junit4]   2> 1340897 INFO  (SUITE-ChaosMonkeySafeLeaderTest-seed#[2055D7445EB42AE]-worker) [    ] o.a.s.SolrTestCaseJ4 Randomized ssl (false) and clientAuth (false) via: @org.apache.solr.util.RandomizeSSL(reason=, value=NaN, ssl=NaN, clientAuth=NaN) w/ MAC_OS_X supressed clientAuth
   [junit4]   2> 1340897 INFO  (SUITE-ChaosMonkeySafeLeaderTest-seed#[2055D7445EB42AE]-worker) [    ] o.a.s.BaseDistributedSearchTestCase Setting hostContext system property: /
   [junit4]   2> 1340900 INFO  (TEST-ChaosMonkeySafeLeaderTest.test-seed#[2055D7445EB42AE]) [    ] o.a.s.c.ZkTestServer STARTING ZK TEST SERVER
   [junit4]   2> 1340900 INFO  (Thread-2568) [    ] o.a.s.c.ZkTestServer client port:0.0.0.0/0.0.0.0:0
   [junit4]   2> 1340900 INFO  (Thread-2568) [    ] o.a.s.c.ZkTestServer Starting server
   [junit4]   2> 1340906 ERROR (Thread-2568) [    ] o.a.z.s.ZooKeeperServer ZKShutdownHandler is not registered, so ZooKeeper server won't take any action on ERROR or SHUTDOWN server state changes
   [junit4]   2> 1341004 INFO  (TEST-ChaosMonkeySafeLeaderTest.test-seed#[2055D7445EB42AE]) [    ] o.a.s.c.ZkTestServer start zk server on port:65380
   [junit4]   2> 1341092 INFO  (zkConnectionManagerCallback-2916-thread-1) [    ] o.a.s.c.c.ConnectionManager zkClient has connected
   [junit4]   2> 1341095 WARN  (NIOServerCxn.Factory:0.0.0.0/0.0.0.0:0) [    ] o.a.z.s.NIOServerCnxn caught end of stream exception
   [junit4]   2> EndOfStreamException: Unable to read additional data from client sessionid 0x161350079680000, likely client has closed socket
   [junit4]   2> 	at org.apache.zookeeper.server.NIOServerCnxn.doIO(NIOServerCnxn.java:239)
   [junit4]   2> 	at org.apache.zookeeper.server.NIOServerCnxnFactory.run(NIOServerCnxnFactory.java:203)
   [junit4]   2> 	at java.lang.Thread.run(Thread.java:748)
   [junit4]   2> 1341100 INFO  (zkConnectionManagerCallback-2918-thread-1) [    ] o.a.s.c.c.ConnectionManager zkClient has connected
   [junit4]   2> 1341107 INFO  (TEST-ChaosMonkeySafeLeaderTest.test-seed#[2055D7445EB42AE]) [    ] o.a.s.c.AbstractZkTestCase put /Users/jenkins/workspace/Lucene-Solr-master-MacOSX/solr/core/src/test-files/solr/collection1/conf/solrconfig-tlog.xml to /configs/conf1/solrconfig.xml
   [junit4]   2> 1341110 INFO  (TEST-ChaosMonkeySafeLeaderTest.test-seed#[2055D7445EB42AE]) [    ] o.a.s.c.AbstractZkTestCase put /Users/jenkins/workspace/Lucene-Solr-master-MacOSX/solr/core/src/test-files/solr/collection1/conf/schema15.xml to /configs/conf1/schema.xml
   [junit4]   2> 1341112 INFO  (TEST-ChaosMonkeySafeLeaderTest.test-seed#[2055D7445EB42AE]) [    ] o.a.s.c.AbstractZkTestCase put /Users/jenkins/workspace/Lucene-Solr-master-MacOSX/solr/core/src/test-files/solr/collection1/conf/solrconfig.snippet.randomindexconfig.xml to /configs/conf1/solrconfig.snippet.randomindexconfig.xml
   [junit4]   2> 1341114 INFO  (TEST-ChaosMonkeySafeLeaderTest.test-seed#[2055D7445EB42AE]) [    ] o.a.s.c.AbstractZkTestCase put /Users/jenkins/workspace/Lucene-Solr-master-MacOSX/solr/core/src/test-files/solr/collection1/conf/stopwords.txt to /configs/conf1/stopwords.txt
   [junit4]   2> 1341115 INFO  (TEST-ChaosMonkeySafeLeaderTest.test-seed#[2055D7445EB42AE]) [    ] o.a.s.c.AbstractZkTestCase put /Users/jenkins/workspace/Lucene-Solr-master-MacOSX/solr/core/src/test-files/solr/collection1/conf/protwords.txt to /configs/conf1/protwords.txt
   [junit4]   2> 1341117 INFO  (TEST-ChaosMonkeySafeLeaderTest.test-seed#[2055D7445EB42AE]) [    ] o.a.s.c.AbstractZkTestCase put /Users/jenkins/workspace/Lucene-Solr-master-MacOSX/solr/core/src/test-files/solr/collection1/conf/currency.xml to /configs/conf1/currency.xml
   [junit4]   2> 1341119 INFO  (TEST-ChaosMonkeySafeLeaderTest.test-seed#[2055D7445EB42AE]) [    ] o.a.s.c.AbstractZkTestCase put /Users/jenkins/workspace/Lucene-Solr-master-MacOSX/solr/core/src/test-files/solr/collection1/conf/enumsConfig.xml to /configs/conf1/enumsConfig.xml
   [junit4]   2> 1341121 INFO  (TEST-ChaosMonkeySafeLeaderTest.test-seed#[2055D7445EB42AE]) [    ] o.a.s.c.AbstractZkTestCase put /Users/jenkins/workspace/Lucene-Solr-master-MacOSX/solr/core/src/test-files/solr/collection1/conf/open-exchange-rates.json to /configs/conf1/open-exchange-rates.json
   [junit4]   2> 1341122 INFO  (TEST-ChaosMonkeySafeLeaderTest.test-seed#[2055D7445EB42AE]) [    ] o.a.s.c.AbstractZkTestCase put /Users/jenkins/workspace/Lucene-Solr-master-MacOSX/solr/core/src/test-files/solr/collection1/conf/mapping-ISOLatin1Accent.txt to /configs/conf1/mapping-ISOLatin1Accent.txt
   [junit4]   2> 1341124 INFO  (TEST-ChaosMonkeySafeLeaderTest.test-seed#[2055D7445EB42AE]) [    ] o.a.s.c.AbstractZkTestCase put /Users/jenkins/workspace/Lucene-Solr-master-MacOSX/solr/core/src/test-files/solr/collection1/conf/old_synonyms.txt to /configs/conf1/old_synonyms.txt
   [junit4]   2> 1341126 INFO  (TEST-ChaosMonkeySafeLeaderTest.test-seed#[2055D7445EB42AE]) [    ] o.a.s.c.AbstractZkTestCase put /Users/jenkins/workspace/Lucene-Solr-master-MacOSX/solr/core/src/test-files/solr/collection1/conf/synonyms.txt to /configs/conf1/synonyms.txt
   [junit4]   2> 1341128 INFO  (TEST-ChaosMonkeySafeLeaderTest.test-seed#[2055D7445EB42AE]) [    ] o.a.s.c.AbstractFullDistribZkTestBase Will use NRT replicas unless explicitly asked otherwise
   [junit4]   2> 1341355 INFO  (TEST-ChaosMonkeySafeLeaderTest.test-seed#[2055D7445EB42AE]) [    ] o.e.j.s.Server jetty-9.4.8.v20171121, build timestamp: 2017-11-21T18:27:37-03:00, git hash: 82b8fb23f757335bb3329d540ce37a2a2615f0a8
   [junit4]   2> 1341356 INFO  (TEST-ChaosMonkeySafeLeaderTest.test-seed#[2055D7445EB42AE]) [    ] o.e.j.s.session DefaultSessionIdManager workerName=node0
   [junit4]   2> 1341357 INFO  (TEST-ChaosMonkeySafeLeaderTest.test-seed#[2055D7445EB42AE]) [    ] o.e.j.s.session No SessionScavenger set, using defaults
   [junit4]   2> 1341357 INFO  (TEST-ChaosMonkeySafeLeaderTest.test-seed#[2055D7445EB42AE]) [    ] o.e.j.s.session Scavenging every 600000ms
   [junit4]   2> 1341357 INFO  (TEST-ChaosMonkeySafeLeaderTest.test-seed#[2055D7445EB42AE]) [    ] o.e.j.s.h.ContextHandler Started o.e.j.s.ServletContextHandler@28a4a071{/,null,AVAILABLE}
   [junit4]   2> 1341361 INFO  (TEST-ChaosMonkeySafeLeaderTest.test-seed#[2055D7445EB42AE]) [    ] o.e.j.s.AbstractConnector Started ServerConnector@54d423c7{HTTP/1.1,[http/1.1]}{127.0.0.1:65383}
   [junit4]   2> 1341361 INFO  (TEST-ChaosMonkeySafeLeaderTest.test-seed#[2055D7445EB42AE]) [    ] o.e.j.s.Server Started @1345394ms
   [junit4]   2> 1341361 INFO  (TEST-ChaosMonkeySafeLeaderTest.test-seed#[2055D7445EB42AE]) [    ] o.a.s.c.s.e.JettySolrRunner Jetty properties: {solr.data.dir=/Users/jenkins/workspace/Lucene-Solr-master-MacOSX/solr/build/solr-core/test/J1/temp/solr.cloud.ChaosMonkeySafeLeaderTest_2055D7445EB42AE-001/tempDir-001/control/data, replicaType=NRT, hostContext=/, hostPort=65383, coreRootDirectory=/Users/jenkins/workspace/Lucene-Solr-master-MacOSX/solr/build/solr-core/test/J1/../../../../../../../../../Users/jenkins/workspace/Lucene-Solr-master-MacOSX/solr/build/solr-core/test/J1/temp/solr.cloud.ChaosMonkeySafeLeaderTest_2055D7445EB42AE-001/control-001/cores}
   [junit4]   2> 1341361 ERROR (TEST-ChaosMonkeySafeLeaderTest.test-seed#[2055D7445EB42AE]) [    ] o.a.s.u.StartupLoggingUtils Missing Java Option solr.log.dir. Logging may be missing or incomplete.
   [junit4]   2> 1341361 INFO  (TEST-ChaosMonkeySafeLeaderTest.test-seed#[2055D7445EB42AE]) [    ] o.a.s.s.SolrDispatchFilter  ___      _       Welcome to Apache Solr™ version 8.0.0
   [junit4]   2> 1341361 INFO  (TEST-ChaosMonkeySafeLeaderTest.test-seed#[2055D7445EB42AE]) [    ] o.a.s.s.SolrDispatchFilter / __| ___| |_ _   Starting in cloud mode on port null
   [junit4]   2> 1341361 INFO  (TEST-ChaosMonkeySafeLeaderTest.test-seed#[2055D7445EB42AE]) [    ] o.a.s.s.SolrDispatchFilter \__ \/ _ \ | '_|  Install dir: null
   [junit4]   2> 1341361 INFO  (TEST-ChaosMonkeySafeLeaderTest.test-seed#[2055D7445EB42AE]) [    ] o.a.s.s.SolrDispatchFilter |___/\___/_|_|    Start time: 2018-01-27T00:24:39.473Z
   [junit4]   2> 1341363 INFO  (zkConnectionManagerCallback-2920-thread-1) [    ] o.a.s.c.c.ConnectionManager zkClient has connected
   [junit4]   2> 1341364 INFO  (TEST-ChaosMonkeySafeLeaderTest.test-seed#[2055D7445EB42AE]) [    ] o.a.s.s.SolrDispatchFilter Loading solr.xml from SolrHome (not found in ZooKeeper)
   [junit4]   2> 1341364 INFO  (TEST-ChaosMonkeySafeLeaderTest.test-seed#[2055D7445EB42AE]) [    ] o.a.s.c.SolrXmlConfig Loading container configuration from /Users/jenkins/workspace/Lucene-Solr-master-MacOSX/solr/build/solr-core/test/J1/temp/solr.cloud.ChaosMonkeySafeLeaderTest_2055D7445EB42AE-001/control-001/solr.xml
   [junit4]   2> 1341371 INFO  (TEST-ChaosMonkeySafeLeaderTest.test-seed#[2055D7445EB42AE]) [    ] o.a.s.c.SolrXmlConfig Configuration parameter autoReplicaFailoverWorkLoopDelay is ignored
   [junit4]   2> 1341371 INFO  (TEST-ChaosMonkeySafeLeaderTest.test-seed#[2055D7445EB42AE]) [    ] o.a.s.c.SolrXmlConfig Configuration parameter autoReplicaFailoverBadNodeExpiration is ignored
   [junit4]   2> 1341371 INFO  (TEST-ChaosMonkeySafeLeaderTest.test-seed#[2055D7445EB42AE]) [    ] o.a.s.c.SolrXmlConfig MBean server found: com.sun.jmx.mbeanserver.JmxMBeanServer@42e9af76, but no JMX reporters were configured - adding default JMX reporter.
   [junit4]   2> 1341374 INFO  (TEST-ChaosMonkeySafeLeaderTest.test-seed#[2055D7445EB42AE]) [    ] o.a.s.c.ZkContainer Zookeeper client=127.0.0.1:65380/solr
   [junit4]   2> 1341376 INFO  (zkConnectionManagerCallback-2924-thread-1) [    ] o.a.s.c.c.ConnectionManager zkClient has connected
   [junit4]   2> 1341378 INFO  (zkConnectionManagerCallback-2926-thread-1-processing-n:127.0.0.1:65383_) [n:127.0.0.1:65383_    ] o.a.s.c.c.ConnectionManager zkClient has connected
   [junit4]   2> 1341540 INFO  (TEST-ChaosMonkeySafeLeaderTest.test-seed#[2055D7445EB42AE]) [n:127.0.0.1:65383_    ] o.a.s.c.Overseer Overseer (id=null) closing
   [junit4]   2> 1341541 INFO  (TEST-ChaosMonkeySafeLeaderTest.test-seed#[2055D7445EB42AE]) [n:127.0.0.1:65383_    ] o.a.s.c.OverseerElectionContext I am going to be the leader 127.0.0.1:65383_
   [junit4]   2> 1341543 INFO  (TEST-ChaosMonkeySafeLeaderTest.test-seed#[2055D7445EB42AE]) [n:127.0.0.1:65383_    ] o.a.s.c.Overseer Overseer (id=99418942931992580-127.0.0.1:65383_-n_0000000000) starting
   [junit4]   2> 1341556 INFO  (TEST-ChaosMonkeySafeLeaderTest.test-seed#[2055D7445EB42AE]) [n:127.0.0.1:65383_    ] o.a.s.c.ZkController Register node as live in ZooKeeper:/live_nodes/127.0.0.1:65383_
   [junit4]   2> 1341559 INFO  (OverseerStateUpdate-99418942931992580-127.0.0.1:65383_-n_0000000000) [n:127.0.0.1:65383_    ] o.a.s.c.c.ZkStateReader Updated live nodes from ZooKeeper... (0) -> (1)
   [junit4]   2> 1341705 INFO  (TEST-ChaosMonkeySafeLeaderTest.test-seed#[2055D7445EB42AE]) [n:127.0.0.1:65383_    ] o.a.s.m.r.SolrJmxReporter JMX monitoring for 'solr.node' (registry 'solr.node') enabled at server: com.sun.jmx.mbeanserver.JmxMBeanServer@42e9af76
   [junit4]   2> 1341717 INFO  (TEST-ChaosMonkeySafeLeaderTest.test-seed#[2055D7445EB42AE]) [n:127.0.0.1:65383_    ] o.a.s.m.r.SolrJmxReporter JMX monitoring for 'solr.jvm' (registry 'solr.jvm') enabled at server: com.sun.jmx.mbeanserver.JmxMBeanServer@42e9af76
   [junit4]   2> 1341717 INFO  (TEST-ChaosMonkeySafeLeaderTest.test-seed#[2055D7445EB42AE]) [n:127.0.0.1:65383_    ] o.a.s.m.r.SolrJmxReporter JMX monitoring for 'solr.jetty' (registry 'solr.jetty') enabled at server: com.sun.jmx.mbeanserver.JmxMBeanServer@42e9af76
   [junit4]   2> 1341719 INFO  (TEST-ChaosMonkeySafeLeaderTest.test-seed#[2055D7445EB42AE]) [n:127.0.0.1:65383_    ] o.a.s.c.CorePropertiesLocator Found 0 core definitions underneath /Users/jenkins/workspace/Lucene-Solr-master-MacOSX/solr/build/solr-core/test/J1/../../../../../../../../../Users/jenkins/workspace/Lucene-Solr-master-MacOSX/solr/build/solr-core/test/J1/temp/solr.cloud.ChaosMonkeySafeLeaderTest_2055D7445EB42AE-001/control-001/cores
   [junit4]   2> 1341743 INFO  (zkConnectionManagerCallback-2932-thread-1) [    ] o.a.s.c.c.ConnectionManager zkClient has connected
   [junit4]   2> 1341745 INFO  (TEST-ChaosMonkeySafeLeaderTest.test-seed#[2055D7445EB42AE]) [    ] o.a.s.c.c.ZkStateReader Updated live nodes from ZooKeeper... (0) -> (1)
   [junit4]   2> 1341746 INFO  (TEST-ChaosMonkeySafeLeaderTest.test-seed#[2055D7445EB42AE]) [    ] o.a.s.c.s.i.ZkClientClusterStateProvider Cluster at 127.0.0.1:65380/solr ready
   [junit4]   2> 1341753 INFO  (qtp1499288484-13681) [n:127.0.0.1:65383_    ] o.a.s.h.a.CollectionsHandler Invoked Collection Action :create with params replicationFactor=1&collection.configName=conf1&name=control_collection&nrtReplicas=1&action=CREATE&numShards=1&createNodeSet=127.0.0.1:65383_&wt=javabin&version=2 and sendToOCPQueue=true
   [junit4]   2> 1341758 INFO  (OverseerThreadFactory-5500-thread-1-processing-n:127.0.0.1:65383_) [n:127.0.0.1:65383_    ] o.a.s.c.a.c.CreateCollectionCmd Create collection control_collection
   [junit4]   2> 1341872 INFO  (qtp1499288484-13685) [n:127.0.0.1:65383_    ] o.a.s.h.a.CoreAdminOperation core create command qt=/admin/cores&collection.configName=conf1&newCollection=true&name=control_collection_shard1_replica_n1&action=CREATE&numShards=1&collection=control_collection&shard=shard1&wt=javabin&version=2&replicaType=NRT
   [junit4]   2> 1341874 INFO  (qtp1499288484-13685) [n:127.0.0.1:65383_    ] o.a.s.c.TransientSolrCoreCacheDefault Allocating transient cache for 4 transient cores
   [junit4]   2> 1341996 INFO  (zkCallback-2925-thread-1-processing-n:127.0.0.1:65383_) [n:127.0.0.1:65383_    ] o.a.s.c.c.ZkStateReader A cluster state change: [WatchedEvent state:SyncConnected type:NodeDataChanged path:/collections/control_collection/state.json] for collection [control_collection] has occurred - updating... (live nodes size: [1])
   [junit4]   2> 1342916 INFO  (qtp1499288484-13685) [n:127.0.0.1:65383_ c:control_collection s:shard1  x:control_collection_shard1_replica_n1] o.a.s.c.SolrConfig Using Lucene MatchVersion: 8.0.0
   [junit4]   2> 1342933 INFO  (qtp1499288484-13685) [n:127.0.0.1:65383_ c:control_collection s:shard1  x:control_collection_shard1_replica_n1] o.a.s.s.IndexSchema [control_collection_shard1_replica_n1] Schema name=test
   [junit4]   2> 1343003 INFO  (qtp1499288484-13685) [n:127.0.0.1:65383_ c:control_collection s:shard1  x:control_collection_shard1_replica_n1] o.a.s.s.IndexSchema Loaded schema test/1.6 with uniqueid field id
   [junit4]   2> 1343022 INFO  (qtp1499288484-13685) [n:127.0.0.1:65383_ c:control_collection s:shard1  x:control_collection_shard1_replica_n1] o.a.s.c.CoreContainer Creating SolrCore 'control_collection_shard1_replica_n1' using configuration from collection control_collection, trusted=true
   [junit4]   2> 1343023 INFO  (qtp1499288484-13685) [n:127.0.0.1:65383_ c:control_collection s:shard1  x:control_collection_shard1_replica_n1] o.a.s.m.r.SolrJmxReporter JMX monitoring for 'solr.core.control_collection.shard1.replica_n1' (registry 'solr.core.control_collection.shard1.replica_n1') enabled at server: com.sun.jmx.mbeanserver.JmxMBeanServer@42e9af76
   [junit4]   2> 1343023 INFO  (qtp1499288484-13685) [n:127.0.0.1:65383_ c:control_collection s:shard1  x:control_collection_shard1_replica_n1] o.a.s.c.SolrCore solr.RecoveryStrategy.Builder
   [junit4]   2> 1343023 INFO  (qtp1499288484-13685) [n:127.0.0.1:65383_ c:control_collection s:shard1  x:control_collection_shard1_replica_n1] o.a.s.c.SolrCore [[control_collection_shard1_replica_n1] ] Opening new SolrCore at [/Users/jenkins/workspace/Lucene-Solr-master-MacOSX/solr/build/solr-core/test/J1/temp/solr.cloud.ChaosMonkeySafeLeaderTest_2055D7445EB42AE-001/control-001/cores/control_collection_shard1_replica_n1], dataDir=[/Users/jenkins/workspace/Lucene-Solr-master-MacOSX/solr/build/solr-core/test/J1/../../../../../../../../../Users/jenkins/workspace/Lucene-Solr-master-MacOSX/solr/build/solr-core/test/J1/temp/solr.cloud.ChaosMonkeySafeLeaderTest_2055D7445EB42AE-001/control-001/cores/control_collection_shard1_replica_n1/data/]
   [junit4]   2> 1343026 INFO  (qtp1499288484-13685) [n:127.0.0.1:65383_ c:control_collection s:shard1  x:control_collection_shard1_replica_n1] o.a.s.u.RandomMergePolicy RandomMergePolicy wrapping class org.apache.lucene.index.TieredMergePolicy: [TieredMergePolicy: maxMergeAtOnce=45, maxMergeAtOnceExplicit=36, maxMergedSegmentMB=27.876953125, floorSegmentMB=1.43359375, forceMergeDeletesPctAllowed=16.119863658364675, segmentsPerTier=24.0, maxCFSSegmentSizeMB=8.796093022207999E12, noCFSRatio=0.0
   [junit4]   2> 1343030 WARN  (qtp1499288484-13685) [n:127.0.0.1:65383_ c:control_collection s:shard1  x:control_collection_shard1_replica_n1] o.a.s.c.RequestHandlers INVALID paramSet a in requestHandler {type = requestHandler,name = /dump,class = DumpRequestHandler,attributes = {initParams=a, name=/dump, class=DumpRequestHandler},args = {defaults={a=A,b=B}}}
   [junit4]   2> 1343075 INFO  (qtp1499288484-13685) [n:127.0.0.1:65383_ c:control_collection s:shard1  x:control_collection_shard1_replica_n1] o.a.s.u.UpdateHandler Using UpdateLog implementation: org.apache.solr.update.UpdateLog
   [junit4]   2> 1343075 INFO  (qtp1499288484-13685) [n:127.0.0.1:65383_ c:control_collection s:shard1  x:control_collection_shard1_replica_n1] o.a.s.u.UpdateLog Initializing UpdateLog: dataDir= defaultSyncLevel=FLUSH numRecordsToKeep=100 maxNumLogsToKeep=10 numVersionBuckets=65536
   [junit4]   2> 1343076 INFO  (qtp1499288484-13685) [n:127.0.0.1:65383_ c:control_collection s:shard1  x:control_collection_shard1_replica_n1] o.a.s.u.CommitTracker Hard AutoCommit: if uncommited for 15000ms; 
   [junit4]   2> 1343076 INFO  (qtp1499288484-13685) [n:127.0.0.1:65383_ c:control_collection s:shard1  x:control_collection_shard1_replica_n1] o.a.s.u.CommitTracker Soft AutoCommit: disabled
   [junit4]   2> 1343077 INFO  (qtp1499288484-13685) [n:127.0.0.1:65383_ c:control_collection s:shard1  x:control_collection_shard1_replica_n1] o.a.s.u.RandomMergePolicy RandomMergePolicy wrapping class org.apache.lucene.index.TieredMergePolicy: [TieredMergePolicy: maxMergeAtOnce=38, maxMergeAtOnceExplicit=26, maxMergedSegmentMB=81.54296875, floorSegmentMB=0.9990234375, forceMergeDeletesPctAllowed=4.537871920032415, segmentsPerTier=25.0, maxCFSSegmentSizeMB=8.796093022207999E12, noCFSRatio=0.737975664255631
   [junit4]   2> 1343078 INFO  (qtp1499288484-13685) [n:127.0.0.1:65383_ c:control_collection s:shard1  x:control_collection_shard1_replica_n1] o.a.s.s.SolrIndexSearcher Opening [Searcher@1d4f376e[control_collection_shard1_replica_n1] main]
   [junit4]   2> 1343079 INFO  (qtp1499288484-13685) [n:127.0.0.1:65383_ c:control_collection s:shard1  x:control_collection_shard1_replica_n1] o.a.s.r.ManagedResourceStorage Configured ZooKeeperStorageIO with znodeBase: /configs/conf1
   [junit4]   2> 1343080 INFO  (qtp1499288484-13685) [n:127.0.0.1:65383_ c:control_collection s:shard1  x:control_collection_shard1_replica_n1] o.a.s.r.ManagedResourceStorage Loaded null at path _rest_managed.json using ZooKeeperStorageIO:path=/configs/conf1
   [junit4]   2> 1343081 INFO  (qtp1499288484-13685) [n:127.0.0.1:65383_ c:control_collection s:shard1  x:control_collection_shard1_replica_n1] o.a.s.h.ReplicationHandler Commits will be reserved for 10000ms.
   [junit4]   2> 1343081 INFO  (qtp1499288484-13685) [n:127.0.0.1:65383_ c:control_collection s:shard1  x:control_collection_shard1_replica_n1] o.a.s.u.UpdateLog Could not find max version in index or recent updates, using new clock 1590703089194631168
   [junit4]   2> 1343082 INFO  (searcherExecutor-5503-thread-1-processing-n:127.0.0.1:65383_ x:control_collection_shard1_replica_n1 s:shard1 c:control_collection) [n:127.0.0.1:65383_ c:control_collection s:shard1  x:control_collection_shard1_replica_n1] o.a.s.c.SolrCore [control_collection_shard1_replica_n1] Registered new searcher Searcher@1d4f376e[control_collection_shard1_replica_n1] main{ExitableDirectoryReader(UninvertingDirectoryReader())}
   [junit4]   2> 1343088 INFO  (qtp1499288484-13685) [n:127.0.0.1:65383_ c:control_collection s:shard1  x:control_collection_shard1_replica_n1] o.a.s.c.ShardLeaderElectionContext Enough replicas found to continue.
   [junit4]   2> 1343088 INFO  (qtp1499288484-13685) [n:127.0.0.1:65383_ c:control_collection s:shard1  x:control_collection_shard1_replica_n1] o.a.s.c.ShardLeaderElectionContext I may be the new leader - try and sync
   [junit4]   2> 1343088 INFO  (qtp1499288484-13685) [n:127.0.0.1:65383_ c:control_collection s:shard1  x:control_collection_shard1_replica_n1] o.a.s.c.SyncStrategy Sync replicas to http://127.0.0.1:65383/control_collection_shard1_replica_n1/
   [junit4]   2> 1343088 INFO  (qtp1499288484-13685) [n:127.0.0.1:65383_ c:control_collection s:shard1  x:control_collection_shard1_replica_n1] o.a.s.c.SyncStrategy Sync Success - now sync replicas to me
   [junit4]   2> 1343088 INFO  (qtp1499288484-13685) [n:127.0.0.1:65383_ c:control_collection s:shard1  x:control_collection_shard1_replica_n1] o.a.s.c.SyncStrategy http://127.0.0.1:65383/control_collection_shard1_replica_n1/ has no replicas
   [junit4]   2> 1343088 INFO  (qtp1499288484-13685) [n:127.0.0.1:65383_ c:control_collection s:shard1  x:control_collection_shard1_replica_n1] o.a.s.c.ShardLeaderElectionContext Found all replicas participating in election, clear LIR
   [junit4]   2> 1343094 INFO  (qtp1499288484-13685) [n:127.0.0.1:65383_ c:control_collection s:shard1  x:control_collection_shard1_replica_n1] o.a.s.c.ShardLeaderElectionContext I am the new leader: http://127.0.0.1:65383/control_collection_shard1_replica_n1/ shard1
   [junit4]   2> 1343207 INFO  (zkCallback-2925-thread-2-processing-n:127.0.0.1:65383_) [n:127.0.0.1:65383_    ] o.a.s.c.c.ZkStateReader A cluster state change: [WatchedEvent state:SyncConnected type:NodeDataChanged path:/collections/control_collection/state.json] for collection [control_collection] has occurred - updating... (live nodes size: [1])
   [junit4]   2> 1343259 INFO  (qtp1499288484-13685) [n:127.0.0.1:65383_ c:control_collection s:shard1  x:control_collection_shard1_replica_n1] o.a.s.c.ZkController I am the leader, no recovery necessary
   [junit4]   2> 1343264 INFO  (qtp1499288484-13685) [n:127.0.0.1:65383_ c:control_collection s:shard1  x:control_collection_shard1_replica_n1] o.a.s.s.HttpSolrCall [admin] webapp=null path=/admin/cores params={qt=/admin/cores&collection.configName=conf1&newCollection=true&name=control_collection_shard1_replica_n1&action=CREATE&numShards=1&collection=control_collection&shard=shard1&wt=javabin&version=2&replicaType=NRT} status=0 QTime=1392
   [junit4]   2> 1343272 INFO  (qtp1499288484-13681) [n:127.0.0.1:65383_    ] o.a.s.h.a.CollectionsHandler Wait for new collection to be active for at most 30 seconds. Check all shard replicas
   [junit4]   2> 1343369 INFO  (zkCallback-2925-thread-2-processing-n:127.0.0.1:65383_) [n:127.0.0.1:65383_    ] o.a.s.c.c.ZkStateReader A cluster state change: [WatchedEvent state:SyncConnected type:NodeDataChanged path:/collections/control_collection/state.json] for collection [control_collection] has occurred - updating... (live nodes size: [1])
   [junit4]   2> 1343765 INFO  (OverseerCollectionConfigSetProcessor-99418942931992580-127.0.0.1:65383_-n_0000000000) [n:127.0.0.1:65383_    ] o.a.s.c.OverseerTaskQueue Response ZK path: /overseer/collection-queue-work/qnr-0000000000 doesn't exist.  Requestor may have disconnected from ZooKeeper
   [junit4]   2> 1344280 INFO  (qtp1499288484-13681) [n:127.0.0.1:65383_    ] o.a.s.s.HttpSolrCall [admin] webapp=null path=/admin/collections params={replicationFactor=1&collection.configName=conf1&name=control_collection&nrtReplicas=1&action=CREATE&numShards=1&createNodeSet=127.0.0.1:65383_&wt=javabin&version=2} status=0 QTime=2527
   [junit4]   2> 1344285 INFO  (zkConnectionManagerCallback-2936-thread-1) [    ] o.a.s.c.c.ConnectionManager zkClient has connected
   [junit4]   2> 1344287 INFO  (TEST-ChaosMonkeySafeLeaderTest.test-seed#[2055D7445EB42AE]) [    ] o.a.s.c.c.ZkStateReader Updated live nodes from ZooKeeper... (0) -> (1)
   [junit4]   2> 1344288 INFO  (TEST-ChaosMonkeySafeLeaderTest.test-seed#[2055D7445EB42AE]) [    ] o.a.s.c.s.i.ZkClientClusterStateProvider Cluster at 127.0.0.1:65380/solr ready
   [junit4]   2> 1344288 INFO  (TEST-ChaosMonkeySafeLeaderTest.test-seed#[2055D7445EB42AE]) [    ] o.a.s.c.ChaosMonkey monkey: init - expire sessions:false cause connection loss:false
   [junit4]   2> 1344289 INFO  (qtp1499288484-13685) [n:127.0.0.1:65383_    ] o.a.s.h.a.CollectionsHandler Invoked Collection Action :create with params replicationFactor=1&collection.configName=conf1&name=collection1&nrtReplicas=1&action=CREATE&numShards=2&createNodeSet=&stateFormat=2&wt=javabin&version=2 and sendToOCPQueue=true
   [junit4]   2> 1344292 INFO  (OverseerThreadFactory-5500-thread-2-processing-n:127.0.0.1:65383_) [n:127.0.0.1:65383_    ] o.a.s.c.a.c.CreateCollectionCmd Create collection collection1
   [junit4]   2> 1344310 WARN  (OverseerThreadFactory-5500-thread-2-processing-n:127.0.0.1:65383_) [n:127.0.0.1:65383_    ] o.a.s.c.a.c.CreateCollectionCmd It is unusual to create a collection (collection1) without cores.
   [junit4]   2> 1344525 INFO  (qtp1499288484-13685) [n:127.0.0.1:65383_    ] o.a.s.h.a.CollectionsHandler Wait for new collection to be active for at most 30 seconds. Check all shard replicas
   [junit4]   2> 1344525 INFO  (qtp1499288484-13685) [n:127.0.0.1:65383_    ] o.a.s.s.HttpSolrCall [admin] webapp=null path=/admin/collections params={replicationFactor=1&collection.configName=conf1&name=collection1&nrtReplicas=1&action=CREATE&numShards=2&createNodeSet=&stateFormat=2&wt=javabin&version=2} status=0 QTime=235
   [junit4]   2> 1344850 INFO  (TEST-ChaosMonkeySafeLeaderTest.test-seed#[2055D7445EB42AE]) [    ] o.a.s.c.AbstractFullDistribZkTestBase create jetty 1 in directory /Users/jenkins/workspace/Lucene-Solr-master-MacOSX/solr/build/solr-core/test/J1/temp/solr.cloud.ChaosMonkeySafeLeaderTest_2055D7445EB42AE-001/shard-1-001 of type NRT
   [junit4]   2> 1344853 INFO  (TEST-ChaosMonkeySafeLeaderTest.test-seed#[2055D7445EB42AE]) [    ] o.e.j.s.Server jetty-9.4.8.v20171121, build timestamp: 2017-11-21T18:27:37-03:00, git hash: 82b8fb23f757335bb3329d540ce37a2a2615f0a8
   [junit4]   2> 1344858 INFO  (TEST-ChaosMonkeySafeLeaderTest.test-seed#[2055D7445EB42AE]) [    ] o.e.j.s.session DefaultSessionIdManager workerName=node0
   [junit4]   2> 1344858 INFO  (TEST-ChaosMonkeySafeLeaderTest.test-seed#[2055D7445EB42AE]) [    ] o.e.j.s.session No SessionScavenger set, using defaults
   [junit4]   2> 1344858 INFO  (TEST-ChaosMonkeySafeLeaderTest.test-seed#[2055D7445EB42AE]) [    ] o.e.j.s.session Scavenging every 660000ms
   [junit4]   2> 1344858 INFO  (TEST-ChaosMonkeySafeLeaderTest.test-seed#[2055D7445EB42AE]) [    ] o.e.j.s.h.ContextHandler Started o.e.j.s.ServletContextHandler@4e6d22bc{/,null,AVAILABLE}
   [junit4]   2> 1344859 INFO  (TEST-ChaosMonkeySafeLeaderTest.test-seed#[2055D7445EB42AE]) [    ] o.e.j.s.AbstractConnector Started ServerConnector@2cb98c7f{HTTP/1.1,[http/1.1]}{127.0.0.1:65392}
   [junit4]   2> 1344859 INFO  (TEST-ChaosMonkeySafeLeaderTest.test-seed#[2055D7445EB42AE]) [    ] o.e.j.s.Server Started @1348891ms
   [junit4]   2> 1344859 INFO  (TEST-ChaosMonkeySafeLeaderTest.test-seed#[2055D7445EB42AE]) [    ] o.a.s.c.s.e.JettySolrRunner Jetty properties: {solr.data.dir=/Users/jenkins/workspace/Lucene-Solr-master-MacOSX/solr/build/solr-core/test/J1/temp/solr.cloud.ChaosMonkeySafeLeaderTest_2055D7445EB42AE-001/tempDir-001/jetty1, solrconfig=solrconfig.xml, hostContext=/, hostPort=65392, coreRootDirectory=/Users/jenkins/workspace/Lucene-Solr-master-MacOSX/solr/build/solr-core/test/J1/../../../../../../../../../Users/jenkins/workspace/Lucene-Solr-master-MacOSX/solr/build/solr-core/test/J1/temp/solr.cloud.ChaosMonkeySafeLeaderTest_2055D7445EB42AE-001/shard-1-001/cores}
   [junit4]   2> 1344859 ERROR (TEST-ChaosMonkeySafeLeaderTest.test-seed#[2055D7445EB42AE]) [    ] o.a.s.u.StartupLoggingUtils Missing Java Option solr.log.dir. Logging may be missing or incomplete.
   [junit4]   2> 1344859 INFO  (TEST-ChaosMonkeySafeLeaderTest.test-seed#[2055D7445EB42AE]) [    ] o.a.s.s.SolrDispatchFilter  ___      _       Welcome to Apache Solr™ version 8.0.0
   [junit4]   2> 1344859 INFO  (TEST-ChaosMonkeySafeLeaderTest.test-seed#[2055D7445EB42AE]) [    ] o.a.s.s.SolrDispatchFilter / __| ___| |_ _   Starting in cloud mode on port null
   [junit4]   2> 1344859 INFO  (TEST-ChaosMonkeySafeLeaderTest.test-seed#[2055D7445EB42AE]) [    ] o.a.s.s.SolrDispatchFilter \__ \/ _ \ | '_|  Install dir: null
   [junit4]   2> 1344859 INFO  (TEST-ChaosMonkeySafeLeaderTest.test-seed#[2055D7445EB42AE]) [    ] o.a.s.s.SolrDispatchFilter |___/\___/_|_|    Start time: 2018-01-27T00:24:42.971Z
   [junit4]   2> 1344861 INFO  (zkConnectionManagerCallback-2938-thread-1) [    ] o.a.s.c.c.ConnectionManager zkClient has connected
   [junit4]   2> 1344863 INFO  (TEST-ChaosMonkeySafeLeaderTest.test-seed#[2055D7445EB42AE]) [    ] o.a.s.s.SolrDispatchFilter Loading solr.xml from SolrHome (not found in ZooKeeper)
   [junit4]   2> 1344863 INFO  (TEST-ChaosMonkeySafeLeaderTest.test-seed#[2055D7445EB42AE]) [    ] o.a.s.c.SolrXmlConfig Loading container configuration from /Users/jenkins/workspace/Lucene-Solr-master-MacOSX/solr/build/solr-core/test/J1/temp/solr.cloud.ChaosMonkeySafeLeaderTest_2055D7445EB42AE-001/shard-1-001/solr.xml
   [junit4]   2> 1344868 INFO  (TEST-ChaosMonkeySafeLeaderTest.test-seed#[2055D7445EB42AE]) [    ] o.a.s.c.SolrXmlConfig Configuration parameter autoReplicaFailoverWorkLoopDelay is ignored
   [junit4]   2> 1344868 INFO  (TEST-ChaosMonkeySafeLeaderTest.test-seed#[2055D7445EB42AE]) [    ] o.a.s.c.SolrXmlConfig Configuration parameter autoReplicaFailoverBadNodeExpiration is ignored
   [junit4]   2> 1344869 INFO  (TEST-ChaosMonkeySafeLeaderTest.test-seed#[2055D7445EB42AE]) [    ] o.a.s.c.SolrXmlConfig MBean server found: com.sun.jmx.mbeanserver.JmxMBeanServer@42e9af76, but no JMX reporters were configured - adding default JMX reporter.
   [junit4]   2> 1344874 INFO  (TEST-ChaosMonkeySafeLeaderTest.test-seed#[2055D7445EB42AE]) [    ] o.a.s.c.ZkContainer Zookeeper client=127.0.0.1:65380/solr
   [junit4]   2> 1344876 INFO  (zkConnectionManagerCallback-2942-thread-1) [    ] o.a.s.c.c.ConnectionManager zkClient has connected
   [junit4]   2> 1344877 WARN  (NIOServerCxn.Factory:0.0.0.0/0.0.0.0:0) [    ] o.a.z.s.NIOServerCnxn caught end of stream exception
   [junit4]   2> EndOfStreamException: Unable to read additional data from client sessionid 0x161350079680008, likely client has closed socket
   [junit4]   2> 	at org.apache.zookeeper.server.NIOServerCnxn.doIO(NIOServerCnxn.java:239)
   [junit4]   2> 	at org.apache.zookeeper.server.NIOServerCnxnFactory.run(NIOServerCnxnFactory.java:203)
   [junit4]   2> 	at java.lang.Thread.run(Thread.java:748)
   [junit4]   2> 1344879 INFO  (zkConnectionManagerCallback-2944-thread-1-processing-n:127.0.0.1:65392_) [n:127.0.0.1:65392_    ] o.a.s.c.c.ConnectionManager zkClient has connected
   [junit4]   2> 1344893 INFO  (TEST-ChaosMonkeySafeLeaderTest.test-seed#[2055D7445EB42AE]) [n:127.0.0.1:65392_    ] o.a.s.c.c.ZkStateReader Updated live nodes from ZooKeeper... (0) -> (1)
   [junit4]   2> 1344897 INFO  (TEST-ChaosMonkeySafeLeaderTest.test-seed#[2055D7445EB42AE]) [n:127.0.0.1:65392_    ] o.a.s.c.Overseer Overseer (id=null) closing
   [junit4]   2> 1344901 INFO  (TEST-ChaosMonkeySafeLeaderTest.test-seed#[2055D7445EB42AE]) [n:127.0.0.1:65392_    ] o.a.s.c.ZkController Register node as live in ZooKeeper:/live_nodes/127.0.0.1:65392_
   [junit4]   2> 1344904 INFO  (zkCallback-2925-thread-2-processing-n:127.0.0.1:65383_) [n:127.0.0.1:65383_    ] o.a.s.c.c.ZkStateReader Updated live nodes from ZooKeeper... (1) -> (2)
   [junit4]   2> 1344907 INFO  (zkCallback-2935-thread-1) [    ] o.a.s.c.c.ZkStateReader Updated live nodes from ZooKeeper... (1) -> (2)
   [junit4]   2> 1344909 INFO  (zkCallback-2943-thread-1-processing-n:127.0.0.1:65392_) [n:127.0.0.1:65392_    ] o.a.s.c.c.ZkStateReader Updated live nodes from ZooKeeper... (1) -> (2)
   [junit4]   2> 1344992 INFO  (TEST-ChaosMonkeySafeLeaderTest.test-seed#[2055D7445EB42AE]) [n:127.0.0.1:65392_    ] o.a.s.m.r.SolrJmxReporter JMX monitoring for 'solr.node' (registry 'solr.node') enabled at server: com.sun.jmx.mbeanserver.JmxMBeanServer@42e9af76
   [junit4]   2> 1345004 INFO  (TEST-ChaosMonkeySafeLeaderTest.test-seed#[2055D7445EB42AE]) [n:127.0.0.1:65392_    ] o.a.s.m.r.SolrJmxReporter JMX monitoring for 'solr.jvm' (registry 'solr.jvm') enabled at server: com.sun.jmx.mbeanserver.JmxMBeanServer@42e9af76
   [junit4]   2> 1345004 INFO  (TEST-ChaosMonkeySafeLeaderTest.test-seed#[2055D7445EB42AE]) [n:127.0.0.1:65392_    ] o.a.s.m.r.SolrJmxReporter JMX monitoring for 'solr.jetty' (registry 'solr.jetty') enabled at server: com.sun.jmx.mbeanserver.JmxMBeanServer@42e9af76
   [junit4]   2> 1345006 INFO  (TEST-ChaosMonkeySafeLeaderTest.test-seed#[2055D7445EB42AE]) [n:127.0.0.1:65392_    ] o.a.s.c.CorePropertiesLocator Found 0 core definitions underneath /Users/jenkins/workspace/Lucene-Solr-master-MacOSX/solr/build/solr-core/test/J1/../../../../../../../../../Users/jenkins/workspace/Lucene-Solr-master-MacOSX/solr/build/solr-core/test/J1/temp/solr.cloud.ChaosMonkeySafeLeaderTest_2055D7445EB42AE-001/shard-1-001/cores
   [junit4]   2> 1345036 INFO  (qtp1499288484-13686) [n:127.0.0.1:65383_    ] o.a.s.h.a.CollectionsHandler Invoked Collection Action :addreplica with params node=127.0.0.1:65392_&action=ADDREPLICA&collection=collection1&shard=shard2&type=NRT&wt=javabin&version=2 and sendToOCPQueue=true
   [junit4]   2> 1345040 INFO  (OverseerCollectionConfigSetProcessor-99418942931992580-127.0.0.1:65383_-n_0000000000) [n:127.0.0.1:65383_    ] o.a.s.c.OverseerTaskQueue Response ZK path: /overseer/collection-queue-work/qnr-0000000002 doesn't exist.  Requestor may have disconnected from ZooKeeper
   [junit4]   2> 1345041 INFO  (OverseerThreadFactory-5500-thread-3-processing-n:127.0.0.1:65383_) [n:127.0.0.1:65383_    ] o.a.s.c.a.c.AddReplicaCmd Node Identified 127.0.0.1:65392_ for creating new replica
   [junit4]   2> 1345052 INFO  (qtp2110380002-13729) [n:127.0.0.1:65392_    ] o.a.s.h.a.CoreAdminOperation core create command qt=/admin/cores&collection.configName=conf1&name=collection1_shard2_replica_n41&action=CREATE&collection=collection1&shard=shard2&wt=javabin&version=2&replicaType=NRT
   [junit4]   2> 1345053 INFO  (qtp2110380002-13729) [n:127.0.0.1:65392_    ] o.a.s.c.TransientSolrCoreCacheDefault Allocating transient cache for 4 transient cores
   [junit4]   2> 1345168 INFO  (zkCallback-2943-thread-1-processing-n:127.0.0.1:65392_) [n:127.0.0.1:65392_    ] o.a.s.c.c.ZkStateReader A cluster state change: [WatchedEvent state:SyncConnected type:NodeDataChanged path:/collections/collection1/state.json] for collection [collection1] has occurred - updating... (live nodes size: [2])
   [junit4]   2> 1346087 INFO  (qtp2110380002-13729) [n:127.0.0.1:65392_ c:collection1 s:shard2  x:collection1_shard2_replica_n41] o.a.s.c.SolrConfig Using Lucene MatchVersion: 8.0.0
   [junit4]   2> 1346097 INFO  (qtp2110380002-13729) [n:127.0.0.1:65392_ c:collection1 s:shard2  x:collection1_shard2_replica_n41] o.a.s.s.IndexSchema [collection1_shard2_replica_n41] Schema name=test
   [junit4]   2> 1346188 INFO  (qtp2110380002-13729) [n:127.0.0.1:65392_ c:collection1 s:shard2  x:collection1_shard2_replica_n41] o.a.s.s.IndexSchema Loaded schema test/1.6 with uniqueid field id
   [junit4]   2> 1346216 INFO  (qtp2110380002-13729) [n:127.0.0.1:65392_ c:collection1 s:shard2  x:collection1_shard2_replica_n41] o.a.s.c.CoreContainer Creating SolrCore 'collection1_shard2_replica_n41' using configuration from collection collection1, trusted=true
   [junit4]   2> 1346217 INFO  (qtp2110380002-13729) [n:127.0.0.1:65392_ c:collection1 s:shard2  x:collection1_shard2_replica_n41] o.a.s.m.r.SolrJmxReporter JMX monitoring for 'solr.core.collection1.shard2.replica_n41' (registry 'solr.core.collection1.shard2.replica_n41') enabled at server: com.sun.jmx.mbeanserver.JmxMBeanServer@42e9af76
   [junit4]   2> 1346217 INFO  (qtp2110380002-13729) [n:127.0.0.1:65392_ c:collection1 s:shard2  x:collection1_shard2_replica_n41] o.a.s.c.SolrCore solr.RecoveryStrategy.Builder
   [junit4]   2> 1346217 INFO  (qtp2110380002-13729) [n:127.0.0.1:65392_ c:collection1 s:shard2  x:collection1_shard2_replica_n41] o.a.s.c.SolrCore [[collection1_shard2_replica_n41] ] Opening new SolrCore at [/Users/jenkins/workspace/Lucene-Solr-master-MacOSX/solr/build/solr-core/test/J1/temp/solr.cloud.ChaosMonkeySafeLeaderTest_2055D7445EB42AE-001/shard-1-001/cores/collection1_shard2_replica_n41], dataDir=[/Users/jenkins/workspace/Lucene-Solr-master-MacOSX/solr/build/solr-core/test/J1/../../../../../../../../../Users/jenkins/workspace/Lucene-Solr-master-MacOSX/solr/build/solr-core/test/J1/temp/solr.cloud.ChaosMonkeySafeLeaderTest_2055D7445EB42AE-001/shard-1-001/cores/collection1_shard2_replica_n41/data/]
   [junit4]   2> 1346222 INFO  (qtp2110380002-13729) [n:127.0.0.1:65392_ c:collection1 s:shard2  x:collection1_shard2_replica_n41] o.a.s.u.RandomMergePolicy RandomMergePolicy wrapping class org.apache.lucene.index.TieredMergePolicy: [TieredMergePolicy: maxMergeAtOnce=45, maxMergeAtOnceExplicit=36, maxMergedSegmentMB=27.876953125, floorSegmentMB=1.43359375, forceMergeDeletesPctAllowed=16.119863658364675, segmentsPerTier=24.0, maxCFSSegmentSizeMB=8.796093022207999E12, noCFSRatio=0.0
   [junit4]   2> 1346224 WARN  (qtp2110380002-13729) [n:127.0.0.1:65392_ c:collection1 s:shard2  x:collection1_shard2_replica_n41] o.a.s.c.RequestHandlers INVALID paramSet a in requestHandler {type = requestHandler,name = /dump,class = DumpRequestHandler,attributes = {initParams=a, name=/dump, class=DumpRequestHandler},args = {defaults={a=A,b=B}}}
   [junit4]   2> 1346287 INFO  (qtp2110380002-13729) [n:127.0.0.1:65392_ c:collection1 s:shard2  x:collection1_shard2_replica_n41] o.a.s.u.UpdateHandler Using UpdateLog implementation: org.apache.solr.update.UpdateLog
   [junit4]   2> 1346287 INFO  (qtp2110380002-13729) [n:127.0.0.1:65392_ c:collection1 s:shard2  x:collection1_shard2_replica_n41] o.a.s.u.UpdateLog Initializing UpdateLog: dataDir= defaultSyncLevel=FLUSH numRecordsToKeep=100 maxNumLogsToKeep=10 numVersionBuckets=65536
   [junit4]   2> 1346288 INFO  (qtp2110380002-13729) [n:127.0.0.1:65392_ c:collection1 s:shard2  x:collection1_shard2_replica_n41] o.a.s.u.CommitTracker Hard AutoCommit: if uncommited for 15000ms; 
   [junit4]   2> 1346288 INFO  (qtp2110380002-13729) [n:127.0.0.1:65392_ c:collection1 s:shard2  x:collection1_shard2_replica_n41] o.a.s.u.CommitTracker Soft AutoCommit: disabled
   [junit4]   2> 1346289 INFO  (qtp2110380002-13729) [n:127.0.0.1:65392_ c:collection1 s:shard2  x:collection1_shard2_replica_n41] o.a.s.u.RandomMergePolicy RandomMergePolicy wrapping class org.apache.lucene.index.TieredMergePolicy: [TieredMergePolicy: maxMergeAtOnce=38, maxMergeAtOnceExplicit=26, maxMergedSegmentMB=81.54296875, floorSegmentMB=0.9990234375, forceMergeDeletesPctAllowed=4.537871920032415, segmentsPerTier=25.0, maxCFSSegmentSizeMB=8.796093022207999E12, noCFSRatio=0.737975664255631
   [junit4]   2> 1346289 INFO  (qtp2110380002-13729) [n:127.0.0.1:65392_ c:collection1 s:shard2  x:collection1_shard2_replica_n41] o.a.s.s.SolrIndexSearcher Opening [Searcher@3506f6f4[collection1_shard2_replica_n41] main]
   [junit4]   2> 1346291 INFO  (qtp2110380002-13729) [n:127.0.0.1:65392_ c:collection1 s:shard2  x:collection1_shard2_replica_n41] o.a.s.r.ManagedResourceStorage Configured ZooKeeperStorageIO with znodeBase: /configs/conf1
   [junit4]   2> 1346292 INFO  (qtp2110380002-13729) [n:127.0.0.1:65392_ c:collection1 s:shard2  x:collection1_shard2_replica_n41] o.a.s.r.ManagedResourceStorage Loaded null at path _rest_managed.json using ZooKeeperStorageIO:path=/configs/conf1
   [junit4]   2> 1346293 INFO  (qtp2110380002-13729) [n:127.0.0.1:65392_ c:collection1 s:shard2  x:collection1_shard2_replica_n41] o.a.s.h.ReplicationHandler Commits will be reserved for 10000ms.
   [junit4]   2> 1346293 INFO  (qtp2110380002-13729) [n:127.0.0.1:65392_ c:collection1 s:shard2  x:collection1_shard2_replica_n41] o.a.s.u.UpdateLog Could not find max version in index or recent updates, using new clock 1590703092562657280
   [junit4]   2> 1346294 INFO  (searcherExecutor-5514-thread-1-processing-n:127.0.0.1:65392_ x:collection1_shard2_replica_n41 s:shard2 c:collection1) [n:127.0.0.1:65392_ c:collection1 s:shard2  x:collection1_shard2_replica_n41] o.a.s.c.SolrCore [collection1_shard2_replica_n41] Registered new searcher Searcher@3506f6f4[collection1_shard2_replica_n41] main{ExitableDirectoryReader(UninvertingDirectoryReader())}
   [junit4]   2> 1346300 INFO  (qtp2110380002-13729) [n:127.0.0.1:65392_ c:collection1 s:shard2  x:collection1_shard2_replica_n41] o.a.s.c.ShardLeaderElectionContext Enough replicas found to continue.
   [junit4]   2> 1346300 INFO  (qtp2110380002-13729) [n:127.0.0.1:65392_ c:collection1 s:shard2  x:collection1_shard2_replica_n41] o.a.s.c.ShardLeaderElectionContext I may be the new leader - try and sync
   [junit4]   2> 1346300 INFO  (qtp2110380002-13729) [n:127.0.0.1:65392_ c:collection1 s:shard2  x:collection1_shard2_replica_n41] o.a.s.c.SyncStrategy Sync replicas to http://127.0.0.1:65392/collection1_shard2_replica_n41/
   [junit4]   2> 1346300 INFO  (qtp2110380002-13729) [n:127.0.0.1:65392_ c:collection1 s:shard2  x:collection1_shard2_replica_n41] o.a.s.c.SyncStrategy Sync Success - now sync replicas to me
   [junit4]   2> 1346300 INFO  (qtp2110380002-13729) [n:127.0.0.1:65392_ c:collection1 s:shard2  x:collection1_shard2_replica_n41] o.a.s.c.SyncStrategy http://127.0.0.1:65392/collection1_shard2_replica_n41/ has no replicas
   [junit4]   2> 1346300 INFO  (qtp2110380002-13729) [n:127.0.0.1:65392_ c:collection1 s:shard2  x:collection1_shard2_replica_n41] o.a.s.c.ShardLeaderElectionContext Found all replicas participating in election, clear LIR
   [junit4]   2> 1346306 INFO  (qtp2110380002-13729) [n:127.0.0.1:65392_ c:collection1 s:shard2  x:collection1_shard2_replica_n41] o.a.s.c.ShardLeaderElectionContext I am the new leader: http://127.0.0.1:65392/collection1_shard2_replica_n41/ shard2
   [junit4]   2> 1346419 INFO  (zkCallback-2943-thread-1-processing-n:127.0.0.1:65392_) [n:127.0.0.1:65392_    ] o.a.s.c.c.ZkStateReader A cluster state change: [WatchedEvent state:SyncConnected type:NodeDataChanged path:/collections/collection1/state.json] for collection [collection1] has occurred - updating... (live nodes size: [2])
   [junit4]   2> 1346478 INFO  (qtp2110380002-13729) [n:127.0.0.1:65392_ c:collection1 s:shard2  x:collection1_shard2_replica_n41] o.a.s.c.ZkController I am the leader, no recovery necessary
   [junit4]   2> 1346480 INFO  (qtp2110380002-13729) [n:127.0.0.1:65392_ c:collection1 s:shard2  x:collection1_shard2_replica_n41] o.a.s.s.HttpSolrCall [admin] webapp=null path=/admin/cores params={qt=/admin/cores&collection.configName=conf1&name=collection1_shard2_replica_n41&action=CREATE&collection=collection1&shard=shard2&wt=javabin&version=2&replicaType=NRT} status=0 QTime=1430
   [junit4]   2> 1346484 INFO  (qtp1499288484-13686) [n:127.0.0.1:65383_    ] o.a.s.s.HttpSolrCall [admin] webapp=null path=/admin/collections params={node=127.0.0.1:65392_&action=ADDREPLICA&collection=collection1&shard=shard2&type=NRT&wt=javabin&version=2} status=0 QTime=1447
   [junit4]   2> 1346583 INFO  (zkCallback-2943-thread-1-processing-n:127.0.0.1:65392_) [n:127.0.0.1:65392_    ] o.a.s.c.c.ZkStateReader A cluster state change: [WatchedEvent state:SyncConnected type:NodeDataChanged path:/collections/collection1/state.json] for collection [collection1] has occurred - updating... (live nodes size: [2])
   [junit4]   2> 1346781 INFO  (TEST-ChaosMonkeySafeLeaderTest.test-seed#[2055D7445EB42AE]) [    ] o.a.s.c.AbstractFullDistribZkTestBase create jetty 2 in directory /Users/jenkins/workspace/Lucene-Solr-master-MacOSX/solr/build/solr-core/test/J1/temp/solr.cloud.ChaosMonkeySafeLeaderTest_2055D7445EB42AE-001/shard-2-001 of type NRT
   [junit4]   2> 1346782 INFO  (TEST-ChaosMonkeySafeLeaderTest.test-seed#[2055D7445EB42AE]) [    ] o.e.j.s.Server jetty-9.4.8.v20171121, build timestamp: 2017-11-21T18:27:37-03:00, git hash: 82b8fb23f757335bb3329d540ce37a2a2615f0a8
   [junit4]   2> 1346783 INFO  (TEST-ChaosMonkeySafeLeaderTest.test-seed#[2055D7445EB42AE]) [    ] o.e.j.s.session DefaultSessionIdManager workerName=node0
   [junit4]   2> 1346783 INFO  (TEST-ChaosMonkeySafeLeaderTest.test-seed#[2055D7445EB42AE]) [    ] o.e.j.s.session No SessionScavenger set, using defaults
   [junit4]   2> 1346783 INFO  (TEST-ChaosMonkeySafeLeaderTest.test-seed#[2055D7445EB42AE]) [    ] o.e.j.s.session Scavenging every 600000ms
   [junit4]   2> 1346783 INFO  (TEST-ChaosMonkeySafeLeaderTest.test-seed#[2055D7445EB42AE]) [    ] o.e.j.s.h.ContextHandler Started o.e.j.s.ServletContextHandler@676583d3{/,null,AVAILABLE}
   [junit4]   2> 1346784 INFO  (TEST-ChaosMonkeySafeLeaderTest.test-seed#[2055D7445EB42AE]) [    ] o.e.j.s.AbstractConnector Started ServerConnector@3c71a58e{HTTP/1.1,[http/1.1]}{127.0.0.1:65397}
   [junit4]   2> 1346784 INFO  (TEST-ChaosMonkeySafeLeaderTest.test-seed#[2055D7445EB42AE]) [    ] o.e.j.s.Server Started @1350817ms
   [junit4]   2> 1346784 INFO  (TEST-ChaosMonkeySafeLeaderTest.test-seed#[2055D7445EB42AE]) [    ] o.a.s.c.s.e.JettySolrRunner Jetty properties: {solr.data.dir=/Users/jenkins/workspace/Lucene-Solr-master-MacOSX/solr/build/solr-core/test/J1/temp/solr.cloud.ChaosMonkeySafeLeaderTest_2055D7445EB42AE-001/tempDir-001/jetty2, replicaType=NRT, solrconfig=solrconfig.xml, hostContext=/, hostPort=65397, coreRootDirectory=/Users/jenkins/workspace/Lucene-Solr-master-MacOSX/solr/build/solr-core/test/J1/../../../../../../../../../Users/jenkins/workspace/Lucene-Solr-master-MacOSX/solr/build/solr-core/test/J1/temp/solr.cloud.ChaosMonkeySafeLeaderTest_2055D7445EB42AE-001/shard-2-001/cores}
   [junit4]   2> 1346784 ERROR (TEST-ChaosMonkeySafeLeaderTest.test-seed#[2055D7445EB42AE]) [    ] o.a.s.u.StartupLoggingUtils Missing Java Option solr.log.dir. Logging may be missing or incomplete.
   [junit4]   2> 1346784 INFO  (TEST-ChaosMonkeySafeLeaderTest.test-seed#[2055D7445EB42AE]) [    ] o.a.s.s.SolrDispatchFilter  ___      _       Welcome to Apache Solr™ version 8.0.0
   [junit4]   2> 1346784 INFO  (TEST-ChaosMonkeySafeLeaderTest.test-seed#[2055D7445EB42AE]) [    ] o.a.s.s.SolrDispatchFilter / __| ___| |_ _   Starting in cloud mode on port null
   [junit4]   2> 1346784 INFO  (TEST-ChaosMonkeySafeLeaderTest.test-seed#[2055D7445EB42AE]) [    ] o.a.s.s.SolrDispatchFilter \__ \/ _ \ | '_|  Install dir: null
   [junit4]   2> 1346784 INFO  (TEST-ChaosMonkeySafeLeaderTest.test-seed#[2055D7445EB42AE]) [    ] o.a.s.s.SolrDispatchFilter |___/\___/_|_|    Start time: 2018-01-27T00:24:44.896Z
   [junit4]   2> 1346786 INFO  (zkConnectionManagerCallback-2948-thread-1) [    ] o.a.s.c.c.ConnectionManager zkClient has connected
   [junit4]   2> 1346787 INFO  (TEST-ChaosMonkeySafeLeaderTest.test-seed#[2055D7445EB42AE]) [    ] o.a.s.s.SolrDispatchFilter Loading solr.xml from SolrHome (not found in ZooKeeper)
   [junit4]   2> 1346787 INFO  (TEST-ChaosMonkeySafeLeaderTest.test-seed#[2055D7445EB42AE]) [    ] o.a.s.c.SolrXmlConfig Loading container configuration from /Users/jenkins/workspace/Lucene-Solr-master-MacOSX/solr/build/solr-core/test/J1/temp/solr.cloud.ChaosMonkeySafeLeaderTest_2055D7445EB42AE-001/shard-2-001/solr.xml
   [junit4]   2> 1346793 INFO  (TEST-ChaosMonkeySafeLeaderTest.test-seed#[2055D7445EB42AE]) [    ] o.a.s.c.SolrXmlConfig Configuration parameter autoReplicaFailoverWorkLoopDelay is ignored
   [junit4]   2> 1346793 INFO  (TEST-ChaosMonkeySafeLeaderTest.test-seed#[2055D7445EB42AE]) [    ] o.a.s.c.SolrXmlConfig Configuration parameter autoReplicaFailoverBadNodeExpiration is ignored
   [junit4]   2> 1346793 INFO  (TEST-ChaosMonkeySafeLeaderTest.test-seed#[2055D7445EB42AE]) [    ] o.a.s.c.SolrXmlConfig MBean server found: com.sun.jmx.mbeanserver.JmxMBeanServer@42e9af76, but no JMX reporters were configured - adding default JMX reporter.
   [junit4]   2> 1346798 INFO  (TEST-ChaosMonkeySafeLeaderTest.test-seed#[2055D7445EB42AE]) [    ] o.a.s.c.ZkContainer Zookeeper client=127.0.0.1:65380/solr
   [junit4]   2> 1346799 INFO  (zkConnectionManagerCallback-2952-thread-1) [    ] o.a.s.c.c.ConnectionManager zkClient has connected
   [junit4]   2> 1346802 INFO  (zkConnectionManagerCallback-2954-thread-1-processing-n:127.0.0.1:65397_) [n:127.0.0.1:65397_    ] o.a.s.c.c.ConnectionManager zkClient has connected
   [junit4]   2> 1346814 INFO  (TEST-ChaosMonkeySafeLeaderTest.test-seed#[2055D7445EB42AE]) [n:127.0.0.1:65397_    ] o.a.s.c.c.ZkStateReader Updated live nodes from ZooKeeper... (0) -> (2)
   [junit4]   2> 1346817 INFO  (TEST-ChaosMonkeySafeLeaderTest.test-seed#[2055D7445EB42AE]) [n:127.0.0.1:65397_    ] o.a.s.c.Overseer Overseer (id=null) closing
   [junit4]   2> 1346821 INFO  (TEST-ChaosMonkeySafeLeaderTest.test-seed#[2055D7445EB42AE]) [n:127.0.0.1:65397_    ] o.a.s.c.ZkController Register node as live in ZooKeeper:/live_nodes/127.0.0.1:65397_
   [junit4]   2> 1346822 INFO  (zkCallback-2935-thread-1) [    ] o.a.s.c.c.ZkStateReader Updated live nodes from ZooKeeper... (2) -> (3)
   [junit4]   2> 1346822 INFO  (zkCallback-2925-thread-2-processing-n:127.0.0.1:65383_) [n:127.0.0.1:65383_    ] o.a.s.c.c.ZkStateReader Updated live nodes from ZooKeeper... (2) -> (3)
   [junit4]   2> 1346822 INFO  (zkCallback-2943-thread-1-processing-n:127.0.0.1:65392_) [n:127.0.0.1:65392_    ] o.a.s.c.c.ZkStateReader Updated live nodes from ZooKeeper... (2) -> (3)
   [junit4]   2> 1346825 INFO  (zkCallback-2953-thread-1-processing-n:127.0.0.1:65397_) [n:127.0.0.1:65397_    ] o.a.s.c.c.ZkStateReader Updated live nodes from ZooKeeper... (2) -> (3)
   [junit4]   2> 1346908 INFO  (TEST-ChaosMonkeySafeLeaderTest.test-seed#[2055D7445EB42AE]) [n:127.0.0.1:65397_    ] o.a.s.m.r.SolrJmxReporter JMX monitoring for 'solr.node' (registry 'solr.node') enabled at server: com.sun.jmx.mbeanserver.JmxMBeanServer@42e9af76
   [junit4]   2> 1346920 INFO  (TEST-ChaosMonkeySafeLeaderTest.test-seed#[2055D7445EB42AE]) [n:127.0.0.1:65397_    ] o.a.s.m.r.SolrJmxReporter JMX monitoring for 'solr.jvm' (registry 'solr.jvm') enabled at server: com.sun.jmx.mbeanserver.JmxMBeanServer@42e9af76
   [junit4]   2> 1346920 INFO  (TEST-ChaosMonkeySafeLeaderTest.test-seed#[2055D7445EB42AE]) [n:127.0.0.1:65397_    ] o.a.s.m.r.SolrJmxReporter JMX monitoring for 'solr.jetty' (registry 'solr.jetty') enabled at server: com.sun.jmx.mbeanserver.JmxMBeanServer@42e9af76
   [junit4]   2> 1346921 INFO  (TEST-ChaosMonkeySafeLeaderTest.test-seed#[2055D7445EB42AE]) [n:127.0.0.1:65397_    ] o.a.s.c.CorePropertiesLocator Found 0 core definitions underneath /Users/jenkins/workspace/Lucene-Solr-master-MacOSX/solr/build/solr-core/test/J1/../../../../../../../../../Users/jenkins/workspace/Lucene-Solr-master-MacOSX/solr/build/solr-core/test/J1/temp/solr.cloud.ChaosMonkeySafeLeaderTest_2055D7445EB42AE-001/shard-2-001/cores
   [junit4]   2> 1347003 INFO  (qtp1499288484-13685) [n:127.0.0.1:65383_    ] o.a.s.h.a.CollectionsHandler Invoked Collection Action :addreplica with params node=127.0.0.1:65397_&action=ADDREPLICA&collection=collection1&shard=shard1&type=NRT&wt=javabin&version=2 and sendToOCPQueue=true
   [junit4]   2> 1347007 INFO  (OverseerCollectionConfigSetProcessor-99418942931992580-127.0.0.1:65383_-n_0000000000) [n:127.0.0.1:65383_    ] o.a.s.c.OverseerTaskQueue Response ZK path: /overseer/collection-queue-work/qnr-0000000004 doesn't exist.  Requestor may have disconnected from ZooKeeper
   [junit4]   2> 1347008 INFO  (OverseerThreadFactory-5500-thread-4-processing-n:127.0.0.1:65383_) [n:127.0.0.1:65383_    ] o.a.s.c.a.c.AddReplicaCmd Node Identified 127.0.0.1:65397_ for creating new replica
   [junit4]   2> 1347015 INFO  (qtp487481438-13761) [n:127.0.0.1:65397_    ] o.a.s.h.a.CoreAdminOperation core create command qt=/admin/cores&collection.configName=conf1&name=collection1_shard1_replica_n43&action=CREATE&collection=collection1&shard=shard1&wt=javabin&version=2&replicaType=NRT
   [junit4]   2> 1347021 INFO  (qtp487481438-13761) [n:127.0.0.1:65397_    ] o.a.s.c.TransientSolrCoreCacheDefault Allocating transient cache for 4 transient cores
   [junit4]   2> 1347133 INFO  (zkCallback-2953-thread-1-processing-n:127.0.0.1:65397_) [n:127.0.0.1:65397_    ] o.a.s.c.c.ZkStateReader A cluster state change: [WatchedEvent state:SyncConnected type:NodeDataChanged path:/collections/collection1/state.json] for collection [collection1] has occurred - updating... (live nodes size: [3])
   [junit4]   2> 1347133 INFO  (zkCallback-2943-thread-1-processing-n:127.0.0.1:65392_) [n:127.0.0.1:65392_    ] o.a.s.c.c.ZkStateReader A cluster state change: [WatchedEvent state:SyncConnected type:NodeDataChanged path:/collections/collection1/state.json] for collection [collection1] has occurred - updating... (live nodes size: [3])
   [junit4]   2> 1348053 INFO  (qtp487481438-13761) [n:127.0.0.1:65397_ c:collection1 s:shard1  x:collection1_shard1_replica_n43] o.a.s.c.SolrConfig Using Lucene MatchVersion: 8.0.0
   [junit4]   2> 1348062 INFO  (qtp487481438-13761) [n:127.0.0.1:65397_ c:collection1 s:shard1  x:collection1_shard1_replica_n43] o.a.s.s.IndexSchema [collection1_shard1_replica_n43] Schema name=test
   [junit4]   2> 1348143 INFO  (qtp487481438-13761) [n:127.0.0.1:65397_ c:collection1 s:shard1  x:collection1_shard1_replica_n43] o.a.s.s.IndexSchema Loaded schema test/1.6 with uniqueid field id
   [junit4]   2> 1348169 INFO  (qtp487481438-13761) [n:127.0.0.1:65397_ c:collection1 s:shard1  x:collection1_shard1_replica_n43] o.a.s.c.CoreContainer Creating SolrCore 'collection1_shard1_replica_n43' using configuration from collection collection1, trusted=true
   [junit4]   2> 1348170 INFO  (qtp487481438-13761) [n:127.0.0.1:65397_ c:collection1 s:shard1  x:collection1_shard1_replica_n43] o.a.s.m.r.SolrJmxReporter JMX monitoring for 'solr.core.collection1.shard1.replica_n43' (registry 'solr.core.collection1.shard1.replica_n43') enabled at server: com.sun.jmx.mbeanserver.JmxMBeanServer@42e9af76
   [junit4]   2> 1348170 INFO  (qtp487481438-13761) [n:127.0.0.1:65397_ c:collection1 s:shard1  x:collection1_shard1_replica_n43] o.a.s.c.SolrCore solr.RecoveryStrategy.Builder
   [junit4]   2> 1348170 INFO  (qtp487481438-13761) [n:127.0.0.1:65397_ c:collection1 s:shard1  x:collection1_shard1_replica_n43] o.a.s.c.SolrCore [[collection1_shard1_replica_n43] ] Opening new SolrCore at [/Users/jenkins/workspace/Lucene-Solr-master-MacOSX/solr/build/solr-core/test/J1/temp/solr.cloud.ChaosMonkeySafeLeaderTest_2055D7445EB42AE-001/shard-2-001/cores/collection1_shard1_replica_n43], dataDir=[/Users/jenkins/workspace/Lucene-Solr-master-MacOSX/solr/build/solr-core/test/J1/../../../../../../../../../Users/jenkins/workspace/Lucene-Solr-master-MacOSX/solr/build/solr-core/test/J1/temp/solr.cloud.ChaosMonkeySafeLeaderTest_2055D7445EB42AE-001/shard-2-001/cores/collection1_shard1_replica_n43/data/]
   [junit4]   2> 1348175 INFO  (qtp487481438-13761) [n:127.0.0.1:65397_ c:collection1 s:shard1  x:collection1_shard1_replica_n43] o.a.s.u.RandomMergePolicy RandomMergePolicy wrapping class org.apache.lucene.index.TieredMergePolicy: [TieredMergePolicy: maxMergeAtOnce=45, maxMergeAtOnceExplicit=36, maxMergedSegmentMB=27.876953125, floorSegmentMB=1.43359375, forceMergeDeletesPctAllowed=16.119863658364675, segmentsPerTier=24.0, maxCFSSegmentSizeMB=8.796093022207999E12, noCFSRatio=0.0
   [junit4]   2> 1348179 WARN  (qtp487481438-13761) [n:127.0.0.1:65397_ c:collection1 s:shard1  x:collection1_shard1_replica_n43] o.a.s.c.RequestHandlers INVALID paramSet a in requestHandler {type = requestHandler,name = /dump,class = DumpRequestHandler,attributes = {initParams=a, name=/dump, class=DumpRequestHandler},args = {defaults={a=A,b=B}}}
   [junit4]   2> 1348230 INFO  (qtp487481438-13761) [n:127.0.0.1:65397_ c:collection1 s:shard1  x:collection1_shard1_replica_n43] o.a.s.u.UpdateHandler Using UpdateLog implementation: org.apache.solr.update.UpdateLog
   [junit4]   2> 1348230 INFO  (qtp487481438-13761) [n:127.0.0.1:65397_ c:collection1 s:shard1  x:collection1_shard1_replica_n43] o.a.s.u.UpdateLog Initializing UpdateLog: dataDir= defaultSyncLevel=FLUSH numRecordsToKeep=100 maxNumLogsToKeep=10 numVersionBuckets=65536
   [junit4]   2> 1348231 INFO  (qtp487481438-13761) [n:127.0.0.1:65397_ c:collection1 s:shard1  x:collection1_shard1_replica_n43] o.a.s.u.CommitTracker Hard AutoCommit: if uncommited for 15000ms; 
   [junit4]   2> 1348231 INFO  (qtp487481438-13761) [n:127.0.0.1:65397_ c:collection1 s:shard1  x:collection1_shard1_replica_n43] o.a.s.u.CommitTracker Soft AutoCommit: disabled
   [junit4]   2> 1348232 INFO  (qtp487481438-13761) [n:127.0.0.1:65397_ c:collection1 s:shard1  x:collection1_shard1_replica_n43] o.a.s.u.RandomMergePolicy RandomMergePolicy wrapping class org.apache.lucene.index.TieredMergePolicy: [TieredMergePolicy: maxMergeAtOnce=38, maxMergeAtOnceExplicit=26, maxMergedSegmentMB=81.54296875, floorSegmentMB=0.9990234375, forceMergeDeletesPctAllowed=4.537871920032415, segmentsPerTier=25.0, maxCFSSegmentSizeMB=8.796093022207999E12, noCFSRatio=0.737975664255631
   [junit4]   2> 1348232 INFO  (qtp487481438-13761) [n:127.0.0.1:65397_ c:collection1 s:shard1  x:collection1_shard1_replica_n43] o.a.s.s.SolrIndexSearcher Opening [Searcher@5dde2f3a[collection1_shard1_replica_n43] main]
   [junit4]   2> 1348234 INFO  (qtp487481438-13761) [n:127.0.0.1:65397_ c:collection1 s:shard1  x:collection1_shard1_replica_n43] o.a.s.r.ManagedResourceStorage Configured ZooKeeperStorageIO with znodeBase: /configs/conf1
   [junit4]   2> 1348234 INFO  (qtp487481438-13761) [n:127.0.0.1:65397_ c:collection1 s:shard1  x:collection1_shard1_replica_n43] o.a.s.r.ManagedResourceStorage Loaded null at path _rest_managed.json using ZooKeeperStorageIO:path=/configs/conf1
   [junit4]   2> 1348235 INFO  (qtp487481438-13761) [n:127.0.0.1:65397_ c:collection1 s:shard1  x:collection1_shard1_replica_n43] o.a.s.h.ReplicationHandler Commits will be reserved for 10000ms.
   [junit4]   2> 1348235 INFO  (qtp487481438-13761) [n:127.0.0.1:65397_ c:collection1 s:shard1  x:collection1_shard1_replica_n43] o.a.s.u.UpdateLog Could not find max version in index or recent updates, using new clock 1590703094598991872
   [junit4]   2> 1348236 INFO  (searcherExecutor-5525-thread-1-processing-n:127.0.0.1:65397_ x:collection1_shard1_replica_n43 s:shard1 c:collection1) [n:127.0.0.1:65397_ c:collection1 s:shard1  x:collection1_shard1_replica_n43] o.a.s.c.SolrCore [collection1_shard1_replica_n43] Registered new searcher Searcher@5dde2f3a[collection1_shard1_replica_n43] main{ExitableDirectoryReader(UninvertingDirectoryReader())}
   [junit4]   2> 1348240 INFO  (qtp487481438-13761) [n:127.0.0.1:65397_ c:collection1 s:shard1  x:collection1_shard1_replica_n43] o.a.s.c.ShardLeaderElectionContext Enough replicas found to continue.
   [junit4]   2> 1348240 INFO  (qtp487481438-13761) [n:127.0.0.1:65397_ c:collection1 s:shard1  x:collection1_shard1_replica_n43] o.a.s.c.ShardLeaderElectionContext I may be the new leader - try and sync
   [junit4]   2> 1348240 INFO  (qtp487481438-13761) [n:127.0.0.1:65397_ c:collection1 s:shard1  x:collection1_shard1_replica_n43] o.a.s.c.SyncStrategy Sync replicas to http://127.0.0.1:65397/collection1_shard1_replica_n43/
   [junit4]   2> 1348240 INFO  (qtp487481438-13761) [n:127.0.0.1:65397_ c:collection1 s:shard1  x:collection1_shard1_replica_n43] o.a.s.c.SyncStrategy Sync Success - now sync replicas to me
   [junit4]   2> 1348240 INFO  (qtp487481438-13761) [n:127.0.0.1:65397_ c:collection1 s:shard1  x:collection1_shard1_replica_n43] o.a.s.c.SyncStrategy http://127.0.0.1:65397/collection1_shard1_replica_n43/ has no replicas
   [junit4]   2> 1348240 INFO  (qtp487481438-13761) [n:127.0.0.1:65397_ c:collection1 s:shard1  x:collection1_shard1_replica_n43] o.a.s.c.ShardLeaderElectionContext Found all replicas participating in election, clear LIR
   [junit4]   2> 1348245 INFO  (qtp487481438-13761) [n:127.0.0.1:65397_ c:collection1 s:shard1  x:collection1_shard1_replica_n43] o.a.s.c.ShardLeaderElectionContext I am the new leader: http://127.0.0.1:65397/collection1_shard1_replica_n43/ shard1
   [junit4]   2> 1348347 INFO  (zkCallback-2943-thread-1-processing-n:127.0.0.1:65392_) [n:127.0.0.1:65392_    ] o.a.s.c.c.ZkStateReader A cluster state change: [WatchedEvent state:SyncConnected type:NodeDataChanged path:/collections/collection1/state.json] for collection [collection1] has occurred - updating... (live nodes size: [3])
   [junit4]   2> 1348347 INFO  (zkCallback-2953-thread-1-processing-n:127.0.0.1:65397_) [n:127.0.0.1:65397_    ] o.a.s.c.c.ZkStateReader A cluster state change: [WatchedEvent state:SyncConnected type:NodeDataChanged path:/collections/collection1/state.json] for collection [collection1] has occurred - updating... (live nodes size: [3])
   [junit4]   2> 1348358 INFO  (qtp487481438-13761) [n:127.0.0.1:65397_ c:collection1 s:shard1  x:collection1_shard1_replica_n43] o.a.s.c.ZkController I am the leader, no recovery necessary
   [junit4]   2> 1348360 INFO  (qtp487481438-13761) [n:127.0.0.1:65397_ c:collection1 s:shard1  x:collection1_shard1_replica_n43] o.a.s.s.HttpSolrCall [admin] webapp=null path=/admin/cores params={qt=/admin/cores&collection.configName=conf1&name=collection1_shard1_replica_n43&action=CREATE&collection=collection1&shard=shard1&wt=javabin&version=2&replicaType=NRT} status=0 QTime=1346
   [junit4]   2> 1348363 INFO  (qtp1499288484-13685) [n:127.0.0.1:65383_    ] o.a.s.s.HttpSolrCall [admin] webapp=null path=/admin/collections params={node=127.0.0.1:65397_&action=ADDREPLICA&collection=collection1&shard=shard1&type=NRT&wt=javabin&version=2} status=0 QTime=1360
   [junit4]   2> 1348462 INFO  (zkCallback-2943-thread-1-processing-n:127.0.0.1:65392_) [n:127.0.0.1:65392_    ] o.a.s.c.c.ZkStateReader A cluster state change: [WatchedEvent state:SyncConnected type:NodeDataChanged path:/collections/collection1/state.json] for collection [collection1] has occurred - updating... (live nodes size: [3])
   [junit4]   2> 1348462 INFO  (zkCallback-2953-thread-1-processing-n:127.0.0.1:65397_) [n:127.0.0.1:65397_    ] o.a.s.c.c.ZkStateReader A cluster state change: [WatchedEvent state:SyncConnected type:NodeDataChanged path:/collections/collection1/state.json] for collection [collection1] has occurred - updating... (live nodes size: [3])
   [junit4]   2> 1348680 INFO  (TEST-ChaosMonkeySafeLeaderTest.test-seed#[2055D7445EB42AE]) [    ] o.a.s.c.AbstractFullDistribZkTestBase create jetty 3 in directory /Users/jenkins/workspace/Lucene-Solr-master-MacOSX/solr/build/solr-core/test/J1/temp/solr.cloud.ChaosMonkeySafeLeaderTest_2055D7445EB42AE-001/shard-3-001 of type NRT
   [junit4]   2> 1348681 INFO  (TEST-ChaosMonkeySafeLeaderTest.test-seed#[2055D7445EB42AE]) [    ] o.e.j.s.Server jetty-9.4.8.v20171121, build timestamp: 2017-11-21T18:27:37-03:00, git hash: 82b8fb23f757335bb3329d540ce37a2a2615f0a8
   [junit4]   2> 1348682 INFO  (TEST-ChaosMonkeySafeLeaderTest.test-seed#[2055D7445EB42AE]) [    ] o.e.j.s.session DefaultSessionIdManager workerName=node0
   [junit4]   2> 1348682 INFO  (TEST-ChaosMonkeySafeLeaderTest.test-seed#[2055D7445EB42AE]) [    ] o.e.j.s.session No SessionScavenger set, using defaults
   [junit4]   2> 1348682 INFO  (TEST-ChaosMonkeySafeLeaderTest.test-seed#[2055D7445EB42AE]) [    ] o.e.j.s.session Scavenging every 660000ms
   [junit4]   2> 1348682 INFO  (TEST-ChaosMonkeySafeLeaderTest.test-seed#[2055D7445EB42AE]) [    ] o.e.j.s.h.ContextHandler Started o.e.j.s.ServletContextHandler@1cd3133f{/,null,AVAILABLE}
   [junit4]   2> 1348682 INFO  (TEST-ChaosMonkeySafeLeaderTest.test-seed#[2055D7445EB42AE]) [    ] o.e.j.s.AbstractConnector Started ServerConnector@2d038460{HTTP/1.1,[http/1.1]}{127.0.0.1:65402}
   [junit4]   2> 1348682 INFO  (TEST-ChaosMonkeySafeLeaderTest.test-seed#[2055D7445EB42AE]) [    ] o.e.j.s.Server Started @1352715ms
   [junit4]   2> 1348682 INFO  (TEST-ChaosMonkeySafeLeaderTest.test-seed#[2055D7445EB42AE]) [    ] o.a.s.c.s.e.JettySolrRunner Jetty properties: {solr.data.dir=/Users/jenkins/workspace/Lucene-Solr-master-MacOSX/solr/build/solr-core/test/J1/temp/solr.cloud.ChaosMonkeySafeLeaderTest_2055D7445EB42AE-001/tempDir-001/jetty3, replicaType=NRT, solrconfig=solrconfig.xml, hostContext=/, hostPort=65402, coreRootDirectory=/Users/jenkins/workspace/Lucene-Solr-master-MacOSX/solr/build/solr-core/test/J1/../../../../../../../../../Users/jenkins/workspace/Lucene-Solr-master-MacOSX/solr/build/solr-core/test/J1/temp/solr.cloud.ChaosMonkeySafeLeaderTest_2055D7445EB42AE-001/shard-3-001/cores}
   [junit4]   2> 1348683 ERROR (TEST-ChaosMonkeySafeLeaderTest.test-seed#[2055D7445EB42AE]) [    ] o.a.s.u.StartupLoggingUtils Missing Java Option solr.log.dir. Logging may be missing or incomplete.
   [junit4]   2> 1348683 INFO  (TEST-ChaosMonkeySafeLeaderTest.test-seed#[2055D7445EB42AE]) [    ] o.a.s.s.SolrDispatchFilter  ___      _       Welcome to Apache Solr™ version 8.0.0
   [junit4]   2> 1348683 INFO  (TEST-ChaosMonkeySafeLeaderTest.test-seed#[2055D7445EB42AE]) [    ] o.a.s.s.SolrDispatchFilter / __| ___| |_ _   Starting in cloud mode on port null
   [junit4]   2> 1348683 INFO  (TEST-ChaosMonkeySafeLeaderTest.test-seed#[2055D7445EB42AE]) [    ] o.a.s.s.SolrDispatchFilter \__ \/ _ \ | '_|  Install dir: null
   [junit4]   2> 1348683 INFO  (TEST-ChaosMonkeySafeLeaderTest.test-seed#[2055D7445EB42AE]) [    ] o.a.s.s.SolrDispatchFilter |___/\___/_|_|    Start time: 2018-01-27T00:24:46.795Z
   [junit4]   2> 1348684 INFO  (zkConnectionManagerCallback-2958-thread-1) [    ] o.a.s.c.c.ConnectionManager zkClient has connected
   [junit4]   2> 1348685 INFO  (TEST-ChaosMonkeySafeLeaderTest.test-seed#[2055D7445EB42AE]) [    ] o.a.s.s.SolrDispatchFilter Loading solr.xml from SolrHome (not found in ZooKeeper)
   [junit4]   2> 1348686 INFO  (TEST-ChaosMonkeySafeLeaderTest.test-seed#[2055D7445EB42AE]) [    ] o.a.s.c.SolrXmlConfig Loading container configuration from /Users/jenkins/workspace/Lucene-Solr-master-MacOSX/solr/build/solr-core/test/J1/temp/solr.cloud.ChaosMonkeySafeLeaderTest_2055D7445EB42AE-001/shard-3-001/solr.xml
   [junit4]   2> 1348690 INFO  (TEST-ChaosMonkeySafeLeaderTest.test-seed#[2055D7445EB42AE]) [    ] o.a.s.c.SolrXmlConfig Configuration parameter autoReplicaFailoverWorkLoopDelay is ignored
   [junit4]   2> 1348690 INFO  (TEST-ChaosMonkeySafeLeaderTest.test-seed#[2055D7445EB42AE]) [    ] o.a.s.c.SolrXmlConfig Configuration parameter autoReplicaFailoverBadNodeExpiration is ignored
   [junit4]   2> 1348690 INFO  (TEST-ChaosMonkeySafeLeaderTest.test-seed#[2055D7445EB42AE]) [    ] o.a.s.c.SolrXmlConfig MBean server found: com.sun.jmx.mbeanserver.JmxMBeanServer@42e9af76, but no JMX reporters were configured - adding default JMX reporter.
   [junit4]   2> 1348693 INFO  (TEST-ChaosMonkeySafeLeaderTest.test-seed#[2055D7445EB42AE]) [    ] o.a.s.c.ZkContainer Zookeeper client=127.0.0.1:65380/solr
   [junit4]   2> 1348695 INFO  (zkConnectionManagerCallback-2962-thread-1) [    ] o.a.s.c.c.ConnectionManager zkClient has connected
   [junit4]   2> 1348697 INFO  (zkConnectionManagerCallback-2964-thread-1-processing-n:127.0.0.1:65402_) [n:127.0.0.1:65402_    ] o.a.s.c.c.ConnectionManager zkClient has connected
   [junit4]   2> 1348706 INFO  (TEST-ChaosMonkeySafeLeaderTest.test-seed#[2055D7445EB42AE]) [n:127.0.0.1:65402_    ] o.a.s.c.c.ZkStateReader Updated live nodes from ZooKeeper... (0) -> (3)
   [junit4]   2> 1348710 INFO  (TEST-ChaosMonkeySafeLeaderTest.test-seed#[2055D7445EB42AE]) [n:127.0.0.1:65402_    ] o.a.s.c.Overseer Overseer (id=null) closing
   [junit4]   2> 1348712 INFO  (TEST-ChaosMonkeySafeLeaderTest.test-seed#[2055D7445EB42AE]) [n:127.0.0.1:65402_    ] o.a.s.c.ZkController Register node as live in ZooKeeper:/live_nodes/127.0.0.1:65402_
   [junit4]   2> 1348714 INFO  (zkCallback-2925-thread-2-processing-n:127.0.0.1:65383_) [n:127.0.0.1:65383_    ] o.a.s.c.c.ZkStateReader Updated live nodes from ZooKeeper... (3) -> (4)
   [junit4]   2> 1348714 INFO  (zkCallback-2935-thread-1) [    ] o.a.s.c.c.ZkStateReader Updated live nodes from ZooKeeper... (3) -> (4)
   [junit4]   2> 1348714 INFO  (zkCallback-2943-thread-1-processing-n:127.0.0.1:65392_) [n:127.0.0.1:65392_    ] o.a.s.c.c.ZkStateReader Updated live nodes from ZooKeeper... (3) -> (4)
   [junit4]   2> 1348714 INFO  (zkCallback-2953-thread-1-processing-n:127.0.0.1:65397_) [n:127.0.0.1:65397_    ] o.a.s.c.c.ZkStateReader Updated live nodes from ZooKeeper... (3) -> (4)
   [junit4]   2> 1348717 INFO  (zkCallback-2963-thread-1-processing-n:127.0.0.1:65402_) [n:127.0.0.1:65402_    ] o.a.s.c.c.ZkStateReader Updated live nodes from ZooKeeper... (3) -> (4)
   [junit4]   2> 1348775 INFO  (TEST-ChaosMonkeySafeLeaderTest.test-seed#[2055D7445EB42AE]) [n:127.0.0.1:65402_    ] o.a.s.m.r.SolrJmxReporter JMX monitoring for 'solr.node' (registry 'solr.node') enabled at server: com.sun.jmx.mbeanserver.JmxMBeanServer@42e9af76
   [junit4]   2> 1348783 INFO  (TEST-ChaosMonkeySafeLeaderTest.test-seed#[2055D7445EB42AE]) [n:127.0.0.1:65402_    ] o.a.s.m.r.SolrJmxReporter JMX monitoring for 'solr.jvm' (registry 'solr.jvm') enabled at server: com.sun.jmx.mbeanserver.JmxMBeanServer@42e9af76
   [junit4]   2> 1348783 INFO  (TEST-ChaosMonkeySafeLeaderTest.test-seed#[2055D7445EB42AE]) [n:127.0.0.1:65402_    ] o.a.s.m.r.SolrJmxReporter JMX monitoring for 'solr.jetty' (registry 'solr.jetty') enabled at server: com.sun.jmx.mbeanserver.JmxMBeanServer@42e9af76
   [junit4]   2> 1348785 INFO  (TEST-ChaosMonkeySafeLeaderTest.test-seed#[2055D7445EB42AE]) [n:127.0.0.1:65402_    ] o.a.s.c.CorePropertiesLocator Found 0 core definitions underneath /Users/jenkins/workspace/Lucene-Solr-master-MacOSX/solr/build/solr-core/test/J1/../../../../../../../../../Users/jenkins/workspace/Lucene-Solr-master-MacOSX/solr/build/solr-core/test/J1/temp/solr.cloud.ChaosMonkeySafeLeaderTest_2055D7445EB42AE-001/shard-3-001/cores
   [junit4]   2> 1348832 INFO  (qtp1499288484-13686) [n:127.0.0.1:65383_    ] o.a.s.h.a.CollectionsHandler Invoked Collection Action :addreplica with params node=127.0.0.1:65402_&action=ADDREPLICA&collection=collection1&shard=shard2&type=NRT&wt=javabin&version=2 and sendToOCPQueue=true
   [junit4]   2> 1348835 INFO  (OverseerCollectionConfigSetProcessor-99418942931992580-127.0.0.1:65383_-n_0000000000) [n:127.0.0.1:65383_    ] o.a.s.c.OverseerTaskQueue Response ZK path: /overseer/collection-queue-work/qnr-0000000006 doesn't exist.  Requestor may have disconnected from ZooKeeper
   [junit4]   2> 1348836 INFO  (OverseerThreadFactory-5500-thread-5-processing-n:127.0.0.1:65383_) [n:127.0.0.1:65383_    ] o.a.s.c.a.c.AddReplicaCmd Node Identified 127.0.0.1:65402_ for creating new replica
   [junit4]   2> 1348844 INFO  (qtp2102412462-13792) [n:127.0.0.1:65402_    ] o.a.s.h.a.CoreAdminOperation core create command qt=/admin/cores&collection.configName=conf1&name=collection1_shard2_replica_n45&action=CREATE&collection=collection1&shard=shard2&wt=javabin&version=2&replicaType=NRT
   [junit4]   2> 1348846 INFO  (qtp2102412462-13792) [n:127.0.0.1:65402_    ] o.a.s.c.TransientSolrCoreCacheDefault Allocating transient cache for 4 transient cores
   [junit4]   2> 1348961 INFO  (zkCallback-2943-thread-1-processing-n:127.0.0.1:65392_) [n:127.0.0.1:65392_    ] o.a.s.c.c.ZkStateReader A cluster state change: [WatchedEvent state:SyncConnected type:NodeDataChanged path:/collections/collection1/state.json] for collection [collection1] has occurred - updating... (live nodes size: [4])
   [junit4]   2> 1348961 INFO  (zkCallback-2953-thread-1-processing-n:127.0.0.1:65397_) [n:127.0.0.1:65397_    ] o.a.s.c.c.ZkStateReader A cluster state change: [WatchedEvent state:SyncConnected type:NodeDataChanged path:/collections/collection1/state.json] for collection [collection1] has occurred - updating... (live nodes size: [4])
   [junit4]   2> 1348961 INFO  (zkCallback-2963-thread-1-processing-n:127.0.0.1:65402_) [n:127.0.0.1:65402_    ] o.a.s.c.c.ZkStateReader A cluster state change: [WatchedEvent state:SyncConnected type:NodeDataChanged path:/collections/collection1/state.json] for collection [collection1] has occurred - updating... (live nodes size: [4])
   [junit4]   2> 1349869 INFO  (qtp2102412462-13792) [n:127.0.0.1:65402_ c:collection1 s:shard2  x:collection1_shard2_replica_n45] o.a.s.c.SolrConfig Using Lucene MatchVersion: 8.0.0
   [junit4]   2> 1349896 INFO  (qtp2102412462-13792) [n:127.0.0.1:65402_ c:collection1 s:shard2  x:collection1_shard2_replica_n45] o.a.s.s.IndexSchema [collection1_shard2_replica_n45] Schema name=test
   [junit4]   2> 1349942 INFO  (qtp2102412462-13792) [n:127.0.0.1:65402_ c:collection1 s:shard2  x:collection1_shard2_replica_n45] o.a.s.s.IndexSchema Loaded schema test/1.6 with uniqueid field id
   [junit4]   2> 1349964 INFO  (qtp2102412462-13792) [n:127.0.0.1:65402_ c:collection1 s:shard2  x:collection1_shard2_replica_n45] o.a.s.c.CoreContainer Creating SolrCore 'collection1_shard2_replica_n45' using configuration from collection collection1, trusted=true
   [junit4]   2> 1349965 INFO  (qtp2102412462-13792) [n:127.0.0.1:65402_ c:collection1 s:shard2  x:collection1_shard2_replica_n45] o.a.s.m.r.SolrJmxReporter JMX monitoring for 'solr.core.collection1.shard2.replica_n45' (registry 'solr.core.collection1.shard2.replica_n45') enabled at server: com.sun.jmx.mbeanserver.JmxMBeanServer@42e9af76
   [junit4]   2> 1349965 INFO  (qtp2102412462-13792) [n:127.0.0.1:65402_ c:collection1 s:shard2  x:collection1_shard2_replica_n45] o.a.s.c.SolrCore solr.RecoveryStrategy.Builder
   [junit4]   2> 1349965 INFO  (qtp2102412462-13792) [n:127.0.0.1:65402_ c:collection1 s:shard2  x:collection1_shard2_replica_n45] o.a.s.c.SolrCore [[collection1_shard2_replica_n45] ] Opening new SolrCore at [/Users/jenkins/workspace/Lucene-Solr-master-MacOSX/solr/build/solr-core/test/J1/temp/solr.cloud.ChaosMonkeySafeLeaderTest_2055D7445EB42AE-001/shard-3-001/cores/collection1_shard2_replica_n45], dataDir=[/Users/jenkins/workspace/Lucene-Solr-master-MacOSX/solr/build/solr-core/test/J1/../../../../../../../../../Users/jenkins/workspace/Lucene-Solr-master-MacOSX/solr/build/solr-core/test/J1/temp/solr.cloud.ChaosMonkeySafeLeaderTest_2055D7445EB42AE-001/shard-3-001/cores/collection1_shard2_replica_n45/data/]
   [junit4]   2> 1349969 INFO  (qtp2102412462-13792) [n:127.0.0.1:65402_ c:collection1 s:shard2  x:collection1_shard2_replica_n45] o.a.s.u.RandomMergePolicy RandomMergePolicy wrapping class org.apache.lucene.index.TieredMergePolicy: [TieredMergePolicy: maxMergeAtOnce=45, maxMergeAtOnceExplicit=36, maxMergedSegmentMB=27.876953125, floorSegmentMB=1.43359375, forceMergeDeletesPctAllowed=16.119863658364675, segmentsPerTier=24.0, maxCFSSegmentSizeMB=8.796093022207999E12, noCFSRatio=0.0
   [junit4]   2> 1349973 WARN  (qtp2102412462-13792) [n:127.0.0.1:65402_ c:collection1 s:shard2  x:collection1_shard2_replica_n45] o.a.s.c.RequestHandlers INVALID paramSet a in requestHandler {type = requestHandler,name = /dump,class = DumpRequestHandler,attributes = {initParams=a, name=/dump, class=DumpRequestHandler},args = {defaults={a=A,b=B}}}
   [junit4]   2> 1350036 INFO  (qtp2102412462-13792) [n:127.0.0.1:65402_ c:collection1 s:shard2  x:collection1_shard2_replica_n45] o.a.s.u.UpdateHandler Using UpdateLog implementation: org.apache.solr.update.UpdateLog
   [junit4]   2> 1350036 INFO  (qtp2102412462-13792) [n:127.0.0.1:65402_ c:collection1 s:shard2  x:collection1_shard2_replica_n45] o.a.s.u.UpdateLog Initializing UpdateLog: dataDir= defaultSyncLevel=FLUSH numRecordsToKeep=100 maxNumLogsToKeep=10 numVersionBuckets=65536
   [junit4]   2> 1350037 INFO  (qtp2102412462-13792) [n:127.0.0.1:65402_ c:collection1 s:shard2  x:collection1_shard2_replica_n45] o.a.s.u.CommitTracker Hard AutoCommit: if uncommited for 15000ms; 
   [junit4]   2> 1350037 INFO  (qtp2102412462-13792) [n:127.0.0.1:65402_ c:collection1 s:shard2  x:collection1_shard2_replica_n45] o.a.s.u.CommitTracker Soft AutoCommit: disabled
   [junit4]   2> 1350038 INFO  (qtp2102412462-13792) [n:127.0.0.1:65402_ c:collection1 s:shard2  x:collection1_shard2_replica_n45] o.a.s.u.RandomMergePolicy RandomMergePolicy wrapping class org.apache.lucene.index.TieredMergePolicy: [TieredMergePolicy: maxMergeAtOnce=38, maxMergeAtOnceExplicit=26, maxMergedSegmentMB=81.54296875, floorSegmentMB=0.9990234375, forceMergeDeletesPctAllowed=4.537871920032415, segmentsPerTier=25.0, maxCFSSegmentSizeMB=8.796093022207999E12, noCFSRatio=0.737975664255631
   [junit4]   2> 1350038 INFO  (qtp2102412462-13792) [n:127.0.0.1:65402_ c:collection1 s:shard2  x:collection1_shard2_replica_n45] o.a.s.s.SolrIndexSearcher Opening [Searcher@4164c949[collection1_shard2_replica_n45] main]
   [junit4]   2> 1350039 INFO  (qtp2102412462-13792) [n:127.0.0.1:65402_ c:collection1 s:shard2  x:collection1_shard2_replica_n45] o.a.s.r.ManagedResourceStorage Configured ZooKeeperStorageIO with znodeBase: /configs/conf1
   [junit4]   2> 1350039 INFO  (qtp2102412462-13792) [n:127.0.0.1:65402_ c:collection1 s:shard2  x:collection1_shard2_replica_n45] o.a.s.r.ManagedResourceStorage Loaded null at path _rest_managed.json using ZooKeeperStorageIO:path=/configs/conf1
   [junit4]   2> 1350039 INFO  (qtp2102412462-13792) [n:127.0.0.1:65402_ c:collection1 s:shard2  x:collection1_shard2_replica_n45] o.a.s.h.ReplicationHandler Commits will be reserved for 10000ms.
   [junit4]   2> 1350039 INFO  (qtp2102412462-13792) [n:127.0.0.1:65402_ c:collection1 s:shard2  x:collection1_shard2_replica_n45] o.a.s.u.UpdateLog Could not find max version in index or recent updates, using new clock 1590703096490622976
   [junit4]   2> 1350039 INFO  (searcherExecutor-5536-thread-1-processing-n:127.0.0.1:65402_ x:collection1_shard2_replica_n45 s:shard2 c:collection1) [n:127.0.0.1:65402_ c:collection1 s:shard2  x:collection1_shard2_replica_n45] o.a.s.c.SolrCore [collection1_shard2_replica_n45] Registered new searcher Searcher@4164c949[collection1_shard2_replica_n45] main{ExitableDirectoryReader(UninvertingDirectoryReader())}
   [junit4]   2> 1350047 INFO  (qtp2102412462-13792) [n:127.0.0.1:65402_ c:collection1 s:shard2  x:collection1_shard2_replica_n45] o.a.s.c.ZkController Core needs to recover:collection1_shard2_replica_n45
   [junit4]   2> 1350047 INFO  (updateExecutor-2959-thread-1-processing-n:127.0.0.1:65402_ x:collection1_shard2_replica_n45 s:shard2 c:collection1) [n:127.0.0.1:65402_ c:collection1 s:shard2 r:core_node46 x:collection1_shard2_replica_n45] o.a.s.u.DefaultSolrCoreState Running recovery
   [junit4]   2> 1350048 INFO  (recoveryExecutor-2960-thread-1-processing-n:127.0.0.1:65402_ x:collection1_shard2_replica_n45 s:shard2 c:collection1 r:core_node46) [n:127.0.0.1:65402_ c:collection1 s:shard2 r:core_node46 x:collection1_shard2_replica_n45] o.a.s.c.RecoveryStrategy Starting recovery process. recoveringAfterStartup=true
   [junit4]   2> 1350048 INFO  (recoveryExecutor-2960-thread-1-processing-n:127.0.0.1:65402_ x:collection1_shard2_replica_n45 s:shard2 c:collection1 r:core_node46) [n:127.0.0.1:65402_ c:collection1 s:shard2 r:core_node46 x:collection1_shard2_replica_n45] o.a.s.c.RecoveryStrategy ###### startupVersions=[[]]
   [junit4]   2> 1350048 INFO  (recoveryExecutor-2960-thread-1-processing-n:127.0.0.1:65402_ x:collection1_shard2_replica_n45 s:shard2 c:collection1 r:core_node46) [n:127.0.0.1:65402_ c:collection1 s:shard2 r:core_node46 x:collection1_shard2_replica_n45] o.a.s.c.RecoveryStrategy Begin buffering updates. core=[collection1_shard2_

[...truncated too long message...]

(jetty-closer-1632-thread-10) [    ] o.e.j.s.h.ContextHandler Stopped o.e.j.s.ServletContextHandler@c22979e{/solr,null,UNAVAILABLE}
   [junit4]   2> 2212472 INFO  (jetty-closer-1632-thread-10) [    ] o.e.j.s.session Stopped scavenging
   [junit4]   2> 2212477 INFO  (coreCloseExecutor-3950-thread-1) [n:127.0.0.1:51934_solr c:collection1 s:shard1 r:core_node10 x:collection1_shard1_replica_n9] o.a.s.m.SolrMetricManager Closing metric reporters for registry=solr.collection.collection1.shard1.leader, tag=1928724495
   [junit4]   2> 2212477 INFO  (coreCloseExecutor-3956-thread-1) [n:127.0.0.1:51917_solr c:collection1 s:shard1 r:core_node4 x:collection1_shard1_replica_n2] o.a.s.m.SolrMetricManager Closing metric reporters for registry=solr.collection.collection1.shard1.leader, tag=79760623
   [junit4]   2> 2212480 INFO  (jetty-closer-1632-thread-7) [    ] o.e.j.s.h.ContextHandler Stopped o.e.j.s.ServletContextHandler@1a5387e5{/solr,null,UNAVAILABLE}
   [junit4]   2> 2212480 INFO  (jetty-closer-1632-thread-7) [    ] o.e.j.s.session Stopped scavenging
   [junit4]   2> 2212484 INFO  (jetty-closer-1632-thread-8) [    ] o.e.j.s.h.ContextHandler Stopped o.e.j.s.ServletContextHandler@76393493{/solr,null,UNAVAILABLE}
   [junit4]   2> 2212484 INFO  (jetty-closer-1632-thread-8) [    ] o.e.j.s.session Stopped scavenging
   [junit4]   2> 2212485 INFO  (coreCloseExecutor-3945-thread-2) [n:127.0.0.1:51714_solr c:collection1 s:shard1 r:core_node12 x:collection1_shard1_replica_n11] o.a.s.m.SolrMetricManager Closing metric reporters for registry=solr.collection.collection1.shard1.leader, tag=1415909573
   [junit4]   2> 2212485 INFO  (coreCloseExecutor-3945-thread-1) [n:127.0.0.1:51714_solr c:testMetricTrigger s:shard2 r:core_node4 x:testMetricTrigger_shard2_replica_n2] o.a.s.m.SolrMetricManager Closing metric reporters for registry=solr.collection.testMetricTrigger.shard2.leader, tag=1710995259
   [junit4]   2> 2212488 INFO  (jetty-closer-1632-thread-1) [    ] o.a.s.c.Overseer Overseer (id=99418986003038231-127.0.0.1:51714_solr-n_0000000006) closing
   [junit4]   2> 2212488 INFO  (OverseerStateUpdate-99418986003038231-127.0.0.1:51714_solr-n_0000000006) [n:127.0.0.1:51714_solr    ] o.a.s.c.Overseer Overseer Loop exiting : 127.0.0.1:51714_solr
   [junit4]   2> 2212489 WARN  (OverseerAutoScalingTriggerThread-99418986003038231-127.0.0.1:51714_solr-n_0000000006) [n:127.0.0.1:51714_solr    ] o.a.s.c.a.OverseerTriggerThread OverseerTriggerThread woken up but we are closed, exiting.
   [junit4]   2> 2212489 DEBUG (jetty-closer-1632-thread-1) [    ] o.a.s.c.a.OverseerTriggerThread OverseerTriggerThread has been closed explicitly
   [junit4]   2> 2212492 INFO  (jetty-closer-1632-thread-1) [    ] o.e.j.s.h.ContextHandler Stopped o.e.j.s.ServletContextHandler@207694c2{/solr,null,UNAVAILABLE}
   [junit4]   2> 2212492 INFO  (jetty-closer-1632-thread-1) [    ] o.e.j.s.session Stopped scavenging
   [junit4]   2> 2213615 INFO  (jetty-closer-1632-thread-6) [    ] o.e.j.s.h.ContextHandler Stopped o.e.j.s.ServletContextHandler@7992cf25{/solr,null,UNAVAILABLE}
   [junit4]   2> 2213615 INFO  (jetty-closer-1632-thread-6) [    ] o.e.j.s.session Stopped scavenging
   [junit4]   2> 2213615 INFO  (jetty-closer-1632-thread-5) [    ] o.e.j.s.h.ContextHandler Stopped o.e.j.s.ServletContextHandler@6f80606{/solr,null,UNAVAILABLE}
   [junit4]   2> 2213615 INFO  (jetty-closer-1632-thread-5) [    ] o.e.j.s.session Stopped scavenging
   [junit4]   2> 2213640 WARN  (zkCallback-1857-thread-1-processing-n:127.0.0.1:52186_solr) [n:127.0.0.1:52186_solr    ] o.a.s.c.c.ZkStateReader ZooKeeper watch triggered, but Solr cannot talk to ZK: [KeeperErrorCode = Session expired for /live_nodes]
   [junit4]   2> 2213640 INFO  (jetty-closer-1632-thread-13) [    ] o.e.j.s.h.ContextHandler Stopped o.e.j.s.ServletContextHandler@1cb43e7b{/solr,null,UNAVAILABLE}
   [junit4]   2> 2213640 INFO  (jetty-closer-1632-thread-13) [    ] o.e.j.s.session Stopped scavenging
   [junit4]   2> 2213642 ERROR (SUITE-TriggerIntegrationTest-seed#[2055D7445EB42AE]-worker) [    ] o.a.z.s.ZooKeeperServer ZKShutdownHandler is not registered, so ZooKeeper server won't take any action on ERROR or SHUTDOWN server state changes
   [junit4]   2> 2213642 INFO  (SUITE-TriggerIntegrationTest-seed#[2055D7445EB42AE]-worker) [    ] o.a.s.c.ZkTestServer connecting to 127.0.0.1:51625 51625
   [junit4]   2> 2213659 INFO  (Thread-1229) [    ] o.a.s.c.ZkTestServer connecting to 127.0.0.1:51625 51625
   [junit4]   2> 2213783 WARN  (Thread-1229) [    ] o.a.s.c.ZkTestServer Watch limit violations: 
   [junit4]   2> Maximum concurrent create/delete watches above limit:
   [junit4]   2> 
   [junit4]   2> 	22	/solr/clusterprops.json
   [junit4]   2> 	22	/solr/aliases.json
   [junit4]   2> 	21	/solr/security.json
   [junit4]   2> 	11	/solr/configs/conf
   [junit4]   2> 
   [junit4]   2> Maximum concurrent data watches above limit:
   [junit4]   2> 
   [junit4]   2> 	157	/solr/collections/collection1/state.json
   [junit4]   2> 	49	/solr/collections/testMetricTrigger/state.json
   [junit4]   2> 	22	/solr/clusterstate.json
   [junit4]   2> 	6	/solr/autoscaling.json
   [junit4]   2> 	4	/solr/overseer_elect/election/99418986003038231-127.0.0.1:51714_solr-n_0000000006
   [junit4]   2> 	3	/solr/collections/collection1/leader_elect/shard1/election/99418986003038253-core_node4-n_0000000000
   [junit4]   2> 	2	/solr/overseer_elect/election/99418986003038265-127.0.0.1:51979_solr-n_0000000017
   [junit4]   2> 	2	/solr/overseer_elect/election/99418986003038268-127.0.0.1:51986_solr-n_0000000018
   [junit4]   2> 	2	/solr/collections/collection1/leader_elect/shard1/election/99418986003038262-core_node6-n_0000000002
   [junit4]   2> 	2	/solr/collections/collection1/leader_elect/shard1/election/99418986003038231-core_node12-n_0000000005
   [junit4]   2> 	2	/solr/overseer_elect/election/99418986003038219-127.0.0.1:51663_solr-n_0000000002
   [junit4]   2> 	2	/solr/overseer_elect/election/99418986003038256-127.0.0.1:51934_solr-n_0000000014
   [junit4]   2> 	2	/solr/overseer_elect/election/99418986003038240-127.0.0.1:51796_solr-n_0000000009
   [junit4]   2> 	2	/solr/overseer_elect/election/99418986003038234-127.0.0.1:51733_solr-n_0000000007
   [junit4]   2> 
   [junit4]   2> Maximum concurrent children watches above limit:
   [junit4]   2> 
   [junit4]   2> 	22	/solr/live_nodes
   [junit4]   2> 	22	/solr/collections
   [junit4]   2> 	6	/solr/overseer/queue-work
   [junit4]   2> 	6	/solr/autoscaling/events/.auto_add_replicas
   [junit4]   2> 	6	/solr/overseer/queue
   [junit4]   2> 	6	/solr/overseer/collection-queue-work
   [junit4]   2> 	2	/solr/autoscaling/events/node_lost_triggerMR
   [junit4]   2> 	2	/solr/autoscaling/events/node_added_triggerCTOOR
   [junit4]   2> 
   [junit4]   2> NOTE: leaving temporary files on disk at: /Users/jenkins/workspace/Lucene-Solr-master-MacOSX/solr/build/solr-core/test/J0/temp/solr.cloud.autoscaling.TriggerIntegrationTest_2055D7445EB42AE-001
   [junit4]   2> NOTE: test params are: codec=Asserting(Lucene70): {id=PostingsFormat(name=LuceneVarGapDocFreqInterval), x_s=PostingsFormat(name=Asserting)}, docValues:{}, maxPointsInLeafNode=67, maxMBSortInHeap=7.234568452708891, sim=Asserting(org.apache.lucene.search.similarities.AssertingSimilarity@66090402), locale=ar-BH, timezone=NZ
   [junit4]   2> NOTE: Mac OS X 10.11.6 x86_64/Oracle Corporation 1.8.0_144 (64-bit)/cpus=3,threads=1,free=45820000,total=349544448
   [junit4]   2> NOTE: All tests run in this JVM: [ClassificationUpdateProcessorTest, TestCollectionAPIs, TestLeaderElectionZkExpiry, TestConfigSetImmutable, TestHdfsBackupRestoreCore, TestRandomFlRTGCloud, InfixSuggestersTest, HdfsRecoverLeaseTest, TestMacros, ParsingFieldUpdateProcessorsTest, TestSolrJ, TestLFUCache, CloudExitableDirectoryReaderTest, TestOmitPositions, SolrJmxReporterTest, SolrIndexConfigTest, TestRecovery, AnalyticsQueryTest, TestRTimerTree, TestClassicSimilarityFactory, HdfsDirectoryFactoryTest, MultiThreadedOCPTest, TestUtils, ConnectionReuseTest, OpenCloseCoreStressTest, TestFieldCache, DistributedDebugComponentTest, TestPointFields, DistributedSuggestComponentTest, BlockJoinFacetRandomTest, TestInitQParser, TestImplicitCoreProperties, TestFastOutputStream, TestLockTree, TestMultiWordSynonyms, TestSolrDeletionPolicy1, AddBlockUpdateTest, TestConfigSetsAPIExclusivity, DocExpirationUpdateProcessorFactoryTest, EnumFieldTest, TestLegacyNumericUtils, HdfsChaosMonkeySafeLeaderTest, SolrTestCaseJ4Test, TestOverriddenPrefixQueryForCustomFieldType, OverseerTaskQueueTest, RequiredFieldsTest, SynonymTokenizerTest, HdfsBasicDistributedZkTest, BJQParserTest, TestFiltering, TestShortCircuitedRequests, DistribJoinFromCollectionTest, StatsComponentTest, HttpPartitionTest, MoreLikeThisHandlerTest, TestFieldResource, TestBM25SimilarityFactory, StressHdfsTest, LukeRequestHandlerTest, SecurityConfHandlerTest, TestFunctionQuery, SolrIndexSplitterTest, SuggestComponentContextFilterQueryTest, PKIAuthenticationIntegrationTest, LeaderElectionTest, DistribCursorPagingTest, TestLazyCores, TestMultiValuedNumericRangeQuery, TestBackupRepositoryFactory, SpatialFilterTest, TestCollectionsAPIViaSolrCloudCluster, TestRangeQuery, FastVectorHighlighterTest, LeaderInitiatedRecoveryOnCommitTest, BinaryUpdateRequestHandlerTest, TestExecutePlanAction, PathHierarchyTokenizerFactoryTest, TestSolrCoreSnapshots, CursorMarkTest, TestCloudPivotFacet, TestBlendedInfixSuggestions, TestGeoJSONResponseWriter, TestFreeTextSuggestions, LeaderFailoverAfterPartitionTest, TestFieldCacheVsDocValues, TestTolerantUpdateProcessorCloud, TestCSVResponseWriter, UniqFieldsUpdateProcessorFactoryTest, CdcrVersionReplicationTest, QueryElevationComponentTest, FieldMutatingUpdateProcessorTest, DirectoryFactoryTest, TestStressUserVersions, TestPullReplica, SolrCloudExampleTest, TestSurroundQueryParser, CloudMLTQParserTest, TriggerIntegrationTest]
   [junit4] Completed [303/770 (2!)] on J0 in 216.11s, 14 tests, 1 failure <<< FAILURES!

[...truncated 49724 lines...]

Mime
View raw message