lucene-dev mailing list archives

Site index · List index
Message view « Date » · « Thread »
Top « Date » · « Thread »
From Policeman Jenkins Server <jenk...@thetaphi.de>
Subject [JENKINS] Lucene-Solr-master-Solaris (64bit/jdk1.8.0) - Build # 1600 - Still Unstable!
Date Tue, 02 Jan 2018 05:42:15 GMT
Build: https://jenkins.thetaphi.de/job/Lucene-Solr-master-Solaris/1600/
Java: 64bit/jdk1.8.0 -XX:-UseCompressedOops -XX:+UseParallelGC

1 tests failed.
FAILED:  org.apache.solr.update.processor.TimeRoutedAliasUpdateProcessorTest.test

Error Message:
expected:<1> but was:<0>

Stack Trace:
java.lang.AssertionError: expected:<1> but was:<0>
	at __randomizedtesting.SeedInfo.seed([993B753FE04A2474:116F4AE54EB6498C]:0)
	at org.junit.Assert.fail(Assert.java:93)
	at org.junit.Assert.failNotEquals(Assert.java:647)
	at org.junit.Assert.assertEquals(Assert.java:128)
	at org.junit.Assert.assertEquals(Assert.java:472)
	at org.junit.Assert.assertEquals(Assert.java:456)
	at org.apache.solr.update.processor.TimeRoutedAliasUpdateProcessorTest.assertInvariants(TimeRoutedAliasUpdateProcessorTest.java:245)
	at org.apache.solr.update.processor.TimeRoutedAliasUpdateProcessorTest.test(TimeRoutedAliasUpdateProcessorTest.java:123)
	at sun.reflect.NativeMethodAccessorImpl.invoke0(Native Method)
	at sun.reflect.NativeMethodAccessorImpl.invoke(NativeMethodAccessorImpl.java:62)
	at sun.reflect.DelegatingMethodAccessorImpl.invoke(DelegatingMethodAccessorImpl.java:43)
	at java.lang.reflect.Method.invoke(Method.java:498)
	at com.carrotsearch.randomizedtesting.RandomizedRunner.invoke(RandomizedRunner.java:1737)
	at com.carrotsearch.randomizedtesting.RandomizedRunner$8.evaluate(RandomizedRunner.java:934)
	at com.carrotsearch.randomizedtesting.RandomizedRunner$9.evaluate(RandomizedRunner.java:970)
	at com.carrotsearch.randomizedtesting.RandomizedRunner$10.evaluate(RandomizedRunner.java:984)
	at com.carrotsearch.randomizedtesting.rules.SystemPropertiesRestoreRule$1.evaluate(SystemPropertiesRestoreRule.java:57)
	at org.apache.lucene.util.TestRuleSetupTeardownChained$1.evaluate(TestRuleSetupTeardownChained.java:49)
	at org.apache.lucene.util.AbstractBeforeAfterRule$1.evaluate(AbstractBeforeAfterRule.java:45)
	at org.apache.lucene.util.TestRuleThreadAndTestName$1.evaluate(TestRuleThreadAndTestName.java:48)
	at org.apache.lucene.util.TestRuleIgnoreAfterMaxFailures$1.evaluate(TestRuleIgnoreAfterMaxFailures.java:64)
	at org.apache.lucene.util.TestRuleMarkFailure$1.evaluate(TestRuleMarkFailure.java:47)
	at com.carrotsearch.randomizedtesting.rules.StatementAdapter.evaluate(StatementAdapter.java:36)
	at com.carrotsearch.randomizedtesting.ThreadLeakControl$StatementRunner.run(ThreadLeakControl.java:368)
	at com.carrotsearch.randomizedtesting.ThreadLeakControl.forkTimeoutingTask(ThreadLeakControl.java:817)
	at com.carrotsearch.randomizedtesting.ThreadLeakControl$3.evaluate(ThreadLeakControl.java:468)
	at com.carrotsearch.randomizedtesting.RandomizedRunner.runSingleTest(RandomizedRunner.java:943)
	at com.carrotsearch.randomizedtesting.RandomizedRunner$5.evaluate(RandomizedRunner.java:829)
	at com.carrotsearch.randomizedtesting.RandomizedRunner$6.evaluate(RandomizedRunner.java:879)
	at com.carrotsearch.randomizedtesting.RandomizedRunner$7.evaluate(RandomizedRunner.java:890)
	at com.carrotsearch.randomizedtesting.rules.StatementAdapter.evaluate(StatementAdapter.java:36)
	at com.carrotsearch.randomizedtesting.rules.SystemPropertiesRestoreRule$1.evaluate(SystemPropertiesRestoreRule.java:57)
	at org.apache.lucene.util.AbstractBeforeAfterRule$1.evaluate(AbstractBeforeAfterRule.java:45)
	at com.carrotsearch.randomizedtesting.rules.StatementAdapter.evaluate(StatementAdapter.java:36)
	at org.apache.lucene.util.TestRuleStoreClassName$1.evaluate(TestRuleStoreClassName.java:41)
	at com.carrotsearch.randomizedtesting.rules.NoShadowingOrOverridesOnMethodsRule$1.evaluate(NoShadowingOrOverridesOnMethodsRule.java:40)
	at com.carrotsearch.randomizedtesting.rules.NoShadowingOrOverridesOnMethodsRule$1.evaluate(NoShadowingOrOverridesOnMethodsRule.java:40)
	at com.carrotsearch.randomizedtesting.rules.StatementAdapter.evaluate(StatementAdapter.java:36)
	at com.carrotsearch.randomizedtesting.rules.StatementAdapter.evaluate(StatementAdapter.java:36)
	at com.carrotsearch.randomizedtesting.rules.StatementAdapter.evaluate(StatementAdapter.java:36)
	at org.apache.lucene.util.TestRuleAssertionsRequired$1.evaluate(TestRuleAssertionsRequired.java:53)
	at org.apache.lucene.util.TestRuleMarkFailure$1.evaluate(TestRuleMarkFailure.java:47)
	at org.apache.lucene.util.TestRuleIgnoreAfterMaxFailures$1.evaluate(TestRuleIgnoreAfterMaxFailures.java:64)
	at org.apache.lucene.util.TestRuleIgnoreTestSuites$1.evaluate(TestRuleIgnoreTestSuites.java:54)
	at com.carrotsearch.randomizedtesting.rules.StatementAdapter.evaluate(StatementAdapter.java:36)
	at com.carrotsearch.randomizedtesting.ThreadLeakControl$StatementRunner.run(ThreadLeakControl.java:368)
	at java.lang.Thread.run(Thread.java:748)




Build Log:
[...truncated 14104 lines...]
   [junit4] Suite: org.apache.solr.update.processor.TimeRoutedAliasUpdateProcessorTest
   [junit4]   2> 4425551 INFO  (SUITE-TimeRoutedAliasUpdateProcessorTest-seed#[993B753FE04A2474]-worker) [    ] o.a.s.SolrTestCaseJ4 SecureRandom sanity checks: test.solr.allowed.securerandom=null & java.security.egd=file:/dev/./urandom
   [junit4]   2> Creating dataDir: /export/home/jenkins/workspace/Lucene-Solr-master-Solaris/solr/build/solr-core/test/J1/temp/solr.update.processor.TimeRoutedAliasUpdateProcessorTest_993B753FE04A2474-001/init-core-data-001
   [junit4]   2> 4425552 WARN  (SUITE-TimeRoutedAliasUpdateProcessorTest-seed#[993B753FE04A2474]-worker) [    ] o.a.s.SolrTestCaseJ4 startTrackingSearchers: numOpens=33 numCloses=33
   [junit4]   2> 4425553 INFO  (SUITE-TimeRoutedAliasUpdateProcessorTest-seed#[993B753FE04A2474]-worker) [    ] o.a.s.SolrTestCaseJ4 Using TrieFields (NUMERIC_POINTS_SYSPROP=false) w/NUMERIC_DOCVALUES_SYSPROP=true
   [junit4]   2> 4425555 INFO  (SUITE-TimeRoutedAliasUpdateProcessorTest-seed#[993B753FE04A2474]-worker) [    ] o.a.s.SolrTestCaseJ4 Randomized ssl (false) and clientAuth (false) via: @org.apache.solr.util.RandomizeSSL(reason=, value=NaN, ssl=NaN, clientAuth=NaN)
   [junit4]   2> 4425556 INFO  (SUITE-TimeRoutedAliasUpdateProcessorTest-seed#[993B753FE04A2474]-worker) [    ] o.a.s.c.MiniSolrCloudCluster Starting cluster of 2 servers in /export/home/jenkins/workspace/Lucene-Solr-master-Solaris/solr/build/solr-core/test/J1/temp/solr.update.processor.TimeRoutedAliasUpdateProcessorTest_993B753FE04A2474-001/tempDir-001
   [junit4]   2> 4425556 INFO  (SUITE-TimeRoutedAliasUpdateProcessorTest-seed#[993B753FE04A2474]-worker) [    ] o.a.s.c.ZkTestServer STARTING ZK TEST SERVER
   [junit4]   2> 4425556 INFO  (Thread-13462) [    ] o.a.s.c.ZkTestServer client port:0.0.0.0/0.0.0.0:0
   [junit4]   2> 4425556 INFO  (Thread-13462) [    ] o.a.s.c.ZkTestServer Starting server
   [junit4]   2> 4425561 ERROR (Thread-13462) [    ] o.a.z.s.ZooKeeperServer ZKShutdownHandler is not registered, so ZooKeeper server won't take any action on ERROR or SHUTDOWN server state changes
   [junit4]   2> 4425666 INFO  (SUITE-TimeRoutedAliasUpdateProcessorTest-seed#[993B753FE04A2474]-worker) [    ] o.a.s.c.ZkTestServer start zk server on port:33055
   [junit4]   2> 4425678 INFO  (zkConnectionManagerCallback-8916-thread-1) [    ] o.a.s.c.c.ConnectionManager zkClient has connected
   [junit4]   2> 4425693 INFO  (jetty-launcher-8913-thread-2) [    ] o.e.j.s.Server jetty-9.3.20.v20170531
   [junit4]   2> 4425693 INFO  (jetty-launcher-8913-thread-1) [    ] o.e.j.s.Server jetty-9.3.20.v20170531
   [junit4]   2> 4425698 INFO  (jetty-launcher-8913-thread-2) [    ] o.e.j.s.h.ContextHandler Started o.e.j.s.ServletContextHandler@729ba8d4{/solr,null,AVAILABLE}
   [junit4]   2> 4425698 INFO  (jetty-launcher-8913-thread-1) [    ] o.e.j.s.h.ContextHandler Started o.e.j.s.ServletContextHandler@38e6458b{/solr,null,AVAILABLE}
   [junit4]   2> 4425699 INFO  (jetty-launcher-8913-thread-1) [    ] o.e.j.s.AbstractConnector Started ServerConnector@4b0fe8f9{HTTP/1.1,[http/1.1]}{127.0.0.1:51630}
   [junit4]   2> 4425699 INFO  (jetty-launcher-8913-thread-1) [    ] o.e.j.s.Server Started @4430556ms
   [junit4]   2> 4425699 INFO  (jetty-launcher-8913-thread-1) [    ] o.a.s.c.s.e.JettySolrRunner Jetty properties: {hostContext=/solr, hostPort=51630}
   [junit4]   2> 4425699 INFO  (jetty-launcher-8913-thread-2) [    ] o.e.j.s.AbstractConnector Started ServerConnector@40674d07{HTTP/1.1,[http/1.1]}{127.0.0.1:59060}
   [junit4]   2> 4425700 ERROR (jetty-launcher-8913-thread-1) [    ] o.a.s.u.StartupLoggingUtils Missing Java Option solr.log.dir. Logging may be missing or incomplete.
   [junit4]   2> 4425700 INFO  (jetty-launcher-8913-thread-1) [    ] o.a.s.s.SolrDispatchFilter  ___      _       Welcome to Apache Solr? version 8.0.0
   [junit4]   2> 4425700 INFO  (jetty-launcher-8913-thread-1) [    ] o.a.s.s.SolrDispatchFilter / __| ___| |_ _   Starting in cloud mode on port null
   [junit4]   2> 4425700 INFO  (jetty-launcher-8913-thread-2) [    ] o.e.j.s.Server Started @4430557ms
   [junit4]   2> 4425701 INFO  (jetty-launcher-8913-thread-2) [    ] o.a.s.c.s.e.JettySolrRunner Jetty properties: {hostContext=/solr, hostPort=59060}
   [junit4]   2> 4425700 INFO  (jetty-launcher-8913-thread-1) [    ] o.a.s.s.SolrDispatchFilter \__ \/ _ \ | '_|  Install dir: null
   [junit4]   2> 4425701 INFO  (jetty-launcher-8913-thread-1) [    ] o.a.s.s.SolrDispatchFilter |___/\___/_|_|    Start time: 2018-01-02T05:20:16.595Z
   [junit4]   2> 4425701 ERROR (jetty-launcher-8913-thread-2) [    ] o.a.s.u.StartupLoggingUtils Missing Java Option solr.log.dir. Logging may be missing or incomplete.
   [junit4]   2> 4425701 INFO  (jetty-launcher-8913-thread-2) [    ] o.a.s.s.SolrDispatchFilter  ___      _       Welcome to Apache Solr? version 8.0.0
   [junit4]   2> 4425701 INFO  (jetty-launcher-8913-thread-2) [    ] o.a.s.s.SolrDispatchFilter / __| ___| |_ _   Starting in cloud mode on port null
   [junit4]   2> 4425701 INFO  (jetty-launcher-8913-thread-2) [    ] o.a.s.s.SolrDispatchFilter \__ \/ _ \ | '_|  Install dir: null
   [junit4]   2> 4425702 INFO  (jetty-launcher-8913-thread-2) [    ] o.a.s.s.SolrDispatchFilter |___/\___/_|_|    Start time: 2018-01-02T05:20:16.596Z
   [junit4]   2> 4425704 INFO  (zkConnectionManagerCallback-8918-thread-1) [    ] o.a.s.c.c.ConnectionManager zkClient has connected
   [junit4]   2> 4425705 INFO  (zkConnectionManagerCallback-8920-thread-1) [    ] o.a.s.c.c.ConnectionManager zkClient has connected
   [junit4]   2> 4425705 INFO  (jetty-launcher-8913-thread-1) [    ] o.a.s.s.SolrDispatchFilter solr.xml found in ZooKeeper. Loading...
   [junit4]   2> 4425706 INFO  (jetty-launcher-8913-thread-2) [    ] o.a.s.s.SolrDispatchFilter solr.xml found in ZooKeeper. Loading...
   [junit4]   2> 4425722 INFO  (jetty-launcher-8913-thread-1) [    ] o.a.s.c.ZkContainer Zookeeper client=127.0.0.1:33055/solr
   [junit4]   2> 4425722 INFO  (jetty-launcher-8913-thread-2) [    ] o.a.s.c.ZkContainer Zookeeper client=127.0.0.1:33055/solr
   [junit4]   2> 4425724 INFO  (zkConnectionManagerCallback-8926-thread-1) [    ] o.a.s.c.c.ConnectionManager zkClient has connected
   [junit4]   2> 4425724 INFO  (zkConnectionManagerCallback-8928-thread-1) [    ] o.a.s.c.c.ConnectionManager zkClient has connected
   [junit4]   2> 4425727 INFO  (zkConnectionManagerCallback-8930-thread-1-processing-n:127.0.0.1:59060_solr) [n:127.0.0.1:59060_solr    ] o.a.s.c.c.ConnectionManager zkClient has connected
   [junit4]   2> 4425727 INFO  (zkConnectionManagerCallback-8932-thread-1-processing-n:127.0.0.1:51630_solr) [n:127.0.0.1:51630_solr    ] o.a.s.c.c.ConnectionManager zkClient has connected
   [junit4]   2> 4425867 INFO  (jetty-launcher-8913-thread-1) [n:127.0.0.1:51630_solr    ] o.a.s.c.Overseer Overseer (id=null) closing
   [junit4]   2> 4425868 INFO  (jetty-launcher-8913-thread-2) [n:127.0.0.1:59060_solr    ] o.a.s.c.Overseer Overseer (id=null) closing
   [junit4]   2> 4425868 INFO  (jetty-launcher-8913-thread-1) [n:127.0.0.1:51630_solr    ] o.a.s.c.OverseerElectionContext I am going to be the leader 127.0.0.1:51630_solr
   [junit4]   2> 4425870 INFO  (jetty-launcher-8913-thread-1) [n:127.0.0.1:51630_solr    ] o.a.s.c.Overseer Overseer (id=99278547612532742-127.0.0.1:51630_solr-n_0000000000) starting
   [junit4]   2> 4425870 INFO  (jetty-launcher-8913-thread-2) [n:127.0.0.1:59060_solr    ] o.a.s.c.ZkController Register node as live in ZooKeeper:/live_nodes/127.0.0.1:59060_solr
   [junit4]   2> 4425874 INFO  (zkCallback-8931-thread-1-processing-n:127.0.0.1:51630_solr) [n:127.0.0.1:51630_solr    ] o.a.s.c.c.ZkStateReader Updated live nodes from ZooKeeper... (0) -> (1)
   [junit4]   2> 4425876 INFO  (zkCallback-8929-thread-1-processing-n:127.0.0.1:59060_solr) [n:127.0.0.1:59060_solr    ] o.a.s.c.c.ZkStateReader Updated live nodes from ZooKeeper... (0) -> (1)
   [junit4]   2> 4425887 INFO  (jetty-launcher-8913-thread-1) [n:127.0.0.1:51630_solr    ] o.a.s.c.ZkController Register node as live in ZooKeeper:/live_nodes/127.0.0.1:51630_solr
   [junit4]   2> 4425889 INFO  (zkCallback-8929-thread-1-processing-n:127.0.0.1:59060_solr) [n:127.0.0.1:59060_solr    ] o.a.s.c.c.ZkStateReader Updated live nodes from ZooKeeper... (1) -> (2)
   [junit4]   2> 4425889 INFO  (zkCallback-8931-thread-1-processing-n:127.0.0.1:51630_solr) [n:127.0.0.1:51630_solr    ] o.a.s.c.c.ZkStateReader Updated live nodes from ZooKeeper... (1) -> (2)
   [junit4]   2> 4425979 INFO  (jetty-launcher-8913-thread-1) [n:127.0.0.1:51630_solr    ] o.a.s.m.r.SolrJmxReporter JMX monitoring for 'solr_51630.solr.node' (registry 'solr.node') enabled at server: com.sun.jmx.mbeanserver.JmxMBeanServer@353ac02
   [junit4]   2> 4425984 INFO  (jetty-launcher-8913-thread-1) [n:127.0.0.1:51630_solr    ] o.a.s.m.r.SolrJmxReporter JMX monitoring for 'solr_51630.solr.jvm' (registry 'solr.jvm') enabled at server: com.sun.jmx.mbeanserver.JmxMBeanServer@353ac02
   [junit4]   2> 4425984 INFO  (jetty-launcher-8913-thread-1) [n:127.0.0.1:51630_solr    ] o.a.s.m.r.SolrJmxReporter JMX monitoring for 'solr_51630.solr.jetty' (registry 'solr.jetty') enabled at server: com.sun.jmx.mbeanserver.JmxMBeanServer@353ac02
   [junit4]   2> 4425985 INFO  (jetty-launcher-8913-thread-1) [n:127.0.0.1:51630_solr    ] o.a.s.c.CorePropertiesLocator Found 0 core definitions underneath /export/home/jenkins/workspace/Lucene-Solr-master-Solaris/solr/build/solr-core/test/J1/temp/solr.update.processor.TimeRoutedAliasUpdateProcessorTest_993B753FE04A2474-001/tempDir-001/node1/.
   [junit4]   2> 4426090 INFO  (jetty-launcher-8913-thread-2) [n:127.0.0.1:59060_solr    ] o.a.s.m.r.SolrJmxReporter JMX monitoring for 'solr_59060.solr.node' (registry 'solr.node') enabled at server: com.sun.jmx.mbeanserver.JmxMBeanServer@353ac02
   [junit4]   2> 4426095 INFO  (jetty-launcher-8913-thread-2) [n:127.0.0.1:59060_solr    ] o.a.s.m.r.SolrJmxReporter JMX monitoring for 'solr_59060.solr.jvm' (registry 'solr.jvm') enabled at server: com.sun.jmx.mbeanserver.JmxMBeanServer@353ac02
   [junit4]   2> 4426095 INFO  (jetty-launcher-8913-thread-2) [n:127.0.0.1:59060_solr    ] o.a.s.m.r.SolrJmxReporter JMX monitoring for 'solr_59060.solr.jetty' (registry 'solr.jetty') enabled at server: com.sun.jmx.mbeanserver.JmxMBeanServer@353ac02
   [junit4]   2> 4426095 INFO  (jetty-launcher-8913-thread-2) [n:127.0.0.1:59060_solr    ] o.a.s.c.CorePropertiesLocator Found 0 core definitions underneath /export/home/jenkins/workspace/Lucene-Solr-master-Solaris/solr/build/solr-core/test/J1/temp/solr.update.processor.TimeRoutedAliasUpdateProcessorTest_993B753FE04A2474-001/tempDir-001/node2/.
   [junit4]   2> 4426111 INFO  (zkConnectionManagerCallback-8938-thread-1) [    ] o.a.s.c.c.ConnectionManager zkClient has connected
   [junit4]   2> 4426234 INFO  (TEST-TimeRoutedAliasUpdateProcessorTest.testParse-seed#[993B753FE04A2474]) [    ] o.a.s.SolrTestCaseJ4 ###Starting testParse
   [junit4]   2> 4426240 INFO  (TEST-TimeRoutedAliasUpdateProcessorTest.testParse-seed#[993B753FE04A2474]) [    ] o.a.s.SolrTestCaseJ4 ###Ending testParse
   [junit4]   2> 4426362 INFO  (TEST-TimeRoutedAliasUpdateProcessorTest.test-seed#[993B753FE04A2474]) [    ] o.a.s.SolrTestCaseJ4 ###Starting test
   [junit4]   2> 4426363 INFO  (zkConnectionManagerCallback-8943-thread-1) [    ] o.a.s.c.c.ConnectionManager zkClient has connected
   [junit4]   2> 4426366 INFO  (TEST-TimeRoutedAliasUpdateProcessorTest.test-seed#[993B753FE04A2474]) [    ] o.a.s.c.c.ZkStateReader Updated live nodes from ZooKeeper... (0) -> (2)
   [junit4]   2> 4426369 INFO  (TEST-TimeRoutedAliasUpdateProcessorTest.test-seed#[993B753FE04A2474]) [    ] o.a.s.c.s.i.ZkClientClusterStateProvider Cluster at 127.0.0.1:33055/solr ready
   [junit4]   2> 4426370 INFO  (qtp2047208962-43548) [n:127.0.0.1:51630_solr    ] o.a.s.h.a.CollectionsHandler Invoked Collection Action :create with params pullReplicas=0&replicationFactor=1&name=timeConfig&nrtReplicas=1&action=CREATE&numShards=1&tlogReplicas=0&wt=javabin&version=2 and sendToOCPQueue=true
   [junit4]   2> 4426374 INFO  (OverseerThreadFactory-13124-thread-1-processing-n:127.0.0.1:51630_solr) [n:127.0.0.1:51630_solr    ] o.a.s.c.CreateCollectionCmd Create collection timeConfig
   [junit4]   2> 4426374 INFO  (OverseerThreadFactory-13124-thread-1-processing-n:127.0.0.1:51630_solr) [n:127.0.0.1:51630_solr    ] o.a.s.c.CreateCollectionCmd Only _default config set found, using it.
   [junit4]   2> 4426375 INFO  (OverseerThreadFactory-13124-thread-1-processing-n:127.0.0.1:51630_solr) [n:127.0.0.1:51630_solr    ] o.a.s.c.c.ZkConfigManager Copying zk node /configs/_default/protwords.txt to /configs/timeConfig/protwords.txt
   [junit4]   2> 4426378 INFO  (OverseerThreadFactory-13124-thread-1-processing-n:127.0.0.1:51630_solr) [n:127.0.0.1:51630_solr    ] o.a.s.c.c.ZkConfigManager Copying zk node /configs/_default/managed-schema to /configs/timeConfig/managed-schema
   [junit4]   2> 4426381 INFO  (OverseerThreadFactory-13124-thread-1-processing-n:127.0.0.1:51630_solr) [n:127.0.0.1:51630_solr    ] o.a.s.c.c.ZkConfigManager Copying zk node /configs/_default/solrconfig.xml to /configs/timeConfig/solrconfig.xml
   [junit4]   2> 4426383 INFO  (OverseerThreadFactory-13124-thread-1-processing-n:127.0.0.1:51630_solr) [n:127.0.0.1:51630_solr    ] o.a.s.c.c.ZkConfigManager Copying zk node /configs/_default/synonyms.txt to /configs/timeConfig/synonyms.txt
   [junit4]   2> 4426386 INFO  (OverseerThreadFactory-13124-thread-1-processing-n:127.0.0.1:51630_solr) [n:127.0.0.1:51630_solr    ] o.a.s.c.c.ZkConfigManager Copying zk node /configs/_default/stopwords.txt to /configs/timeConfig/stopwords.txt
   [junit4]   2> 4426389 INFO  (OverseerThreadFactory-13124-thread-1-processing-n:127.0.0.1:51630_solr) [n:127.0.0.1:51630_solr    ] o.a.s.c.c.ZkConfigManager Copying zk node /configs/_default/params.json to /configs/timeConfig/params.json
   [junit4]   2> 4426392 INFO  (OverseerThreadFactory-13124-thread-1-processing-n:127.0.0.1:51630_solr) [n:127.0.0.1:51630_solr    ] o.a.s.c.c.ZkConfigManager Copying zk node /configs/_default/lang/contractions_it.txt to /configs/timeConfig/lang/contractions_it.txt
   [junit4]   2> 4426396 INFO  (OverseerThreadFactory-13124-thread-1-processing-n:127.0.0.1:51630_solr) [n:127.0.0.1:51630_solr    ] o.a.s.c.c.ZkConfigManager Copying zk node /configs/_default/lang/stemdict_nl.txt to /configs/timeConfig/lang/stemdict_nl.txt
   [junit4]   2> 4426398 INFO  (OverseerThreadFactory-13124-thread-1-processing-n:127.0.0.1:51630_solr) [n:127.0.0.1:51630_solr    ] o.a.s.c.c.ZkConfigManager Copying zk node /configs/_default/lang/stopwords_no.txt to /configs/timeConfig/lang/stopwords_no.txt
   [junit4]   2> 4426401 INFO  (OverseerThreadFactory-13124-thread-1-processing-n:127.0.0.1:51630_solr) [n:127.0.0.1:51630_solr    ] o.a.s.c.c.ZkConfigManager Copying zk node /configs/_default/lang/stopwords_hy.txt to /configs/timeConfig/lang/stopwords_hy.txt
   [junit4]   2> 4426405 INFO  (OverseerThreadFactory-13124-thread-1-processing-n:127.0.0.1:51630_solr) [n:127.0.0.1:51630_solr    ] o.a.s.c.c.ZkConfigManager Copying zk node /configs/_default/lang/contractions_ca.txt to /configs/timeConfig/lang/contractions_ca.txt
   [junit4]   2> 4426408 INFO  (OverseerThreadFactory-13124-thread-1-processing-n:127.0.0.1:51630_solr) [n:127.0.0.1:51630_solr    ] o.a.s.c.c.ZkConfigManager Copying zk node /configs/_default/lang/stopwords_id.txt to /configs/timeConfig/lang/stopwords_id.txt
   [junit4]   2> 4426412 INFO  (OverseerThreadFactory-13124-thread-1-processing-n:127.0.0.1:51630_solr) [n:127.0.0.1:51630_solr    ] o.a.s.c.c.ZkConfigManager Copying zk node /configs/_default/lang/stopwords_ga.txt to /configs/timeConfig/lang/stopwords_ga.txt
   [junit4]   2> 4426415 INFO  (OverseerThreadFactory-13124-thread-1-processing-n:127.0.0.1:51630_solr) [n:127.0.0.1:51630_solr    ] o.a.s.c.c.ZkConfigManager Copying zk node /configs/_default/lang/stopwords_da.txt to /configs/timeConfig/lang/stopwords_da.txt
   [junit4]   2> 4426419 INFO  (OverseerThreadFactory-13124-thread-1-processing-n:127.0.0.1:51630_solr) [n:127.0.0.1:51630_solr    ] o.a.s.c.c.ZkConfigManager Copying zk node /configs/_default/lang/stopwords_hi.txt to /configs/timeConfig/lang/stopwords_hi.txt
   [junit4]   2> 4426423 INFO  (OverseerThreadFactory-13124-thread-1-processing-n:127.0.0.1:51630_solr) [n:127.0.0.1:51630_solr    ] o.a.s.c.c.ZkConfigManager Copying zk node /configs/_default/lang/stopwords_ja.txt to /configs/timeConfig/lang/stopwords_ja.txt
   [junit4]   2> 4426426 INFO  (OverseerThreadFactory-13124-thread-1-processing-n:127.0.0.1:51630_solr) [n:127.0.0.1:51630_solr    ] o.a.s.c.c.ZkConfigManager Copying zk node /configs/_default/lang/stopwords_pt.txt to /configs/timeConfig/lang/stopwords_pt.txt
   [junit4]   2> 4426429 INFO  (OverseerThreadFactory-13124-thread-1-processing-n:127.0.0.1:51630_solr) [n:127.0.0.1:51630_solr    ] o.a.s.c.c.ZkConfigManager Copying zk node /configs/_default/lang/stopwords_hu.txt to /configs/timeConfig/lang/stopwords_hu.txt
   [junit4]   2> 4426432 INFO  (OverseerThreadFactory-13124-thread-1-processing-n:127.0.0.1:51630_solr) [n:127.0.0.1:51630_solr    ] o.a.s.c.c.ZkConfigManager Copying zk node /configs/_default/lang/stopwords_el.txt to /configs/timeConfig/lang/stopwords_el.txt
   [junit4]   2> 4426436 INFO  (OverseerThreadFactory-13124-thread-1-processing-n:127.0.0.1:51630_solr) [n:127.0.0.1:51630_solr    ] o.a.s.c.c.ZkConfigManager Copying zk node /configs/_default/lang/stopwords_ru.txt to /configs/timeConfig/lang/stopwords_ru.txt
   [junit4]   2> 4426439 INFO  (OverseerThreadFactory-13124-thread-1-processing-n:127.0.0.1:51630_solr) [n:127.0.0.1:51630_solr    ] o.a.s.c.c.ZkConfigManager Copying zk node /configs/_default/lang/stopwords_tr.txt to /configs/timeConfig/lang/stopwords_tr.txt
   [junit4]   2> 4426442 INFO  (OverseerThreadFactory-13124-thread-1-processing-n:127.0.0.1:51630_solr) [n:127.0.0.1:51630_solr    ] o.a.s.c.c.ZkConfigManager Copying zk node /configs/_default/lang/stopwords_ar.txt to /configs/timeConfig/lang/stopwords_ar.txt
   [junit4]   2> 4426445 INFO  (OverseerThreadFactory-13124-thread-1-processing-n:127.0.0.1:51630_solr) [n:127.0.0.1:51630_solr    ] o.a.s.c.c.ZkConfigManager Copying zk node /configs/_default/lang/userdict_ja.txt to /configs/timeConfig/lang/userdict_ja.txt
   [junit4]   2> 4426448 INFO  (OverseerThreadFactory-13124-thread-1-processing-n:127.0.0.1:51630_solr) [n:127.0.0.1:51630_solr    ] o.a.s.c.c.ZkConfigManager Copying zk node /configs/_default/lang/stopwords_eu.txt to /configs/timeConfig/lang/stopwords_eu.txt
   [junit4]   2> 4426452 INFO  (OverseerThreadFactory-13124-thread-1-processing-n:127.0.0.1:51630_solr) [n:127.0.0.1:51630_solr    ] o.a.s.c.c.ZkConfigManager Copying zk node /configs/_default/lang/stopwords_it.txt to /configs/timeConfig/lang/stopwords_it.txt
   [junit4]   2> 4426455 INFO  (OverseerThreadFactory-13124-thread-1-processing-n:127.0.0.1:51630_solr) [n:127.0.0.1:51630_solr    ] o.a.s.c.c.ZkConfigManager Copying zk node /configs/_default/lang/stopwords_cz.txt to /configs/timeConfig/lang/stopwords_cz.txt
   [junit4]   2> 4426458 INFO  (OverseerThreadFactory-13124-thread-1-processing-n:127.0.0.1:51630_solr) [n:127.0.0.1:51630_solr    ] o.a.s.c.c.ZkConfigManager Copying zk node /configs/_default/lang/stoptags_ja.txt to /configs/timeConfig/lang/stoptags_ja.txt
   [junit4]   2> 4426461 INFO  (OverseerThreadFactory-13124-thread-1-processing-n:127.0.0.1:51630_solr) [n:127.0.0.1:51630_solr    ] o.a.s.c.c.ZkConfigManager Copying zk node /configs/_default/lang/contractions_fr.txt to /configs/timeConfig/lang/contractions_fr.txt
   [junit4]   2> 4426464 INFO  (OverseerThreadFactory-13124-thread-1-processing-n:127.0.0.1:51630_solr) [n:127.0.0.1:51630_solr    ] o.a.s.c.c.ZkConfigManager Copying zk node /configs/_default/lang/stopwords_de.txt to /configs/timeConfig/lang/stopwords_de.txt
   [junit4]   2> 4426467 INFO  (OverseerThreadFactory-13124-thread-1-processing-n:127.0.0.1:51630_solr) [n:127.0.0.1:51630_solr    ] o.a.s.c.c.ZkConfigManager Copying zk node /configs/_default/lang/stopwords_fa.txt to /configs/timeConfig/lang/stopwords_fa.txt
   [junit4]   2> 4426471 INFO  (OverseerThreadFactory-13124-thread-1-processing-n:127.0.0.1:51630_solr) [n:127.0.0.1:51630_solr    ] o.a.s.c.c.ZkConfigManager Copying zk node /configs/_default/lang/contractions_ga.txt to /configs/timeConfig/lang/contractions_ga.txt
   [junit4]   2> 4426474 INFO  (OverseerThreadFactory-13124-thread-1-processing-n:127.0.0.1:51630_solr) [n:127.0.0.1:51630_solr    ] o.a.s.c.c.ZkConfigManager Copying zk node /configs/_default/lang/stopwords_ca.txt to /configs/timeConfig/lang/stopwords_ca.txt
   [junit4]   2> 4426477 INFO  (OverseerThreadFactory-13124-thread-1-processing-n:127.0.0.1:51630_solr) [n:127.0.0.1:51630_solr    ] o.a.s.c.c.ZkConfigManager Copying zk node /configs/_default/lang/stopwords_nl.txt to /configs/timeConfig/lang/stopwords_nl.txt
   [junit4]   2> 4426479 INFO  (OverseerThreadFactory-13124-thread-1-processing-n:127.0.0.1:51630_solr) [n:127.0.0.1:51630_solr    ] o.a.s.c.c.ZkConfigManager Copying zk node /configs/_default/lang/stopwords_bg.txt to /configs/timeConfig/lang/stopwords_bg.txt
   [junit4]   2> 4426482 INFO  (OverseerThreadFactory-13124-thread-1-processing-n:127.0.0.1:51630_solr) [n:127.0.0.1:51630_solr    ] o.a.s.c.c.ZkConfigManager Copying zk node /configs/_default/lang/stopwords_lv.txt to /configs/timeConfig/lang/stopwords_lv.txt
   [junit4]   2> 4426484 INFO  (OverseerThreadFactory-13124-thread-1-processing-n:127.0.0.1:51630_solr) [n:127.0.0.1:51630_solr    ] o.a.s.c.c.ZkConfigManager Copying zk node /configs/_default/lang/stopwords_en.txt to /configs/timeConfig/lang/stopwords_en.txt
   [junit4]   2> 4426487 INFO  (OverseerThreadFactory-13124-thread-1-processing-n:127.0.0.1:51630_solr) [n:127.0.0.1:51630_solr    ] o.a.s.c.c.ZkConfigManager Copying zk node /configs/_default/lang/stopwords_es.txt to /configs/timeConfig/lang/stopwords_es.txt
   [junit4]   2> 4426489 INFO  (OverseerThreadFactory-13124-thread-1-processing-n:127.0.0.1:51630_solr) [n:127.0.0.1:51630_solr    ] o.a.s.c.c.ZkConfigManager Copying zk node /configs/_default/lang/stopwords_ro.txt to /configs/timeConfig/lang/stopwords_ro.txt
   [junit4]   2> 4426492 INFO  (OverseerThreadFactory-13124-thread-1-processing-n:127.0.0.1:51630_solr) [n:127.0.0.1:51630_solr    ] o.a.s.c.c.ZkConfigManager Copying zk node /configs/_default/lang/stopwords_th.txt to /configs/timeConfig/lang/stopwords_th.txt
   [junit4]   2> 4426494 INFO  (OverseerThreadFactory-13124-thread-1-processing-n:127.0.0.1:51630_solr) [n:127.0.0.1:51630_solr    ] o.a.s.c.c.ZkConfigManager Copying zk node /configs/_default/lang/stopwords_fr.txt to /configs/timeConfig/lang/stopwords_fr.txt
   [junit4]   2> 4426496 INFO  (OverseerThreadFactory-13124-thread-1-processing-n:127.0.0.1:51630_solr) [n:127.0.0.1:51630_solr    ] o.a.s.c.c.ZkConfigManager Copying zk node /configs/_default/lang/stopwords_sv.txt to /configs/timeConfig/lang/stopwords_sv.txt
   [junit4]   2> 4426498 INFO  (OverseerThreadFactory-13124-thread-1-processing-n:127.0.0.1:51630_solr) [n:127.0.0.1:51630_solr    ] o.a.s.c.c.ZkConfigManager Copying zk node /configs/_default/lang/stopwords_fi.txt to /configs/timeConfig/lang/stopwords_fi.txt
   [junit4]   2> 4426501 INFO  (OverseerThreadFactory-13124-thread-1-processing-n:127.0.0.1:51630_solr) [n:127.0.0.1:51630_solr    ] o.a.s.c.c.ZkConfigManager Copying zk node /configs/_default/lang/hyphenations_ga.txt to /configs/timeConfig/lang/hyphenations_ga.txt
   [junit4]   2> 4426503 INFO  (OverseerThreadFactory-13124-thread-1-processing-n:127.0.0.1:51630_solr) [n:127.0.0.1:51630_solr    ] o.a.s.c.c.ZkConfigManager Copying zk node /configs/_default/lang/stopwords_gl.txt to /configs/timeConfig/lang/stopwords_gl.txt
   [junit4]   2> 4426624 INFO  (OverseerStateUpdate-99278547612532742-127.0.0.1:51630_solr-n_0000000000) [n:127.0.0.1:51630_solr    ] o.a.s.c.o.SliceMutator createReplica() {
   [junit4]   2>   "operation":"ADDREPLICA",
   [junit4]   2>   "collection":"timeConfig",
   [junit4]   2>   "shard":"shard1",
   [junit4]   2>   "core":"timeConfig_shard1_replica_n1",
   [junit4]   2>   "state":"down",
   [junit4]   2>   "base_url":"http://127.0.0.1:59060/solr",
   [junit4]   2>   "type":"NRT",
   [junit4]   2>   "waitForFinalState":"false"} 
   [junit4]   2> 4426828 INFO  (qtp102213412-43540) [n:127.0.0.1:59060_solr    ] o.a.s.h.a.CoreAdminOperation core create command qt=/admin/cores&coreNodeName=core_node2&collection.configName=timeConfig&newCollection=true&name=timeConfig_shard1_replica_n1&action=CREATE&numShards=1&collection=timeConfig&shard=shard1&wt=javabin&version=2&replicaType=NRT
   [junit4]   2> 4426829 INFO  (qtp102213412-43540) [n:127.0.0.1:59060_solr    ] o.a.s.c.TransientSolrCoreCacheDefault Allocating transient cache for 2147483647 transient cores
   [junit4]   2> 4426949 INFO  (zkCallback-8929-thread-1-processing-n:127.0.0.1:59060_solr) [n:127.0.0.1:59060_solr    ] o.a.s.c.c.ZkStateReader A cluster state change: [WatchedEvent state:SyncConnected type:NodeDataChanged path:/collections/timeConfig/state.json] for collection [timeConfig] has occurred - updating... (live nodes size: [2])
   [junit4]   2> 4426949 INFO  (zkCallback-8929-thread-2-processing-n:127.0.0.1:59060_solr) [n:127.0.0.1:59060_solr    ] o.a.s.c.c.ZkStateReader A cluster state change: [WatchedEvent state:SyncConnected type:NodeDataChanged path:/collections/timeConfig/state.json] for collection [timeConfig] has occurred - updating... (live nodes size: [2])
   [junit4]   2> 4427856 INFO  (qtp102213412-43540) [n:127.0.0.1:59060_solr c:timeConfig s:shard1 r:core_node2 x:timeConfig_shard1_replica_n1] o.a.s.c.RequestParams conf resource params.json loaded . version : 0 
   [junit4]   2> 4427857 INFO  (qtp102213412-43540) [n:127.0.0.1:59060_solr c:timeConfig s:shard1 r:core_node2 x:timeConfig_shard1_replica_n1] o.a.s.c.RequestParams request params refreshed to version 0
   [junit4]   2> 4427858 WARN  (qtp102213412-43540) [n:127.0.0.1:59060_solr c:timeConfig s:shard1 r:core_node2 x:timeConfig_shard1_replica_n1] o.a.s.c.SolrConfig Couldn't add files from /export/home/jenkins/workspace/Lucene-Solr-master-Solaris/solr/build/solr-core/test/J1/temp/solr.update.processor.TimeRoutedAliasUpdateProcessorTest_993B753FE04A2474-001/tempDir-001/node2/timeConfig_shard1_replica_n1/../../../../contrib/extraction/lib filtered by .*\.jar to classpath: /export/home/jenkins/workspace/Lucene-Solr-master-Solaris/solr/build/solr-core/test/J1/temp/solr.update.processor.TimeRoutedAliasUpdateProcessorTest_993B753FE04A2474-001/tempDir-001/node2/timeConfig_shard1_replica_n1/../../../../contrib/extraction/lib
   [junit4]   2> 4427858 WARN  (qtp102213412-43540) [n:127.0.0.1:59060_solr c:timeConfig s:shard1 r:core_node2 x:timeConfig_shard1_replica_n1] o.a.s.c.SolrConfig Couldn't add files from /export/home/jenkins/workspace/Lucene-Solr-master-Solaris/solr/build/solr-core/test/J1/temp/solr.update.processor.TimeRoutedAliasUpdateProcessorTest_993B753FE04A2474-001/tempDir-001/node2/timeConfig_shard1_replica_n1/../../../../dist filtered by solr-cell-\d.*\.jar to classpath: /export/home/jenkins/workspace/Lucene-Solr-master-Solaris/solr/build/solr-core/test/J1/temp/solr.update.processor.TimeRoutedAliasUpdateProcessorTest_993B753FE04A2474-001/tempDir-001/node2/timeConfig_shard1_replica_n1/../../../../dist
   [junit4]   2> 4427859 WARN  (qtp102213412-43540) [n:127.0.0.1:59060_solr c:timeConfig s:shard1 r:core_node2 x:timeConfig_shard1_replica_n1] o.a.s.c.SolrConfig Couldn't add files from /export/home/jenkins/workspace/Lucene-Solr-master-Solaris/solr/build/solr-core/test/J1/temp/solr.update.processor.TimeRoutedAliasUpdateProcessorTest_993B753FE04A2474-001/tempDir-001/node2/timeConfig_shard1_replica_n1/../../../../contrib/clustering/lib filtered by .*\.jar to classpath: /export/home/jenkins/workspace/Lucene-Solr-master-Solaris/solr/build/solr-core/test/J1/temp/solr.update.processor.TimeRoutedAliasUpdateProcessorTest_993B753FE04A2474-001/tempDir-001/node2/timeConfig_shard1_replica_n1/../../../../contrib/clustering/lib
   [junit4]   2> 4427859 WARN  (qtp102213412-43540) [n:127.0.0.1:59060_solr c:timeConfig s:shard1 r:core_node2 x:timeConfig_shard1_replica_n1] o.a.s.c.SolrConfig Couldn't add files from /export/home/jenkins/workspace/Lucene-Solr-master-Solaris/solr/build/solr-core/test/J1/temp/solr.update.processor.TimeRoutedAliasUpdateProcessorTest_993B753FE04A2474-001/tempDir-001/node2/timeConfig_shard1_replica_n1/../../../../dist filtered by solr-clustering-\d.*\.jar to classpath: /export/home/jenkins/workspace/Lucene-Solr-master-Solaris/solr/build/solr-core/test/J1/temp/solr.update.processor.TimeRoutedAliasUpdateProcessorTest_993B753FE04A2474-001/tempDir-001/node2/timeConfig_shard1_replica_n1/../../../../dist
   [junit4]   2> 4427860 WARN  (qtp102213412-43540) [n:127.0.0.1:59060_solr c:timeConfig s:shard1 r:core_node2 x:timeConfig_shard1_replica_n1] o.a.s.c.SolrConfig Couldn't add files from /export/home/jenkins/workspace/Lucene-Solr-master-Solaris/solr/build/solr-core/test/J1/temp/solr.update.processor.TimeRoutedAliasUpdateProcessorTest_993B753FE04A2474-001/tempDir-001/node2/timeConfig_shard1_replica_n1/../../../../contrib/langid/lib filtered by .*\.jar to classpath: /export/home/jenkins/workspace/Lucene-Solr-master-Solaris/solr/build/solr-core/test/J1/temp/solr.update.processor.TimeRoutedAliasUpdateProcessorTest_993B753FE04A2474-001/tempDir-001/node2/timeConfig_shard1_replica_n1/../../../../contrib/langid/lib
   [junit4]   2> 4427860 WARN  (qtp102213412-43540) [n:127.0.0.1:59060_solr c:timeConfig s:shard1 r:core_node2 x:timeConfig_shard1_replica_n1] o.a.s.c.SolrConfig Couldn't add files from /export/home/jenkins/workspace/Lucene-Solr-master-Solaris/solr/build/solr-core/test/J1/temp/solr.update.processor.TimeRoutedAliasUpdateProcessorTest_993B753FE04A2474-001/tempDir-001/node2/timeConfig_shard1_replica_n1/../../../../dist filtered by solr-langid-\d.*\.jar to classpath: /export/home/jenkins/workspace/Lucene-Solr-master-Solaris/solr/build/solr-core/test/J1/temp/solr.update.processor.TimeRoutedAliasUpdateProcessorTest_993B753FE04A2474-001/tempDir-001/node2/timeConfig_shard1_replica_n1/../../../../dist
   [junit4]   2> 4427860 WARN  (qtp102213412-43540) [n:127.0.0.1:59060_solr c:timeConfig s:shard1 r:core_node2 x:timeConfig_shard1_replica_n1] o.a.s.c.SolrConfig Couldn't add files from /export/home/jenkins/workspace/Lucene-Solr-master-Solaris/solr/build/solr-core/test/J1/temp/solr.update.processor.TimeRoutedAliasUpdateProcessorTest_993B753FE04A2474-001/tempDir-001/node2/timeConfig_shard1_replica_n1/../../../../contrib/velocity/lib filtered by .*\.jar to classpath: /export/home/jenkins/workspace/Lucene-Solr-master-Solaris/solr/build/solr-core/test/J1/temp/solr.update.processor.TimeRoutedAliasUpdateProcessorTest_993B753FE04A2474-001/tempDir-001/node2/timeConfig_shard1_replica_n1/../../../../contrib/velocity/lib
   [junit4]   2> 4427861 WARN  (qtp102213412-43540) [n:127.0.0.1:59060_solr c:timeConfig s:shard1 r:core_node2 x:timeConfig_shard1_replica_n1] o.a.s.c.SolrConfig Couldn't add files from /export/home/jenkins/workspace/Lucene-Solr-master-Solaris/solr/build/solr-core/test/J1/temp/solr.update.processor.TimeRoutedAliasUpdateProcessorTest_993B753FE04A2474-001/tempDir-001/node2/timeConfig_shard1_replica_n1/../../../../dist filtered by solr-velocity-\d.*\.jar to classpath: /export/home/jenkins/workspace/Lucene-Solr-master-Solaris/solr/build/solr-core/test/J1/temp/solr.update.processor.TimeRoutedAliasUpdateProcessorTest_993B753FE04A2474-001/tempDir-001/node2/timeConfig_shard1_replica_n1/../../../../dist
   [junit4]   2> 4427872 INFO  (qtp102213412-43540) [n:127.0.0.1:59060_solr c:timeConfig s:shard1 r:core_node2 x:timeConfig_shard1_replica_n1] o.a.s.c.SolrConfig Using Lucene MatchVersion: 8.0.0
   [junit4]   2> 4427892 INFO  (qtp102213412-43540) [n:127.0.0.1:59060_solr c:timeConfig s:shard1 r:core_node2 x:timeConfig_shard1_replica_n1] o.a.s.s.IndexSchema [timeConfig_shard1_replica_n1] Schema name=default-config
   [junit4]   2> 4428054 INFO  (qtp102213412-43540) [n:127.0.0.1:59060_solr c:timeConfig s:shard1 r:core_node2 x:timeConfig_shard1_replica_n1] o.a.s.s.IndexSchema Loaded schema default-config/1.6 with uniqueid field id
   [junit4]   2> 4428091 INFO  (qtp102213412-43540) [n:127.0.0.1:59060_solr c:timeConfig s:shard1 r:core_node2 x:timeConfig_shard1_replica_n1] o.a.s.c.CoreContainer Creating SolrCore 'timeConfig_shard1_replica_n1' using configuration from collection timeConfig, trusted=true
   [junit4]   2> 4428092 INFO  (qtp102213412-43540) [n:127.0.0.1:59060_solr c:timeConfig s:shard1 r:core_node2 x:timeConfig_shard1_replica_n1] o.a.s.m.r.SolrJmxReporter JMX monitoring for 'solr_59060.solr.core.timeConfig.shard1.replica_n1' (registry 'solr.core.timeConfig.shard1.replica_n1') enabled at server: com.sun.jmx.mbeanserver.JmxMBeanServer@353ac02
   [junit4]   2> 4428092 INFO  (qtp102213412-43540) [n:127.0.0.1:59060_solr c:timeConfig s:shard1 r:core_node2 x:timeConfig_shard1_replica_n1] o.a.s.c.SolrCore solr.RecoveryStrategy.Builder
   [junit4]   2> 4428092 INFO  (qtp102213412-43540) [n:127.0.0.1:59060_solr c:timeConfig s:shard1 r:core_node2 x:timeConfig_shard1_replica_n1] o.a.s.c.SolrCore [[timeConfig_shard1_replica_n1] ] Opening new SolrCore at [/export/home/jenkins/workspace/Lucene-Solr-master-Solaris/solr/build/solr-core/test/J1/temp/solr.update.processor.TimeRoutedAliasUpdateProcessorTest_993B753FE04A2474-001/tempDir-001/node2/timeConfig_shard1_replica_n1], dataDir=[/export/home/jenkins/workspace/Lucene-Solr-master-Solaris/solr/build/solr-core/test/J1/temp/solr.update.processor.TimeRoutedAliasUpdateProcessorTest_993B753FE04A2474-001/tempDir-001/node2/./timeConfig_shard1_replica_n1/data/]
   [junit4]   2> 4428094 INFO  (qtp102213412-43540) [n:127.0.0.1:59060_solr c:timeConfig s:shard1 r:core_node2 x:timeConfig_shard1_replica_n1] o.a.s.r.XSLTResponseWriter xsltCacheLifetimeSeconds=5
   [junit4]   2> 4428139 INFO  (qtp102213412-43540) [n:127.0.0.1:59060_solr c:timeConfig s:shard1 r:core_node2 x:timeConfig_shard1_replica_n1] o.a.s.u.UpdateHandler Using UpdateLog implementation: org.apache.solr.update.UpdateLog
   [junit4]   2> 4428139 INFO  (qtp102213412-43540) [n:127.0.0.1:59060_solr c:timeConfig s:shard1 r:core_node2 x:timeConfig_shard1_replica_n1] o.a.s.u.UpdateLog Initializing UpdateLog: dataDir= defaultSyncLevel=FLUSH numRecordsToKeep=100 maxNumLogsToKeep=10 numVersionBuckets=65536
   [junit4]   2> 4428140 INFO  (qtp102213412-43540) [n:127.0.0.1:59060_solr c:timeConfig s:shard1 r:core_node2 x:timeConfig_shard1_replica_n1] o.a.s.u.CommitTracker Hard AutoCommit: if uncommited for 15000ms; 
   [junit4]   2> 4428140 INFO  (qtp102213412-43540) [n:127.0.0.1:59060_solr c:timeConfig s:shard1 r:core_node2 x:timeConfig_shard1_replica_n1] o.a.s.u.CommitTracker Soft AutoCommit: disabled
   [junit4]   2> 4428141 INFO  (qtp102213412-43540) [n:127.0.0.1:59060_solr c:timeConfig s:shard1 r:core_node2 x:timeConfig_shard1_replica_n1] o.a.s.s.SolrIndexSearcher Opening [Searcher@7c3b9c01[timeConfig_shard1_replica_n1] main]
   [junit4]   2> 4428142 INFO  (qtp102213412-43540) [n:127.0.0.1:59060_solr c:timeConfig s:shard1 r:core_node2 x:timeConfig_shard1_replica_n1] o.a.s.r.ManagedResourceStorage Configured ZooKeeperStorageIO with znodeBase: /configs/timeConfig
   [junit4]   2> 4428143 INFO  (qtp102213412-43540) [n:127.0.0.1:59060_solr c:timeConfig s:shard1 r:core_node2 x:timeConfig_shard1_replica_n1] o.a.s.r.ManagedResourceStorage Loaded null at path _rest_managed.json using ZooKeeperStorageIO:path=/configs/timeConfig
   [junit4]   2> 4428143 INFO  (qtp102213412-43540) [n:127.0.0.1:59060_solr c:timeConfig s:shard1 r:core_node2 x:timeConfig_shard1_replica_n1] o.a.s.s.ZkIndexSchemaReader Creating ZooKeeper watch for the managed schema at /configs/timeConfig/managed-schema
   [junit4]   2> 4428144 INFO  (qtp102213412-43540) [n:127.0.0.1:59060_solr c:timeConfig s:shard1 r:core_node2 x:timeConfig_shard1_replica_n1] o.a.s.s.ZkIndexSchemaReader Current schema version 0 is already the latest
   [junit4]   2> 4428144 INFO  (qtp102213412-43540) [n:127.0.0.1:59060_solr c:timeConfig s:shard1 r:core_node2 x:timeConfig_shard1_replica_n1] o.a.s.h.c.SpellCheckComponent Initializing spell checkers
   [junit4]   2> 4428144 INFO  (qtp102213412-43540) [n:127.0.0.1:59060_solr c:timeConfig s:shard1 r:core_node2 x:timeConfig_shard1_replica_n1] o.a.s.s.DirectSolrSpellChecker init: {name=default,field=_text_,classname=solr.DirectSolrSpellChecker,distanceMeasure=internal,accuracy=0.5,maxEdits=2,minPrefix=1,maxInspections=5,minQueryLength=4,maxQueryFrequency=0.01}
   [junit4]   2> 4428145 INFO  (qtp102213412-43540) [n:127.0.0.1:59060_solr c:timeConfig s:shard1 r:core_node2 x:timeConfig_shard1_replica_n1] o.a.s.h.ReplicationHandler Commits will be reserved for 10000ms.
   [junit4]   2> 4428146 INFO  (qtp102213412-43540) [n:127.0.0.1:59060_solr c:timeConfig s:shard1 r:core_node2 x:timeConfig_shard1_replica_n1] o.a.s.u.UpdateLog Could not find max version in index or recent updates, using new clock 1588456764515287040
   [junit4]   2> 4428146 INFO  (searcherExecutor-13129-thread-1-processing-n:127.0.0.1:59060_solr x:timeConfig_shard1_replica_n1 s:shard1 c:timeConfig r:core_node2) [n:127.0.0.1:59060_solr c:timeConfig s:shard1 r:core_node2 x:timeConfig_shard1_replica_n1] o.a.s.c.QuerySenderListener QuerySenderListener sending requests to Searcher@7c3b9c01[timeConfig_shard1_replica_n1] main{ExitableDirectoryReader(UninvertingDirectoryReader())}
   [junit4]   2> 4428146 INFO  (searcherExecutor-13129-thread-1-processing-n:127.0.0.1:59060_solr x:timeConfig_shard1_replica_n1 s:shard1 c:timeConfig r:core_node2) [n:127.0.0.1:59060_solr c:timeConfig s:shard1 r:core_node2 x:timeConfig_shard1_replica_n1] o.a.s.c.QuerySenderListener QuerySenderListener done.
   [junit4]   2> 4428146 INFO  (searcherExecutor-13129-thread-1-processing-n:127.0.0.1:59060_solr x:timeConfig_shard1_replica_n1 s:shard1 c:timeConfig r:core_node2) [n:127.0.0.1:59060_solr c:timeConfig s:shard1 r:core_node2 x:timeConfig_shard1_replica_n1] o.a.s.h.c.SpellCheckComponent Loading spell index for spellchecker: default
   [junit4]   2> 4428147 INFO  (searcherExecutor-13129-thread-1-processing-n:127.0.0.1:59060_solr x:timeConfig_shard1_replica_n1 s:shard1 c:timeConfig r:core_node2) [n:127.0.0.1:59060_solr c:timeConfig s:shard1 r:core_node2 x:timeConfig_shard1_replica_n1] o.a.s.c.SolrCore [timeConfig_shard1_replica_n1] Registered new searcher Searcher@7c3b9c01[timeConfig_shard1_replica_n1] main{ExitableDirectoryReader(UninvertingDirectoryReader())}
   [junit4]   2> 4428152 INFO  (qtp102213412-43540) [n:127.0.0.1:59060_solr c:timeConfig s:shard1 r:core_node2 x:timeConfig_shard1_replica_n1] o.a.s.c.ShardLeaderElectionContext Enough replicas found to continue.
   [junit4]   2> 4428152 INFO  (qtp102213412-43540) [n:127.0.0.1:59060_solr c:timeConfig s:shard1 r:core_node2 x:timeConfig_shard1_replica_n1] o.a.s.c.ShardLeaderElectionContext I may be the new leader - try and sync
   [junit4]   2> 4428152 INFO  (qtp102213412-43540) [n:127.0.0.1:59060_solr c:timeConfig s:shard1 r:core_node2 x:timeConfig_shard1_replica_n1] o.a.s.c.SyncStrategy Sync replicas to http://127.0.0.1:59060/solr/timeConfig_shard1_replica_n1/
   [junit4]   2> 4428152 INFO  (qtp102213412-43540) [n:127.0.0.1:59060_solr c:timeConfig s:shard1 r:core_node2 x:timeConfig_shard1_replica_n1] o.a.s.c.SyncStrategy Sync Success - now sync replicas to me
   [junit4]   2> 4428152 INFO  (qtp102213412-43540) [n:127.0.0.1:59060_solr c:timeConfig s:shard1 r:core_node2 x:timeConfig_shard1_replica_n1] o.a.s.c.SyncStrategy http://127.0.0.1:59060/solr/timeConfig_shard1_replica_n1/ has no replicas
   [junit4]   2> 4428152 INFO  (qtp102213412-43540) [n:127.0.0.1:59060_solr c:timeConfig s:shard1 r:core_node2 x:timeConfig_shard1_replica_n1] o.a.s.c.ShardLeaderElectionContext Found all replicas participating in election, clear LIR
   [junit4]   2> 4428156 INFO  (qtp102213412-43540) [n:127.0.0.1:59060_solr c:timeConfig s:shard1 r:core_node2 x:timeConfig_shard1_replica_n1] o.a.s.c.ShardLeaderElectionContext I am the new leader: http://127.0.0.1:59060/solr/timeConfig_shard1_replica_n1/ shard1
   [junit4]   2> 4428260 INFO  (zkCallback-8929-thread-1-processing-n:127.0.0.1:59060_solr) [n:127.0.0.1:59060_solr    ] o.a.s.c.c.ZkStateReader A cluster state change: [WatchedEvent state:SyncConnected type:NodeDataChanged path:/collections/timeConfig/state.json] for collection [timeConfig] has occurred - updating... (live nodes size: [2])
   [junit4]   2> 4428260 INFO  (zkCallback-8929-thread-2-processing-n:127.0.0.1:59060_solr) [n:127.0.0.1:59060_solr    ] o.a.s.c.c.ZkStateReader A cluster state change: [WatchedEvent state:SyncConnected type:NodeDataChanged path:/collections/timeConfig/state.json] for collection [timeConfig] has occurred - updating... (live nodes size: [2])
   [junit4]   2> 4428308 INFO  (qtp102213412-43540) [n:127.0.0.1:59060_solr c:timeConfig s:shard1 r:core_node2 x:timeConfig_shard1_replica_n1] o.a.s.c.ZkController I am the leader, no recovery necessary
   [junit4]   2> 4428312 INFO  (qtp102213412-43540) [n:127.0.0.1:59060_solr c:timeConfig s:shard1 r:core_node2 x:timeConfig_shard1_replica_n1] o.a.s.s.HttpSolrCall [admin] webapp=null path=/admin/cores params={qt=/admin/cores&coreNodeName=core_node2&collection.configName=timeConfig&newCollection=true&name=timeConfig_shard1_replica_n1&action=CREATE&numShards=1&collection=timeConfig&shard=shard1&wt=javabin&version=2&replicaType=NRT} status=0 QTime=1484
   [junit4]   2> 4428321 INFO  (qtp2047208962-43548) [n:127.0.0.1:51630_solr    ] o.a.s.h.a.CollectionsHandler Wait for new collection to be active for at most 30 seconds. Check all shard replicas
   [junit4]   2> 4428380 INFO  (OverseerCollectionConfigSetProcessor-99278547612532742-127.0.0.1:51630_solr-n_0000000000) [n:127.0.0.1:51630_solr    ] o.a.s.c.OverseerTaskQueue Response ZK path: /overseer/collection-queue-work/qnr-0000000000 doesn't exist.  Requestor may have disconnected from ZooKeeper
   [junit4]   2> 4428414 INFO  (zkCallback-8929-thread-2-processing-n:127.0.0.1:59060_solr) [n:127.0.0.1:59060_solr    ] o.a.s.c.c.ZkStateReader A cluster state change: [WatchedEvent state:SyncConnected type:NodeDataChanged path:/collections/timeConfig/state.json] for collection [timeConfig] has occurred - updating... (live nodes size: [2])
   [junit4]   2> 4428414 INFO  (zkCallback-8929-thread-1-processing-n:127.0.0.1:59060_solr) [n:127.0.0.1:59060_solr    ] o.a.s.c.c.ZkStateReader A cluster state change: [WatchedEvent state:SyncConnected type:NodeDataChanged path:/collections/timeConfig/state.json] for collection [timeConfig] has occurred - updating... (live nodes size: [2])
   [junit4]   2> 4429329 INFO  (qtp2047208962-43548) [n:127.0.0.1:51630_solr    ] o.a.s.s.HttpSolrCall [admin] webapp=null path=/admin/collections params={pullReplicas=0&replicationFactor=1&name=timeConfig&nrtReplicas=1&action=CREATE&numShards=1&tlogReplicas=0&wt=javabin&version=2} status=0 QTime=2959
   [junit4]   2> 4429344 INFO  (qtp102213412-43542) [n:127.0.0.1:59060_solr c:timeConfig s:shard1 r:core_node2 x:timeConfig_shard1_replica_n1] o.a.s.h.SolrConfigHandler Executed config commands successfully and persisted to ZK [{"set-user-property":{"timePartitionAliasName":"myalias"}}, {"set-user-property":{"update.autoCreateFields":false}}, {"add-updateprocessor":{
   [junit4]   2>     "name":"tolerant",
   [junit4]   2>     "class":"solr.TolerantUpdateProcessorFactory"}}, {"add-updateprocessor":{
   [junit4]   2>     "name":"inc",
   [junit4]   2>     "class":"org.apache.solr.update.processor.TimeRoutedAliasUpdateProcessorTest$IncrementURPFactory",
   [junit4]   2>     "fieldName":"integer_i"}}]
   [junit4]   2> 4429344 INFO  (qtp102213412-43542) [n:127.0.0.1:59060_solr c:timeConfig s:shard1 r:core_node2 x:timeConfig_shard1_replica_n1] o.a.s.h.SolrConfigHandler Waiting up to 30 secs for 1 replicas to set the property overlay to be of version 0 for collection timeConfig
   [junit4]   2> 4429346 INFO  (Thread-13481) [n:127.0.0.1:59060_solr    ] o.a.s.c.SolrCore config update listener called for core timeConfig_shard1_replica_n1
   [junit4]   2> 4429349 INFO  (Thread-13481) [n:127.0.0.1:59060_solr    ] o.a.s.c.SolrCore core reload timeConfig_shard1_replica_n1
   [junit4]   2> 4429349 INFO  (solrHandlerExecutor-13134-thread-1-processing-n:127.0.0.1:59060_solr x:timeConfig_shard1_replica_n1 s:shard1 c:timeConfig r:core_node2) [n:127.0.0.1:59060_solr c:timeConfig s:shard1 r:core_node2 x:timeConfig_shard1_replica_n1] o.a.s.h.SolrConfigHandler Time elapsed : 0 secs, maxWait 30
   [junit4]   2> 4429371 INFO  (Thread-13481) [n:127.0.0.1:59060_solr    ] o.a.s.c.RequestParams conf resource params.json loaded . version : 0 
   [junit4]   2> 4429371 INFO  (Thread-13481) [n:127.0.0.1:59060_solr    ] o.a.s.c.RequestParams request params refreshed to version 0
   [junit4]   2> 4429372 WARN  (Thread-13481) [n:127.0.0.1:59060_solr    ] o.a.s.c.SolrConfig Couldn't add files from /export/home/jenkins/workspace/Lucene-Solr-master-Solaris/solr/build/solr-core/test/J1/temp/solr.update.processor.TimeRoutedAliasUpdateProcessorTest_993B753FE04A2474-001/tempDir-001/node2/timeConfig_shard1_replica_n1/../../../../contrib/extraction/lib filtered by .*\.jar to classpath: /export/home/jenkins/workspace/Lucene-Solr-master-Solaris/solr/build/solr-core/test/J1/temp/solr.update.processor.TimeRoutedAliasUpdateProcessorTest_993B753FE04A2474-001/tempDir-001/node2/timeConfig_shard1_replica_n1/../../../../contrib/extraction/lib
   [junit4]   2> 4429372 WARN  (Thread-13481) [n:127.0.0.1:59060_solr    ] o.a.s.c.SolrConfig Couldn't add files from /export/home/jenkins/workspace/Lucene-Solr-master-Solaris/solr/build/solr-core/test/J1/temp/solr.update.processor.TimeRoutedAliasUpdateProcessorTest_993B753FE04A2474-001/tempDir-001/node2/timeConfig_shard1_replica_n1/../../../../dist filtered by solr-cell-\d.*\.jar to classpath: /export/home/jenkins/workspace/Lucene-Solr-master-Solaris/solr/build/solr-core/test/J1/temp/solr.update.processor.TimeRoutedAliasUpdateProcessorTest_993B753FE04A2474-001/tempDir-001/node2/timeConfig_shard1_replica_n1/../../../../dist
   [junit4]   2> 4429373 WARN  (Thread-13481) [n:127.0.0.1:59060_solr    ] o.a.s.c.SolrConfig Couldn't add files from /export/home/jenkins/workspace/Lucene-Solr-master-Solaris/solr/build/solr-core/test/J1/temp/solr.update.processor.TimeRoutedAliasUpdateProcessorTest_993B753FE04A2474-001/tempDir-001/node2/timeConfig_shard1_replica_n1/../../../../contrib/clustering/lib filtered by .*\.jar to classpath: /export/home/jenkins/workspace/Lucene-Solr-master-Solaris/solr/build/solr-core/test/J1/temp/solr.update.processor.TimeRoutedAliasUpdateProcessorTest_993B753FE04A2474-001/tempDir-001/node2/timeConfig_shard1_replica_n1/../../../../contrib/clustering/lib
   [junit4]   2> 4429373 WARN  (Thread-13481) [n:127.0.0.1:59060_solr    ] o.a.s.c.SolrConfig Couldn't add files from /export/home/jenkins/workspace/Lucene-Solr-master-Solaris/solr/build/solr-core/test/J1/temp/solr.update.processor.TimeRoutedAliasUpdateProcessorTest_993B753FE04A2474-001/tempDir-001/node2/timeConfig_shard1_replica_n1/../../../../dist filtered by solr-clustering-\d.*\.jar to classpath: /export/home/jenkins/workspace/Lucene-Solr-master-Solaris/solr/build/solr-core/test/J1/temp/solr.update.processor.TimeRoutedAliasUpdateProcessorTest_993B753FE04A2474-001/tempDir-001/node2/timeConfig_shard1_replica_n1/../../../../dist
   [junit4]   2> 4429373 WARN  (Thread-13481) [n:127.0.0.1:59060_solr    ] o.a.s.c.SolrConfig Couldn't add files from /export/home/jenkins/workspace/Lucene-Solr-master-Solaris/solr/build/solr-core/test/J1/temp/solr.update.processor.TimeRoutedAliasUpdateProcessorTest_993B753FE04A2474-001/tempDir-001/node2/timeConfig_shard1_replica_n1/../../../../contrib/langid/lib filtered by .*\.jar to classpath: /export/home/jenkins/workspace/Lucene-Solr-master-Solaris/solr/build/solr-core/test/J1/temp/solr.update.processor.TimeRoutedAliasUpdateProcessorTest_993B753FE04A2474-001/tempDir-001/node2/timeConfig_shard1_replica_n1/../../../../contrib/langid/lib
   [junit4]   2> 4429373 WARN  (Thread-13481) [n:127.0.0.1:59060_solr    ] o.a.s.c.SolrConfig Couldn't add files from /export/home/jenkins/workspace/Lucene-Solr-master-Solaris/solr/build/solr-core/test/J1/temp/solr.update.processor.TimeRoutedAliasUpdateProcessorTest_993B753FE04A2474-001/tempDir-001/node2/timeConfig_shard1_replica_n1/../../../../dist filtered by solr-langid-\d.*\.jar to classpath: /export/home/jenkins/workspace/Lucene-Solr-master-Solaris/solr/build/solr-core/test/J1/temp/solr.update.processor.TimeRoutedAliasUpdateProcessorTest_993B753FE04A2474-001/tempDir-001/node2/timeConfig_shard1_replica_n1/../../../../dist
   [junit4]   2> 4429374 WARN  (Thread-13481) [n:127.0.0.1:59060_solr    ] o.a.s.c.SolrConfig Couldn't add files from /export/home/jenkins/workspace/Lucene-Solr-master-Solaris/solr/build/solr-core/test/J1/temp/solr.update.processor.TimeRoutedAliasUpdateProcessorTest_993B753FE04A2474-001/tempDir-001/node2/timeConfig_shard1_replica_n1/../../../../contrib/velocity/lib filtered by .*\.jar to classpath: /export/home/jenkins/workspace/Lucene-Solr-master-Solaris/solr/build/solr-core/test/J1/temp/solr.update.processor.TimeRoutedAliasUpdateProcessorTest_993B753FE04A2474-001/tempDir-001/node2/timeConfig_shard1_replica_n1/../../../../contrib/velocity/lib
   [junit4]   2> 4429374 WARN  (Thread-13481) [n:127.0.0.1:59060_solr    ] o.a.s.c.SolrConfig Couldn't add files from /export/home/jenkins/workspace/Lucene-Solr-master-Solaris/solr/build/solr-core/test/J1/temp/solr.update.processor.TimeRoutedAliasUpdateProcessorTest_993B753FE04A2474-001/tempDir-001/node2/timeConfig_shard1_replica_n1/../../../../dist filtered by solr-velocity-\d.*\.jar to classpath: /export/home/jenkins/workspace/Lucene-Solr-master-Solaris/solr/build/solr-core/test/J1/temp/solr.update.processor.TimeRoutedAliasUpdateProcessorTest_993B753FE04A2474-001/tempDir-001/node2/timeConfig_shard1_replica_n1/../../../../dist
   [junit4]   2> 4429383 INFO  (Thread-13481) [n:127.0.0.1:59060_solr    ] o.a.s.c.SolrConfig Using Lucene MatchVersion: 8.0.0
   [junit4]   2> 4429402 INFO  (Thread-13481) [n:127.0.0.1:59060_solr    ] o.a.s.s.IndexSchema [timeConfig_shard1_replica_n1] Schema name=default-config
   [junit4]   2> 4429450 INFO  (qtp102213412-43543) [n:127.0.0.1:59060_solr c:timeConfig s:shard1 r:core_node2 x:timeConfig_shard1_replica_n1] o.a.s.h.SolrConfigHandler expecting overlay version 0 but my version is -1
   [junit4]   2> 4429451 INFO  (qtp102213412-43543) [n:127.0.0.1:59060_solr c:timeConfig s:shard1 r:core_node2 x:timeConfig_shard1_replica_n1] o.a.s.c.S.Request [timeConfig_shard1_replica_n1]  webapp=/solr path=/config/znodeVersion params={overlay=0&wt=javabin&version=2} status=0 QTime=0
   [junit4]   2> 4429451 INFO  (SolrConfigHandler-refreshconf) [n:127.0.0.1:59060_solr c:timeConfig s:shard1 r:core_node2 x:timeConfig_shard1_replica_n1] o.a.s.h.SolrConfigHandler Another reload is in progress . Not doing anything
   [junit4]   2> 4429451 INFO  (solrHandlerExecutor-13134-thread-1-processing-n:127.0.0.1:59060_solr x:timeConfig_shard1_replica_n1 s:shard1 c:timeConfig r:core_node2) [n:127.0.0.1:59060_solr c:timeConfig s:shard1 r:core_node2 x:timeConfig_shard1_replica_n1] o.a.s.h.SolrConfigHandler Could not get expectedVersion 0 from http://127.0.0.1:59060/solr/timeConfig_shard1_replica_n1/ for prop overlay   after 1 attempts
   [junit4]   2> 4429451 INFO  (solrHandlerExecutor-13134-thread-1-processing-n:127.0.0.1:59060_solr x:timeConfig_shard1_replica_n1 s:shard1 c:timeConfig r:core_node2) [n:127.0.0.1:59060_solr c:timeConfig s:shard1 r:core_node2 x:timeConfig_shard1_replica_n1] o.a.s.h.SolrConfigHandler Time elapsed : 0 secs, maxWait 30
   [junit4]   2> 4429552 INFO  (qtp102213412-43544) [n:127.0.0.1:59060_solr c:timeConfig s:shard1 r:core_node2 x:timeConfig_shard1_replica_n1] o.a.s.h.SolrConfigHandler expecting overlay version 0 but my version is -1
   [junit4]   2> 4429552 INFO  (qtp102213412-43544) [n:127.0.0.1:59060_solr c:timeConfig s:shard1 r:core_node2 x:timeConfig_shard1_replica_n1] o.a.s.c.S.Request [timeConfig_shard1_replica_n1]  webapp=/solr path=/config/znodeVersion params={overlay=0&wt=javabin&version=2} status=0 QTime=0
   [junit4]   2> 4429552 INFO  (SolrConfigHandler-refreshconf) [n:127.0.0.1:59060_solr c:timeConfig s:shard1 r:core_node2 x:timeConfig_shard1_replica_n1] o.a.s.h.SolrConfigHandler Another reload is in progress . Not doing anything
   [junit4]   2> 4429553 INFO  (solrHandlerExecutor-13134-thread-1-processing-n:127.0.0.1:59060_solr x:timeConfig_shard1_replica_n1 s:shard1 c:timeConfig r:core_node2) [n:127.0.0.1:59060_solr c:timeConfig s:shard1 r:core_node2 x:timeConfig_shard1_replica_n1] o.a.s.h.SolrConfigHandler Could not get expectedVersion 0 from http://127.0.0.1:59060/solr/timeConfig_shard1_replica_n1/ for prop overlay   after 2 attempts
   [junit4]   2> 4429553 INFO  (solrHandlerExecutor-13134-thread-1-processing-n:127.0.0.1:59060_solr x:timeConfig_shard1_replica_n1 s:shard1 c:timeConfig r:core_node2) [n:127.0.0.1:59060_solr c:timeConfig s:shard1 r:core_node2 x:timeConfig_shard1_replica_n1] o.a.s.h.SolrConfigHandler Time elapsed : 0 secs, maxWait 30
   [junit4]   2> 4429570 INFO  (Thread-13481) [n:127.0.0.1:59060_solr    ] o.a.s.s.IndexSchema Loaded schema default-config/1.6 with uniqueid field id
   [junit4]   2> 4429614 INFO  (Thread-13481) [n:127.0.0.1:59060_solr    ] o.a.s.c.CoreContainer Reloading SolrCore 'timeConfig_shard1_replica_n1' using configuration from collection timeConfig
   [junit4]   2> 4429629 INFO  (Thread-13481) [n:127.0.0.1:59060_solr c:timeConfig s:shard1 r:core_node2 x:timeConfig_shard1_replica_n1] o.a.s.m.r.SolrJmxReporter JMX monitoring for 'solr_59060.solr.core.timeConfig.shard1.replica_n1' (registry 'solr.core.timeConfig.shard1.replica_n1') enabled at server: com.sun.jmx.mbeanserver.JmxMBeanServer@353ac02
   [junit4]   2> 4429629 INFO  (Thread-13481) [n:127.0.0.1:59060_solr c:timeConfig s:shard1 r:core_node2 x:timeConfig_shard1_replica_n1] o.a.s.c.SolrCore [[timeConfig_shard1_replica_n1] ] Opening new SolrCore at [/export/home/jenkins/workspace/Lucene-Solr-master-Solaris/solr/build/solr-core/test/J1/temp/solr.update.processor.TimeRoutedAliasUpdateProcessorTest_993B753FE04A2474-001/tempDir-001/node2/timeConfig_shard1_replica_n1], dataDir=[/export/home/jenkins/workspace/Lucene-Solr-master-Solaris/solr/build/solr-core/test/J1/temp/solr.update.processor.TimeRoutedAliasUpdateProcessorTest_993B753FE04A2474-001/tempDir-001/node2/./timeConfig_shard1_replica_n1/data/]
   [junit4]   2> 4429630 INFO  (Thread-13481) [n:127.0.0.1:59060_solr c:timeConfig s:shard1 r:core_node2 x:timeConfig_shard1_replica_n1] o.a.s.r.XSLTResponseWriter xsltCacheLifetimeSeconds=5
   [junit4]   2> 4429654 INFO  (qtp102213412-43545) [n:127.0.0.1:59060_solr c:timeConfig s:shard1 r:core_node2 x:timeConfig_shard1_replica_n1] o.a.s.h.SolrConfigHandler expecting overlay version 0 but my version is -1
   [junit4]   2> 4429654 INFO  (qtp102213412-43545) [n:127.0.0.1:59060_solr c:timeConfig s:shard1 r:core_node2 x:timeConfig_shard1_replica_n1] o.a.s.c.S.Request [timeConfig_shard1_replica_n1]  webapp=/solr path=/config/znodeVersion params={overlay=0&wt=javabin&version=2} status=0 QTime=0
   [junit4]   2> 4429654 INFO  (SolrConfigHandler-refreshconf) [n:127.0.0.1:59060_solr c:timeConfig s:shard1 r:core_node2 x:timeConfig_shard1_replica_n1] o.a.s.h.SolrConfigHandler Another reload is in progress . Not doing anything
   [junit4]   2> 4429654 INFO  (solrHandlerExecutor-13134-thread-1-processing-n:127.0.0.1:59060_solr x:timeConfig_shard1_replica_n1 s:shard1 c:timeConfig r:core_node2) [n:127.0.0.1:59060_solr c:timeConfig s:shard1 r:core_node2 x:timeConfig_shard1_replica_n1] o.a.s.h.SolrConfigHandler Could not get expectedVersion 0 from http://127.0.0.1:59060/solr/timeConfig_shard1_replica_n1/ for prop overlay   after 3 attempts
   [junit4]   2> 4429654 INFO  (solrHandlerExecutor-13134-thread-1-processing-n:127.0.0.1:59060_solr x:timeConfig_shard1_replica_n1 s:shard1 c:timeConfig r:core_node2) [n:127.0.0.1:59060_solr c:timeConfig s:shard1 r:core_node2 x:timeConfig_shard1_replica_n1] o.a.s.h.SolrConfigHandler Time elapsed : 0 secs, maxWait 30
   [junit4]   2> 4429674 INFO  (Thread-13481) [n:127.0.0.1:59060_solr c:timeConfig s:shard1 r:core_node2 x:timeConfig_shard1_replica_n1] o.a.s.u.CommitTracker Hard AutoCommit: if uncommited for 15000ms; 
   [junit4]   2> 4429674 INFO  (Thread-13481) [n:127.0.0.1:59060_solr c:timeConfig s:shard1 r:core_node2 x:timeConfig_shard1_replica_n1] o.a.s.u.CommitTracker Soft AutoCommit: disabled
   [junit4]   2> 4429675 INFO  (Thread-13481) [n:127.0.0.1:59060_solr c:timeConfig s:shard1 r:core_node2 x:timeConfig_shard1_replica_n1] o.a.s.s.SolrIndexSearcher Opening [Searcher@17c3c9d3[timeConfig_shard1_replica_n1] main]
   [junit4]   2> 4429677 INFO  (Thread-13481) [n:127.0.0.1:59060_solr c:timeConfig s:shard1 r:core_node2 x:timeConfig_shard1_replica_n1] o.a.s.r.ManagedResourceStorage Configured ZooKeeperStorageIO with znodeBase: /configs/timeConfig
   [junit4]   2> 4429677 INFO  (Thread-13481) [n:127.0.0.1:59060_solr c:timeConfig s:shard1 r:core_node2 x:timeConfig_shard1_replica_n1] o.a.s.r.ManagedResourceStorage Loaded null at path _rest_managed.json using ZooKeeperStorageIO:path=/configs/timeConfig
   [junit4]   2> 4429677 INFO  (Thread-13481) [n:127.0.0.1:59060_solr c:timeConfig s:shard1 r:core_node2 x:timeConfig_shard1_replica_n1] o.a.s.s.ZkIndexSchemaReader Creating ZooKeeper watch for the managed schema at /configs/timeConfig/managed-schema
   [junit4]   2> 4429678 INFO  (Thread-13481) [n:127.0.0.1:59060_solr c:timeConfig s:shard1 r:core_node2 x:timeConfig_shard1_replica_n1] o.a.s.s.ZkIndexSchemaReader Current schema version 0 is already the latest
   [junit4]   2> 4429678 INFO  (Thread-13481) [n:127.0.0.1:59060_solr c:timeConfig s:shard1 r:core_node2 x:timeConfig_shard1_replica_n1] o.a.s.h.c.SpellCheckComponent Initializing spell checkers
   [junit4]   2> 4429678 INFO  (Thread-13481) [n:127.0.0.1:59060_solr c:timeConfig s:shard1 r:core_node2 x:timeConfig_shard1_replica_n1] o.a.s.s.DirectSolrSpellChecker init: {name=default,field=_text_,classname=solr.DirectSolrSpellChecker,distanceMeasure=internal,accuracy=0.5,maxEdits=2,minPrefix=1,maxInspections=5,minQueryLength=4,maxQueryFrequency=0.01}
   [junit4]   2> 4429679 INFO  (Thread-13481) [n:127.0.0.1:59060_solr c:timeConfig s:shard1 r:core_node2 x:timeConfig_shard1_replica_n1] o.a.s.h.ReplicationHandler Commits will be reserved for 10000ms.
   [junit4]   2> 4429679 INFO  (Thread-13481) [n:127.0.0.1:59060_solr c:timeConfig s:shard1 r:core_node2 x:timeConfig_shard1_replica_n1] o.a.s.u.UpdateLog Could not find max version in index or recent updates, using new clock 1588456766122754048
   [junit4]   2> 4429679 INFO  (searcherExecutor-13135-thread-1-processing-n:127.0.0.1:59060_solr x:timeConfig_shard1_replica_n1 s:shard1 c:timeConfig r:core_node2) [n:127.0.0.1:59060_solr c:timeConfig s:shard1 r:core_node2 x:timeConfig_shard1_replica_n1] o.a.s.c.QuerySenderListener QuerySenderListener sending requests to Searcher@17c3c9d3[timeConfig_shard1_replica_n1] main{ExitableDirectoryReader(UninvertingDirectoryReader())}
   [junit4]   2> 4429679 INFO  (searcherExecutor-13135-thread-1-processing-n:127.0.0.1:59060_solr x:timeConfig_shard1_replica_n1 s:shard1 c:timeConfig r:core_node2) [n:127.0.0.1:59060_solr c:timeConfig s:shard1 r:core_node2 x:timeConfig_shard1_replica_n1] o.a.s.c.QuerySenderListener QuerySenderListener done.
   [junit4]   2> 4429679 INFO  (searcherExecutor-13135-thread-1-processing-n:127.0.0.1:59060_solr x:timeConfig_shard1_replica_n1 s:shard1 c:timeConfig r:core_node2) [n:127.0.0.1:59060_solr c:timeConfig s:shard1 r:core_node2 x:timeConfig_shard1_replica_n1] o.a.s.h.c.SpellCheckComponent Loading spell index for spellchecker: default
   [junit4]   2> 4429683 INFO  (Thread-13481) [n:127.0.0.1:59060_solr c:timeConfig s:shard1 r:core_node2 x:timeConfig_shard1_replica_n1] o.a.s.u.DefaultSolrCoreState New IndexWriter is ready to be used.
   [junit4]   2> 4429684 INFO  (searcherExecutor-13135-thread-1-processing-n:127.0.0.1:59060_solr x:timeConfig_shard1_replica_n1 s:shard1 c:timeConfig r:core_node2) [n:127.0.0.1:59060_solr c:timeConfig s:shard1 r:core_node2 x:timeConfig_shard1_replica_n1] o.a.s.c.SolrCore [timeConfig_shard1_replica_n1] Registered new searcher Searcher@17c3c9d3[timeConfig_shard1_replica_n1] main{ExitableDirectoryReader(UninvertingDirectoryReader())}
   [junit4]   2> 4429684 INFO  (Thread-13481) [n:127.0.0.1:59060_solr c:timeConfig s:shard1 r:core_node2 x:timeConfig_shard1_replica_n1] o.a.s.s.SolrIndexSearcher Opening [Searcher@78116f6f[timeConfig_shard1_replica_n1] main]
   [junit4]   2> 4429684 INFO  (searcherExecutor-13135-thread-1-processing-n:127.0.0.1:59060_solr x:timeConfig_shard1_replica_n1 s:shard1 c:timeConfig r:core_node2) [n:127.0.0.1:59060_solr c:timeConfig s:shard1 r:core_node2 x:timeConfig_shard1_replica_n1] o.a.s.c.QuerySenderListener QuerySenderListener sending requests to Searcher@78116f6f[timeConfig_shard1_replica_n1] main{ExitableDirectoryReader(UninvertingDirectoryReader())}
   [junit4]   2> 4429684 INFO  (searcherExecutor-13135-thread-1-processing-n:127.0.0.1:59060_solr x:timeConfig_shard1_replica_n1 s:shard1 c:timeConfig r:core_node2) [n:127.0.0.1:59060_solr c:timeConfig s:shard1 r:core_node2 x:timeConfig_shard1_replica_n1] o.a.s.c.QuerySenderListener QuerySenderListener done.
   [junit4]   2> 4429686 INFO  (searcherExecutor-13135-thread-1-processing-n:127.0.0.1:59060_solr x:timeConfig_shard1_replica_n1 s:shard1 c:timeConfig r:core_node2) [n:127.0.0.1:59060_solr c:timeConfig s:shard1 r:core_node2 x:timeConfig_shard1_replica_n1] o.a.s.c.SolrCore [timeConfig_shard1_replica_n1] Registered new searcher Searcher@78116f6f[timeConfig_shard1_replica_n1] main{ExitableDirectoryReader(UninvertingDirectoryReader())}
   [junit4]   2> 4429755 INFO  (qtp102213412-43538) [n:127.0.0.1:59060_solr c:timeConfig s:shard1 r:core_node2 x:timeConfig_shard1_replica_n1] o.a.s.h.SolrConfigHandler I already have the expected version 0 of config
   [junit4]   2> 4429755 INFO  (qtp102213412-43538) [n:127.0.0.1:59060_solr c:timeConfig s:shard1 r:core_node2 x:timeConfig_shard1_replica_n1] o.a.s.h.SolrConfigHandler isStale false , resourceloader org.apache.solr.cloud.ZkSolrResourceLoader
   [junit4]   2> 4429755 INFO  (qtp102213412-43538) [n:127.0.0.1:59060_solr c:timeConfig s:shard1 r:core_node2 x:timeConfig_shard1_replica_n1] o.a.s.c.S.Request [timeConfig_shard1_replica_n1]  webapp=/solr path=/config/znodeVersion params={overlay=0&wt=javabin&version=2} status=0 QTime=0
   [junit4]   2> 4429756 INFO  (qtp102213412-43542) [n:127.0.0.1:59060_solr c:timeConfig s:shard1 r:core_node2 x:timeConfig_shard1_replica_n1] o.a.s.h.SolrConfigHandler Took 411.0ms to set the property overlay to be of version 0 for collection timeConfig
   [junit4]   2> 4429756 INFO  (qtp102213412-43542) [n:127.0.0.1:59060_solr c:timeConfig s:shard1 r:core_node2 x:timeConfig_shard1_replica_n1] o.a.s.c.S.Request [timeConfig_shard1_replica_n1]  webapp=/solr path=/config params={wt=javabin&version=2} status=0 QTime=417
   [junit4]   2> 4429756 INFO  (qtp102213412-43542) [n:127.0.0.1:59060_solr c:timeConfig s:shard1 r:core_node2 x:timeConfig_shard1_replica_n1] o.a.s.c.SolrCore [timeConfig_shard1_replica_n1]  CLOSING SolrCore org.apache.solr.core.SolrCore@301b413d
   [junit4]   2> 4429756 INFO  (qtp102213412-43542) [n:127.0.0.1:59060_solr c:timeConfig s:shard1 r:core_node2 x:timeConfig_shard1_replica_n1] o.a.s.m.SolrMetricManager Closing metric reporters for registry=solr.core.timeConfig.shard1.replica_n1, tag=807092541
   [junit4]   2> 4429756 INFO  (qtp102213412-43542) [n:127.0.0.1:59060_solr c:timeConfig s:shard1 r:core_node2 x:timeConfig_shard1_replica_n1] o.a.s.m.r.SolrJmxReporter Closing reporter [org.apache.solr.metrics.reporters.SolrJmxReporter@4e25e602: rootName = solr_59060, domain = solr.core.timeConfig.shard1.replica_n1, service url = null, agent id = null] for registry solr.core.timeConfig.shard1.replica_n1 / com.codahale.metrics.MetricRegistry@716f7ee0
   [junit4]   2> 4429760 INFO  (qtp102213412-43542) [n:127.0.0.1:59060_solr c:timeConfig s:shard1 r:core_node2 x:timeConfig_shard1_replica_n1] o.a.s.m.SolrMetricManager Closing metric reporters for registry=solr.collection.timeConfig.shard1.leader, tag=807092541
   [junit4]   2> 4429779 INFO  (qtp102213412-43540) [n:127.0.0.1:59060_solr c:timeConfig s:shard1 r:core_node2 x:timeConfig_shard1_replica_n1] o.a.s.c.ZkController Persisted config data to node /configs/timeConfig/params.json 
   [junit4]   2> 4429779 INFO  (qtp102213412-43540) [n:127.0.0.1:59060_solr c:timeConfig s:shard1 r:core_node2 x:timeConfig_shard1_replica_n1] o.a.s.h.SolrConfigHandler Waiting up to 30 secs for 1 replicas to set the property params to be of version 1 for collection timeConfig
   [junit4]   2> 4429780 INFO  (Thread-13482) [n:127.0.0.1:59060_solr    ] o.a.s.c.SolrCore config update listener called for core timeConfig_shard1_replica_n1
   [junit4]   2> 4429781 INFO  (solrHandlerExecutor-13139-thread-1-processing-n:127.0.0.1:59060_solr x:timeConfig_shard1_replica_n1 s:shard1 c:timeConfig r:core_node2) [n:127.0.0.1:59060_solr c:timeConfig s:shard1 r:core_node2 x:timeConfig_shard1_replica_n1] o.a.s.h.SolrConfigHandler Time elapsed : 0 secs, maxWait 30
   [junit4]   2> 4429781 INFO  (Thread-13482) [n:127.0.0.1:59060_solr    ] o.a.s.c.RequestParams conf resource params.json loaded . version : 1 
   [junit4]   2> 4429781 INFO  (Thread-13482) [n:127.0.0.1:59060_solr    ] o.a.s.c.RequestParams request params refreshed to version 1
   [junit4]   2> 4429882 INFO  (qtp102213412-43544) [n:127.0.0.1:59060_solr c:timeConfig s:shard1 r:core_node2 x:timeConfig_shard1_replica_n1] o.a.s.h.SolrConfigHandler I already have the expected version 1 of params
   [junit4]   2> 4429882 INFO  (qtp102213412-43544) [n:127.0.0.1:59060_solr c:timeConfig s:shard1 r:core_node2 x:timeConfig_shard1_replica_n1] o.a.s.h.SolrConfigHandler isStale false , resourceloader org.apache.solr.cloud.ZkSolrResourceLoader
   [junit4]   2> 4429882 INFO  (qtp102213412-43544) [n:127.0.0.1:59060_solr c:timeConfig s:shard1 r:core_node2 x:timeConfig_shard1_replica_n1] o.a.s.c.S.Request [timeConfig_shard1_replica_n1]  webapp=/solr path=/config/znodeVersion params={params=1&wt=javabin&version=2} status=0 QTime=0
   [junit4]   2> 4429883 INFO  (qtp102213412-43540) [n:127.0.0.1:59060_solr c:timeConfig s:shard1 r:core_node2 x:timeConfig_shard1_replica_n1] o.a.s.h.SolrConfigHandler Took 103.0ms to set the property params to be of version 1 for collection timeConfig
   [junit4]   2> 4429883 INFO  (qtp102213412-43540) [n:127.0.0.1:59060_solr c:timeConfig s:shard1 r:core_node2 x:timeConfig_shard1_replica_n1] o.a.s.c.S.Request [timeConfig_shard1_replica_n1]  webapp=/solr path=/config/params params={wt=javabin&version=2} status=0 QTime=105
   [junit4]   2> 4429884 INFO  (qtp2047208962-43551) [n:127.0.0.1:51630_solr    ] o.a.s.h.a.CollectionsHandler Invoked Collection Action :delete with params name=timeConfig&action=DELETE&wt=javabin&version=2 and sendToOCPQueue=true
   [junit4]   2> 4429890 INFO  (OverseerThreadFactory-13124-thread-2-processing-n:127.0.0.1:51630_solr) [n:127.0.0.1:51630_solr    ] o.a.s.c.OverseerCollectionMessageHandler Executing Collection Cmd : action=UNLOAD&deleteInstanceDir=true&deleteDataDir=true
   [junit4]   2> 4429891 INFO  (qtp102213412-43545) [n:127.0.0.1:59060_solr    ] o.a.s.m.SolrMetricManager Closing metric reporters for registry=solr.core.timeConfig.shard1.replica_n1, tag=null
   [junit4]   2> 4429891 INFO  (qtp102213412-43545) [n:127.0.0.1:59060_solr    ] o.a.s.m.r.SolrJmxReporter Closing reporter [org.apache.solr.metrics.reporters.SolrJmxReporter@6ce92b75: rootName = solr_59060, domain = solr.core.timeConfig.shard1.replica_n1, service url = null, agent id = null] for registry solr.core.timeConfig.shard1.replica_n1 / com.codahale.metrics.MetricRegistry@716f7ee0
   [junit4]   2> 4429896 INFO  (qtp102213412-43545) [n:127.0.0.1:59060_solr    ] o.a.s.c.SolrCore [timeConfig_shard1_replica_n1]  CLOSING SolrCore org.apache.solr.core.SolrCore@56b4529d
   [junit4]   2> 4429896 INFO  (qtp102213412-43545) [n:127.0.0.1:59060_solr    ] o.a.s.m.SolrMetricManager Closing metric reporters for registry=solr.core.timeConfig.shard1.replica_n1, tag=1454658205
   [junit4]   2> 4429896 INFO  (qtp102213412-43545) [n:127.0.0.1:59060_solr    ] o.a.s.m.SolrMetricManager Closing metric reporters for registry=solr.collection.timeConfig.shard1.leader, tag=1454658205
   [junit4]   2> 4429902 INFO  (qtp102213412-43545) [n:127.0.0.1:59060_solr    ] o.a.s.s.HttpSolrCall [admin] webapp=null path=/admin/cores params={deleteInstanceDir=true&core=timeConfig_shard1_replica_n1&qt=/admin/cores&deleteDataDir=true&action=UNLOAD&wt=javabin&version=2} status=0 QTime=12
   [junit4]   2> 4430611 INFO  (qtp2047208962-43551) [n:127.0.0.1:51630_solr    ] o.a.s.s.HttpSolrCall [admin] webapp=null path=/admin/collections params={name=timeConfig&action=DELETE&wt=javabin&version=2} status=0 QTime=727
   [junit4]   2> 4430612 INFO  (qtp2047208962-43552) [n:127.0.0.1:51630_solr    ] o.a.s.h.a.CollectionsHandler Invoked Collection Action :create with params replicationFactor=1&property.timePartitionAliasName=myalias&collection.configName=timeConfig&name=myalias_2017-10-23&nrtReplicas=1&action=CREATE&numShards=1&wt=javabin&version=2 and sendToOCPQueue=true
   [junit4]   2> 4430615 INFO  (OverseerThreadFactory-13124-thread-3-processing-n:127.0.0.1:51630_solr) [n:127.0.0.1:51630_solr    ] o.a.s.c.CreateCollectionCmd Create collection myalias_2017-10-23
   [junit4]   2> 4430616 INFO  (OverseerCollectionConfigSetProcessor-99278547612532742-127.0.0.1:51630_solr-n_0000000000) [n:127.0.0.1:51630_solr    ] o.a.s.c.OverseerTaskQueue Response ZK path: /overseer/collection-queue-work/qnr-0000000002 doesn't exist.  Requestor may have disconnected from ZooKeeper
   [junit4]   2> 4430830 INFO  (OverseerStateUpdate-99278547612532742-127.0.0.1:51630_solr-n_0000000000) [n:127.0.0.1:51630_solr    ] o.a.s.c.o.SliceMutator createReplica() {
   [junit4]   2>   "operation":"ADDREPLICA",
   [junit4]   2>   "collection":"myalias_2017-10-23",
   [junit4]   2>   "shard":"shard1",
   [junit4]   2>   "core":"myalias_2017-10-23_shard1_replica_n1",
   [junit4]   2>   "state":"down",
   [junit4]   2>   "base_url":"http://127.0.0.1:51630/solr",
   [junit4]   2>   "type":"NRT",
   [junit4]   2>   "waitForFinalState":"false"} 
   [junit4]   2> 4431032 INFO  (qtp2047208962-43546) [n:127.0.0.1:51630_solr    ] o.a.s.h.a.CoreAdminOperation core create command qt=/admin/cores&collection.configName=timeConfig&newCollection=true&collection=myalias_2017-10-23&version=2&replicaType=NRT&coreNodeName=core_node2&property.timePartitionAliasName=myalias&name=myalias_2017-10-23_shard1_replica_n1&action=CREATE&numShards=1&shard=shard1&wt=javabin
   [junit4]   2> 4431033 INFO  (qtp2047208962-43546) [n:127.0.0.1:51630_solr    ] o.a.s.c.TransientSolrCoreCacheDefault Allocating transient cache for 2147483647 transient cores
   [junit4]   2> 4431138 INFO  (zkCallback-8931-thread-2-processing-n:127.0.0.1:51630_solr) [n:127.0.0.1:51630_solr    ] o.a.s.c.c.ZkStateReader A cluster state change: [WatchedEvent state:SyncConnected type:NodeDataChanged path:/collections/myalias_2017-10-23/state.json] for collection [myalias_2017-10-23] has occurred - updating... (live nodes size: [2])
   [junit4]   2> 4431138 INFO  (zkCallback-8931-thread-1-processing-n:127.0.0.1:51630_solr) [n:127.0.0.1:51630_solr    ] o.a.s.c.c.ZkStateReader A cluster state change: [WatchedEvent state:SyncConnected type:NodeDataChanged path:/collections/myalias_2017-10-23/state.json] for collection [myalias_2017-10-23] has occurred - updating... (live nodes size: [2])
   [junit4]   2> 4432059 INFO  (qtp2047208962-43546) [n:127.0.0.1:51630_solr c:myalias_2017-10-23 s:shard1 r:core_node2 x:myalias_2017-10-23_shard1_replica_n1] o.a.s.c.RequestParams conf resource params.json loaded . version : 1 
   [junit4]   2> 4432059 INFO  (qtp2047208962-43546) [n:127.0.0.1:51630_solr c:myalias_2017-10-23 s:shard1 r:core_node2 x:myalias_2017-10-23_shard1_replica_n1] o.a.s.c.RequestParams request params refreshed to version 1
   [junit4]   2> 4432060 WARN  (qtp2047208962-43546) [n:127.0.0.1:51630_solr c:myalias_2017-10-23 s:shard1 r:core_node2 x:myalias_2017-10-23_shard1_replica_n1] o.a.s.c.SolrConfig Couldn't add files from /export/home/jenkins/workspace/Lucene-Solr-master-Solaris/solr/build/solr-core/test/J1/temp/solr.update.processor.TimeRoutedAliasUpdateProcessorTest_993B753FE04A2474-001/tempDir-001/node1/myalias_2017-10-23_shard1_replica_n1/../../../../contrib/extraction/lib filtered by .*\.jar to classpath: /export/home/jenkins/workspace/Lucene-Solr-master-Solaris/solr/build/solr-core/test/J1/temp/solr.update.processor.TimeRoutedAliasUpdateProcessorTest_993B753FE04A2474-001/tempDir-001/node1/myalias_2017-10-23_shard1_replica_n1/../../../../contrib/extraction/lib
   [junit4]   2> 4432060 WARN  (qtp2047208962-43546) [n:127.0.0.1:51630_solr c:myalias_2017-10-23 s:shard1 r:core_node2 x:myalias_2017-10-23_shard1_replica_n1] o.a.s.c.SolrConfig Couldn't add files from /export/home/jenkins/workspace/Lucene-Solr-master-Solaris/solr/build/solr-core/test/J1/temp/solr.update.processor.TimeRoutedAliasUpdateProcessorTest_993B753FE04A2474-001/tempDir-001/node1/myalias_2017-10-23_shard1_replica_n1/../../../../dist filtered by solr-cell-\d.*\.jar to classpath: /export/home/jenkins/workspace/Lucene-Solr-master-Solaris/solr/build/solr-core/test/J1/temp/solr.update.processor.TimeRoutedAliasUpdateProcessorTest_993B753FE04A2474-001/tempDir-001/node1/myalias_2017-10-23_shard1_replica_n1/../../../../dist
   [junit4]   2> 4432061 WARN  (qtp2047208962-43546) [n:127.0.0.1:51630_solr c:myalias_2017-10-23 s:shard1 r:core_node2 x:myalias_2017-10-23_shard1_replica_n1] o.a.s.c.SolrConfig Couldn't add files from /export/home/jenkins/workspace/Lucene-Solr-master-Solaris/solr/build/solr-core/test/J1/temp/solr.update.processor.TimeRoutedAliasUpdateProcessorTest_993B753FE04A2474-001/tempDir-001/node1/myalias_2017-10-23_shard1_replica_n1/../../../../contrib/clustering/lib filtered by .*\.jar to classpath: /export/home/jenkins/workspace/Lucene-Solr-master-Solaris/solr/build/solr-core/test/J1/temp/solr.update.processor.TimeRoutedAliasUpdateProcessorTest_993B753FE04A2474-001/tempDir-001/node1/myalias_2017-10-23_shard1_replica_n1/../../../../contrib/clustering/lib
   [junit4]   2> 4432061 WARN  (qtp2047208962-43546) [n:127.0.0.1:51630_solr c:myalias_2017-10-23 s:shard1 r:core_node2 x:myalias_2017-10-23_shard1_replica_n1] o.a.s.c.SolrConfig Couldn't add files from /export/home/jenkins/workspace/Lucene-Solr-master-Solaris/solr/build/solr-core/test/J1/temp/solr.update.processor.TimeRoutedAliasUpdateProcessorTest_993B753FE04A2474-001/tempDir-001/node1/myalias_2017-10-23_shard1_replica_n1/../../../../dist filtered by solr-clustering-\d.*\.jar to classpath: /export/home/jenkins/workspace/Lucene-Solr-master-Solaris/solr/build/solr-core/test/J1/temp/solr.update.processor.TimeRoutedAliasUpdateProcessorTest_993B753FE04A2474-001/tempDir-001/node1/myalias_2017-10-23_shard1_replica_n1/../../../../dist
   [junit4]   2> 4432061 WARN  (qtp2047208962-43546) [n:127.0.0.1:51630_solr c:myalias_2017-10-23 s:shard1 r:core_node2 x:myalias_2017-10-23_shard1_replica_n1] o.a.s.c.SolrConfig Couldn't add files from /export/home/jenkins/workspace/Lucene-Solr-master-Solaris/solr/build/solr-core/test/J1/temp/solr.update.processor.TimeRoutedAliasUpdateProcessorTest_993B753FE04A2474-001/tempDir-001/node1/myalias_2017-10-23_shard1_replica_n1/../../../../contrib/langid/lib filtered by .*\.jar to classpath: /export/home/jenkins/workspace/Lucene-Solr-master-Solaris/solr/build/solr-core/test/J1/temp/solr.update.processor.TimeRoutedAliasUpdateProcessorTest_993B753FE04A2474-001/tempDir-001/node1/myalias_2017-10-23_shard1_replica_n1/../../../../contrib/langid/lib
   [junit4]   2> 4432062 WARN  (qtp2047208962-43546) [n:127.0.0.1:51630_solr c:myalias_2017-10-23 s:shard1 r:core_node2 x:myalias_2017-10-23_shard1_replica_n1] o.a.s.c.SolrConfig Couldn't add files from /export/home/jenkins/workspace/Lucene-Solr-master-Solaris/solr/build/solr-core/test/J1/temp/solr.update.processor.TimeRoutedAliasUpdateProcessorTest_993B753FE04A2474-001/tempDir-001/node1/myalias_2017-10-23_shard1_replica_n1/../../../../dist filtered by solr-langid-\d.*\.jar to classpath: /export/home/jenkins/workspace/Lucene-Solr-master-Solaris/solr/build/solr-core/test/J1/temp/solr.update.processor.TimeRoutedAliasUpdateProcessorTest_993B753FE04A2474-001/tempDir-001/node1/myalias_2017-10-23_shard1_replica_n1/../../../../dist
   [junit4]   2> 4432062 WARN  (qtp2047208962-43546) [n:127.0.0.1:51630_solr c:myalias_2017-10-23 s:shard1 r:core_node2 x:myalias_2017-10-23_shard1_replica_n1] o.a.s.c.SolrConfig Couldn't add files from /export/home/jenkins/workspace/Lucene-Solr-master-Solaris/solr/build/solr-core/test/J1/temp/solr.update.processor.TimeRoutedAliasUpdateProcessorTest_993B753FE04A2474-001/tempDir-001/node1/myalias_2017-10-23_shard1_replica_n1/../../../../contrib/velocity/lib filtered by .*\.jar to classpath: /export/home/jenkins/workspace/Lucene-Solr-master-Solaris/solr/build/solr-core/test/J1/temp/solr.update.processor.TimeRoutedAliasUpdateProcessorTest_993B753FE04A2474-001/tempDir-001/node1/myalias_2017-10-23_shard1_replica_n1/../../../../contrib/velocity/lib
   [junit4]   2> 4432062 WARN  (qtp2047208962-43546) [n:127.0.0.1:51630_solr c:myalias_2017-10-23 s:shard1 r:core_node2 x:myalias_2017-10-23_shard1_replica_n1] o.a.s.c.SolrConfig Couldn't add files from /export/home/jenkins/workspace/Lucene-Solr-master-Solaris/solr/build/solr-core/test/J1/temp/solr.update.processor.TimeRoutedAliasUpdateProcessorTest_993B753FE04A2474-001/tempDir-001/node1/myalias_2017-10-23_shard1_replica_n1/../../../../dist filtered by solr-velocity-\d.*\.jar to classpath: /export/home/jenkins/workspace/Lucene-Solr-master-Solaris/solr/build/solr-core/test/J1/temp/solr.update.processor.TimeRoutedAliasUpdateProcessorTest_993B753FE04A2474-001/tempDir-001/node1/myalias_2017-10-23_shard1_replica_n1/../../../../dist
   [junit4]   2> 4432075 INFO  (qtp2047208962-43546) [n:127.0.0.1:51630_solr c:myalias_2017-10-23 s:shard1 r:core_node2 x:myalias_2017-10-23_shard1_replica_n1] o.a.s.c.SolrConfig Using Lucene MatchVersion: 8.0.0
   [junit4]   2> 4432099 INFO  (qtp2047208962-43546) [n:127.0.0.1:51630_solr c:myalias_2017-10-23 s:shard1 r:core_node2 x:myalias_2017-10-23_shard1_replica_n1] o.a.s.s.IndexSchema [myalias_2017-10-23_shard1_replica_n1] Schema name=default-config
   [junit4]   2> 4432236 INFO  (qtp2047208962-43546) [n:127.0.0.1:51630_solr c:myalias_2017-10-23 s:shard1 r:core_node2 x:myalias_2017-10-23_shard1_replica_n1] o.a.s.s.IndexSchema Loaded schema default-config/1.6 with uniqueid field id
   [junit4]   2> 4432277 INFO  (qtp2047208962-43546) [n:127.0.0.1:51630_solr c:myalias_2017-10-23 s:shard1 r:core_node2 x:myalias_2017-10-23_shard1_replica_n1] o.a.s.c.CoreContainer Creating SolrCore 'myalias_2017-10-23_shard1_replica_n1' using configuration from collection myalias_2017-10-23, trusted=true
   [junit4]   2> 4432278 INFO  (qtp2047208962-43546) [n:127.0.0.1:51630_solr c:myalias_2017-10-23 s:shard1 r:core_node2 x:myalias_2017-10-23_shard1_replica_n1] o.a.s.m.r.SolrJmxReporter JMX monitoring for 'solr_51630.solr.core.myalias_2017-10-23.shard1.replica_n1' (registry 'solr.core.myalias_2017-10-23.shard1.replica_n1') enabled at server: com.sun.jmx.mbeanserver.JmxMBeanServer@353ac02
   [junit4]   2> 4432278 INFO  (qtp2047208962-43546) [n:127.0.0.1:51630_solr c:myalias_2017-10-23 s:shard1 r:core_node2 x:myalias_2017-10-23_shard1_replica_n1] o.a.s.c.SolrCore solr.RecoveryStrategy.Builder
   [junit4]   2> 4432278 INFO  (qtp2047208962-43546) [n:127.0.0.1:51630_solr c:myalias_2017-10-23 s:shard1 r:core_node2 x:myalias_2017-10-23_shard1_replica_n1] o.a.s.c.SolrCore [[myalias_2017-10-23_shard1_replica_n1] ] Opening new SolrCore at [/export/home/jenkins/workspace/Lucene-Solr-master-Solaris/solr/build/solr-core/test/J1/temp/solr.update.processor.TimeRoutedAliasUpdateProcessorTest_993B753FE04A2474-001/tempDir-001/node1/myalias_2017-10-23_shard1_replica_n1], dataDir=[/export/home/jenkins/workspace/Lucene-Solr-master-Solaris/solr/build/solr-core/test/J1/temp/solr.update.processor.TimeRoutedAliasUpdateProcessorTest_993B753FE04A2474-001/tempDir-001/node1/./myalias_2017-10-23_shard1_replica_n1/data/]
   [junit4]   2> 4432280 INFO  (qtp2047208962-43546) [n:127.0.0.1:51630_solr c:myalias_2017-10-23 s:shard1 r:core_node2 x:myalias_2017-10-23_shard1_replica_n1] o.a.s.r.XSLTResponseWriter xsltCacheLifetimeSeconds=5
   [junit4]   2> 4432324 INFO  (qtp2047208962-43546) [n:127.0.0.1:51630_solr c:myalias_2017-10-23 s:shard1 r:core_node2 x:myalias_2017-10-23_shard1_replica_n1] o.a.s.u.UpdateHandler Using UpdateLog implementation: org.apache.solr.update.UpdateLog
   [junit4]   2> 4432324 INFO  (qtp2047208962-43546) [n:127.0.0.1:51630_solr c:myalias_2017-10-23 s:shard1 r:core_node2 x:myalias_2017-10-23_shard1_replica_n1] o.a.s.u.UpdateLog Initializing UpdateLog: dataDir= defaultSyncLevel=FLUSH numRecordsToKeep=100 maxNumLogsToKeep=10 numVersionBuckets=65536
   [junit4]   2> 4432325 INFO  (qtp2047208962-43546) [n:127.0.0.1:51630_solr c:myalias_2017-10-23 s:shard1 r:core_node2 x:myalias_2017-10-23_shard1_replica_n1] o.a.s.u.CommitTracker Hard AutoCommit: if uncommited for 15000ms; 
   [junit4]   2> 4432325 INFO  (qtp2047208962-43546) [n:127.0.0.1:51630_solr c:myalias_2017-10-23 s:shard1 r:core_node2 x:myalias_2017-10-23_shard1_replica_n1] o.a.s.u.CommitTracker Soft AutoCommit: disabled
   [junit4]   2> 4432326 INFO  (qtp2047208962-43546) [n:127.0.0.1:51630_solr c:myalias_2017-10-23 s:shard1 r:core_node2 x:myalias_2017-10-23_shard1_replica_n1] o.a.s.s.SolrIndexSearcher Opening [Searcher@4fac6b6e[myalias_2017-10-23_shard1_replica_n1] main]
   [junit4]   2> 4432328 INFO  (qtp2047208962-43546) [n:127.0.0.1:51630_solr c:myalias_2017-10-23 s:shard1 r:core_node2 x:myalias_2017-10-23_shard1_replica_n1] o.a.s.r.ManagedResourceStorage Configured ZooKeeperStorageIO with znodeBase: /configs/timeConfig
   [junit4]   2> 4432328 INFO  (qtp2047208962-43546) [n:127.0.0.1:51630_solr c:myalias_2017-10-23 s:shard1 r:core_node2 x:myalias_2017-10-23_shard1_replica_n1] o.a.s.r.ManagedResourceStorage Loaded null at path _rest_managed.json using ZooKeeperStorageIO:path=/configs/timeConfig
   [junit4]   2> 4432328 INFO  (qtp2047208962-43546) [n:127.0.0.1:51630_solr c:myalias_2017-10-23 s:shard1 r:core_node2 x:myalias_2017-10-23_shard1_replica_n1] o.a.s.s.ZkIndexSchemaReader Creating ZooKeeper watch for the managed schema at /configs/timeConfig/managed-schema
   [junit4]   2> 4432329 INFO  (qtp2047208962-43546) [n:127.0.0.1:51630_solr c:myalias_2017-10-23 s:shard1 r:core_node2 x:myalias_2017-10-23_shard1_replica_n1] o.a.s.s.ZkIndexSchemaReader Current schema version 0 is already the latest
   [junit4]   2> 4432329 INFO  (qtp2047208962-43546) [n:127.0.0.1:51630_solr c:myalias_2017-10-23 s:shard1 r:core_node2 x:myalias_2017-10-23_shard1_replica_n1] o.a.s.h.c.SpellCheckComponent Initializing spell checkers
   [junit4]   2> 4432329 INFO  (qtp2047208962-43546) [n:127.0.0.1:51630_solr c:myalias_2017-10-23 s:shard1 r:core_node2 x:myalias_2017-10-23_shard1_replica_n1] o.a.s.s.DirectSolrSpellChecker init: {name=default,field=_text_,classname=solr.DirectSolrSpellChecker,distanceMeasure=internal,accuracy=0.5,maxEdits=2,minPrefix=1,maxInspections=5,minQueryLength=4,maxQueryFrequency=0.01}
   [junit4]   2> 4432331 INFO  (qtp2047208962-43546) [n:127.0.0.1:51630_solr c:myalias_2017-10-23 s:shard1 r:core_node2 x:myalias_2017-10-23_shard1_replica_n1] o.a.s.h.ReplicationHandler Commits will be reserved for 10000ms.
   [junit4]   2> 4432331 INFO  (qtp2047208962-43546) [n:127.0.0.1:51630_solr c:myalias_2017-10-23 s:shard1 r:core_node2 x:myalias_2017-10-23_shard1_replica_n1] o.a.s.u.UpdateLog Could not find max version in index or recent updates, using new clock 1588456768903577600
   [junit4]   2> 4432331 INFO  (searcherExecutor-13140-thread-1-processing-n:127.0.0.1:51630_solr x:myalias_2017-10-23_shard1_replica_n1 s:shard1 c:myalias_2017-10-23 r:core_node2) [n:127.0.0.1:51630_solr c:myalias_2017-10-23 s:shard1 r:core_node2 x:myalias_2017-10-23_shard1_replica_n1] o.a.s.c.QuerySenderListener QuerySenderListener sending requests to Searcher@4fac6b6e[myalias_2017-10-23_shard1_replica_n1] main{ExitableDirectoryReader(UninvertingDirectoryReader())}
   [junit4]   2> 4432331 INFO  (searcherExecutor-13140-thread-1-processing-n:127.0.0.1:51630_solr x:myalias_2017-10-23_shard1_replica_n1 s:shard1 c:myalias_2017-10-23 r:core_node2) [n:127.0.0.1:51630_solr c:myalias_2017-10-23 s:shard1 r:core_node2 x:myalias_2017-10-23_shard1_replica_n1] o.a.s.c.QuerySenderListener QuerySenderListener done.
   [junit4]   2> 4432331 INFO  (searcherExecutor-13140-thread-1-processing-n:127.0.0

[...truncated too long message...]

.Thread.run(Thread.java:748)
   [junit4]   2> 4433823 INFO  (jetty-closer-8914-thread-1) [    ] o.e.j.s.h.ContextHandler Stopped o.e.j.s.ServletContextHandler@38e6458b{/solr,null,UNAVAILABLE}
   [junit4]   2> 4433824 ERROR (SUITE-TimeRoutedAliasUpdateProcessorTest-seed#[993B753FE04A2474]-worker) [    ] o.a.z.s.ZooKeeperServer ZKShutdownHandler is not registered, so ZooKeeper server won't take any action on ERROR or SHUTDOWN server state changes
   [junit4]   2> 4433825 INFO  (SUITE-TimeRoutedAliasUpdateProcessorTest-seed#[993B753FE04A2474]-worker) [    ] o.a.s.c.ZkTestServer connecting to 127.0.0.1:33055 33055
   [junit4]   2> 4444074 INFO  (Thread-13462) [    ] o.a.s.c.ZkTestServer connecting to 127.0.0.1:33055 33055
   [junit4]   2> 4444083 WARN  (Thread-13462) [    ] o.a.s.c.ZkTestServer Watch limit violations: 
   [junit4]   2> Maximum concurrent create/delete watches above limit:
   [junit4]   2> 
   [junit4]   2> 	4	/solr/aliases.json
   [junit4]   2> 	4	/solr/clusterprops.json
   [junit4]   2> 	4	/solr/configs/timeConfig
   [junit4]   2> 	3	/solr/configs/timeConfig/managed-schema
   [junit4]   2> 	2	/solr/security.json
   [junit4]   2> 
   [junit4]   2> Maximum concurrent data watches above limit:
   [junit4]   2> 
   [junit4]   2> 	5	/solr/collections/timeConfig/state.json
   [junit4]   2> 	5	/solr/collections/myalias_2017-10-23/state.json
   [junit4]   2> 	4	/solr/clusterstate.json
   [junit4]   2> 
   [junit4]   2> Maximum concurrent children watches above limit:
   [junit4]   2> 
   [junit4]   2> 	4	/solr/live_nodes
   [junit4]   2> 	4	/solr/collections
   [junit4]   2> 
   [junit4]   2> NOTE: leaving temporary files on disk at: /export/home/jenkins/workspace/Lucene-Solr-master-Solaris/solr/build/solr-core/test/J1/temp/solr.update.processor.TimeRoutedAliasUpdateProcessorTest_993B753FE04A2474-001
   [junit4]   2> NOTE: test params are: codec=Asserting(Lucene70): {}, docValues:{}, maxPointsInLeafNode=636, maxMBSortInHeap=5.746970741250607, sim=Asserting(org.apache.lucene.search.similarities.AssertingSimilarity@76958c7a), locale=sr-RS, timezone=Asia/Ujung_Pandang
   [junit4]   2> NOTE: SunOS 5.11 amd64/Oracle Corporation 1.8.0_152 (64-bit)/cpus=3,threads=1,free=242223288,total=526385152
   [junit4]   2> NOTE: All tests run in this JVM: [RollingRestartTest, TestPrepRecovery, TestFilteredDocIdSet, TestFastLRUCache, PreAnalyzedUpdateProcessorTest, TestSimpleTrackingShardHandler, FileUtilsTest, ReplicaListTransformerTest, SolrIndexConfigTest, DOMUtilTest, TestFieldCacheSortRandom, TestConfigSets, TestMacroExpander, TestQueryWrapperFilter, DocumentBuilderTest, TestNumericTerms32, HealthCheckHandlerTest, AutoScalingHandlerTest, SystemInfoHandlerTest, TestPushWriter, DeleteLastCustomShardedReplicaTest, LoggingHandlerTest, SolrCoreCheckLockOnStartupTest, ReplicationFactorTest, DirectSolrSpellCheckerTest, TestConfigSetsAPI, BasicDistributedZk2Test, BadComponentTest, MetricsHandlerTest, TestSchemalessBufferedUpdates, TestRandomRequestDistribution, TestHalfAndHalfDocValues, HdfsRestartWhileUpdatingTest, CopyFieldTest, HdfsBasicDistributedZk2Test, TestPolicyCloud, DocValuesTest, TermsComponentTest, TestBadConfig, HdfsCollectionsAPIDistributedZkTest, TestDistributedGrouping, TestComplexPhraseLeadingWildcard, SolrGangliaReporterTest, MBeansHandlerTest, ChaosMonkeyNothingIsSafeWithPullReplicasTest, SimplePostToolTest, TestSizeLimitedDistributedMap, DistributedMLTComponentTest, TestCloudPseudoReturnFields, TermVectorComponentTest, TestScoreJoinQPNoScore, AtomicUpdatesTest, TestQueryUtils, TestSortByMinMaxFunction, FullSolrCloudDistribCmdsTest, TestWordDelimiterFilterFactory, TestLuceneMatchVersion, ShardRoutingCustomTest, ExternalFileFieldSortTest, TestCrossCoreJoin, TlogReplayBufferedWhileIndexingTest, JvmMetricsTest, TestPartialUpdateDeduplication, SubstringBytesRefFilterTest, CdcrBidirectionalTest, TestTriggerIntegration, TestCharFilters, TermVectorComponentDistributedTest, DistributedQueueTest, PolyFieldTest, TestZkChroot, TestConfigReload, CdcrReplicationDistributedZkTest, SchemaVersionSpecificBehaviorTest, TestClusterStateProvider, NumberUtilsTest, AutoAddReplicasIntegrationTest, CdcrRequestHandlerTest, TestStressReorder, TestFaceting, DistributedIntervalFacetingTest, DistributedFacetPivotSmallAdvancedTest, TestNumericRangeQuery32, StressHdfsTest, TestSolrCoreSnapshots, TestStressVersions, CacheHeaderTest, TestSolrIndexConfig, TestExactSharedStatsCache, SpellingQueryConverterTest, BooleanFieldTest, TestBulkSchemaAPI, UpdateParamsTest, TestCoreAdminApis, DistributedExpandComponentTest, TestMinMaxOnMultiValuedField, SearchRateTriggerTest, TestRawTransformer, TestSolrCloudWithSecureImpersonation, TestBM25SimilarityFactory, TestPostingsSolrHighlighter, SynonymTokenizerTest, TestFieldCollectionResource, QueryElevationComponentTest, TestElisionMultitermQuery, ManagedSchemaRoundRobinCloudTest, CloudExitableDirectoryReaderTest, DocValuesMissingTest, TestReloadAndDeleteDocs, TestStressInPlaceUpdates, TestHdfsCloudBackupRestore, IndexSchemaRuntimeFieldTest, TestTrieFacet, EchoParamsTest, TestSolrXml, AssignTest, JSONWriterTest, TestFastOutputStream, BasicAuthStandaloneTest, SolrXmlInZkTest, CloneFieldUpdateProcessorFactoryTest, TestDistribStateManager, AliasIntegrationTest, TestManagedResourceStorage, TestSQLHandler, OverriddenZkACLAndCredentialsProvidersTest, BlockJoinFacetDistribTest, DocValuesNotIndexedTest, TestPerFieldSimilarity, TestConfigSetImmutable, SearchHandlerTest, SolrIndexMetricsTest, TestTlogReplica, MigrateRouteKeyTest, SolrJmxReporterCloudTest, FullHLLTest, JsonLoaderTest, DocumentAnalysisRequestHandlerTest, TestHashPartitioner, TestDocTermOrds, FacetPivotSmallTest, CurrencyFieldTypeTest, NodeAddedTriggerTest, TestSchemaNameResource, PingRequestHandlerTest, DocValuesMultiTest, JavabinLoaderTest, HLLUtilTest, TestImplicitCoreProperties, TestBulkSchemaConcurrent, ActionThrottleTest, SecurityConfHandlerTest, TestManagedSynonymGraphFilterFactory, SharedFSAutoReplicaFailoverTest, StatelessScriptUpdateProcessorFactoryTest, TestFunctionQuery, SolrPluginUtilsTest, TestNoOpRegenerator, MetricUtilsTest, CollectionsAPIDistributedZkTest, CheckHdfsIndexTest, DistributedQueryComponentOptimizationTest, V2StandaloneTest, LeaderElectionIntegrationTest, TestReqParamsAPI, SpatialHeatmapFacetsTest, TestAuthorizationFramework, TestPointFields, TestCSVLoader, DirectoryFactoryTest, SearchHandlerTest, DistributedFacetPivotLargeTest, SOLR749Test, TestFieldCacheReopen, DistributedFacetPivotWhiteBoxTest, TestIndexSearcher, TestDefaultStatsCache, TestDFISimilarityFactory, CoreAdminHandlerTest, TestCollationField, TestSolrCloudWithHadoopAuthPlugin, TestSystemIdResolver, TestSerializedLuceneMatchVersion, HdfsDirectoryFactoryTest, TestSubQueryTransformerDistrib, LeaderInitiatedRecoveryOnShardRestartTest, TestSolrQueryResponse, BasicDistributedZkTest, TestGroupingSearch, SolrCmdDistributorTest, PeerSyncTest, SoftAutoCommitTest, AsyncCallRequestStatusResponseTest, ChaosMonkeySafeLeaderWithPullReplicasTest, CollectionsAPISolrJTest, CustomCollectionTest, DeleteStatusTest, DistribCursorPagingTest, ForceLeaderTest, LeaderElectionContextKeyTest, LeaderFailureAfterFreshStartTest, MoveReplicaHDFSTest, MultiThreadedOCPTest, PeerSyncReplicationTest, RemoteQueryErrorTest, ReplaceNodeTest, SaslZkACLProviderTest, SolrCLIZkUtilsTest, SolrCloudExampleTest, TestCloudJSONFacetJoinDomain, TestCloudSearcherWarming, TestDeleteCollectionOnDownNodes, TestDownShardTolerantSearch, TestLeaderElectionZkExpiry, TestLockTree, TestMiniSolrCloudClusterSSL, TestPullReplicaErrorHandling, TestSegmentSorting, TestSolrCloudWithDelegationTokens, TestStressCloudBlindAtomicUpdates, TestUtilizeNode, ExecutePlanActionTest, HttpTriggerListenerTest, NodeLostTriggerTest, SystemLogListenerTest, TriggerIntegrationTest, HdfsBasicDistributedZkTest, HdfsChaosMonkeyNothingIsSafeTest, HdfsRecoverLeaseTest, HdfsTlogReplayBufferedWhileIndexingTest, HdfsUnloadDistributedZkTest, HdfsWriteToMultipleCollectionsTest, TestClusterStateMutator, ZkStateReaderTest, ImplicitSnitchTest, RulesTest, TestInitParams, TestShardHandlerFactory, TestSimpleTextCodec, TestSolrCloudSnapshots, TestHdfsBackupRestoreCore, TestSolrConfigHandlerConcurrent, TestSystemCollAutoCreate, InfixSuggestersTest, ShufflingReplicaListTransformerTest, SuggestComponentContextFilterQueryTest, TestDistributedStatsComponentCardinality, SolrMetricReporterTest, SolrGraphiteReporterTest, SolrCloudReportersTest, TestStreamBody, TestMacros, TestBinaryResponseWriter, TestExportWriter, TestGeoJSONResponseWriter, TestGraphMLResponseWriter, TestRawResponseWriter, TestSubQueryTransformer, TestRestManager, TestDynamicFieldCollectionResource, TestFieldTypeCollectionResource, TestSchemaSimilarityResource, TestUniqueKeyFieldResource, TestManagedStopFilterFactory, DateRangeFieldTest, TestCloudSchemaless, AnalyticsQueryTest, LargeFieldTest, RankQueryTest, SortSpecParsingTest, TestAddFieldRealTimeGet, TestCollapseQParserPlugin, TestComplexPhraseQParserPlugin, TestCustomSort, TestFieldSortValues, TestGraphTermsQParserPlugin, TestHashQParserPlugin, TestInitQParser, TestLegacyNumericRangeQueryBuilder, TestMissingGroups, TestOverriddenPrefixQueryForCustomFieldType, TestPayloadCheckQParserPlugin, TestPayloadScoreQParserPlugin, TestReRankQParserPlugin, TestRecoveryHdfs, TestOrdValues, BlockJoinFacetSimpleTest, TestCloudNestedDocsSort, SimpleMLTQParserTest, TestPKIAuthenticationPlugin, TestRuleBasedAuthorizationPlugin, TestDelegationWithHadoopAuth, HttpSolrCallGetCoreTest, HdfsDirectoryTest, UpdateLogTest, AddSchemaFieldsUpdateProcessorFactoryTest, AtomicUpdateProcessorFactoryTest, ClassificationUpdateProcessorIntegrationTest, ClassificationUpdateProcessorTest, DocExpirationUpdateProcessorFactoryTest, IgnoreCommitOptimizeUpdateProcessorFactoryTest, TemplateUpdateProcessorTest, TestNamedUpdateProcessors, TimeRoutedAliasUpdateProcessorTest]
   [junit4] Completed [752/765 (1!)] on J1 in 18.61s, 2 tests, 1 failure <<< FAILURES!

[...truncated 48105 lines...]

Mime
View raw message