lucene-dev mailing list archives

Site index · List index
Message view « Date » · « Thread »
Top « Date » · « Thread »
From Policeman Jenkins Server <jenk...@thetaphi.de>
Subject [JENKINS] Lucene-Solr-7.x-MacOSX (64bit/jdk-9) - Build # 390 - Still Unstable!
Date Tue, 09 Jan 2018 17:49:12 GMT
Build: https://jenkins.thetaphi.de/job/Lucene-Solr-7.x-MacOSX/390/
Java: 64bit/jdk-9 -XX:-UseCompressedOops -XX:+UseParallelGC

9 tests failed.
FAILED:  org.apache.solr.cloud.FullSolrCloudDistribCmdsTest.test

Error Message:
Could not find collection:collection2

Stack Trace:
java.lang.AssertionError: Could not find collection:collection2
	at __randomizedtesting.SeedInfo.seed([D84B434FCC81BDBB:501F7C95627DD043]:0)
	at org.junit.Assert.fail(Assert.java:93)
	at org.junit.Assert.assertTrue(Assert.java:43)
	at org.junit.Assert.assertNotNull(Assert.java:526)
	at org.apache.solr.cloud.AbstractDistribZkTestBase.waitForRecoveriesToFinish(AbstractDistribZkTestBase.java:155)
	at org.apache.solr.cloud.AbstractDistribZkTestBase.waitForRecoveriesToFinish(AbstractDistribZkTestBase.java:140)
	at org.apache.solr.cloud.AbstractDistribZkTestBase.waitForRecoveriesToFinish(AbstractDistribZkTestBase.java:135)
	at org.apache.solr.cloud.AbstractFullDistribZkTestBase.waitForRecoveriesToFinish(AbstractFullDistribZkTestBase.java:913)
	at org.apache.solr.cloud.FullSolrCloudDistribCmdsTest.testIndexingBatchPerRequestWithHttpSolrClient(FullSolrCloudDistribCmdsTest.java:612)
	at org.apache.solr.cloud.FullSolrCloudDistribCmdsTest.test(FullSolrCloudDistribCmdsTest.java:152)
	at java.base/jdk.internal.reflect.NativeMethodAccessorImpl.invoke0(Native Method)
	at java.base/jdk.internal.reflect.NativeMethodAccessorImpl.invoke(NativeMethodAccessorImpl.java:62)
	at java.base/jdk.internal.reflect.DelegatingMethodAccessorImpl.invoke(DelegatingMethodAccessorImpl.java:43)
	at java.base/java.lang.reflect.Method.invoke(Method.java:564)
	at com.carrotsearch.randomizedtesting.RandomizedRunner.invoke(RandomizedRunner.java:1737)
	at com.carrotsearch.randomizedtesting.RandomizedRunner$8.evaluate(RandomizedRunner.java:934)
	at com.carrotsearch.randomizedtesting.RandomizedRunner$9.evaluate(RandomizedRunner.java:970)
	at com.carrotsearch.randomizedtesting.RandomizedRunner$10.evaluate(RandomizedRunner.java:984)
	at org.apache.solr.BaseDistributedSearchTestCase$ShardsRepeatRule$ShardsFixedStatement.callStatement(BaseDistributedSearchTestCase.java:993)
	at org.apache.solr.BaseDistributedSearchTestCase$ShardsRepeatRule$ShardsStatement.evaluate(BaseDistributedSearchTestCase.java:968)
	at com.carrotsearch.randomizedtesting.rules.SystemPropertiesRestoreRule$1.evaluate(SystemPropertiesRestoreRule.java:57)
	at org.apache.lucene.util.TestRuleSetupTeardownChained$1.evaluate(TestRuleSetupTeardownChained.java:49)
	at org.apache.lucene.util.AbstractBeforeAfterRule$1.evaluate(AbstractBeforeAfterRule.java:45)
	at org.apache.lucene.util.TestRuleThreadAndTestName$1.evaluate(TestRuleThreadAndTestName.java:48)
	at org.apache.lucene.util.TestRuleIgnoreAfterMaxFailures$1.evaluate(TestRuleIgnoreAfterMaxFailures.java:64)
	at org.apache.lucene.util.TestRuleMarkFailure$1.evaluate(TestRuleMarkFailure.java:47)
	at com.carrotsearch.randomizedtesting.rules.StatementAdapter.evaluate(StatementAdapter.java:36)
	at com.carrotsearch.randomizedtesting.ThreadLeakControl$StatementRunner.run(ThreadLeakControl.java:368)
	at com.carrotsearch.randomizedtesting.ThreadLeakControl.forkTimeoutingTask(ThreadLeakControl.java:817)
	at com.carrotsearch.randomizedtesting.ThreadLeakControl$3.evaluate(ThreadLeakControl.java:468)
	at com.carrotsearch.randomizedtesting.RandomizedRunner.runSingleTest(RandomizedRunner.java:943)
	at com.carrotsearch.randomizedtesting.RandomizedRunner$5.evaluate(RandomizedRunner.java:829)
	at com.carrotsearch.randomizedtesting.RandomizedRunner$6.evaluate(RandomizedRunner.java:879)
	at com.carrotsearch.randomizedtesting.RandomizedRunner$7.evaluate(RandomizedRunner.java:890)
	at com.carrotsearch.randomizedtesting.rules.StatementAdapter.evaluate(StatementAdapter.java:36)
	at com.carrotsearch.randomizedtesting.rules.SystemPropertiesRestoreRule$1.evaluate(SystemPropertiesRestoreRule.java:57)
	at org.apache.lucene.util.AbstractBeforeAfterRule$1.evaluate(AbstractBeforeAfterRule.java:45)
	at com.carrotsearch.randomizedtesting.rules.StatementAdapter.evaluate(StatementAdapter.java:36)
	at org.apache.lucene.util.TestRuleStoreClassName$1.evaluate(TestRuleStoreClassName.java:41)
	at com.carrotsearch.randomizedtesting.rules.NoShadowingOrOverridesOnMethodsRule$1.evaluate(NoShadowingOrOverridesOnMethodsRule.java:40)
	at com.carrotsearch.randomizedtesting.rules.NoShadowingOrOverridesOnMethodsRule$1.evaluate(NoShadowingOrOverridesOnMethodsRule.java:40)
	at com.carrotsearch.randomizedtesting.rules.StatementAdapter.evaluate(StatementAdapter.java:36)
	at com.carrotsearch.randomizedtesting.rules.StatementAdapter.evaluate(StatementAdapter.java:36)
	at org.apache.lucene.util.TestRuleAssertionsRequired$1.evaluate(TestRuleAssertionsRequired.java:53)
	at org.apache.lucene.util.TestRuleMarkFailure$1.evaluate(TestRuleMarkFailure.java:47)
	at org.apache.lucene.util.TestRuleIgnoreAfterMaxFailures$1.evaluate(TestRuleIgnoreAfterMaxFailures.java:64)
	at org.apache.lucene.util.TestRuleIgnoreTestSuites$1.evaluate(TestRuleIgnoreTestSuites.java:54)
	at com.carrotsearch.randomizedtesting.rules.StatementAdapter.evaluate(StatementAdapter.java:36)
	at com.carrotsearch.randomizedtesting.ThreadLeakControl$StatementRunner.run(ThreadLeakControl.java:368)
	at java.base/java.lang.Thread.run(Thread.java:844)


FAILED:  org.apache.solr.client.solrj.request.SchemaTest.copyFieldsShouldFailWhenOneOfTheFieldsDoesntExistInTheSchema

Error Message:
Error from server at http://127.0.0.1:56218/solr/collection1: error processing commands

Stack Trace:
org.apache.solr.client.solrj.impl.HttpSolrClient$RemoteExecutionException: Error from server at http://127.0.0.1:56218/solr/collection1: error processing commands
	at __randomizedtesting.SeedInfo.seed([EB3ABB9883346397:C4FE9C38B73C1BFD]:0)
	at org.apache.solr.client.solrj.impl.HttpSolrClient$RemoteExecutionException.create(HttpSolrClient.java:830)
	at org.apache.solr.client.solrj.impl.HttpSolrClient.executeMethod(HttpSolrClient.java:620)
	at org.apache.solr.client.solrj.impl.HttpSolrClient.request(HttpSolrClient.java:255)
	at org.apache.solr.client.solrj.impl.HttpSolrClient.request(HttpSolrClient.java:244)
	at org.apache.solr.client.solrj.SolrRequest.process(SolrRequest.java:194)
	at org.apache.solr.client.solrj.SolrRequest.process(SolrRequest.java:211)
	at org.apache.solr.client.solrj.request.SchemaTest.copyFieldsShouldFailWhenOneOfTheFieldsDoesntExistInTheSchema(SchemaTest.java:806)
	at java.base/jdk.internal.reflect.NativeMethodAccessorImpl.invoke0(Native Method)
	at java.base/jdk.internal.reflect.NativeMethodAccessorImpl.invoke(NativeMethodAccessorImpl.java:62)
	at java.base/jdk.internal.reflect.DelegatingMethodAccessorImpl.invoke(DelegatingMethodAccessorImpl.java:43)
	at java.base/java.lang.reflect.Method.invoke(Method.java:564)
	at com.carrotsearch.randomizedtesting.RandomizedRunner.invoke(RandomizedRunner.java:1737)
	at com.carrotsearch.randomizedtesting.RandomizedRunner$8.evaluate(RandomizedRunner.java:934)
	at com.carrotsearch.randomizedtesting.RandomizedRunner$9.evaluate(RandomizedRunner.java:970)
	at com.carrotsearch.randomizedtesting.RandomizedRunner$10.evaluate(RandomizedRunner.java:984)
	at com.carrotsearch.randomizedtesting.rules.SystemPropertiesRestoreRule$1.evaluate(SystemPropertiesRestoreRule.java:57)
	at org.apache.lucene.util.TestRuleSetupTeardownChained$1.evaluate(TestRuleSetupTeardownChained.java:49)
	at org.apache.lucene.util.AbstractBeforeAfterRule$1.evaluate(AbstractBeforeAfterRule.java:45)
	at org.apache.lucene.util.TestRuleThreadAndTestName$1.evaluate(TestRuleThreadAndTestName.java:48)
	at org.apache.lucene.util.TestRuleIgnoreAfterMaxFailures$1.evaluate(TestRuleIgnoreAfterMaxFailures.java:64)
	at org.apache.lucene.util.TestRuleMarkFailure$1.evaluate(TestRuleMarkFailure.java:47)
	at com.carrotsearch.randomizedtesting.rules.StatementAdapter.evaluate(StatementAdapter.java:36)
	at com.carrotsearch.randomizedtesting.ThreadLeakControl$StatementRunner.run(ThreadLeakControl.java:368)
	at com.carrotsearch.randomizedtesting.ThreadLeakControl.forkTimeoutingTask(ThreadLeakControl.java:817)
	at com.carrotsearch.randomizedtesting.ThreadLeakControl$3.evaluate(ThreadLeakControl.java:468)
	at com.carrotsearch.randomizedtesting.RandomizedRunner.runSingleTest(RandomizedRunner.java:943)
	at com.carrotsearch.randomizedtesting.RandomizedRunner$5.evaluate(RandomizedRunner.java:829)
	at com.carrotsearch.randomizedtesting.RandomizedRunner$6.evaluate(RandomizedRunner.java:879)
	at com.carrotsearch.randomizedtesting.RandomizedRunner$7.evaluate(RandomizedRunner.java:890)
	at com.carrotsearch.randomizedtesting.rules.StatementAdapter.evaluate(StatementAdapter.java:36)
	at com.carrotsearch.randomizedtesting.rules.SystemPropertiesRestoreRule$1.evaluate(SystemPropertiesRestoreRule.java:57)
	at org.apache.lucene.util.AbstractBeforeAfterRule$1.evaluate(AbstractBeforeAfterRule.java:45)
	at com.carrotsearch.randomizedtesting.rules.StatementAdapter.evaluate(StatementAdapter.java:36)
	at org.apache.lucene.util.TestRuleStoreClassName$1.evaluate(TestRuleStoreClassName.java:41)
	at com.carrotsearch.randomizedtesting.rules.NoShadowingOrOverridesOnMethodsRule$1.evaluate(NoShadowingOrOverridesOnMethodsRule.java:40)
	at com.carrotsearch.randomizedtesting.rules.NoShadowingOrOverridesOnMethodsRule$1.evaluate(NoShadowingOrOverridesOnMethodsRule.java:40)
	at com.carrotsearch.randomizedtesting.rules.StatementAdapter.evaluate(StatementAdapter.java:36)
	at com.carrotsearch.randomizedtesting.rules.StatementAdapter.evaluate(StatementAdapter.java:36)
	at org.apache.lucene.util.TestRuleAssertionsRequired$1.evaluate(TestRuleAssertionsRequired.java:53)
	at org.apache.lucene.util.TestRuleMarkFailure$1.evaluate(TestRuleMarkFailure.java:47)
	at org.apache.lucene.util.TestRuleIgnoreAfterMaxFailures$1.evaluate(TestRuleIgnoreAfterMaxFailures.java:64)
	at org.apache.lucene.util.TestRuleIgnoreTestSuites$1.evaluate(TestRuleIgnoreTestSuites.java:54)
	at com.carrotsearch.randomizedtesting.rules.StatementAdapter.evaluate(StatementAdapter.java:36)
	at com.carrotsearch.randomizedtesting.ThreadLeakControl$StatementRunner.run(ThreadLeakControl.java:368)
	at java.base/java.lang.Thread.run(Thread.java:844)


FAILED:  org.apache.solr.client.solrj.request.SchemaTest.addFieldShouldntBeCalledTwiceWithTheSameName

Error Message:
Error from server at http://127.0.0.1:56222/solr/collection1: error processing commands

Stack Trace:
org.apache.solr.client.solrj.impl.HttpSolrClient$RemoteExecutionException: Error from server at http://127.0.0.1:56222/solr/collection1: error processing commands
	at __randomizedtesting.SeedInfo.seed([EB3ABB9883346397:3A49D3C2378C833B]:0)
	at org.apache.solr.client.solrj.impl.HttpSolrClient$RemoteExecutionException.create(HttpSolrClient.java:830)
	at org.apache.solr.client.solrj.impl.HttpSolrClient.executeMethod(HttpSolrClient.java:620)
	at org.apache.solr.client.solrj.impl.HttpSolrClient.request(HttpSolrClient.java:255)
	at org.apache.solr.client.solrj.impl.HttpSolrClient.request(HttpSolrClient.java:244)
	at org.apache.solr.client.solrj.SolrRequest.process(SolrRequest.java:194)
	at org.apache.solr.client.solrj.SolrRequest.process(SolrRequest.java:211)
	at org.apache.solr.client.solrj.request.SchemaTest.addFieldShouldntBeCalledTwiceWithTheSameName(SchemaTest.java:293)
	at java.base/jdk.internal.reflect.NativeMethodAccessorImpl.invoke0(Native Method)
	at java.base/jdk.internal.reflect.NativeMethodAccessorImpl.invoke(NativeMethodAccessorImpl.java:62)
	at java.base/jdk.internal.reflect.DelegatingMethodAccessorImpl.invoke(DelegatingMethodAccessorImpl.java:43)
	at java.base/java.lang.reflect.Method.invoke(Method.java:564)
	at com.carrotsearch.randomizedtesting.RandomizedRunner.invoke(RandomizedRunner.java:1737)
	at com.carrotsearch.randomizedtesting.RandomizedRunner$8.evaluate(RandomizedRunner.java:934)
	at com.carrotsearch.randomizedtesting.RandomizedRunner$9.evaluate(RandomizedRunner.java:970)
	at com.carrotsearch.randomizedtesting.RandomizedRunner$10.evaluate(RandomizedRunner.java:984)
	at com.carrotsearch.randomizedtesting.rules.SystemPropertiesRestoreRule$1.evaluate(SystemPropertiesRestoreRule.java:57)
	at org.apache.lucene.util.TestRuleSetupTeardownChained$1.evaluate(TestRuleSetupTeardownChained.java:49)
	at org.apache.lucene.util.AbstractBeforeAfterRule$1.evaluate(AbstractBeforeAfterRule.java:45)
	at org.apache.lucene.util.TestRuleThreadAndTestName$1.evaluate(TestRuleThreadAndTestName.java:48)
	at org.apache.lucene.util.TestRuleIgnoreAfterMaxFailures$1.evaluate(TestRuleIgnoreAfterMaxFailures.java:64)
	at org.apache.lucene.util.TestRuleMarkFailure$1.evaluate(TestRuleMarkFailure.java:47)
	at com.carrotsearch.randomizedtesting.rules.StatementAdapter.evaluate(StatementAdapter.java:36)
	at com.carrotsearch.randomizedtesting.ThreadLeakControl$StatementRunner.run(ThreadLeakControl.java:368)
	at com.carrotsearch.randomizedtesting.ThreadLeakControl.forkTimeoutingTask(ThreadLeakControl.java:817)
	at com.carrotsearch.randomizedtesting.ThreadLeakControl$3.evaluate(ThreadLeakControl.java:468)
	at com.carrotsearch.randomizedtesting.RandomizedRunner.runSingleTest(RandomizedRunner.java:943)
	at com.carrotsearch.randomizedtesting.RandomizedRunner$5.evaluate(RandomizedRunner.java:829)
	at com.carrotsearch.randomizedtesting.RandomizedRunner$6.evaluate(RandomizedRunner.java:879)
	at com.carrotsearch.randomizedtesting.RandomizedRunner$7.evaluate(RandomizedRunner.java:890)
	at com.carrotsearch.randomizedtesting.rules.StatementAdapter.evaluate(StatementAdapter.java:36)
	at com.carrotsearch.randomizedtesting.rules.SystemPropertiesRestoreRule$1.evaluate(SystemPropertiesRestoreRule.java:57)
	at org.apache.lucene.util.AbstractBeforeAfterRule$1.evaluate(AbstractBeforeAfterRule.java:45)
	at com.carrotsearch.randomizedtesting.rules.StatementAdapter.evaluate(StatementAdapter.java:36)
	at org.apache.lucene.util.TestRuleStoreClassName$1.evaluate(TestRuleStoreClassName.java:41)
	at com.carrotsearch.randomizedtesting.rules.NoShadowingOrOverridesOnMethodsRule$1.evaluate(NoShadowingOrOverridesOnMethodsRule.java:40)
	at com.carrotsearch.randomizedtesting.rules.NoShadowingOrOverridesOnMethodsRule$1.evaluate(NoShadowingOrOverridesOnMethodsRule.java:40)
	at com.carrotsearch.randomizedtesting.rules.StatementAdapter.evaluate(StatementAdapter.java:36)
	at com.carrotsearch.randomizedtesting.rules.StatementAdapter.evaluate(StatementAdapter.java:36)
	at org.apache.lucene.util.TestRuleAssertionsRequired$1.evaluate(TestRuleAssertionsRequired.java:53)
	at org.apache.lucene.util.TestRuleMarkFailure$1.evaluate(TestRuleMarkFailure.java:47)
	at org.apache.lucene.util.TestRuleIgnoreAfterMaxFailures$1.evaluate(TestRuleIgnoreAfterMaxFailures.java:64)
	at org.apache.lucene.util.TestRuleIgnoreTestSuites$1.evaluate(TestRuleIgnoreTestSuites.java:54)
	at com.carrotsearch.randomizedtesting.rules.StatementAdapter.evaluate(StatementAdapter.java:36)
	at com.carrotsearch.randomizedtesting.ThreadLeakControl$StatementRunner.run(ThreadLeakControl.java:368)
	at java.base/java.lang.Thread.run(Thread.java:844)


FAILED:  org.apache.solr.client.solrj.request.SchemaTest.deletingAFieldThatDoesntExistInTheSchemaShouldFail

Error Message:
Error from server at http://127.0.0.1:56241/solr/collection1: error processing commands

Stack Trace:
org.apache.solr.client.solrj.impl.HttpSolrClient$RemoteExecutionException: Error from server at http://127.0.0.1:56241/solr/collection1: error processing commands
	at __randomizedtesting.SeedInfo.seed([EB3ABB9883346397:D2D5C2AF4954318D]:0)
	at org.apache.solr.client.solrj.impl.HttpSolrClient$RemoteExecutionException.create(HttpSolrClient.java:830)
	at org.apache.solr.client.solrj.impl.HttpSolrClient.executeMethod(HttpSolrClient.java:620)
	at org.apache.solr.client.solrj.impl.HttpSolrClient.request(HttpSolrClient.java:255)
	at org.apache.solr.client.solrj.impl.HttpSolrClient.request(HttpSolrClient.java:244)
	at org.apache.solr.client.solrj.SolrRequest.process(SolrRequest.java:194)
	at org.apache.solr.client.solrj.SolrRequest.process(SolrRequest.java:211)
	at org.apache.solr.client.solrj.request.SchemaTest.deletingAFieldThatDoesntExistInTheSchemaShouldFail(SchemaTest.java:332)
	at java.base/jdk.internal.reflect.NativeMethodAccessorImpl.invoke0(Native Method)
	at java.base/jdk.internal.reflect.NativeMethodAccessorImpl.invoke(NativeMethodAccessorImpl.java:62)
	at java.base/jdk.internal.reflect.DelegatingMethodAccessorImpl.invoke(DelegatingMethodAccessorImpl.java:43)
	at java.base/java.lang.reflect.Method.invoke(Method.java:564)
	at com.carrotsearch.randomizedtesting.RandomizedRunner.invoke(RandomizedRunner.java:1737)
	at com.carrotsearch.randomizedtesting.RandomizedRunner$8.evaluate(RandomizedRunner.java:934)
	at com.carrotsearch.randomizedtesting.RandomizedRunner$9.evaluate(RandomizedRunner.java:970)
	at com.carrotsearch.randomizedtesting.RandomizedRunner$10.evaluate(RandomizedRunner.java:984)
	at com.carrotsearch.randomizedtesting.rules.SystemPropertiesRestoreRule$1.evaluate(SystemPropertiesRestoreRule.java:57)
	at org.apache.lucene.util.TestRuleSetupTeardownChained$1.evaluate(TestRuleSetupTeardownChained.java:49)
	at org.apache.lucene.util.AbstractBeforeAfterRule$1.evaluate(AbstractBeforeAfterRule.java:45)
	at org.apache.lucene.util.TestRuleThreadAndTestName$1.evaluate(TestRuleThreadAndTestName.java:48)
	at org.apache.lucene.util.TestRuleIgnoreAfterMaxFailures$1.evaluate(TestRuleIgnoreAfterMaxFailures.java:64)
	at org.apache.lucene.util.TestRuleMarkFailure$1.evaluate(TestRuleMarkFailure.java:47)
	at com.carrotsearch.randomizedtesting.rules.StatementAdapter.evaluate(StatementAdapter.java:36)
	at com.carrotsearch.randomizedtesting.ThreadLeakControl$StatementRunner.run(ThreadLeakControl.java:368)
	at com.carrotsearch.randomizedtesting.ThreadLeakControl.forkTimeoutingTask(ThreadLeakControl.java:817)
	at com.carrotsearch.randomizedtesting.ThreadLeakControl$3.evaluate(ThreadLeakControl.java:468)
	at com.carrotsearch.randomizedtesting.RandomizedRunner.runSingleTest(RandomizedRunner.java:943)
	at com.carrotsearch.randomizedtesting.RandomizedRunner$5.evaluate(RandomizedRunner.java:829)
	at com.carrotsearch.randomizedtesting.RandomizedRunner$6.evaluate(RandomizedRunner.java:879)
	at com.carrotsearch.randomizedtesting.RandomizedRunner$7.evaluate(RandomizedRunner.java:890)
	at com.carrotsearch.randomizedtesting.rules.StatementAdapter.evaluate(StatementAdapter.java:36)
	at com.carrotsearch.randomizedtesting.rules.SystemPropertiesRestoreRule$1.evaluate(SystemPropertiesRestoreRule.java:57)
	at org.apache.lucene.util.AbstractBeforeAfterRule$1.evaluate(AbstractBeforeAfterRule.java:45)
	at com.carrotsearch.randomizedtesting.rules.StatementAdapter.evaluate(StatementAdapter.java:36)
	at org.apache.lucene.util.TestRuleStoreClassName$1.evaluate(TestRuleStoreClassName.java:41)
	at com.carrotsearch.randomizedtesting.rules.NoShadowingOrOverridesOnMethodsRule$1.evaluate(NoShadowingOrOverridesOnMethodsRule.java:40)
	at com.carrotsearch.randomizedtesting.rules.NoShadowingOrOverridesOnMethodsRule$1.evaluate(NoShadowingOrOverridesOnMethodsRule.java:40)
	at com.carrotsearch.randomizedtesting.rules.StatementAdapter.evaluate(StatementAdapter.java:36)
	at com.carrotsearch.randomizedtesting.rules.StatementAdapter.evaluate(StatementAdapter.java:36)
	at org.apache.lucene.util.TestRuleAssertionsRequired$1.evaluate(TestRuleAssertionsRequired.java:53)
	at org.apache.lucene.util.TestRuleMarkFailure$1.evaluate(TestRuleMarkFailure.java:47)
	at org.apache.lucene.util.TestRuleIgnoreAfterMaxFailures$1.evaluate(TestRuleIgnoreAfterMaxFailures.java:64)
	at org.apache.lucene.util.TestRuleIgnoreTestSuites$1.evaluate(TestRuleIgnoreTestSuites.java:54)
	at com.carrotsearch.randomizedtesting.rules.StatementAdapter.evaluate(StatementAdapter.java:36)
	at com.carrotsearch.randomizedtesting.ThreadLeakControl$StatementRunner.run(ThreadLeakControl.java:368)
	at java.base/java.lang.Thread.run(Thread.java:844)


FAILED:  org.apache.solr.client.solrj.request.SchemaTest.deletingADynamicFieldThatDoesntExistInTheSchemaShouldFail

Error Message:
Error from server at http://127.0.0.1:56259/solr/collection1: error processing commands

Stack Trace:
org.apache.solr.client.solrj.impl.HttpSolrClient$RemoteExecutionException: Error from server at http://127.0.0.1:56259/solr/collection1: error processing commands
	at __randomizedtesting.SeedInfo.seed([EB3ABB9883346397:6FC9B87B48EF1758]:0)
	at org.apache.solr.client.solrj.impl.HttpSolrClient$RemoteExecutionException.create(HttpSolrClient.java:830)
	at org.apache.solr.client.solrj.impl.HttpSolrClient.executeMethod(HttpSolrClient.java:620)
	at org.apache.solr.client.solrj.impl.HttpSolrClient.request(HttpSolrClient.java:255)
	at org.apache.solr.client.solrj.impl.HttpSolrClient.request(HttpSolrClient.java:244)
	at org.apache.solr.client.solrj.SolrRequest.process(SolrRequest.java:194)
	at org.apache.solr.client.solrj.SolrRequest.process(SolrRequest.java:211)
	at org.apache.solr.client.solrj.request.SchemaTest.deletingADynamicFieldThatDoesntExistInTheSchemaShouldFail(SchemaTest.java:458)
	at java.base/jdk.internal.reflect.NativeMethodAccessorImpl.invoke0(Native Method)
	at java.base/jdk.internal.reflect.NativeMethodAccessorImpl.invoke(NativeMethodAccessorImpl.java:62)
	at java.base/jdk.internal.reflect.DelegatingMethodAccessorImpl.invoke(DelegatingMethodAccessorImpl.java:43)
	at java.base/java.lang.reflect.Method.invoke(Method.java:564)
	at com.carrotsearch.randomizedtesting.RandomizedRunner.invoke(RandomizedRunner.java:1737)
	at com.carrotsearch.randomizedtesting.RandomizedRunner$8.evaluate(RandomizedRunner.java:934)
	at com.carrotsearch.randomizedtesting.RandomizedRunner$9.evaluate(RandomizedRunner.java:970)
	at com.carrotsearch.randomizedtesting.RandomizedRunner$10.evaluate(RandomizedRunner.java:984)
	at com.carrotsearch.randomizedtesting.rules.SystemPropertiesRestoreRule$1.evaluate(SystemPropertiesRestoreRule.java:57)
	at org.apache.lucene.util.TestRuleSetupTeardownChained$1.evaluate(TestRuleSetupTeardownChained.java:49)
	at org.apache.lucene.util.AbstractBeforeAfterRule$1.evaluate(AbstractBeforeAfterRule.java:45)
	at org.apache.lucene.util.TestRuleThreadAndTestName$1.evaluate(TestRuleThreadAndTestName.java:48)
	at org.apache.lucene.util.TestRuleIgnoreAfterMaxFailures$1.evaluate(TestRuleIgnoreAfterMaxFailures.java:64)
	at org.apache.lucene.util.TestRuleMarkFailure$1.evaluate(TestRuleMarkFailure.java:47)
	at com.carrotsearch.randomizedtesting.rules.StatementAdapter.evaluate(StatementAdapter.java:36)
	at com.carrotsearch.randomizedtesting.ThreadLeakControl$StatementRunner.run(ThreadLeakControl.java:368)
	at com.carrotsearch.randomizedtesting.ThreadLeakControl.forkTimeoutingTask(ThreadLeakControl.java:817)
	at com.carrotsearch.randomizedtesting.ThreadLeakControl$3.evaluate(ThreadLeakControl.java:468)
	at com.carrotsearch.randomizedtesting.RandomizedRunner.runSingleTest(RandomizedRunner.java:943)
	at com.carrotsearch.randomizedtesting.RandomizedRunner$5.evaluate(RandomizedRunner.java:829)
	at com.carrotsearch.randomizedtesting.RandomizedRunner$6.evaluate(RandomizedRunner.java:879)
	at com.carrotsearch.randomizedtesting.RandomizedRunner$7.evaluate(RandomizedRunner.java:890)
	at com.carrotsearch.randomizedtesting.rules.StatementAdapter.evaluate(StatementAdapter.java:36)
	at com.carrotsearch.randomizedtesting.rules.SystemPropertiesRestoreRule$1.evaluate(SystemPropertiesRestoreRule.java:57)
	at org.apache.lucene.util.AbstractBeforeAfterRule$1.evaluate(AbstractBeforeAfterRule.java:45)
	at com.carrotsearch.randomizedtesting.rules.StatementAdapter.evaluate(StatementAdapter.java:36)
	at org.apache.lucene.util.TestRuleStoreClassName$1.evaluate(TestRuleStoreClassName.java:41)
	at com.carrotsearch.randomizedtesting.rules.NoShadowingOrOverridesOnMethodsRule$1.evaluate(NoShadowingOrOverridesOnMethodsRule.java:40)
	at com.carrotsearch.randomizedtesting.rules.NoShadowingOrOverridesOnMethodsRule$1.evaluate(NoShadowingOrOverridesOnMethodsRule.java:40)
	at com.carrotsearch.randomizedtesting.rules.StatementAdapter.evaluate(StatementAdapter.java:36)
	at com.carrotsearch.randomizedtesting.rules.StatementAdapter.evaluate(StatementAdapter.java:36)
	at org.apache.lucene.util.TestRuleAssertionsRequired$1.evaluate(TestRuleAssertionsRequired.java:53)
	at org.apache.lucene.util.TestRuleMarkFailure$1.evaluate(TestRuleMarkFailure.java:47)
	at org.apache.lucene.util.TestRuleIgnoreAfterMaxFailures$1.evaluate(TestRuleIgnoreAfterMaxFailures.java:64)
	at org.apache.lucene.util.TestRuleIgnoreTestSuites$1.evaluate(TestRuleIgnoreTestSuites.java:54)
	at com.carrotsearch.randomizedtesting.rules.StatementAdapter.evaluate(StatementAdapter.java:36)
	at com.carrotsearch.randomizedtesting.ThreadLeakControl$StatementRunner.run(ThreadLeakControl.java:368)
	at java.base/java.lang.Thread.run(Thread.java:844)


FAILED:  org.apache.solr.client.solrj.request.SchemaTest.deletingAFieldTypeThatDoesntExistInTheSchemaShouldFail

Error Message:
Error from server at http://127.0.0.1:56276/solr/collection1: error processing commands

Stack Trace:
org.apache.solr.client.solrj.impl.HttpSolrClient$RemoteExecutionException: Error from server at http://127.0.0.1:56276/solr/collection1: error processing commands
	at __randomizedtesting.SeedInfo.seed([EB3ABB9883346397:900C8A42CA2E4F42]:0)
	at org.apache.solr.client.solrj.impl.HttpSolrClient$RemoteExecutionException.create(HttpSolrClient.java:830)
	at org.apache.solr.client.solrj.impl.HttpSolrClient.executeMethod(HttpSolrClient.java:620)
	at org.apache.solr.client.solrj.impl.HttpSolrClient.request(HttpSolrClient.java:255)
	at org.apache.solr.client.solrj.impl.HttpSolrClient.request(HttpSolrClient.java:244)
	at org.apache.solr.client.solrj.SolrRequest.process(SolrRequest.java:194)
	at org.apache.solr.client.solrj.SolrRequest.process(SolrRequest.java:211)
	at org.apache.solr.client.solrj.request.SchemaTest.deletingAFieldTypeThatDoesntExistInTheSchemaShouldFail(SchemaTest.java:694)
	at java.base/jdk.internal.reflect.NativeMethodAccessorImpl.invoke0(Native Method)
	at java.base/jdk.internal.reflect.NativeMethodAccessorImpl.invoke(NativeMethodAccessorImpl.java:62)
	at java.base/jdk.internal.reflect.DelegatingMethodAccessorImpl.invoke(DelegatingMethodAccessorImpl.java:43)
	at java.base/java.lang.reflect.Method.invoke(Method.java:564)
	at com.carrotsearch.randomizedtesting.RandomizedRunner.invoke(RandomizedRunner.java:1737)
	at com.carrotsearch.randomizedtesting.RandomizedRunner$8.evaluate(RandomizedRunner.java:934)
	at com.carrotsearch.randomizedtesting.RandomizedRunner$9.evaluate(RandomizedRunner.java:970)
	at com.carrotsearch.randomizedtesting.RandomizedRunner$10.evaluate(RandomizedRunner.java:984)
	at com.carrotsearch.randomizedtesting.rules.SystemPropertiesRestoreRule$1.evaluate(SystemPropertiesRestoreRule.java:57)
	at org.apache.lucene.util.TestRuleSetupTeardownChained$1.evaluate(TestRuleSetupTeardownChained.java:49)
	at org.apache.lucene.util.AbstractBeforeAfterRule$1.evaluate(AbstractBeforeAfterRule.java:45)
	at org.apache.lucene.util.TestRuleThreadAndTestName$1.evaluate(TestRuleThreadAndTestName.java:48)
	at org.apache.lucene.util.TestRuleIgnoreAfterMaxFailures$1.evaluate(TestRuleIgnoreAfterMaxFailures.java:64)
	at org.apache.lucene.util.TestRuleMarkFailure$1.evaluate(TestRuleMarkFailure.java:47)
	at com.carrotsearch.randomizedtesting.rules.StatementAdapter.evaluate(StatementAdapter.java:36)
	at com.carrotsearch.randomizedtesting.ThreadLeakControl$StatementRunner.run(ThreadLeakControl.java:368)
	at com.carrotsearch.randomizedtesting.ThreadLeakControl.forkTimeoutingTask(ThreadLeakControl.java:817)
	at com.carrotsearch.randomizedtesting.ThreadLeakControl$3.evaluate(ThreadLeakControl.java:468)
	at com.carrotsearch.randomizedtesting.RandomizedRunner.runSingleTest(RandomizedRunner.java:943)
	at com.carrotsearch.randomizedtesting.RandomizedRunner$5.evaluate(RandomizedRunner.java:829)
	at com.carrotsearch.randomizedtesting.RandomizedRunner$6.evaluate(RandomizedRunner.java:879)
	at com.carrotsearch.randomizedtesting.RandomizedRunner$7.evaluate(RandomizedRunner.java:890)
	at com.carrotsearch.randomizedtesting.rules.StatementAdapter.evaluate(StatementAdapter.java:36)
	at com.carrotsearch.randomizedtesting.rules.SystemPropertiesRestoreRule$1.evaluate(SystemPropertiesRestoreRule.java:57)
	at org.apache.lucene.util.AbstractBeforeAfterRule$1.evaluate(AbstractBeforeAfterRule.java:45)
	at com.carrotsearch.randomizedtesting.rules.StatementAdapter.evaluate(StatementAdapter.java:36)
	at org.apache.lucene.util.TestRuleStoreClassName$1.evaluate(TestRuleStoreClassName.java:41)
	at com.carrotsearch.randomizedtesting.rules.NoShadowingOrOverridesOnMethodsRule$1.evaluate(NoShadowingOrOverridesOnMethodsRule.java:40)
	at com.carrotsearch.randomizedtesting.rules.NoShadowingOrOverridesOnMethodsRule$1.evaluate(NoShadowingOrOverridesOnMethodsRule.java:40)
	at com.carrotsearch.randomizedtesting.rules.StatementAdapter.evaluate(StatementAdapter.java:36)
	at com.carrotsearch.randomizedtesting.rules.StatementAdapter.evaluate(StatementAdapter.java:36)
	at org.apache.lucene.util.TestRuleAssertionsRequired$1.evaluate(TestRuleAssertionsRequired.java:53)
	at org.apache.lucene.util.TestRuleMarkFailure$1.evaluate(TestRuleMarkFailure.java:47)
	at org.apache.lucene.util.TestRuleIgnoreAfterMaxFailures$1.evaluate(TestRuleIgnoreAfterMaxFailures.java:64)
	at org.apache.lucene.util.TestRuleIgnoreTestSuites$1.evaluate(TestRuleIgnoreTestSuites.java:54)
	at com.carrotsearch.randomizedtesting.rules.StatementAdapter.evaluate(StatementAdapter.java:36)
	at com.carrotsearch.randomizedtesting.ThreadLeakControl$StatementRunner.run(ThreadLeakControl.java:368)
	at java.base/java.lang.Thread.run(Thread.java:844)


FAILED:  org.apache.solr.client.solrj.request.SchemaTest.deleteCopyFieldShouldFailWhenOneOfTheFieldsDoesntExistInTheSchema

Error Message:
Error from server at http://127.0.0.1:56287/solr/collection1: error processing commands

Stack Trace:
org.apache.solr.client.solrj.impl.HttpSolrClient$RemoteExecutionException: Error from server at http://127.0.0.1:56287/solr/collection1: error processing commands
	at __randomizedtesting.SeedInfo.seed([EB3ABB9883346397:2EA7B66EF42B83E9]:0)
	at org.apache.solr.client.solrj.impl.HttpSolrClient$RemoteExecutionException.create(HttpSolrClient.java:830)
	at org.apache.solr.client.solrj.impl.HttpSolrClient.executeMethod(HttpSolrClient.java:620)
	at org.apache.solr.client.solrj.impl.HttpSolrClient.request(HttpSolrClient.java:255)
	at org.apache.solr.client.solrj.impl.HttpSolrClient.request(HttpSolrClient.java:244)
	at org.apache.solr.client.solrj.SolrRequest.process(SolrRequest.java:194)
	at org.apache.solr.client.solrj.SolrRequest.process(SolrRequest.java:211)
	at org.apache.solr.client.solrj.request.SchemaTest.deleteCopyFieldShouldFailWhenOneOfTheFieldsDoesntExistInTheSchema(SchemaTest.java:841)
	at java.base/jdk.internal.reflect.NativeMethodAccessorImpl.invoke0(Native Method)
	at java.base/jdk.internal.reflect.NativeMethodAccessorImpl.invoke(NativeMethodAccessorImpl.java:62)
	at java.base/jdk.internal.reflect.DelegatingMethodAccessorImpl.invoke(DelegatingMethodAccessorImpl.java:43)
	at java.base/java.lang.reflect.Method.invoke(Method.java:564)
	at com.carrotsearch.randomizedtesting.RandomizedRunner.invoke(RandomizedRunner.java:1737)
	at com.carrotsearch.randomizedtesting.RandomizedRunner$8.evaluate(RandomizedRunner.java:934)
	at com.carrotsearch.randomizedtesting.RandomizedRunner$9.evaluate(RandomizedRunner.java:970)
	at com.carrotsearch.randomizedtesting.RandomizedRunner$10.evaluate(RandomizedRunner.java:984)
	at com.carrotsearch.randomizedtesting.rules.SystemPropertiesRestoreRule$1.evaluate(SystemPropertiesRestoreRule.java:57)
	at org.apache.lucene.util.TestRuleSetupTeardownChained$1.evaluate(TestRuleSetupTeardownChained.java:49)
	at org.apache.lucene.util.AbstractBeforeAfterRule$1.evaluate(AbstractBeforeAfterRule.java:45)
	at org.apache.lucene.util.TestRuleThreadAndTestName$1.evaluate(TestRuleThreadAndTestName.java:48)
	at org.apache.lucene.util.TestRuleIgnoreAfterMaxFailures$1.evaluate(TestRuleIgnoreAfterMaxFailures.java:64)
	at org.apache.lucene.util.TestRuleMarkFailure$1.evaluate(TestRuleMarkFailure.java:47)
	at com.carrotsearch.randomizedtesting.rules.StatementAdapter.evaluate(StatementAdapter.java:36)
	at com.carrotsearch.randomizedtesting.ThreadLeakControl$StatementRunner.run(ThreadLeakControl.java:368)
	at com.carrotsearch.randomizedtesting.ThreadLeakControl.forkTimeoutingTask(ThreadLeakControl.java:817)
	at com.carrotsearch.randomizedtesting.ThreadLeakControl$3.evaluate(ThreadLeakControl.java:468)
	at com.carrotsearch.randomizedtesting.RandomizedRunner.runSingleTest(RandomizedRunner.java:943)
	at com.carrotsearch.randomizedtesting.RandomizedRunner$5.evaluate(RandomizedRunner.java:829)
	at com.carrotsearch.randomizedtesting.RandomizedRunner$6.evaluate(RandomizedRunner.java:879)
	at com.carrotsearch.randomizedtesting.RandomizedRunner$7.evaluate(RandomizedRunner.java:890)
	at com.carrotsearch.randomizedtesting.rules.StatementAdapter.evaluate(StatementAdapter.java:36)
	at com.carrotsearch.randomizedtesting.rules.SystemPropertiesRestoreRule$1.evaluate(SystemPropertiesRestoreRule.java:57)
	at org.apache.lucene.util.AbstractBeforeAfterRule$1.evaluate(AbstractBeforeAfterRule.java:45)
	at com.carrotsearch.randomizedtesting.rules.StatementAdapter.evaluate(StatementAdapter.java:36)
	at org.apache.lucene.util.TestRuleStoreClassName$1.evaluate(TestRuleStoreClassName.java:41)
	at com.carrotsearch.randomizedtesting.rules.NoShadowingOrOverridesOnMethodsRule$1.evaluate(NoShadowingOrOverridesOnMethodsRule.java:40)
	at com.carrotsearch.randomizedtesting.rules.NoShadowingOrOverridesOnMethodsRule$1.evaluate(NoShadowingOrOverridesOnMethodsRule.java:40)
	at com.carrotsearch.randomizedtesting.rules.StatementAdapter.evaluate(StatementAdapter.java:36)
	at com.carrotsearch.randomizedtesting.rules.StatementAdapter.evaluate(StatementAdapter.java:36)
	at org.apache.lucene.util.TestRuleAssertionsRequired$1.evaluate(TestRuleAssertionsRequired.java:53)
	at org.apache.lucene.util.TestRuleMarkFailure$1.evaluate(TestRuleMarkFailure.java:47)
	at org.apache.lucene.util.TestRuleIgnoreAfterMaxFailures$1.evaluate(TestRuleIgnoreAfterMaxFailures.java:64)
	at org.apache.lucene.util.TestRuleIgnoreTestSuites$1.evaluate(TestRuleIgnoreTestSuites.java:54)
	at com.carrotsearch.randomizedtesting.rules.StatementAdapter.evaluate(StatementAdapter.java:36)
	at com.carrotsearch.randomizedtesting.ThreadLeakControl$StatementRunner.run(ThreadLeakControl.java:368)
	at java.base/java.lang.Thread.run(Thread.java:844)


FAILED:  org.apache.solr.client.solrj.request.SchemaTest.addDynamicFieldShouldntBeCalledTwiceWithTheSameName

Error Message:
Error from server at http://127.0.0.1:56310/solr/collection1: error processing commands

Stack Trace:
org.apache.solr.client.solrj.impl.HttpSolrClient$RemoteExecutionException: Error from server at http://127.0.0.1:56310/solr/collection1: error processing commands
	at __randomizedtesting.SeedInfo.seed([EB3ABB9883346397:A1CAF4BE5B25D68A]:0)
	at org.apache.solr.client.solrj.impl.HttpSolrClient$RemoteExecutionException.create(HttpSolrClient.java:830)
	at org.apache.solr.client.solrj.impl.HttpSolrClient.executeMethod(HttpSolrClient.java:620)
	at org.apache.solr.client.solrj.impl.HttpSolrClient.request(HttpSolrClient.java:255)
	at org.apache.solr.client.solrj.impl.HttpSolrClient.request(HttpSolrClient.java:244)
	at org.apache.solr.client.solrj.SolrRequest.process(SolrRequest.java:194)
	at org.apache.solr.client.solrj.SolrRequest.process(SolrRequest.java:211)
	at org.apache.solr.client.solrj.request.SchemaTest.addDynamicFieldShouldntBeCalledTwiceWithTheSameName(SchemaTest.java:417)
	at java.base/jdk.internal.reflect.NativeMethodAccessorImpl.invoke0(Native Method)
	at java.base/jdk.internal.reflect.NativeMethodAccessorImpl.invoke(NativeMethodAccessorImpl.java:62)
	at java.base/jdk.internal.reflect.DelegatingMethodAccessorImpl.invoke(DelegatingMethodAccessorImpl.java:43)
	at java.base/java.lang.reflect.Method.invoke(Method.java:564)
	at com.carrotsearch.randomizedtesting.RandomizedRunner.invoke(RandomizedRunner.java:1737)
	at com.carrotsearch.randomizedtesting.RandomizedRunner$8.evaluate(RandomizedRunner.java:934)
	at com.carrotsearch.randomizedtesting.RandomizedRunner$9.evaluate(RandomizedRunner.java:970)
	at com.carrotsearch.randomizedtesting.RandomizedRunner$10.evaluate(RandomizedRunner.java:984)
	at com.carrotsearch.randomizedtesting.rules.SystemPropertiesRestoreRule$1.evaluate(SystemPropertiesRestoreRule.java:57)
	at org.apache.lucene.util.TestRuleSetupTeardownChained$1.evaluate(TestRuleSetupTeardownChained.java:49)
	at org.apache.lucene.util.AbstractBeforeAfterRule$1.evaluate(AbstractBeforeAfterRule.java:45)
	at org.apache.lucene.util.TestRuleThreadAndTestName$1.evaluate(TestRuleThreadAndTestName.java:48)
	at org.apache.lucene.util.TestRuleIgnoreAfterMaxFailures$1.evaluate(TestRuleIgnoreAfterMaxFailures.java:64)
	at org.apache.lucene.util.TestRuleMarkFailure$1.evaluate(TestRuleMarkFailure.java:47)
	at com.carrotsearch.randomizedtesting.rules.StatementAdapter.evaluate(StatementAdapter.java:36)
	at com.carrotsearch.randomizedtesting.ThreadLeakControl$StatementRunner.run(ThreadLeakControl.java:368)
	at com.carrotsearch.randomizedtesting.ThreadLeakControl.forkTimeoutingTask(ThreadLeakControl.java:817)
	at com.carrotsearch.randomizedtesting.ThreadLeakControl$3.evaluate(ThreadLeakControl.java:468)
	at com.carrotsearch.randomizedtesting.RandomizedRunner.runSingleTest(RandomizedRunner.java:943)
	at com.carrotsearch.randomizedtesting.RandomizedRunner$5.evaluate(RandomizedRunner.java:829)
	at com.carrotsearch.randomizedtesting.RandomizedRunner$6.evaluate(RandomizedRunner.java:879)
	at com.carrotsearch.randomizedtesting.RandomizedRunner$7.evaluate(RandomizedRunner.java:890)
	at com.carrotsearch.randomizedtesting.rules.StatementAdapter.evaluate(StatementAdapter.java:36)
	at com.carrotsearch.randomizedtesting.rules.SystemPropertiesRestoreRule$1.evaluate(SystemPropertiesRestoreRule.java:57)
	at org.apache.lucene.util.AbstractBeforeAfterRule$1.evaluate(AbstractBeforeAfterRule.java:45)
	at com.carrotsearch.randomizedtesting.rules.StatementAdapter.evaluate(StatementAdapter.java:36)
	at org.apache.lucene.util.TestRuleStoreClassName$1.evaluate(TestRuleStoreClassName.java:41)
	at com.carrotsearch.randomizedtesting.rules.NoShadowingOrOverridesOnMethodsRule$1.evaluate(NoShadowingOrOverridesOnMethodsRule.java:40)
	at com.carrotsearch.randomizedtesting.rules.NoShadowingOrOverridesOnMethodsRule$1.evaluate(NoShadowingOrOverridesOnMethodsRule.java:40)
	at com.carrotsearch.randomizedtesting.rules.StatementAdapter.evaluate(StatementAdapter.java:36)
	at com.carrotsearch.randomizedtesting.rules.StatementAdapter.evaluate(StatementAdapter.java:36)
	at org.apache.lucene.util.TestRuleAssertionsRequired$1.evaluate(TestRuleAssertionsRequired.java:53)
	at org.apache.lucene.util.TestRuleMarkFailure$1.evaluate(TestRuleMarkFailure.java:47)
	at org.apache.lucene.util.TestRuleIgnoreAfterMaxFailures$1.evaluate(TestRuleIgnoreAfterMaxFailures.java:64)
	at org.apache.lucene.util.TestRuleIgnoreTestSuites$1.evaluate(TestRuleIgnoreTestSuites.java:54)
	at com.carrotsearch.randomizedtesting.rules.StatementAdapter.evaluate(StatementAdapter.java:36)
	at com.carrotsearch.randomizedtesting.ThreadLeakControl$StatementRunner.run(ThreadLeakControl.java:368)
	at java.base/java.lang.Thread.run(Thread.java:844)


FAILED:  org.apache.solr.client.solrj.request.SchemaTest.addFieldTypeShouldntBeCalledTwiceWithTheSameName

Error Message:
Error from server at http://127.0.0.1:56312/solr/collection1: error processing commands

Stack Trace:
org.apache.solr.client.solrj.impl.HttpSolrClient$RemoteExecutionException: Error from server at http://127.0.0.1:56312/solr/collection1: error processing commands
	at __randomizedtesting.SeedInfo.seed([EB3ABB9883346397:2EDB49887D49713F]:0)
	at org.apache.solr.client.solrj.impl.HttpSolrClient$RemoteExecutionException.create(HttpSolrClient.java:830)
	at org.apache.solr.client.solrj.impl.HttpSolrClient.executeMethod(HttpSolrClient.java:620)
	at org.apache.solr.client.solrj.impl.HttpSolrClient.request(HttpSolrClient.java:255)
	at org.apache.solr.client.solrj.impl.HttpSolrClient.request(HttpSolrClient.java:244)
	at org.apache.solr.client.solrj.SolrRequest.process(SolrRequest.java:194)
	at org.apache.solr.client.solrj.SolrRequest.process(SolrRequest.java:211)
	at org.apache.solr.client.solrj.request.SchemaTest.addFieldTypeShouldntBeCalledTwiceWithTheSameName(SchemaTest.java:649)
	at java.base/jdk.internal.reflect.NativeMethodAccessorImpl.invoke0(Native Method)
	at java.base/jdk.internal.reflect.NativeMethodAccessorImpl.invoke(NativeMethodAccessorImpl.java:62)
	at java.base/jdk.internal.reflect.DelegatingMethodAccessorImpl.invoke(DelegatingMethodAccessorImpl.java:43)
	at java.base/java.lang.reflect.Method.invoke(Method.java:564)
	at com.carrotsearch.randomizedtesting.RandomizedRunner.invoke(RandomizedRunner.java:1737)
	at com.carrotsearch.randomizedtesting.RandomizedRunner$8.evaluate(RandomizedRunner.java:934)
	at com.carrotsearch.randomizedtesting.RandomizedRunner$9.evaluate(RandomizedRunner.java:970)
	at com.carrotsearch.randomizedtesting.RandomizedRunner$10.evaluate(RandomizedRunner.java:984)
	at com.carrotsearch.randomizedtesting.rules.SystemPropertiesRestoreRule$1.evaluate(SystemPropertiesRestoreRule.java:57)
	at org.apache.lucene.util.TestRuleSetupTeardownChained$1.evaluate(TestRuleSetupTeardownChained.java:49)
	at org.apache.lucene.util.AbstractBeforeAfterRule$1.evaluate(AbstractBeforeAfterRule.java:45)
	at org.apache.lucene.util.TestRuleThreadAndTestName$1.evaluate(TestRuleThreadAndTestName.java:48)
	at org.apache.lucene.util.TestRuleIgnoreAfterMaxFailures$1.evaluate(TestRuleIgnoreAfterMaxFailures.java:64)
	at org.apache.lucene.util.TestRuleMarkFailure$1.evaluate(TestRuleMarkFailure.java:47)
	at com.carrotsearch.randomizedtesting.rules.StatementAdapter.evaluate(StatementAdapter.java:36)
	at com.carrotsearch.randomizedtesting.ThreadLeakControl$StatementRunner.run(ThreadLeakControl.java:368)
	at com.carrotsearch.randomizedtesting.ThreadLeakControl.forkTimeoutingTask(ThreadLeakControl.java:817)
	at com.carrotsearch.randomizedtesting.ThreadLeakControl$3.evaluate(ThreadLeakControl.java:468)
	at com.carrotsearch.randomizedtesting.RandomizedRunner.runSingleTest(RandomizedRunner.java:943)
	at com.carrotsearch.randomizedtesting.RandomizedRunner$5.evaluate(RandomizedRunner.java:829)
	at com.carrotsearch.randomizedtesting.RandomizedRunner$6.evaluate(RandomizedRunner.java:879)
	at com.carrotsearch.randomizedtesting.RandomizedRunner$7.evaluate(RandomizedRunner.java:890)
	at com.carrotsearch.randomizedtesting.rules.StatementAdapter.evaluate(StatementAdapter.java:36)
	at com.carrotsearch.randomizedtesting.rules.SystemPropertiesRestoreRule$1.evaluate(SystemPropertiesRestoreRule.java:57)
	at org.apache.lucene.util.AbstractBeforeAfterRule$1.evaluate(AbstractBeforeAfterRule.java:45)
	at com.carrotsearch.randomizedtesting.rules.StatementAdapter.evaluate(StatementAdapter.java:36)
	at org.apache.lucene.util.TestRuleStoreClassName$1.evaluate(TestRuleStoreClassName.java:41)
	at com.carrotsearch.randomizedtesting.rules.NoShadowingOrOverridesOnMethodsRule$1.evaluate(NoShadowingOrOverridesOnMethodsRule.java:40)
	at com.carrotsearch.randomizedtesting.rules.NoShadowingOrOverridesOnMethodsRule$1.evaluate(NoShadowingOrOverridesOnMethodsRule.java:40)
	at com.carrotsearch.randomizedtesting.rules.StatementAdapter.evaluate(StatementAdapter.java:36)
	at com.carrotsearch.randomizedtesting.rules.StatementAdapter.evaluate(StatementAdapter.java:36)
	at org.apache.lucene.util.TestRuleAssertionsRequired$1.evaluate(TestRuleAssertionsRequired.java:53)
	at org.apache.lucene.util.TestRuleMarkFailure$1.evaluate(TestRuleMarkFailure.java:47)
	at org.apache.lucene.util.TestRuleIgnoreAfterMaxFailures$1.evaluate(TestRuleIgnoreAfterMaxFailures.java:64)
	at org.apache.lucene.util.TestRuleIgnoreTestSuites$1.evaluate(TestRuleIgnoreTestSuites.java:54)
	at com.carrotsearch.randomizedtesting.rules.StatementAdapter.evaluate(StatementAdapter.java:36)
	at com.carrotsearch.randomizedtesting.ThreadLeakControl$StatementRunner.run(ThreadLeakControl.java:368)
	at java.base/java.lang.Thread.run(Thread.java:844)




Build Log:
[...truncated 12896 lines...]
   [junit4] Suite: org.apache.solr.cloud.FullSolrCloudDistribCmdsTest
   [junit4]   2> 1813423 ERROR (Finalizer) [    ] o.a.s.c.CoreContainer CoreContainer was not close prior to finalize(), indicates a bug -- POSSIBLE RESOURCE LEAK!!!  instance=1499343282
   [junit4]   2> 1813423 ERROR (Finalizer) [    ] o.a.s.c.CoreContainer CoreContainer was not close prior to finalize(), indicates a bug -- POSSIBLE RESOURCE LEAK!!!  instance=1473613041
   [junit4]   2> 1813423 ERROR (Finalizer) [    ] o.a.s.c.CoreContainer CoreContainer was not close prior to finalize(), indicates a bug -- POSSIBLE RESOURCE LEAK!!!  instance=923563491
   [junit4]   2> 1813424 ERROR (Finalizer) [    ] o.a.s.c.CoreContainer CoreContainer was not close prior to finalize(), indicates a bug -- POSSIBLE RESOURCE LEAK!!!  instance=346517438
   [junit4]   2> 1813424 ERROR (Finalizer) [    ] o.a.s.c.CoreContainer CoreContainer was not close prior to finalize(), indicates a bug -- POSSIBLE RESOURCE LEAK!!!  instance=1008523041
   [junit4]   2> 1813424 ERROR (Finalizer) [    ] o.a.s.c.CoreContainer CoreContainer was not close prior to finalize(), indicates a bug -- POSSIBLE RESOURCE LEAK!!!  instance=1205167703
   [junit4]   2> 1813424 ERROR (Finalizer) [    ] o.a.s.c.CoreContainer CoreContainer was not close prior to finalize(), indicates a bug -- POSSIBLE RESOURCE LEAK!!!  instance=321036323
   [junit4]   2> 1813424 ERROR (Finalizer) [    ] o.a.s.c.CoreContainer CoreContainer was not close prior to finalize(), indicates a bug -- POSSIBLE RESOURCE LEAK!!!  instance=1012393830
   [junit4]   2> Creating dataDir: /Users/jenkins/workspace/Lucene-Solr-7.x-MacOSX/solr/build/solr-core/test/J0/temp/solr.cloud.FullSolrCloudDistribCmdsTest_D84B434FCC81BDBB-001/init-core-data-001
   [junit4]   2> 1813426 INFO  (SUITE-FullSolrCloudDistribCmdsTest-seed#[D84B434FCC81BDBB]-worker) [    ] o.a.s.SolrTestCaseJ4 Using PointFields (NUMERIC_POINTS_SYSPROP=true) w/NUMERIC_DOCVALUES_SYSPROP=true
   [junit4]   2> 1813427 INFO  (SUITE-FullSolrCloudDistribCmdsTest-seed#[D84B434FCC81BDBB]-worker) [    ] o.a.s.SolrTestCaseJ4 Randomized ssl (false) and clientAuth (false) via: @org.apache.solr.SolrTestCaseJ4$SuppressSSL(bugUrl="https://issues.apache.org/jira/browse/SOLR-5776") w/ MAC_OS_X supressed clientAuth
   [junit4]   2> 1813427 INFO  (SUITE-FullSolrCloudDistribCmdsTest-seed#[D84B434FCC81BDBB]-worker) [    ] o.a.s.SolrTestCaseJ4 SecureRandom sanity checks: test.solr.allowed.securerandom=null & java.security.egd=file:/dev/./urandom
   [junit4]   2> 1813427 INFO  (SUITE-FullSolrCloudDistribCmdsTest-seed#[D84B434FCC81BDBB]-worker) [    ] o.a.s.BaseDistributedSearchTestCase Setting hostContext system property: /cuvw/ow
   [junit4]   2> 1813428 INFO  (TEST-FullSolrCloudDistribCmdsTest.test-seed#[D84B434FCC81BDBB]) [    ] o.a.s.c.ZkTestServer STARTING ZK TEST SERVER
   [junit4]   2> 1813428 INFO  (Thread-3986) [    ] o.a.s.c.ZkTestServer client port:0.0.0.0/0.0.0.0:0
   [junit4]   2> 1813428 INFO  (Thread-3986) [    ] o.a.s.c.ZkTestServer Starting server
   [junit4]   2> 1813430 ERROR (Thread-3986) [    ] o.a.z.s.ZooKeeperServer ZKShutdownHandler is not registered, so ZooKeeper server won't take any action on ERROR or SHUTDOWN server state changes
   [junit4]   2> 1813536 INFO  (TEST-FullSolrCloudDistribCmdsTest.test-seed#[D84B434FCC81BDBB]) [    ] o.a.s.c.ZkTestServer start zk server on port:50206
   [junit4]   2> 1813574 INFO  (zkConnectionManagerCallback-5093-thread-1) [    ] o.a.s.c.c.ConnectionManager zkClient has connected
   [junit4]   2> 1813581 INFO  (zkConnectionManagerCallback-5095-thread-1) [    ] o.a.s.c.c.ConnectionManager zkClient has connected
   [junit4]   2> 1813596 INFO  (TEST-FullSolrCloudDistribCmdsTest.test-seed#[D84B434FCC81BDBB]) [    ] o.a.s.c.AbstractZkTestCase put /Users/jenkins/workspace/Lucene-Solr-7.x-MacOSX/solr/core/src/test-files/solr/collection1/conf/solrconfig-tlog.xml to /configs/conf1/solrconfig.xml
   [junit4]   2> 1813600 INFO  (TEST-FullSolrCloudDistribCmdsTest.test-seed#[D84B434FCC81BDBB]) [    ] o.a.s.c.AbstractZkTestCase put /Users/jenkins/workspace/Lucene-Solr-7.x-MacOSX/solr/core/src/test-files/solr/collection1/conf/schema15.xml to /configs/conf1/schema.xml
   [junit4]   2> 1813604 INFO  (TEST-FullSolrCloudDistribCmdsTest.test-seed#[D84B434FCC81BDBB]) [    ] o.a.s.c.AbstractZkTestCase put /Users/jenkins/workspace/Lucene-Solr-7.x-MacOSX/solr/core/src/test-files/solr/collection1/conf/solrconfig.snippet.randomindexconfig.xml to /configs/conf1/solrconfig.snippet.randomindexconfig.xml
   [junit4]   2> 1813606 INFO  (TEST-FullSolrCloudDistribCmdsTest.test-seed#[D84B434FCC81BDBB]) [    ] o.a.s.c.AbstractZkTestCase put /Users/jenkins/workspace/Lucene-Solr-7.x-MacOSX/solr/core/src/test-files/solr/collection1/conf/stopwords.txt to /configs/conf1/stopwords.txt
   [junit4]   2> 1813608 INFO  (TEST-FullSolrCloudDistribCmdsTest.test-seed#[D84B434FCC81BDBB]) [    ] o.a.s.c.AbstractZkTestCase put /Users/jenkins/workspace/Lucene-Solr-7.x-MacOSX/solr/core/src/test-files/solr/collection1/conf/protwords.txt to /configs/conf1/protwords.txt
   [junit4]   2> 1813610 INFO  (TEST-FullSolrCloudDistribCmdsTest.test-seed#[D84B434FCC81BDBB]) [    ] o.a.s.c.AbstractZkTestCase put /Users/jenkins/workspace/Lucene-Solr-7.x-MacOSX/solr/core/src/test-files/solr/collection1/conf/currency.xml to /configs/conf1/currency.xml
   [junit4]   2> 1813613 INFO  (TEST-FullSolrCloudDistribCmdsTest.test-seed#[D84B434FCC81BDBB]) [    ] o.a.s.c.AbstractZkTestCase put /Users/jenkins/workspace/Lucene-Solr-7.x-MacOSX/solr/core/src/test-files/solr/collection1/conf/enumsConfig.xml to /configs/conf1/enumsConfig.xml
   [junit4]   2> 1813615 INFO  (TEST-FullSolrCloudDistribCmdsTest.test-seed#[D84B434FCC81BDBB]) [    ] o.a.s.c.AbstractZkTestCase put /Users/jenkins/workspace/Lucene-Solr-7.x-MacOSX/solr/core/src/test-files/solr/collection1/conf/open-exchange-rates.json to /configs/conf1/open-exchange-rates.json
   [junit4]   2> 1813617 INFO  (TEST-FullSolrCloudDistribCmdsTest.test-seed#[D84B434FCC81BDBB]) [    ] o.a.s.c.AbstractZkTestCase put /Users/jenkins/workspace/Lucene-Solr-7.x-MacOSX/solr/core/src/test-files/solr/collection1/conf/mapping-ISOLatin1Accent.txt to /configs/conf1/mapping-ISOLatin1Accent.txt
   [junit4]   2> 1813619 INFO  (TEST-FullSolrCloudDistribCmdsTest.test-seed#[D84B434FCC81BDBB]) [    ] o.a.s.c.AbstractZkTestCase put /Users/jenkins/workspace/Lucene-Solr-7.x-MacOSX/solr/core/src/test-files/solr/collection1/conf/old_synonyms.txt to /configs/conf1/old_synonyms.txt
   [junit4]   2> 1813621 INFO  (TEST-FullSolrCloudDistribCmdsTest.test-seed#[D84B434FCC81BDBB]) [    ] o.a.s.c.AbstractZkTestCase put /Users/jenkins/workspace/Lucene-Solr-7.x-MacOSX/solr/core/src/test-files/solr/collection1/conf/synonyms.txt to /configs/conf1/synonyms.txt
   [junit4]   2> 1813624 INFO  (TEST-FullSolrCloudDistribCmdsTest.test-seed#[D84B434FCC81BDBB]) [    ] o.a.s.c.AbstractFullDistribZkTestBase Will use NRT replicas unless explicitly asked otherwise
   [junit4]   2> 1813938 INFO  (TEST-FullSolrCloudDistribCmdsTest.test-seed#[D84B434FCC81BDBB]) [    ] o.e.j.s.Server jetty-9.3.20.v20170531
   [junit4]   2> 1813940 INFO  (TEST-FullSolrCloudDistribCmdsTest.test-seed#[D84B434FCC81BDBB]) [    ] o.e.j.s.h.ContextHandler Started o.e.j.s.ServletContextHandler@5da0cfda{/cuvw/ow,null,AVAILABLE}
   [junit4]   2> 1813940 INFO  (TEST-FullSolrCloudDistribCmdsTest.test-seed#[D84B434FCC81BDBB]) [    ] o.e.j.s.AbstractConnector Started ServerConnector@533758cb{HTTP/1.1,[http/1.1]}{127.0.0.1:50209}
   [junit4]   2> 1813940 INFO  (TEST-FullSolrCloudDistribCmdsTest.test-seed#[D84B434FCC81BDBB]) [    ] o.e.j.s.Server Started @1817194ms
   [junit4]   2> 1813940 INFO  (TEST-FullSolrCloudDistribCmdsTest.test-seed#[D84B434FCC81BDBB]) [    ] o.a.s.c.s.e.JettySolrRunner Jetty properties: {hostContext=/cuvw/ow, solr.data.dir=/Users/jenkins/workspace/Lucene-Solr-7.x-MacOSX/solr/build/solr-core/test/J0/temp/solr.cloud.FullSolrCloudDistribCmdsTest_D84B434FCC81BDBB-001/tempDir-001/control/data, hostPort=50209, coreRootDirectory=/Users/jenkins/workspace/Lucene-Solr-7.x-MacOSX/solr/build/solr-core/test/J0/temp/solr.cloud.FullSolrCloudDistribCmdsTest_D84B434FCC81BDBB-001/control-001/cores, replicaType=NRT}
   [junit4]   2> 1813940 ERROR (TEST-FullSolrCloudDistribCmdsTest.test-seed#[D84B434FCC81BDBB]) [    ] o.a.s.u.StartupLoggingUtils Missing Java Option solr.log.dir. Logging may be missing or incomplete.
   [junit4]   2> 1813941 INFO  (TEST-FullSolrCloudDistribCmdsTest.test-seed#[D84B434FCC81BDBB]) [    ] o.a.s.s.SolrDispatchFilter  ___      _       Welcome to Apache Solr? version 7.3.0
   [junit4]   2> 1813941 INFO  (TEST-FullSolrCloudDistribCmdsTest.test-seed#[D84B434FCC81BDBB]) [    ] o.a.s.s.SolrDispatchFilter / __| ___| |_ _   Starting in cloud mode on port null
   [junit4]   2> 1813941 INFO  (TEST-FullSolrCloudDistribCmdsTest.test-seed#[D84B434FCC81BDBB]) [    ] o.a.s.s.SolrDispatchFilter \__ \/ _ \ | '_|  Install dir: null
   [junit4]   2> 1813941 INFO  (TEST-FullSolrCloudDistribCmdsTest.test-seed#[D84B434FCC81BDBB]) [    ] o.a.s.s.SolrDispatchFilter |___/\___/_|_|    Start time: 2018-01-09T17:13:00.913153Z
   [junit4]   2> 1813942 INFO  (zkConnectionManagerCallback-5097-thread-1) [    ] o.a.s.c.c.ConnectionManager zkClient has connected
   [junit4]   2> 1813943 INFO  (TEST-FullSolrCloudDistribCmdsTest.test-seed#[D84B434FCC81BDBB]) [    ] o.a.s.s.SolrDispatchFilter Loading solr.xml from SolrHome (not found in ZooKeeper)
   [junit4]   2> 1813943 INFO  (TEST-FullSolrCloudDistribCmdsTest.test-seed#[D84B434FCC81BDBB]) [    ] o.a.s.c.SolrXmlConfig Loading container configuration from /Users/jenkins/workspace/Lucene-Solr-7.x-MacOSX/solr/build/solr-core/test/J0/temp/solr.cloud.FullSolrCloudDistribCmdsTest_D84B434FCC81BDBB-001/control-001/solr.xml
   [junit4]   2> 1813945 INFO  (TEST-FullSolrCloudDistribCmdsTest.test-seed#[D84B434FCC81BDBB]) [    ] o.a.s.c.SolrXmlConfig Configuration parameter autoReplicaFailoverWorkLoopDelay is ignored
   [junit4]   2> 1813945 INFO  (TEST-FullSolrCloudDistribCmdsTest.test-seed#[D84B434FCC81BDBB]) [    ] o.a.s.c.SolrXmlConfig Configuration parameter autoReplicaFailoverBadNodeExpiration is ignored
   [junit4]   2> 1813946 INFO  (TEST-FullSolrCloudDistribCmdsTest.test-seed#[D84B434FCC81BDBB]) [    ] o.a.s.c.SolrXmlConfig MBean server found: com.sun.jmx.mbeanserver.JmxMBeanServer@45ceb74e, but no JMX reporters were configured - adding default JMX reporter.
   [junit4]   2> 1813948 INFO  (TEST-FullSolrCloudDistribCmdsTest.test-seed#[D84B434FCC81BDBB]) [    ] o.a.s.c.ZkContainer Zookeeper client=127.0.0.1:50206/solr
   [junit4]   2> 1813949 INFO  (zkConnectionManagerCallback-5101-thread-1) [    ] o.a.s.c.c.ConnectionManager zkClient has connected
   [junit4]   2> 1813952 INFO  (zkConnectionManagerCallback-5103-thread-1-processing-n:127.0.0.1:50209_cuvw%2Fow) [n:127.0.0.1:50209_cuvw%2Fow    ] o.a.s.c.c.ConnectionManager zkClient has connected
   [junit4]   2> 1814071 INFO  (TEST-FullSolrCloudDistribCmdsTest.test-seed#[D84B434FCC81BDBB]) [n:127.0.0.1:50209_cuvw%2Fow    ] o.a.s.c.Overseer Overseer (id=null) closing
   [junit4]   2> 1814072 INFO  (TEST-FullSolrCloudDistribCmdsTest.test-seed#[D84B434FCC81BDBB]) [n:127.0.0.1:50209_cuvw%2Fow    ] o.a.s.c.OverseerElectionContext I am going to be the leader 127.0.0.1:50209_cuvw%2Fow
   [junit4]   2> 1814073 INFO  (TEST-FullSolrCloudDistribCmdsTest.test-seed#[D84B434FCC81BDBB]) [n:127.0.0.1:50209_cuvw%2Fow    ] o.a.s.c.Overseer Overseer (id=99320986363625476-127.0.0.1:50209_cuvw%2Fow-n_0000000000) starting
   [junit4]   2> 1814083 INFO  (TEST-FullSolrCloudDistribCmdsTest.test-seed#[D84B434FCC81BDBB]) [n:127.0.0.1:50209_cuvw%2Fow    ] o.a.s.c.ZkController Register node as live in ZooKeeper:/live_nodes/127.0.0.1:50209_cuvw%2Fow
   [junit4]   2> 1814084 INFO  (OverseerStateUpdate-99320986363625476-127.0.0.1:50209_cuvw%2Fow-n_0000000000) [n:127.0.0.1:50209_cuvw%2Fow    ] o.a.s.c.c.ZkStateReader Updated live nodes from ZooKeeper... (0) -> (1)
   [junit4]   2> 1814135 INFO  (TEST-FullSolrCloudDistribCmdsTest.test-seed#[D84B434FCC81BDBB]) [n:127.0.0.1:50209_cuvw%2Fow    ] o.a.s.m.r.SolrJmxReporter JMX monitoring for 'solr.node' (registry 'solr.node') enabled at server: com.sun.jmx.mbeanserver.JmxMBeanServer@45ceb74e
   [junit4]   2> 1814143 INFO  (TEST-FullSolrCloudDistribCmdsTest.test-seed#[D84B434FCC81BDBB]) [n:127.0.0.1:50209_cuvw%2Fow    ] o.a.s.m.r.SolrJmxReporter JMX monitoring for 'solr.jvm' (registry 'solr.jvm') enabled at server: com.sun.jmx.mbeanserver.JmxMBeanServer@45ceb74e
   [junit4]   2> 1814143 INFO  (TEST-FullSolrCloudDistribCmdsTest.test-seed#[D84B434FCC81BDBB]) [n:127.0.0.1:50209_cuvw%2Fow    ] o.a.s.m.r.SolrJmxReporter JMX monitoring for 'solr.jetty' (registry 'solr.jetty') enabled at server: com.sun.jmx.mbeanserver.JmxMBeanServer@45ceb74e
   [junit4]   2> 1814144 INFO  (TEST-FullSolrCloudDistribCmdsTest.test-seed#[D84B434FCC81BDBB]) [n:127.0.0.1:50209_cuvw%2Fow    ] o.a.s.c.CorePropertiesLocator Found 0 core definitions underneath /Users/jenkins/workspace/Lucene-Solr-7.x-MacOSX/solr/build/solr-core/test/J0/temp/solr.cloud.FullSolrCloudDistribCmdsTest_D84B434FCC81BDBB-001/control-001/cores
   [junit4]   2> 1814157 INFO  (zkConnectionManagerCallback-5109-thread-1) [    ] o.a.s.c.c.ConnectionManager zkClient has connected
   [junit4]   2> 1814159 INFO  (TEST-FullSolrCloudDistribCmdsTest.test-seed#[D84B434FCC81BDBB]) [    ] o.a.s.c.c.ZkStateReader Updated live nodes from ZooKeeper... (0) -> (1)
   [junit4]   2> 1814160 INFO  (TEST-FullSolrCloudDistribCmdsTest.test-seed#[D84B434FCC81BDBB]) [    ] o.a.s.c.s.i.ZkClientClusterStateProvider Cluster at 127.0.0.1:50206/solr ready
   [junit4]   2> 1814161 INFO  (qtp2127340067-20225) [n:127.0.0.1:50209_cuvw%2Fow    ] o.a.s.h.a.CollectionsHandler Invoked Collection Action :create with params replicationFactor=1&collection.configName=conf1&name=control_collection&nrtReplicas=1&action=CREATE&numShards=1&createNodeSet=127.0.0.1:50209_cuvw%252Fow&wt=javabin&version=2 and sendToOCPQueue=true
   [junit4]   2> 1814163 INFO  (OverseerThreadFactory-8647-thread-1-processing-n:127.0.0.1:50209_cuvw%2Fow) [n:127.0.0.1:50209_cuvw%2Fow    ] o.a.s.c.CreateCollectionCmd Create collection control_collection
   [junit4]   2> 1814286 INFO  (qtp2127340067-20227) [n:127.0.0.1:50209_cuvw%2Fow    ] o.a.s.h.a.CoreAdminOperation core create command qt=/admin/cores&collection.configName=conf1&newCollection=true&name=control_collection_shard1_replica_n1&action=CREATE&numShards=1&collection=control_collection&shard=shard1&wt=javabin&version=2&replicaType=NRT
   [junit4]   2> 1814287 INFO  (qtp2127340067-20227) [n:127.0.0.1:50209_cuvw%2Fow    ] o.a.s.c.TransientSolrCoreCacheDefault Allocating transient cache for 4 transient cores
   [junit4]   2> 1814399 INFO  (zkCallback-5102-thread-1-processing-n:127.0.0.1:50209_cuvw%2Fow) [n:127.0.0.1:50209_cuvw%2Fow    ] o.a.s.c.c.ZkStateReader A cluster state change: [WatchedEvent state:SyncConnected type:NodeDataChanged path:/collections/control_collection/state.json] for collection [control_collection] has occurred - updating... (live nodes size: [1])
   [junit4]   2> 1815311 INFO  (qtp2127340067-20227) [n:127.0.0.1:50209_cuvw%2Fow c:control_collection s:shard1  x:control_collection_shard1_replica_n1] o.a.s.c.SolrConfig Using Lucene MatchVersion: 7.3.0
   [junit4]   2> 1815322 INFO  (qtp2127340067-20227) [n:127.0.0.1:50209_cuvw%2Fow c:control_collection s:shard1  x:control_collection_shard1_replica_n1] o.a.s.s.IndexSchema [control_collection_shard1_replica_n1] Schema name=test
   [junit4]   2> 1815376 INFO  (qtp2127340067-20227) [n:127.0.0.1:50209_cuvw%2Fow c:control_collection s:shard1  x:control_collection_shard1_replica_n1] o.a.s.s.IndexSchema Loaded schema test/1.6 with uniqueid field id
   [junit4]   2> 1815394 INFO  (qtp2127340067-20227) [n:127.0.0.1:50209_cuvw%2Fow c:control_collection s:shard1  x:control_collection_shard1_replica_n1] o.a.s.c.CoreContainer Creating SolrCore 'control_collection_shard1_replica_n1' using configuration from collection control_collection, trusted=true
   [junit4]   2> 1815395 INFO  (qtp2127340067-20227) [n:127.0.0.1:50209_cuvw%2Fow c:control_collection s:shard1  x:control_collection_shard1_replica_n1] o.a.s.m.r.SolrJmxReporter JMX monitoring for 'solr.core.control_collection.shard1.replica_n1' (registry 'solr.core.control_collection.shard1.replica_n1') enabled at server: com.sun.jmx.mbeanserver.JmxMBeanServer@45ceb74e
   [junit4]   2> 1815395 INFO  (qtp2127340067-20227) [n:127.0.0.1:50209_cuvw%2Fow c:control_collection s:shard1  x:control_collection_shard1_replica_n1] o.a.s.c.SolrCore solr.RecoveryStrategy.Builder
   [junit4]   2> 1815395 INFO  (qtp2127340067-20227) [n:127.0.0.1:50209_cuvw%2Fow c:control_collection s:shard1  x:control_collection_shard1_replica_n1] o.a.s.c.SolrCore [[control_collection_shard1_replica_n1] ] Opening new SolrCore at [/Users/jenkins/workspace/Lucene-Solr-7.x-MacOSX/solr/build/solr-core/test/J0/temp/solr.cloud.FullSolrCloudDistribCmdsTest_D84B434FCC81BDBB-001/control-001/cores/control_collection_shard1_replica_n1], dataDir=[/Users/jenkins/workspace/Lucene-Solr-7.x-MacOSX/solr/build/solr-core/test/J0/temp/solr.cloud.FullSolrCloudDistribCmdsTest_D84B434FCC81BDBB-001/control-001/cores/control_collection_shard1_replica_n1/data/]
   [junit4]   2> 1815396 INFO  (qtp2127340067-20227) [n:127.0.0.1:50209_cuvw%2Fow c:control_collection s:shard1  x:control_collection_shard1_replica_n1] o.a.s.u.RandomMergePolicy RandomMergePolicy wrapping class org.apache.lucene.index.TieredMergePolicy: [TieredMergePolicy: maxMergeAtOnce=46, maxMergeAtOnceExplicit=46, maxMergedSegmentMB=29.67578125, floorSegmentMB=1.921875, forceMergeDeletesPctAllowed=7.588484189980816, segmentsPerTier=10.0, maxCFSSegmentSizeMB=8.796093022207999E12, noCFSRatio=1.0
   [junit4]   2> 1815398 WARN  (qtp2127340067-20227) [n:127.0.0.1:50209_cuvw%2Fow c:control_collection s:shard1  x:control_collection_shard1_replica_n1] o.a.s.c.RequestHandlers INVALID paramSet a in requestHandler {type = requestHandler,name = /dump,class = DumpRequestHandler,attributes = {initParams=a, name=/dump, class=DumpRequestHandler},args = {defaults={a=A,b=B}}}
   [junit4]   2> 1815427 INFO  (qtp2127340067-20227) [n:127.0.0.1:50209_cuvw%2Fow c:control_collection s:shard1  x:control_collection_shard1_replica_n1] o.a.s.u.UpdateHandler Using UpdateLog implementation: org.apache.solr.update.UpdateLog
   [junit4]   2> 1815427 INFO  (qtp2127340067-20227) [n:127.0.0.1:50209_cuvw%2Fow c:control_collection s:shard1  x:control_collection_shard1_replica_n1] o.a.s.u.UpdateLog Initializing UpdateLog: dataDir= defaultSyncLevel=FLUSH numRecordsToKeep=100 maxNumLogsToKeep=10 numVersionBuckets=65536
   [junit4]   2> 1815428 INFO  (qtp2127340067-20227) [n:127.0.0.1:50209_cuvw%2Fow c:control_collection s:shard1  x:control_collection_shard1_replica_n1] o.a.s.u.CommitTracker Hard AutoCommit: disabled
   [junit4]   2> 1815428 INFO  (qtp2127340067-20227) [n:127.0.0.1:50209_cuvw%2Fow c:control_collection s:shard1  x:control_collection_shard1_replica_n1] o.a.s.u.CommitTracker Soft AutoCommit: disabled
   [junit4]   2> 1815429 INFO  (qtp2127340067-20227) [n:127.0.0.1:50209_cuvw%2Fow c:control_collection s:shard1  x:control_collection_shard1_replica_n1] o.a.s.u.RandomMergePolicy RandomMergePolicy wrapping class org.apache.lucene.index.LogByteSizeMergePolicy: [LogByteSizeMergePolicy: minMergeSize=1677721, mergeFactor=18, maxMergeSize=2147483648, maxMergeSizeForForcedMerge=9223372036854775807, calibrateSizeByDeletes=true, maxMergeDocs=2147483647, maxCFSSegmentSizeMB=8.796093022207999E12, noCFSRatio=0.6258483312993698]
   [junit4]   2> 1815429 INFO  (qtp2127340067-20227) [n:127.0.0.1:50209_cuvw%2Fow c:control_collection s:shard1  x:control_collection_shard1_replica_n1] o.a.s.s.SolrIndexSearcher Opening [Searcher@613d653c[control_collection_shard1_replica_n1] main]
   [junit4]   2> 1815430 INFO  (qtp2127340067-20227) [n:127.0.0.1:50209_cuvw%2Fow c:control_collection s:shard1  x:control_collection_shard1_replica_n1] o.a.s.r.ManagedResourceStorage Configured ZooKeeperStorageIO with znodeBase: /configs/conf1
   [junit4]   2> 1815431 INFO  (qtp2127340067-20227) [n:127.0.0.1:50209_cuvw%2Fow c:control_collection s:shard1  x:control_collection_shard1_replica_n1] o.a.s.r.ManagedResourceStorage Loaded null at path _rest_managed.json using ZooKeeperStorageIO:path=/configs/conf1
   [junit4]   2> 1815431 INFO  (qtp2127340067-20227) [n:127.0.0.1:50209_cuvw%2Fow c:control_collection s:shard1  x:control_collection_shard1_replica_n1] o.a.s.h.ReplicationHandler Commits will be reserved for 10000ms.
   [junit4]   2> 1815431 INFO  (qtp2127340067-20227) [n:127.0.0.1:50209_cuvw%2Fow c:control_collection s:shard1  x:control_collection_shard1_replica_n1] o.a.s.u.UpdateLog Could not find max version in index or recent updates, using new clock 1589135783916208128
   [junit4]   2> 1815432 INFO  (searcherExecutor-8650-thread-1-processing-n:127.0.0.1:50209_cuvw%2Fow x:control_collection_shard1_replica_n1 s:shard1 c:control_collection) [n:127.0.0.1:50209_cuvw%2Fow c:control_collection s:shard1  x:control_collection_shard1_replica_n1] o.a.s.c.SolrCore [control_collection_shard1_replica_n1] Registered new searcher Searcher@613d653c[control_collection_shard1_replica_n1] main{ExitableDirectoryReader(UninvertingDirectoryReader())}
   [junit4]   2> 1815437 INFO  (qtp2127340067-20227) [n:127.0.0.1:50209_cuvw%2Fow c:control_collection s:shard1  x:control_collection_shard1_replica_n1] o.a.s.c.ShardLeaderElectionContext Enough replicas found to continue.
   [junit4]   2> 1815437 INFO  (qtp2127340067-20227) [n:127.0.0.1:50209_cuvw%2Fow c:control_collection s:shard1  x:control_collection_shard1_replica_n1] o.a.s.c.ShardLeaderElectionContext I may be the new leader - try and sync
   [junit4]   2> 1815437 INFO  (qtp2127340067-20227) [n:127.0.0.1:50209_cuvw%2Fow c:control_collection s:shard1  x:control_collection_shard1_replica_n1] o.a.s.c.SyncStrategy Sync replicas to http://127.0.0.1:50209/cuvw/ow/control_collection_shard1_replica_n1/
   [junit4]   2> 1815437 INFO  (qtp2127340067-20227) [n:127.0.0.1:50209_cuvw%2Fow c:control_collection s:shard1  x:control_collection_shard1_replica_n1] o.a.s.c.SyncStrategy Sync Success - now sync replicas to me
   [junit4]   2> 1815437 INFO  (qtp2127340067-20227) [n:127.0.0.1:50209_cuvw%2Fow c:control_collection s:shard1  x:control_collection_shard1_replica_n1] o.a.s.c.SyncStrategy http://127.0.0.1:50209/cuvw/ow/control_collection_shard1_replica_n1/ has no replicas
   [junit4]   2> 1815437 INFO  (qtp2127340067-20227) [n:127.0.0.1:50209_cuvw%2Fow c:control_collection s:shard1  x:control_collection_shard1_replica_n1] o.a.s.c.ShardLeaderElectionContext Found all replicas participating in election, clear LIR
   [junit4]   2> 1815442 INFO  (qtp2127340067-20227) [n:127.0.0.1:50209_cuvw%2Fow c:control_collection s:shard1  x:control_collection_shard1_replica_n1] o.a.s.c.ShardLeaderElectionContext I am the new leader: http://127.0.0.1:50209/cuvw/ow/control_collection_shard1_replica_n1/ shard1
   [junit4]   2> 1815555 INFO  (zkCallback-5102-thread-2-processing-n:127.0.0.1:50209_cuvw%2Fow) [n:127.0.0.1:50209_cuvw%2Fow    ] o.a.s.c.c.ZkStateReader A cluster state change: [WatchedEvent state:SyncConnected type:NodeDataChanged path:/collections/control_collection/state.json] for collection [control_collection] has occurred - updating... (live nodes size: [1])
   [junit4]   2> 1815613 INFO  (qtp2127340067-20227) [n:127.0.0.1:50209_cuvw%2Fow c:control_collection s:shard1  x:control_collection_shard1_replica_n1] o.a.s.c.ZkController I am the leader, no recovery necessary
   [junit4]   2> 1815617 INFO  (qtp2127340067-20227) [n:127.0.0.1:50209_cuvw%2Fow c:control_collection s:shard1  x:control_collection_shard1_replica_n1] o.a.s.s.HttpSolrCall [admin] webapp=null path=/admin/cores params={qt=/admin/cores&collection.configName=conf1&newCollection=true&name=control_collection_shard1_replica_n1&action=CREATE&numShards=1&collection=control_collection&shard=shard1&wt=javabin&version=2&replicaType=NRT} status=0 QTime=1330
   [junit4]   2> 1815624 INFO  (qtp2127340067-20225) [n:127.0.0.1:50209_cuvw%2Fow    ] o.a.s.h.a.CollectionsHandler Wait for new collection to be active for at most 30 seconds. Check all shard replicas
   [junit4]   2> 1815729 INFO  (zkCallback-5102-thread-2-processing-n:127.0.0.1:50209_cuvw%2Fow) [n:127.0.0.1:50209_cuvw%2Fow    ] o.a.s.c.c.ZkStateReader A cluster state change: [WatchedEvent state:SyncConnected type:NodeDataChanged path:/collections/control_collection/state.json] for collection [control_collection] has occurred - updating... (live nodes size: [1])
   [junit4]   2> 1816167 INFO  (OverseerCollectionConfigSetProcessor-99320986363625476-127.0.0.1:50209_cuvw%2Fow-n_0000000000) [n:127.0.0.1:50209_cuvw%2Fow    ] o.a.s.c.OverseerTaskQueue Response ZK path: /overseer/collection-queue-work/qnr-0000000000 doesn't exist.  Requestor may have disconnected from ZooKeeper
   [junit4]   2> 1816627 INFO  (qtp2127340067-20225) [n:127.0.0.1:50209_cuvw%2Fow    ] o.a.s.s.HttpSolrCall [admin] webapp=null path=/admin/collections params={replicationFactor=1&collection.configName=conf1&name=control_collection&nrtReplicas=1&action=CREATE&numShards=1&createNodeSet=127.0.0.1:50209_cuvw%252Fow&wt=javabin&version=2} status=0 QTime=2465
   [junit4]   2> 1816635 INFO  (zkConnectionManagerCallback-5113-thread-1) [    ] o.a.s.c.c.ConnectionManager zkClient has connected
   [junit4]   2> 1816638 INFO  (TEST-FullSolrCloudDistribCmdsTest.test-seed#[D84B434FCC81BDBB]) [    ] o.a.s.c.c.ZkStateReader Updated live nodes from ZooKeeper... (0) -> (1)
   [junit4]   2> 1816641 INFO  (TEST-FullSolrCloudDistribCmdsTest.test-seed#[D84B434FCC81BDBB]) [    ] o.a.s.c.s.i.ZkClientClusterStateProvider Cluster at 127.0.0.1:50206/solr ready
   [junit4]   2> 1816642 INFO  (TEST-FullSolrCloudDistribCmdsTest.test-seed#[D84B434FCC81BDBB]) [    ] o.a.s.c.ChaosMonkey monkey: init - expire sessions:false cause connection loss:false
   [junit4]   2> 1816643 INFO  (qtp2127340067-20228) [n:127.0.0.1:50209_cuvw%2Fow    ] o.a.s.h.a.CollectionsHandler Invoked Collection Action :create with params replicationFactor=1&collection.configName=conf1&name=collection1&nrtReplicas=1&action=CREATE&numShards=3&createNodeSet=&stateFormat=2&wt=javabin&version=2 and sendToOCPQueue=true
   [junit4]   2> 1816649 INFO  (OverseerThreadFactory-8647-thread-2-processing-n:127.0.0.1:50209_cuvw%2Fow) [n:127.0.0.1:50209_cuvw%2Fow    ] o.a.s.c.CreateCollectionCmd Create collection collection1
   [junit4]   2> 1816651 WARN  (OverseerThreadFactory-8647-thread-2-processing-n:127.0.0.1:50209_cuvw%2Fow) [n:127.0.0.1:50209_cuvw%2Fow    ] o.a.s.c.CreateCollectionCmd It is unusual to create a collection (collection1) without cores.
   [junit4]   2> 1816877 INFO  (qtp2127340067-20228) [n:127.0.0.1:50209_cuvw%2Fow    ] o.a.s.h.a.CollectionsHandler Wait for new collection to be active for at most 30 seconds. Check all shard replicas
   [junit4]   2> 1816878 INFO  (qtp2127340067-20228) [n:127.0.0.1:50209_cuvw%2Fow    ] o.a.s.s.HttpSolrCall [admin] webapp=null path=/admin/collections params={replicationFactor=1&collection.configName=conf1&name=collection1&nrtReplicas=1&action=CREATE&numShards=3&createNodeSet=&stateFormat=2&wt=javabin&version=2} status=0 QTime=235
   [junit4]   2> 1817090 INFO  (TEST-FullSolrCloudDistribCmdsTest.test-seed#[D84B434FCC81BDBB]) [    ] o.a.s.c.AbstractFullDistribZkTestBase create jetty 1 in directory /Users/jenkins/workspace/Lucene-Solr-7.x-MacOSX/solr/build/solr-core/test/J0/temp/solr.cloud.FullSolrCloudDistribCmdsTest_D84B434FCC81BDBB-001/shard-1-001 of type NRT
   [junit4]   2> 1817090 INFO  (TEST-FullSolrCloudDistribCmdsTest.test-seed#[D84B434FCC81BDBB]) [    ] o.e.j.s.Server jetty-9.3.20.v20170531
   [junit4]   2> 1817092 INFO  (TEST-FullSolrCloudDistribCmdsTest.test-seed#[D84B434FCC81BDBB]) [    ] o.e.j.s.h.ContextHandler Started o.e.j.s.ServletContextHandler@4525e96c{/cuvw/ow,null,AVAILABLE}
   [junit4]   2> 1817092 INFO  (TEST-FullSolrCloudDistribCmdsTest.test-seed#[D84B434FCC81BDBB]) [    ] o.e.j.s.AbstractConnector Started ServerConnector@4b7e4554{HTTP/1.1,[http/1.1]}{127.0.0.1:50218}
   [junit4]   2> 1817092 INFO  (TEST-FullSolrCloudDistribCmdsTest.test-seed#[D84B434FCC81BDBB]) [    ] o.e.j.s.Server Started @1820346ms
   [junit4]   2> 1817092 INFO  (TEST-FullSolrCloudDistribCmdsTest.test-seed#[D84B434FCC81BDBB]) [    ] o.a.s.c.s.e.JettySolrRunner Jetty properties: {hostContext=/cuvw/ow, solrconfig=solrconfig.xml, solr.data.dir=/Users/jenkins/workspace/Lucene-Solr-7.x-MacOSX/solr/build/solr-core/test/J0/temp/solr.cloud.FullSolrCloudDistribCmdsTest_D84B434FCC81BDBB-001/tempDir-001/jetty1, hostPort=50218, coreRootDirectory=/Users/jenkins/workspace/Lucene-Solr-7.x-MacOSX/solr/build/solr-core/test/J0/../../../../../../../../../Users/jenkins/workspace/Lucene-Solr-7.x-MacOSX/solr/build/solr-core/test/J0/temp/solr.cloud.FullSolrCloudDistribCmdsTest_D84B434FCC81BDBB-001/shard-1-001/cores}
   [junit4]   2> 1817092 ERROR (TEST-FullSolrCloudDistribCmdsTest.test-seed#[D84B434FCC81BDBB]) [    ] o.a.s.u.StartupLoggingUtils Missing Java Option solr.log.dir. Logging may be missing or incomplete.
   [junit4]   2> 1817092 INFO  (TEST-FullSolrCloudDistribCmdsTest.test-seed#[D84B434FCC81BDBB]) [    ] o.a.s.s.SolrDispatchFilter  ___      _       Welcome to Apache Solr? version 7.3.0
   [junit4]   2> 1817093 INFO  (TEST-FullSolrCloudDistribCmdsTest.test-seed#[D84B434FCC81BDBB]) [    ] o.a.s.s.SolrDispatchFilter / __| ___| |_ _   Starting in cloud mode on port null
   [junit4]   2> 1817093 INFO  (TEST-FullSolrCloudDistribCmdsTest.test-seed#[D84B434FCC81BDBB]) [    ] o.a.s.s.SolrDispatchFilter \__ \/ _ \ | '_|  Install dir: null
   [junit4]   2> 1817093 INFO  (TEST-FullSolrCloudDistribCmdsTest.test-seed#[D84B434FCC81BDBB]) [    ] o.a.s.s.SolrDispatchFilter |___/\___/_|_|    Start time: 2018-01-09T17:13:04.065098Z
   [junit4]   2> 1817094 INFO  (zkConnectionManagerCallback-5115-thread-1) [    ] o.a.s.c.c.ConnectionManager zkClient has connected
   [junit4]   2> 1817095 INFO  (TEST-FullSolrCloudDistribCmdsTest.test-seed#[D84B434FCC81BDBB]) [    ] o.a.s.s.SolrDispatchFilter Loading solr.xml from SolrHome (not found in ZooKeeper)
   [junit4]   2> 1817095 INFO  (TEST-FullSolrCloudDistribCmdsTest.test-seed#[D84B434FCC81BDBB]) [    ] o.a.s.c.SolrXmlConfig Loading container configuration from /Users/jenkins/workspace/Lucene-Solr-7.x-MacOSX/solr/build/solr-core/test/J0/temp/solr.cloud.FullSolrCloudDistribCmdsTest_D84B434FCC81BDBB-001/shard-1-001/solr.xml
   [junit4]   2> 1817097 INFO  (TEST-FullSolrCloudDistribCmdsTest.test-seed#[D84B434FCC81BDBB]) [    ] o.a.s.c.SolrXmlConfig Configuration parameter autoReplicaFailoverWorkLoopDelay is ignored
   [junit4]   2> 1817097 INFO  (TEST-FullSolrCloudDistribCmdsTest.test-seed#[D84B434FCC81BDBB]) [    ] o.a.s.c.SolrXmlConfig Configuration parameter autoReplicaFailoverBadNodeExpiration is ignored
   [junit4]   2> 1817098 INFO  (TEST-FullSolrCloudDistribCmdsTest.test-seed#[D84B434FCC81BDBB]) [    ] o.a.s.c.SolrXmlConfig MBean server found: com.sun.jmx.mbeanserver.JmxMBeanServer@45ceb74e, but no JMX reporters were configured - adding default JMX reporter.
   [junit4]   2> 1817100 INFO  (TEST-FullSolrCloudDistribCmdsTest.test-seed#[D84B434FCC81BDBB]) [    ] o.a.s.c.ZkContainer Zookeeper client=127.0.0.1:50206/solr
   [junit4]   2> 1817101 INFO  (zkConnectionManagerCallback-5119-thread-1) [    ] o.a.s.c.c.ConnectionManager zkClient has connected
   [junit4]   2> 1817103 INFO  (zkConnectionManagerCallback-5121-thread-1-processing-n:127.0.0.1:50218_cuvw%2Fow) [n:127.0.0.1:50218_cuvw%2Fow    ] o.a.s.c.c.ConnectionManager zkClient has connected
   [junit4]   2> 1817113 INFO  (TEST-FullSolrCloudDistribCmdsTest.test-seed#[D84B434FCC81BDBB]) [n:127.0.0.1:50218_cuvw%2Fow    ] o.a.s.c.c.ZkStateReader Updated live nodes from ZooKeeper... (0) -> (1)
   [junit4]   2> 1817117 INFO  (TEST-FullSolrCloudDistribCmdsTest.test-seed#[D84B434FCC81BDBB]) [n:127.0.0.1:50218_cuvw%2Fow    ] o.a.s.c.Overseer Overseer (id=null) closing
   [junit4]   2> 1817119 INFO  (TEST-FullSolrCloudDistribCmdsTest.test-seed#[D84B434FCC81BDBB]) [n:127.0.0.1:50218_cuvw%2Fow    ] o.a.s.c.ZkController Register node as live in ZooKeeper:/live_nodes/127.0.0.1:50218_cuvw%2Fow
   [junit4]   2> 1817121 INFO  (zkCallback-5102-thread-2-processing-n:127.0.0.1:50209_cuvw%2Fow) [n:127.0.0.1:50209_cuvw%2Fow    ] o.a.s.c.c.ZkStateReader Updated live nodes from ZooKeeper... (1) -> (2)
   [junit4]   2> 1817121 INFO  (zkCallback-5120-thread-1-processing-n:127.0.0.1:50218_cuvw%2Fow) [n:127.0.0.1:50218_cuvw%2Fow    ] o.a.s.c.c.ZkStateReader Updated live nodes from ZooKeeper... (1) -> (2)
   [junit4]   2> 1817121 INFO  (zkCallback-5112-thread-1) [    ] o.a.s.c.c.ZkStateReader Updated live nodes from ZooKeeper... (1) -> (2)
   [junit4]   2> 1817148 INFO  (TEST-FullSolrCloudDistribCmdsTest.test-seed#[D84B434FCC81BDBB]) [n:127.0.0.1:50218_cuvw%2Fow    ] o.a.s.m.r.SolrJmxReporter JMX monitoring for 'solr.node' (registry 'solr.node') enabled at server: com.sun.jmx.mbeanserver.JmxMBeanServer@45ceb74e
   [junit4]   2> 1817157 INFO  (TEST-FullSolrCloudDistribCmdsTest.test-seed#[D84B434FCC81BDBB]) [n:127.0.0.1:50218_cuvw%2Fow    ] o.a.s.m.r.SolrJmxReporter JMX monitoring for 'solr.jvm' (registry 'solr.jvm') enabled at server: com.sun.jmx.mbeanserver.JmxMBeanServer@45ceb74e
   [junit4]   2> 1817157 INFO  (TEST-FullSolrCloudDistribCmdsTest.test-seed#[D84B434FCC81BDBB]) [n:127.0.0.1:50218_cuvw%2Fow    ] o.a.s.m.r.SolrJmxReporter JMX monitoring for 'solr.jetty' (registry 'solr.jetty') enabled at server: com.sun.jmx.mbeanserver.JmxMBeanServer@45ceb74e
   [junit4]   2> 1817158 INFO  (TEST-FullSolrCloudDistribCmdsTest.test-seed#[D84B434FCC81BDBB]) [n:127.0.0.1:50218_cuvw%2Fow    ] o.a.s.c.CorePropertiesLocator Found 0 core definitions underneath /Users/jenkins/workspace/Lucene-Solr-7.x-MacOSX/solr/build/solr-core/test/J0/../../../../../../../../../Users/jenkins/workspace/Lucene-Solr-7.x-MacOSX/solr/build/solr-core/test/J0/temp/solr.cloud.FullSolrCloudDistribCmdsTest_D84B434FCC81BDBB-001/shard-1-001/cores
   [junit4]   2> 1817177 INFO  (qtp2127340067-20230) [n:127.0.0.1:50209_cuvw%2Fow    ] o.a.s.h.a.CollectionsHandler Invoked Collection Action :addreplica with params node=127.0.0.1:50218_cuvw%252Fow&action=ADDREPLICA&collection=collection1&shard=shard2&type=NRT&wt=javabin&version=2 and sendToOCPQueue=true
   [junit4]   2> 1817180 INFO  (OverseerCollectionConfigSetProcessor-99320986363625476-127.0.0.1:50209_cuvw%2Fow-n_0000000000) [n:127.0.0.1:50209_cuvw%2Fow    ] o.a.s.c.OverseerTaskQueue Response ZK path: /overseer/collection-queue-work/qnr-0000000002 doesn't exist.  Requestor may have disconnected from ZooKeeper
   [junit4]   2> 1817181 INFO  (OverseerThreadFactory-8647-thread-3-processing-n:127.0.0.1:50209_cuvw%2Fow) [n:127.0.0.1:50209_cuvw%2Fow    ] o.a.s.c.AddReplicaCmd Node Identified 127.0.0.1:50218_cuvw%2Fow for creating new replica
   [junit4]   2> 1817185 INFO  (qtp359194155-20273) [n:127.0.0.1:50218_cuvw%2Fow    ] o.a.s.h.a.CoreAdminOperation core create command qt=/admin/cores&collection.configName=conf1&name=collection1_shard2_replica_n61&action=CREATE&collection=collection1&shard=shard2&wt=javabin&version=2&replicaType=NRT
   [junit4]   2> 1817185 INFO  (qtp359194155-20273) [n:127.0.0.1:50218_cuvw%2Fow    ] o.a.s.c.TransientSolrCoreCacheDefault Allocating transient cache for 4 transient cores
   [junit4]   2> 1817293 INFO  (zkCallback-5120-thread-1-processing-n:127.0.0.1:50218_cuvw%2Fow) [n:127.0.0.1:50218_cuvw%2Fow    ] o.a.s.c.c.ZkStateReader A cluster state change: [WatchedEvent state:SyncConnected type:NodeDataChanged path:/collections/collection1/state.json] for collection [collection1] has occurred - updating... (live nodes size: [2])
   [junit4]   2> 1818204 INFO  (qtp359194155-20273) [n:127.0.0.1:50218_cuvw%2Fow c:collection1 s:shard2  x:collection1_shard2_replica_n61] o.a.s.c.SolrConfig Using Lucene MatchVersion: 7.3.0
   [junit4]   2> 1818223 INFO  (qtp359194155-20273) [n:127.0.0.1:50218_cuvw%2Fow c:collection1 s:shard2  x:collection1_shard2_replica_n61] o.a.s.s.IndexSchema [collection1_shard2_replica_n61] Schema name=test
   [junit4]   2> 1818274 INFO  (qtp359194155-20273) [n:127.0.0.1:50218_cuvw%2Fow c:collection1 s:shard2  x:collection1_shard2_replica_n61] o.a.s.s.IndexSchema Loaded schema test/1.6 with uniqueid field id
   [junit4]   2> 1818293 INFO  (qtp359194155-20273) [n:127.0.0.1:50218_cuvw%2Fow c:collection1 s:shard2  x:collection1_shard2_replica_n61] o.a.s.c.CoreContainer Creating SolrCore 'collection1_shard2_replica_n61' using configuration from collection collection1, trusted=true
   [junit4]   2> 1818294 INFO  (qtp359194155-20273) [n:127.0.0.1:50218_cuvw%2Fow c:collection1 s:shard2  x:collection1_shard2_replica_n61] o.a.s.m.r.SolrJmxReporter JMX monitoring for 'solr.core.collection1.shard2.replica_n61' (registry 'solr.core.collection1.shard2.replica_n61') enabled at server: com.sun.jmx.mbeanserver.JmxMBeanServer@45ceb74e
   [junit4]   2> 1818294 INFO  (qtp359194155-20273) [n:127.0.0.1:50218_cuvw%2Fow c:collection1 s:shard2  x:collection1_shard2_replica_n61] o.a.s.c.SolrCore solr.RecoveryStrategy.Builder
   [junit4]   2> 1818294 INFO  (qtp359194155-20273) [n:127.0.0.1:50218_cuvw%2Fow c:collection1 s:shard2  x:collection1_shard2_replica_n61] o.a.s.c.SolrCore [[collection1_shard2_replica_n61] ] Opening new SolrCore at [/Users/jenkins/workspace/Lucene-Solr-7.x-MacOSX/solr/build/solr-core/test/J0/temp/solr.cloud.FullSolrCloudDistribCmdsTest_D84B434FCC81BDBB-001/shard-1-001/cores/collection1_shard2_replica_n61], dataDir=[/Users/jenkins/workspace/Lucene-Solr-7.x-MacOSX/solr/build/solr-core/test/J0/../../../../../../../../../Users/jenkins/workspace/Lucene-Solr-7.x-MacOSX/solr/build/solr-core/test/J0/temp/solr.cloud.FullSolrCloudDistribCmdsTest_D84B434FCC81BDBB-001/shard-1-001/cores/collection1_shard2_replica_n61/data/]
   [junit4]   2> 1818295 INFO  (qtp359194155-20273) [n:127.0.0.1:50218_cuvw%2Fow c:collection1 s:shard2  x:collection1_shard2_replica_n61] o.a.s.u.RandomMergePolicy RandomMergePolicy wrapping class org.apache.lucene.index.TieredMergePolicy: [TieredMergePolicy: maxMergeAtOnce=46, maxMergeAtOnceExplicit=46, maxMergedSegmentMB=29.67578125, floorSegmentMB=1.921875, forceMergeDeletesPctAllowed=7.588484189980816, segmentsPerTier=10.0, maxCFSSegmentSizeMB=8.796093022207999E12, noCFSRatio=1.0
   [junit4]   2> 1818297 WARN  (qtp359194155-20273) [n:127.0.0.1:50218_cuvw%2Fow c:collection1 s:shard2  x:collection1_shard2_replica_n61] o.a.s.c.RequestHandlers INVALID paramSet a in requestHandler {type = requestHandler,name = /dump,class = DumpRequestHandler,attributes = {initParams=a, name=/dump, class=DumpRequestHandler},args = {defaults={a=A,b=B}}}
   [junit4]   2> 1818325 INFO  (qtp359194155-20273) [n:127.0.0.1:50218_cuvw%2Fow c:collection1 s:shard2  x:collection1_shard2_replica_n61] o.a.s.u.UpdateHandler Using UpdateLog implementation: org.apache.solr.update.UpdateLog
   [junit4]   2> 1818325 INFO  (qtp359194155-20273) [n:127.0.0.1:50218_cuvw%2Fow c:collection1 s:shard2  x:collection1_shard2_replica_n61] o.a.s.u.UpdateLog Initializing UpdateLog: dataDir= defaultSyncLevel=FLUSH numRecordsToKeep=100 maxNumLogsToKeep=10 numVersionBuckets=65536
   [junit4]   2> 1818326 INFO  (qtp359194155-20273) [n:127.0.0.1:50218_cuvw%2Fow c:collection1 s:shard2  x:collection1_shard2_replica_n61] o.a.s.u.CommitTracker Hard AutoCommit: disabled
   [junit4]   2> 1818326 INFO  (qtp359194155-20273) [n:127.0.0.1:50218_cuvw%2Fow c:collection1 s:shard2  x:collection1_shard2_replica_n61] o.a.s.u.CommitTracker Soft AutoCommit: disabled
   [junit4]   2> 1818327 INFO  (qtp359194155-20273) [n:127.0.0.1:50218_cuvw%2Fow c:collection1 s:shard2  x:collection1_shard2_replica_n61] o.a.s.u.RandomMergePolicy RandomMergePolicy wrapping class org.apache.lucene.index.LogByteSizeMergePolicy: [LogByteSizeMergePolicy: minMergeSize=1677721, mergeFactor=18, maxMergeSize=2147483648, maxMergeSizeForForcedMerge=9223372036854775807, calibrateSizeByDeletes=true, maxMergeDocs=2147483647, maxCFSSegmentSizeMB=8.796093022207999E12, noCFSRatio=0.6258483312993698]
   [junit4]   2> 1818327 INFO  (qtp359194155-20273) [n:127.0.0.1:50218_cuvw%2Fow c:collection1 s:shard2  x:collection1_shard2_replica_n61] o.a.s.s.SolrIndexSearcher Opening [Searcher@6ab13e28[collection1_shard2_replica_n61] main]
   [junit4]   2> 1818329 INFO  (qtp359194155-20273) [n:127.0.0.1:50218_cuvw%2Fow c:collection1 s:shard2  x:collection1_shard2_replica_n61] o.a.s.r.ManagedResourceStorage Configured ZooKeeperStorageIO with znodeBase: /configs/conf1
   [junit4]   2> 1818329 INFO  (qtp359194155-20273) [n:127.0.0.1:50218_cuvw%2Fow c:collection1 s:shard2  x:collection1_shard2_replica_n61] o.a.s.r.ManagedResourceStorage Loaded null at path _rest_managed.json using ZooKeeperStorageIO:path=/configs/conf1
   [junit4]   2> 1818330 INFO  (qtp359194155-20273) [n:127.0.0.1:50218_cuvw%2Fow c:collection1 s:shard2  x:collection1_shard2_replica_n61] o.a.s.h.ReplicationHandler Commits will be reserved for 10000ms.
   [junit4]   2> 1818330 INFO  (qtp359194155-20273) [n:127.0.0.1:50218_cuvw%2Fow c:collection1 s:shard2  x:collection1_shard2_replica_n61] o.a.s.u.UpdateLog Could not find max version in index or recent updates, using new clock 1589135786956029952
   [junit4]   2> 1818330 INFO  (searcherExecutor-8661-thread-1-processing-n:127.0.0.1:50218_cuvw%2Fow x:collection1_shard2_replica_n61 s:shard2 c:collection1) [n:127.0.0.1:50218_cuvw%2Fow c:collection1 s:shard2  x:collection1_shard2_replica_n61] o.a.s.c.SolrCore [collection1_shard2_replica_n61] Registered new searcher Searcher@6ab13e28[collection1_shard2_replica_n61] main{ExitableDirectoryReader(UninvertingDirectoryReader())}
   [junit4]   2> 1818335 INFO  (qtp359194155-20273) [n:127.0.0.1:50218_cuvw%2Fow c:collection1 s:shard2  x:collection1_shard2_replica_n61] o.a.s.c.ShardLeaderElectionContext Enough replicas found to continue.
   [junit4]   2> 1818335 INFO  (qtp359194155-20273) [n:127.0.0.1:50218_cuvw%2Fow c:collection1 s:shard2  x:collection1_shard2_replica_n61] o.a.s.c.ShardLeaderElectionContext I may be the new leader - try and sync
   [junit4]   2> 1818335 INFO  (qtp359194155-20273) [n:127.0.0.1:50218_cuvw%2Fow c:collection1 s:shard2  x:collection1_shard2_replica_n61] o.a.s.c.SyncStrategy Sync replicas to http://127.0.0.1:50218/cuvw/ow/collection1_shard2_replica_n61/
   [junit4]   2> 1818335 INFO  (qtp359194155-20273) [n:127.0.0.1:50218_cuvw%2Fow c:collection1 s:shard2  x:collection1_shard2_replica_n61] o.a.s.c.SyncStrategy Sync Success - now sync replicas to me
   [junit4]   2> 1818335 INFO  (qtp359194155-20273) [n:127.0.0.1:50218_cuvw%2Fow c:collection1 s:shard2  x:collection1_shard2_replica_n61] o.a.s.c.SyncStrategy http://127.0.0.1:50218/cuvw/ow/collection1_shard2_replica_n61/ has no replicas
   [junit4]   2> 1818335 INFO  (qtp359194155-20273) [n:127.0.0.1:50218_cuvw%2Fow c:collection1 s:shard2  x:collection1_shard2_replica_n61] o.a.s.c.ShardLeaderElectionContext Found all replicas participating in election, clear LIR
   [junit4]   2> 1818340 INFO  (qtp359194155-20273) [n:127.0.0.1:50218_cuvw%2Fow c:collection1 s:shard2  x:collection1_shard2_replica_n61] o.a.s.c.ShardLeaderElectionContext I am the new leader: http://127.0.0.1:50218/cuvw/ow/collection1_shard2_replica_n61/ shard2
   [junit4]   2> 1818452 INFO  (zkCallback-5120-thread-1-processing-n:127.0.0.1:50218_cuvw%2Fow) [n:127.0.0.1:50218_cuvw%2Fow    ] o.a.s.c.c.ZkStateReader A cluster state change: [WatchedEvent state:SyncConnected type:NodeDataChanged path:/collections/collection1/state.json] for collection [collection1] has occurred - updating... (live nodes size: [2])
   [junit4]   2> 1818511 INFO  (qtp359194155-20273) [n:127.0.0.1:50218_cuvw%2Fow c:collection1 s:shard2  x:collection1_shard2_replica_n61] o.a.s.c.ZkController I am the leader, no recovery necessary
   [junit4]   2> 1818515 INFO  (qtp359194155-20273) [n:127.0.0.1:50218_cuvw%2Fow c:collection1 s:shard2  x:collection1_shard2_replica_n61] o.a.s.s.HttpSolrCall [admin] webapp=null path=/admin/cores params={qt=/admin/cores&collection.configName=conf1&name=collection1_shard2_replica_n61&action=CREATE&collection=collection1&shard=shard2&wt=javabin&version=2&replicaType=NRT} status=0 QTime=1329
   [junit4]   2> 1818521 INFO  (qtp2127340067-20230) [n:127.0.0.1:50209_cuvw%2Fow    ] o.a.s.s.HttpSolrCall [admin] webapp=null path=/admin/collections params={node=127.0.0.1:50218_cuvw%252Fow&action=ADDREPLICA&collection=collection1&shard=shard2&type=NRT&wt=javabin&version=2} status=0 QTime=1344
   [junit4]   2> 1818618 INFO  (zkCallback-5120-thread-1-processing-n:127.0.0.1:50218_cuvw%2Fow) [n:127.0.0.1:50218_cuvw%2Fow    ] o.a.s.c.c.ZkStateReader A cluster state change: [WatchedEvent state:SyncConnected type:NodeDataChanged path:/collections/collection1/state.json] for collection [collection1] has occurred - updating... (live nodes size: [2])
   [junit4]   2> 1818771 INFO  (TEST-FullSolrCloudDistribCmdsTest.test-seed#[D84B434FCC81BDBB]) [    ] o.a.s.c.AbstractFullDistribZkTestBase create jetty 2 in directory /Users/jenkins/workspace/Lucene-Solr-7.x-MacOSX/solr/build/solr-core/test/J0/temp/solr.cloud.FullSolrCloudDistribCmdsTest_D84B434FCC81BDBB-001/shard-2-001 of type NRT
   [junit4]   2> 1818771 INFO  (TEST-FullSolrCloudDistribCmdsTest.test-seed#[D84B434FCC81BDBB]) [    ] o.e.j.s.Server jetty-9.3.20.v20170531
   [junit4]   2> 1818773 INFO  (TEST-FullSolrCloudDistribCmdsTest.test-seed#[D84B434FCC81BDBB]) [    ] o.e.j.s.h.ContextHandler Started o.e.j.s.ServletContextHandler@2297cb27{/cuvw/ow,null,AVAILABLE}

[...truncated too long message...]

o.a.s.s.ManagedIndexSchema Field type 'failureInt' already exists.
   [junit4]   2> 46485 ERROR (qtp1869081517-1591) [    x:collection1] o.a.s.h.RequestHandlerBase org.apache.solr.api.ApiBag$ExceptionWithErrObject: error processing commands, errors: [{add-field-type={name=failureInt, class=solr.IntPointField, omitNorms=true, positionIncrementGap=0}, errorMessages=[Field type 'failureInt' already exists.
   [junit4]   2> ]}], 
   [junit4]   2> 	at org.apache.solr.handler.SchemaHandler.handleRequestBody(SchemaHandler.java:92)
   [junit4]   2> 	at org.apache.solr.handler.RequestHandlerBase.handleRequest(RequestHandlerBase.java:177)
   [junit4]   2> 	at org.apache.solr.core.SolrCore.execute(SolrCore.java:2503)
   [junit4]   2> 	at org.apache.solr.servlet.HttpSolrCall.execute(HttpSolrCall.java:711)
   [junit4]   2> 	at org.apache.solr.servlet.HttpSolrCall.call(HttpSolrCall.java:517)
   [junit4]   2> 	at org.apache.solr.servlet.SolrDispatchFilter.doFilter(SolrDispatchFilter.java:380)
   [junit4]   2> 	at org.apache.solr.servlet.SolrDispatchFilter.doFilter(SolrDispatchFilter.java:326)
   [junit4]   2> 	at org.eclipse.jetty.servlet.ServletHandler$CachedChain.doFilter(ServletHandler.java:1759)
   [junit4]   2> 	at org.apache.solr.client.solrj.embedded.JettySolrRunner$DebugFilter.doFilter(JettySolrRunner.java:139)
   [junit4]   2> 	at org.eclipse.jetty.servlet.ServletHandler$CachedChain.doFilter(ServletHandler.java:1759)
   [junit4]   2> 	at org.eclipse.jetty.servlet.ServletHandler.doHandle(ServletHandler.java:582)
   [junit4]   2> 	at org.eclipse.jetty.server.session.SessionHandler.doHandle(SessionHandler.java:224)
   [junit4]   2> 	at org.eclipse.jetty.server.handler.ContextHandler.doHandle(ContextHandler.java:1180)
   [junit4]   2> 	at org.eclipse.jetty.servlet.ServletHandler.doScope(ServletHandler.java:512)
   [junit4]   2> 	at org.eclipse.jetty.server.session.SessionHandler.doScope(SessionHandler.java:185)
   [junit4]   2> 	at org.eclipse.jetty.server.handler.ContextHandler.doScope(ContextHandler.java:1112)
   [junit4]   2> 	at org.eclipse.jetty.server.handler.ScopedHandler.handle(ScopedHandler.java:141)
   [junit4]   2> 	at org.eclipse.jetty.server.handler.gzip.GzipHandler.handle(GzipHandler.java:426)
   [junit4]   2> 	at org.eclipse.jetty.server.handler.HandlerWrapper.handle(HandlerWrapper.java:134)
   [junit4]   2> 	at org.eclipse.jetty.server.Server.handle(Server.java:534)
   [junit4]   2> 	at org.eclipse.jetty.server.HttpChannel.handle(HttpChannel.java:320)
   [junit4]   2> 	at org.eclipse.jetty.server.HttpConnection.onFillable(HttpConnection.java:251)
   [junit4]   2> 	at org.eclipse.jetty.io.AbstractConnection$ReadCallback.succeeded(AbstractConnection.java:283)
   [junit4]   2> 	at org.eclipse.jetty.io.FillInterest.fillable(FillInterest.java:108)
   [junit4]   2> 	at org.eclipse.jetty.io.SelectChannelEndPoint$2.run(SelectChannelEndPoint.java:93)
   [junit4]   2> 	at org.eclipse.jetty.util.thread.strategy.ExecuteProduceConsume.executeProduceConsume(ExecuteProduceConsume.java:303)
   [junit4]   2> 	at org.eclipse.jetty.util.thread.strategy.ExecuteProduceConsume.produceConsume(ExecuteProduceConsume.java:148)
   [junit4]   2> 	at org.eclipse.jetty.util.thread.strategy.ExecuteProduceConsume.run(ExecuteProduceConsume.java:136)
   [junit4]   2> 	at org.eclipse.jetty.util.thread.QueuedThreadPool.runJob(QueuedThreadPool.java:671)
   [junit4]   2> 	at org.eclipse.jetty.util.thread.QueuedThreadPool$2.run(QueuedThreadPool.java:589)
   [junit4]   2> 	at java.base/java.lang.Thread.run(Thread.java:844)
   [junit4]   2> 
   [junit4]   2> 46485 INFO  (qtp1869081517-1591) [    x:collection1] o.a.s.c.S.Request [collection1]  webapp=/solr path=/schema params={wt=javabin&version=2} status=400 QTime=0
   [junit4]   2> 46489 INFO  (TEST-SchemaTest.addFieldTypeShouldntBeCalledTwiceWithTheSameName-seed#[EB3ABB9883346397]) [    ] o.e.j.s.AbstractConnector Stopped ServerConnector@21d5523f{HTTP/1.1,[http/1.1]}{127.0.0.1:0}
   [junit4]   2> 46489 INFO  (TEST-SchemaTest.addFieldTypeShouldntBeCalledTwiceWithTheSameName-seed#[EB3ABB9883346397]) [    ] o.a.s.c.CoreContainer Shutting down CoreContainer instance=1257761083
   [junit4]   2> 46490 INFO  (TEST-SchemaTest.addFieldTypeShouldntBeCalledTwiceWithTheSameName-seed#[EB3ABB9883346397]) [    ] o.a.s.m.SolrMetricManager Closing metric reporters for registry=solr.node, tag=null
   [junit4]   2> 46490 INFO  (TEST-SchemaTest.addFieldTypeShouldntBeCalledTwiceWithTheSameName-seed#[EB3ABB9883346397]) [    ] o.a.s.m.r.SolrJmxReporter Closing reporter [org.apache.solr.metrics.reporters.SolrJmxReporter@5fa3f66f: rootName = null, domain = solr.node, service url = null, agent id = null] for registry solr.node / com.codahale.metrics.MetricRegistry@3f5f33bb
   [junit4]   2> 46512 INFO  (TEST-SchemaTest.addFieldTypeShouldntBeCalledTwiceWithTheSameName-seed#[EB3ABB9883346397]) [    ] o.a.s.m.SolrMetricManager Closing metric reporters for registry=solr.jvm, tag=null
   [junit4]   2> 46512 INFO  (TEST-SchemaTest.addFieldTypeShouldntBeCalledTwiceWithTheSameName-seed#[EB3ABB9883346397]) [    ] o.a.s.m.r.SolrJmxReporter Closing reporter [org.apache.solr.metrics.reporters.SolrJmxReporter@105f8506: rootName = null, domain = solr.jvm, service url = null, agent id = null] for registry solr.jvm / com.codahale.metrics.MetricRegistry@4c71687a
   [junit4]   2> 46516 INFO  (TEST-SchemaTest.addFieldTypeShouldntBeCalledTwiceWithTheSameName-seed#[EB3ABB9883346397]) [    ] o.a.s.m.SolrMetricManager Closing metric reporters for registry=solr.jetty, tag=null
   [junit4]   2> 46516 INFO  (TEST-SchemaTest.addFieldTypeShouldntBeCalledTwiceWithTheSameName-seed#[EB3ABB9883346397]) [    ] o.a.s.m.r.SolrJmxReporter Closing reporter [org.apache.solr.metrics.reporters.SolrJmxReporter@5d40de9d: rootName = null, domain = solr.jetty, service url = null, agent id = null] for registry solr.jetty / com.codahale.metrics.MetricRegistry@27f4f4bd
   [junit4]   2> 46517 INFO  (coreCloseExecutor-502-thread-1) [    x:collection1] o.a.s.c.SolrCore [collection1]  CLOSING SolrCore org.apache.solr.core.SolrCore@292a5a63
   [junit4]   2> 46517 INFO  (coreCloseExecutor-502-thread-1) [    x:collection1] o.a.s.m.SolrMetricManager Closing metric reporters for registry=solr.core.collection1, tag=690641507
   [junit4]   2> 46517 INFO  (coreCloseExecutor-502-thread-1) [    x:collection1] o.a.s.m.r.SolrJmxReporter Closing reporter [org.apache.solr.metrics.reporters.SolrJmxReporter@4a0eba86: rootName = null, domain = solr.core.collection1, service url = null, agent id = null] for registry solr.core.collection1 / com.codahale.metrics.MetricRegistry@59109bed
   [junit4]   2> 46528 INFO  (TEST-SchemaTest.addFieldTypeShouldntBeCalledTwiceWithTheSameName-seed#[EB3ABB9883346397]) [    ] o.e.j.s.h.ContextHandler Stopped o.e.j.s.ServletContextHandler@536f0c1c{/solr,null,UNAVAILABLE}
   [junit4]   2> 46529 INFO  (TEST-SchemaTest.addFieldTypeShouldntBeCalledTwiceWithTheSameName-seed#[EB3ABB9883346397]) [    ] o.a.s.SolrTestCaseJ4 ###Ending addFieldTypeShouldntBeCalledTwiceWithTheSameName
   [junit4]   2> NOTE: reproduce with: ant test  -Dtestcase=SchemaTest -Dtests.method=addFieldTypeShouldntBeCalledTwiceWithTheSameName -Dtests.seed=EB3ABB9883346397 -Dtests.slow=true -Dtests.locale=sr-Latn-ME -Dtests.timezone=Pacific/Tongatapu -Dtests.asserts=true -Dtests.file.encoding=US-ASCII
   [junit4] ERROR   0.31s J0 | SchemaTest.addFieldTypeShouldntBeCalledTwiceWithTheSameName <<<
   [junit4]    > Throwable #1: org.apache.solr.client.solrj.impl.HttpSolrClient$RemoteExecutionException: Error from server at http://127.0.0.1:56312/solr/collection1: error processing commands
   [junit4]    > 	at __randomizedtesting.SeedInfo.seed([EB3ABB9883346397:2EDB49887D49713F]:0)
   [junit4]    > 	at org.apache.solr.client.solrj.impl.HttpSolrClient$RemoteExecutionException.create(HttpSolrClient.java:830)
   [junit4]    > 	at org.apache.solr.client.solrj.impl.HttpSolrClient.executeMethod(HttpSolrClient.java:620)
   [junit4]    > 	at org.apache.solr.client.solrj.impl.HttpSolrClient.request(HttpSolrClient.java:255)
   [junit4]    > 	at org.apache.solr.client.solrj.impl.HttpSolrClient.request(HttpSolrClient.java:244)
   [junit4]    > 	at org.apache.solr.client.solrj.SolrRequest.process(SolrRequest.java:194)
   [junit4]    > 	at org.apache.solr.client.solrj.SolrRequest.process(SolrRequest.java:211)
   [junit4]    > 	at org.apache.solr.client.solrj.request.SchemaTest.addFieldTypeShouldntBeCalledTwiceWithTheSameName(SchemaTest.java:649)
   [junit4]    > 	at java.base/jdk.internal.reflect.NativeMethodAccessorImpl.invoke0(Native Method)
   [junit4]    > 	at java.base/jdk.internal.reflect.NativeMethodAccessorImpl.invoke(NativeMethodAccessorImpl.java:62)
   [junit4]    > 	at java.base/jdk.internal.reflect.DelegatingMethodAccessorImpl.invoke(DelegatingMethodAccessorImpl.java:43)
   [junit4]    > 	at java.base/java.lang.reflect.Method.invoke(Method.java:564)
   [junit4]    > 	at java.base/java.lang.Thread.run(Thread.java:844)
   [junit4]   2> NOTE: leaving temporary files on disk at: /Users/jenkins/workspace/Lucene-Solr-7.x-MacOSX/solr/build/solr-solrj/test/J0/temp/solr.client.solrj.request.SchemaTest_EB3ABB9883346397-001
   [junit4]   2> NOTE: test params are: codec=Asserting(Lucene70): {}, docValues:{}, maxPointsInLeafNode=337, maxMBSortInHeap=5.583492494296249, sim=RandomSimilarity(queryNorm=false): {}, locale=sr-Latn-ME, timezone=Pacific/Tongatapu
   [junit4]   2> NOTE: Mac OS X 10.11.6 x86_64/Oracle Corporation 9 (64-bit)/cpus=3,threads=1,free=170575080,total=273678336
   [junit4]   2> NOTE: All tests run in this JVM: [UuidEvaluatorTest, SubtractEvaluatorTest, TestDocumentObjectBinder, JdbcTest, RecursiveEvaluatorTest, TestToleratedUpdateError, TestBatchUpdate, StreamExpressionToExpessionTest, ArcSineEvaluatorTest, NoOpResponseParserTest, TestSolrProperties, NotEvaluatorTest, SchemaTest]
   [junit4] Completed [30/146 (1!)] on J0 in 15.84s, 35 tests, 8 errors <<< FAILURES!

[...truncated 40303 lines...]

Mime
View raw message