lucene-dev mailing list archives

Site index · List index
Message view « Date » · « Thread »
Top « Date » · « Thread »
From Policeman Jenkins Server <jenk...@thetaphi.de>
Subject [JENKINS] Lucene-Solr-master-Windows (64bit/jdk1.8.0_144) - Build # 7089 - Still Unstable!
Date Tue, 02 Jan 2018 20:56:10 GMT
Build: https://jenkins.thetaphi.de/job/Lucene-Solr-master-Windows/7089/
Java: 64bit/jdk1.8.0_144 -XX:-UseCompressedOops -XX:+UseConcMarkSweepGC

5 tests failed.
FAILED:  junit.framework.TestSuite.org.apache.lucene.codecs.memory.TestMemoryPostingsFormat

Error Message:
Could not remove the following files (in the order of attempts):    C:\Users\jenkins\workspace\Lucene-Solr-master-Windows\lucene\build\codecs\test\J1\temp\lucene.codecs.memory.TestMemoryPostingsFormat_B5D6AE7BB991AEAB-001\testPostingsFormat-003: java.nio.file.AccessDeniedException: C:\Users\jenkins\workspace\Lucene-Solr-master-Windows\lucene\build\codecs\test\J1\temp\lucene.codecs.memory.TestMemoryPostingsFormat_B5D6AE7BB991AEAB-001\testPostingsFormat-003    C:\Users\jenkins\workspace\Lucene-Solr-master-Windows\lucene\build\codecs\test\J1\temp\lucene.codecs.memory.TestMemoryPostingsFormat_B5D6AE7BB991AEAB-001: java.nio.file.DirectoryNotEmptyException: C:\Users\jenkins\workspace\Lucene-Solr-master-Windows\lucene\build\codecs\test\J1\temp\lucene.codecs.memory.TestMemoryPostingsFormat_B5D6AE7BB991AEAB-001 

Stack Trace:
java.io.IOException: Could not remove the following files (in the order of attempts):
   C:\Users\jenkins\workspace\Lucene-Solr-master-Windows\lucene\build\codecs\test\J1\temp\lucene.codecs.memory.TestMemoryPostingsFormat_B5D6AE7BB991AEAB-001\testPostingsFormat-003: java.nio.file.AccessDeniedException: C:\Users\jenkins\workspace\Lucene-Solr-master-Windows\lucene\build\codecs\test\J1\temp\lucene.codecs.memory.TestMemoryPostingsFormat_B5D6AE7BB991AEAB-001\testPostingsFormat-003
   C:\Users\jenkins\workspace\Lucene-Solr-master-Windows\lucene\build\codecs\test\J1\temp\lucene.codecs.memory.TestMemoryPostingsFormat_B5D6AE7BB991AEAB-001: java.nio.file.DirectoryNotEmptyException: C:\Users\jenkins\workspace\Lucene-Solr-master-Windows\lucene\build\codecs\test\J1\temp\lucene.codecs.memory.TestMemoryPostingsFormat_B5D6AE7BB991AEAB-001

	at __randomizedtesting.SeedInfo.seed([B5D6AE7BB991AEAB]:0)
	at org.apache.lucene.util.IOUtils.rm(IOUtils.java:329)
	at org.apache.lucene.util.TestRuleTemporaryFilesCleanup.afterAlways(TestRuleTemporaryFilesCleanup.java:216)
	at com.carrotsearch.randomizedtesting.rules.TestRuleAdapter$1.afterAlways(TestRuleAdapter.java:31)
	at com.carrotsearch.randomizedtesting.rules.StatementAdapter.evaluate(StatementAdapter.java:43)
	at com.carrotsearch.randomizedtesting.rules.StatementAdapter.evaluate(StatementAdapter.java:36)
	at org.apache.lucene.util.TestRuleAssertionsRequired$1.evaluate(TestRuleAssertionsRequired.java:53)
	at org.apache.lucene.util.TestRuleMarkFailure$1.evaluate(TestRuleMarkFailure.java:47)
	at org.apache.lucene.util.TestRuleIgnoreAfterMaxFailures$1.evaluate(TestRuleIgnoreAfterMaxFailures.java:64)
	at org.apache.lucene.util.TestRuleIgnoreTestSuites$1.evaluate(TestRuleIgnoreTestSuites.java:54)
	at com.carrotsearch.randomizedtesting.rules.StatementAdapter.evaluate(StatementAdapter.java:36)
	at com.carrotsearch.randomizedtesting.ThreadLeakControl$StatementRunner.run(ThreadLeakControl.java:368)
	at java.lang.Thread.run(Thread.java:748)


FAILED:  junit.framework.TestSuite.org.apache.lucene.store.TestMmapDirectory

Error Message:
Could not remove the following files (in the order of attempts):    C:\Users\jenkins\workspace\Lucene-Solr-master-Windows\lucene\build\core\test\J1\temp\lucene.store.TestMmapDirectory_81E8713CF1423D64-001\tempDir-006: java.nio.file.DirectoryNotEmptyException: C:\Users\jenkins\workspace\Lucene-Solr-master-Windows\lucene\build\core\test\J1\temp\lucene.store.TestMmapDirectory_81E8713CF1423D64-001\tempDir-006 

Stack Trace:
java.io.IOException: Could not remove the following files (in the order of attempts):
   C:\Users\jenkins\workspace\Lucene-Solr-master-Windows\lucene\build\core\test\J1\temp\lucene.store.TestMmapDirectory_81E8713CF1423D64-001\tempDir-006: java.nio.file.DirectoryNotEmptyException: C:\Users\jenkins\workspace\Lucene-Solr-master-Windows\lucene\build\core\test\J1\temp\lucene.store.TestMmapDirectory_81E8713CF1423D64-001\tempDir-006

	at __randomizedtesting.SeedInfo.seed([81E8713CF1423D64]:0)
	at org.apache.lucene.util.IOUtils.rm(IOUtils.java:329)
	at org.apache.lucene.util.TestRuleTemporaryFilesCleanup.afterAlways(TestRuleTemporaryFilesCleanup.java:216)
	at com.carrotsearch.randomizedtesting.rules.TestRuleAdapter$1.afterAlways(TestRuleAdapter.java:31)
	at com.carrotsearch.randomizedtesting.rules.StatementAdapter.evaluate(StatementAdapter.java:43)
	at com.carrotsearch.randomizedtesting.rules.StatementAdapter.evaluate(StatementAdapter.java:36)
	at org.apache.lucene.util.TestRuleAssertionsRequired$1.evaluate(TestRuleAssertionsRequired.java:53)
	at org.apache.lucene.util.TestRuleMarkFailure$1.evaluate(TestRuleMarkFailure.java:47)
	at org.apache.lucene.util.TestRuleIgnoreAfterMaxFailures$1.evaluate(TestRuleIgnoreAfterMaxFailures.java:64)
	at org.apache.lucene.util.TestRuleIgnoreTestSuites$1.evaluate(TestRuleIgnoreTestSuites.java:54)
	at com.carrotsearch.randomizedtesting.rules.StatementAdapter.evaluate(StatementAdapter.java:36)
	at com.carrotsearch.randomizedtesting.ThreadLeakControl$StatementRunner.run(ThreadLeakControl.java:368)
	at java.lang.Thread.run(Thread.java:748)


FAILED:  org.apache.solr.cloud.autoscaling.sim.TestTriggerIntegration.testNodeMarkersRegistration

Error Message:


Stack Trace:
java.util.ConcurrentModificationException
	at __randomizedtesting.SeedInfo.seed([9423561C831E4B71:8C99DE108D2B869E]:0)
	at java.util.ArrayList$Itr.checkForComodification(ArrayList.java:901)
	at java.util.ArrayList$Itr.next(ArrayList.java:851)
	at org.apache.solr.cloud.autoscaling.sim.SimSolrCloudTestCase.tearDown(SimSolrCloudTestCase.java:141)
	at sun.reflect.GeneratedMethodAccessor10.invoke(Unknown Source)
	at sun.reflect.DelegatingMethodAccessorImpl.invoke(DelegatingMethodAccessorImpl.java:43)
	at java.lang.reflect.Method.invoke(Method.java:498)
	at com.carrotsearch.randomizedtesting.RandomizedRunner.invoke(RandomizedRunner.java:1737)
	at com.carrotsearch.randomizedtesting.RandomizedRunner$10.evaluate(RandomizedRunner.java:992)
	at com.carrotsearch.randomizedtesting.rules.SystemPropertiesRestoreRule$1.evaluate(SystemPropertiesRestoreRule.java:57)
	at org.apache.lucene.util.TestRuleSetupTeardownChained$1.evaluate(TestRuleSetupTeardownChained.java:49)
	at org.apache.lucene.util.AbstractBeforeAfterRule$1.evaluate(AbstractBeforeAfterRule.java:45)
	at org.apache.lucene.util.TestRuleThreadAndTestName$1.evaluate(TestRuleThreadAndTestName.java:48)
	at org.apache.lucene.util.TestRuleIgnoreAfterMaxFailures$1.evaluate(TestRuleIgnoreAfterMaxFailures.java:64)
	at org.apache.lucene.util.TestRuleMarkFailure$1.evaluate(TestRuleMarkFailure.java:47)
	at com.carrotsearch.randomizedtesting.rules.StatementAdapter.evaluate(StatementAdapter.java:36)
	at com.carrotsearch.randomizedtesting.ThreadLeakControl$StatementRunner.run(ThreadLeakControl.java:368)
	at com.carrotsearch.randomizedtesting.ThreadLeakControl.forkTimeoutingTask(ThreadLeakControl.java:817)
	at com.carrotsearch.randomizedtesting.ThreadLeakControl$3.evaluate(ThreadLeakControl.java:468)
	at com.carrotsearch.randomizedtesting.RandomizedRunner.runSingleTest(RandomizedRunner.java:943)
	at com.carrotsearch.randomizedtesting.RandomizedRunner$5.evaluate(RandomizedRunner.java:829)
	at com.carrotsearch.randomizedtesting.RandomizedRunner$6.evaluate(RandomizedRunner.java:879)
	at com.carrotsearch.randomizedtesting.RandomizedRunner$7.evaluate(RandomizedRunner.java:890)
	at com.carrotsearch.randomizedtesting.rules.StatementAdapter.evaluate(StatementAdapter.java:36)
	at com.carrotsearch.randomizedtesting.rules.SystemPropertiesRestoreRule$1.evaluate(SystemPropertiesRestoreRule.java:57)
	at org.apache.lucene.util.AbstractBeforeAfterRule$1.evaluate(AbstractBeforeAfterRule.java:45)
	at com.carrotsearch.randomizedtesting.rules.StatementAdapter.evaluate(StatementAdapter.java:36)
	at org.apache.lucene.util.TestRuleStoreClassName$1.evaluate(TestRuleStoreClassName.java:41)
	at com.carrotsearch.randomizedtesting.rules.NoShadowingOrOverridesOnMethodsRule$1.evaluate(NoShadowingOrOverridesOnMethodsRule.java:40)
	at com.carrotsearch.randomizedtesting.rules.NoShadowingOrOverridesOnMethodsRule$1.evaluate(NoShadowingOrOverridesOnMethodsRule.java:40)
	at com.carrotsearch.randomizedtesting.rules.StatementAdapter.evaluate(StatementAdapter.java:36)
	at com.carrotsearch.randomizedtesting.rules.StatementAdapter.evaluate(StatementAdapter.java:36)
	at com.carrotsearch.randomizedtesting.rules.StatementAdapter.evaluate(StatementAdapter.java:36)
	at org.apache.lucene.util.TestRuleAssertionsRequired$1.evaluate(TestRuleAssertionsRequired.java:53)
	at org.apache.lucene.util.TestRuleMarkFailure$1.evaluate(TestRuleMarkFailure.java:47)
	at org.apache.lucene.util.TestRuleIgnoreAfterMaxFailures$1.evaluate(TestRuleIgnoreAfterMaxFailures.java:64)
	at org.apache.lucene.util.TestRuleIgnoreTestSuites$1.evaluate(TestRuleIgnoreTestSuites.java:54)
	at com.carrotsearch.randomizedtesting.rules.StatementAdapter.evaluate(StatementAdapter.java:36)
	at com.carrotsearch.randomizedtesting.ThreadLeakControl$StatementRunner.run(ThreadLeakControl.java:368)
	at java.lang.Thread.run(Thread.java:748)


FAILED:  junit.framework.TestSuite.org.apache.lucene.index.TestBackwardsCompatibility

Error Message:
Could not remove the following files (in the order of attempts):    C:\Users\jenkins\workspace\Lucene-Solr-master-Windows\lucene\build\backward-codecs\test\J0\temp\lucene.index.TestBackwardsCompatibility_8270FB84E1E763B0-001\5.2.0-nocfs-001: java.nio.file.DirectoryNotEmptyException: C:\Users\jenkins\workspace\Lucene-Solr-master-Windows\lucene\build\backward-codecs\test\J0\temp\lucene.index.TestBackwardsCompatibility_8270FB84E1E763B0-001\5.2.0-nocfs-001 

Stack Trace:
java.io.IOException: Could not remove the following files (in the order of attempts):
   C:\Users\jenkins\workspace\Lucene-Solr-master-Windows\lucene\build\backward-codecs\test\J0\temp\lucene.index.TestBackwardsCompatibility_8270FB84E1E763B0-001\5.2.0-nocfs-001: java.nio.file.DirectoryNotEmptyException: C:\Users\jenkins\workspace\Lucene-Solr-master-Windows\lucene\build\backward-codecs\test\J0\temp\lucene.index.TestBackwardsCompatibility_8270FB84E1E763B0-001\5.2.0-nocfs-001

	at __randomizedtesting.SeedInfo.seed([8270FB84E1E763B0]:0)
	at org.apache.lucene.util.IOUtils.rm(IOUtils.java:329)
	at org.apache.lucene.util.TestRuleTemporaryFilesCleanup.afterAlways(TestRuleTemporaryFilesCleanup.java:216)
	at com.carrotsearch.randomizedtesting.rules.TestRuleAdapter$1.afterAlways(TestRuleAdapter.java:31)
	at com.carrotsearch.randomizedtesting.rules.StatementAdapter.evaluate(StatementAdapter.java:43)
	at com.carrotsearch.randomizedtesting.rules.StatementAdapter.evaluate(StatementAdapter.java:36)
	at org.apache.lucene.util.TestRuleAssertionsRequired$1.evaluate(TestRuleAssertionsRequired.java:53)
	at org.apache.lucene.util.TestRuleMarkFailure$1.evaluate(TestRuleMarkFailure.java:47)
	at org.apache.lucene.util.TestRuleIgnoreAfterMaxFailures$1.evaluate(TestRuleIgnoreAfterMaxFailures.java:64)
	at org.apache.lucene.util.TestRuleIgnoreTestSuites$1.evaluate(TestRuleIgnoreTestSuites.java:54)
	at com.carrotsearch.randomizedtesting.rules.StatementAdapter.evaluate(StatementAdapter.java:36)
	at com.carrotsearch.randomizedtesting.ThreadLeakControl$StatementRunner.run(ThreadLeakControl.java:368)
	at java.lang.Thread.run(Thread.java:748)


FAILED:  junit.framework.TestSuite.org.apache.solr.update.processor.TestOpenNLPExtractNamedEntitiesUpdateProcessorFactory

Error Message:
Could not remove the following files (in the order of attempts):    C:\Users\jenkins\workspace\Lucene-Solr-master-Windows\solr\build\contrib\solr-analysis-extras\test\J1\temp\solr.update.processor.TestOpenNLPExtractNamedEntitiesUpdateProcessorFactory_29E97630D59D36B6-001\tempDir-001\collection1\conf: java.nio.file.DirectoryNotEmptyException: C:\Users\jenkins\workspace\Lucene-Solr-master-Windows\solr\build\contrib\solr-analysis-extras\test\J1\temp\solr.update.processor.TestOpenNLPExtractNamedEntitiesUpdateProcessorFactory_29E97630D59D36B6-001\tempDir-001\collection1\conf    C:\Users\jenkins\workspace\Lucene-Solr-master-Windows\solr\build\contrib\solr-analysis-extras\test\J1\temp\solr.update.processor.TestOpenNLPExtractNamedEntitiesUpdateProcessorFactory_29E97630D59D36B6-001\tempDir-001\collection1: java.nio.file.DirectoryNotEmptyException: C:\Users\jenkins\workspace\Lucene-Solr-master-Windows\solr\build\contrib\solr-analysis-extras\test\J1\temp\solr.update.processor.TestOpenNLPExtractNamedEntitiesUpdateProcessorFactory_29E97630D59D36B6-001\tempDir-001\collection1    C:\Users\jenkins\workspace\Lucene-Solr-master-Windows\solr\build\contrib\solr-analysis-extras\test\J1\temp\solr.update.processor.TestOpenNLPExtractNamedEntitiesUpdateProcessorFactory_29E97630D59D36B6-001\tempDir-001: java.nio.file.DirectoryNotEmptyException: C:\Users\jenkins\workspace\Lucene-Solr-master-Windows\solr\build\contrib\solr-analysis-extras\test\J1\temp\solr.update.processor.TestOpenNLPExtractNamedEntitiesUpdateProcessorFactory_29E97630D59D36B6-001\tempDir-001    C:\Users\jenkins\workspace\Lucene-Solr-master-Windows\solr\build\contrib\solr-analysis-extras\test\J1\temp\solr.update.processor.TestOpenNLPExtractNamedEntitiesUpdateProcessorFactory_29E97630D59D36B6-001\tempDir-001\collection1\conf\en-test-ner-person.bin: java.nio.file.AccessDeniedException: C:\Users\jenkins\workspace\Lucene-Solr-master-Windows\solr\build\contrib\solr-analysis-extras\test\J1\temp\solr.update.processor.TestOpenNLPExtractNamedEntitiesUpdateProcessorFactory_29E97630D59D36B6-001\tempDir-001\collection1\conf\en-test-ner-person.bin    C:\Users\jenkins\workspace\Lucene-Solr-master-Windows\solr\build\contrib\solr-analysis-extras\test\J1\temp\solr.update.processor.TestOpenNLPExtractNamedEntitiesUpdateProcessorFactory_29E97630D59D36B6-001\tempDir-001\collection1\conf\en-test-sent.bin: java.nio.file.AccessDeniedException: C:\Users\jenkins\workspace\Lucene-Solr-master-Windows\solr\build\contrib\solr-analysis-extras\test\J1\temp\solr.update.processor.TestOpenNLPExtractNamedEntitiesUpdateProcessorFactory_29E97630D59D36B6-001\tempDir-001\collection1\conf\en-test-sent.bin    C:\Users\jenkins\workspace\Lucene-Solr-master-Windows\solr\build\contrib\solr-analysis-extras\test\J1\temp\solr.update.processor.TestOpenNLPExtractNamedEntitiesUpdateProcessorFactory_29E97630D59D36B6-001\tempDir-001\collection1\conf\en-test-tokenizer.bin: java.nio.file.AccessDeniedException: C:\Users\jenkins\workspace\Lucene-Solr-master-Windows\solr\build\contrib\solr-analysis-extras\test\J1\temp\solr.update.processor.TestOpenNLPExtractNamedEntitiesUpdateProcessorFactory_29E97630D59D36B6-001\tempDir-001\collection1\conf\en-test-tokenizer.bin    C:\Users\jenkins\workspace\Lucene-Solr-master-Windows\solr\build\contrib\solr-analysis-extras\test\J1\temp\solr.update.processor.TestOpenNLPExtractNamedEntitiesUpdateProcessorFactory_29E97630D59D36B6-001: java.nio.file.DirectoryNotEmptyException: C:\Users\jenkins\workspace\Lucene-Solr-master-Windows\solr\build\contrib\solr-analysis-extras\test\J1\temp\solr.update.processor.TestOpenNLPExtractNamedEntitiesUpdateProcessorFactory_29E97630D59D36B6-001 

Stack Trace:
java.io.IOException: Could not remove the following files (in the order of attempts):
   C:\Users\jenkins\workspace\Lucene-Solr-master-Windows\solr\build\contrib\solr-analysis-extras\test\J1\temp\solr.update.processor.TestOpenNLPExtractNamedEntitiesUpdateProcessorFactory_29E97630D59D36B6-001\tempDir-001\collection1\conf: java.nio.file.DirectoryNotEmptyException: C:\Users\jenkins\workspace\Lucene-Solr-master-Windows\solr\build\contrib\solr-analysis-extras\test\J1\temp\solr.update.processor.TestOpenNLPExtractNamedEntitiesUpdateProcessorFactory_29E97630D59D36B6-001\tempDir-001\collection1\conf
   C:\Users\jenkins\workspace\Lucene-Solr-master-Windows\solr\build\contrib\solr-analysis-extras\test\J1\temp\solr.update.processor.TestOpenNLPExtractNamedEntitiesUpdateProcessorFactory_29E97630D59D36B6-001\tempDir-001\collection1: java.nio.file.DirectoryNotEmptyException: C:\Users\jenkins\workspace\Lucene-Solr-master-Windows\solr\build\contrib\solr-analysis-extras\test\J1\temp\solr.update.processor.TestOpenNLPExtractNamedEntitiesUpdateProcessorFactory_29E97630D59D36B6-001\tempDir-001\collection1
   C:\Users\jenkins\workspace\Lucene-Solr-master-Windows\solr\build\contrib\solr-analysis-extras\test\J1\temp\solr.update.processor.TestOpenNLPExtractNamedEntitiesUpdateProcessorFactory_29E97630D59D36B6-001\tempDir-001: java.nio.file.DirectoryNotEmptyException: C:\Users\jenkins\workspace\Lucene-Solr-master-Windows\solr\build\contrib\solr-analysis-extras\test\J1\temp\solr.update.processor.TestOpenNLPExtractNamedEntitiesUpdateProcessorFactory_29E97630D59D36B6-001\tempDir-001
   C:\Users\jenkins\workspace\Lucene-Solr-master-Windows\solr\build\contrib\solr-analysis-extras\test\J1\temp\solr.update.processor.TestOpenNLPExtractNamedEntitiesUpdateProcessorFactory_29E97630D59D36B6-001\tempDir-001\collection1\conf\en-test-ner-person.bin: java.nio.file.AccessDeniedException: C:\Users\jenkins\workspace\Lucene-Solr-master-Windows\solr\build\contrib\solr-analysis-extras\test\J1\temp\solr.update.processor.TestOpenNLPExtractNamedEntitiesUpdateProcessorFactory_29E97630D59D36B6-001\tempDir-001\collection1\conf\en-test-ner-person.bin
   C:\Users\jenkins\workspace\Lucene-Solr-master-Windows\solr\build\contrib\solr-analysis-extras\test\J1\temp\solr.update.processor.TestOpenNLPExtractNamedEntitiesUpdateProcessorFactory_29E97630D59D36B6-001\tempDir-001\collection1\conf\en-test-sent.bin: java.nio.file.AccessDeniedException: C:\Users\jenkins\workspace\Lucene-Solr-master-Windows\solr\build\contrib\solr-analysis-extras\test\J1\temp\solr.update.processor.TestOpenNLPExtractNamedEntitiesUpdateProcessorFactory_29E97630D59D36B6-001\tempDir-001\collection1\conf\en-test-sent.bin
   C:\Users\jenkins\workspace\Lucene-Solr-master-Windows\solr\build\contrib\solr-analysis-extras\test\J1\temp\solr.update.processor.TestOpenNLPExtractNamedEntitiesUpdateProcessorFactory_29E97630D59D36B6-001\tempDir-001\collection1\conf\en-test-tokenizer.bin: java.nio.file.AccessDeniedException: C:\Users\jenkins\workspace\Lucene-Solr-master-Windows\solr\build\contrib\solr-analysis-extras\test\J1\temp\solr.update.processor.TestOpenNLPExtractNamedEntitiesUpdateProcessorFactory_29E97630D59D36B6-001\tempDir-001\collection1\conf\en-test-tokenizer.bin
   C:\Users\jenkins\workspace\Lucene-Solr-master-Windows\solr\build\contrib\solr-analysis-extras\test\J1\temp\solr.update.processor.TestOpenNLPExtractNamedEntitiesUpdateProcessorFactory_29E97630D59D36B6-001: java.nio.file.DirectoryNotEmptyException: C:\Users\jenkins\workspace\Lucene-Solr-master-Windows\solr\build\contrib\solr-analysis-extras\test\J1\temp\solr.update.processor.TestOpenNLPExtractNamedEntitiesUpdateProcessorFactory_29E97630D59D36B6-001

	at __randomizedtesting.SeedInfo.seed([29E97630D59D36B6]:0)
	at org.apache.lucene.util.IOUtils.rm(IOUtils.java:329)
	at org.apache.lucene.util.TestRuleTemporaryFilesCleanup.afterAlways(TestRuleTemporaryFilesCleanup.java:216)
	at com.carrotsearch.randomizedtesting.rules.TestRuleAdapter$1.afterAlways(TestRuleAdapter.java:31)
	at com.carrotsearch.randomizedtesting.rules.StatementAdapter.evaluate(StatementAdapter.java:43)
	at com.carrotsearch.randomizedtesting.rules.StatementAdapter.evaluate(StatementAdapter.java:36)
	at org.apache.lucene.util.TestRuleAssertionsRequired$1.evaluate(TestRuleAssertionsRequired.java:53)
	at org.apache.lucene.util.TestRuleMarkFailure$1.evaluate(TestRuleMarkFailure.java:47)
	at org.apache.lucene.util.TestRuleIgnoreAfterMaxFailures$1.evaluate(TestRuleIgnoreAfterMaxFailures.java:64)
	at org.apache.lucene.util.TestRuleIgnoreTestSuites$1.evaluate(TestRuleIgnoreTestSuites.java:54)
	at com.carrotsearch.randomizedtesting.rules.StatementAdapter.evaluate(StatementAdapter.java:36)
	at com.carrotsearch.randomizedtesting.ThreadLeakControl$StatementRunner.run(ThreadLeakControl.java:368)
	at java.lang.Thread.run(Thread.java:748)




Build Log:
[...truncated 678 lines...]
   [junit4] Suite: org.apache.lucene.store.TestMmapDirectory
   [junit4]   2> NOTE: test params are: codec=Asserting(Lucene70): {}, docValues:{}, maxPointsInLeafNode=132, maxMBSortInHeap=5.813211990561918, sim=Asserting(org.apache.lucene.search.similarities.AssertingSimilarity@200e33f8), locale=zh, timezone=Europe/Skopje
   [junit4]   2> NOTE: Windows 10 10.0 amd64/Oracle Corporation 1.8.0_144 (64-bit)/cpus=3,threads=1,free=337561336,total=518979584
   [junit4]   2> NOTE: All tests run in this JVM: [TestIndexTooManyDocs, TestReadOnlyIndex, TestIndexWriterExceptions2, TestMaxPosition, TestOfflineSorter, TestSetOnce, TestAutomatonQuery, TestDocumentsWriterStallControl, TestPerSegmentDeletes, TestSortedSetSelector, TestFixedBitSet, TestIndexWriterMaxDocs, TestSimpleExplanations, TestPerFieldPostingsFormat2, TestCachingCollector, TestPolygon2D, TestPostingsOffsets, TestMultiFields, TestSortRandom, TestMultiDocValues, TestSentinelIntSet, Test2BSortedDocValuesFixedSorted, TestDocIDMerger, TestMergeSchedulerExternal, TestUpgradeIndexMergePolicy, TestSpanNearQuery, TestReqExclBulkScorer, TestIndexWriterForceMerge, TestCustomTermFreq, TestIntsRef, TestIndexOrDocValuesQuery, TestForTooMuchCloning, TestDistributionSPL, TestGraphTokenizers, TestMultiTermQueryRewrites, TestIntRangeFieldQueries, TestShardSearching, TestClassicSimilarity, TestFastDecompressionMode, TestDoubleRangeFieldQueries, TestBM25Similarity, Test2BNumericDocValues, TestTopFieldCollector, TestPagedBytes, TestIndexReaderClose, Test2BTerms, TestPositiveScoresOnlyCollector, TestTransactions, TestAllFilesHaveChecksumFooter, TestIndexWriterCommit, TestVersion, TestMultiPhraseQuery, TestMultiPhraseEnum, TestNotDocIdSet, TestStressIndexing2, TestFastCompressionMode, TestNoDeletionPolicy, TestSortRescorer, Test2BPostingsBytes, TestIndexCommit, TestBlendedTermQuery, TestTermVectorsWriter, TestDirectory, TestBooleanScorer, TestBasics, TestNot, TestSegmentMerger, TestTrackingDirectoryWrapper, TestNRTCachingDirectory, TestAxiomaticF1LOG, TestFileSwitchDirectory, TestFilterDirectory, TestRegExp, TestPointQueries, TestBytesRefAttImpl, Test2BPostings, TestRollingBuffer, TestSegmentTermDocs, TestIndexedDISI, TestDocValuesQueries, TestMutablePointsReaderUtils, TestSearchAfter, Test2BBinaryDocValues, TestSegmentInfos, TestSpanOrQuery, TestSmallFloat, TestOrdinalMap, TestSpansEnum, TestFilterSpans, TestMinShouldMatch2, TestTermdocPerf, TestCachingTokenFilter, TestOmitNorms, TestPerFieldDocValuesFormat, TestTermRangeQuery, TestBytesStore, TestSpanMultiTermQueryWrapper, TestFilterDirectoryReader, TestSegmentCacheables, TestDeterminism, TestStringHelper, TestMultiLevelSkipList, TestComplexExplanationsOfNonMatches, TestNGramPhraseQuery, TestPhraseQuery, TestAutomaton, TestMmapDirectory]
   [junit4]   2> NOTE: reproduce with: ant test  -Dtestcase=TestMmapDirectory -Dtests.seed=81E8713CF1423D64 -Dtests.slow=true -Dtests.locale=zh -Dtests.timezone=Europe/Skopje -Dtests.asserts=true -Dtests.file.encoding=US-ASCII
   [junit4] ERROR   0.00s J1 | TestMmapDirectory (suite) <<<
   [junit4]    > Throwable #1: java.io.IOException: Could not remove the following files (in the order of attempts):
   [junit4]    >    C:\Users\jenkins\workspace\Lucene-Solr-master-Windows\lucene\build\core\test\J1\temp\lucene.store.TestMmapDirectory_81E8713CF1423D64-001\tempDir-006: java.nio.file.DirectoryNotEmptyException: C:\Users\jenkins\workspace\Lucene-Solr-master-Windows\lucene\build\core\test\J1\temp\lucene.store.TestMmapDirectory_81E8713CF1423D64-001\tempDir-006
   [junit4]    > 	at __randomizedtesting.SeedInfo.seed([81E8713CF1423D64]:0)
   [junit4]    > 	at org.apache.lucene.util.IOUtils.rm(IOUtils.java:329)
   [junit4]    > 	at java.lang.Thread.run(Thread.java:748)
   [junit4] Completed [137/477 (1!)] on J1 in 3.33s, 43 tests, 1 error, 1 skipped <<< FAILURES!

[...truncated 4100 lines...]
   [junit4] Suite: org.apache.lucene.index.TestBackwardsCompatibility
   [junit4] IGNOR/A 0.03s J0 | TestBackwardsCompatibility.testCreateSortedIndex
   [junit4]    > Assumption #1: backcompat creation tests must be run with -Dtests.bwcdir=/path/to/write/indexes
   [junit4] IGNOR/A 0.01s J0 | TestBackwardsCompatibility.testCreateSingleSegmentNoCFS
   [junit4]    > Assumption #1: backcompat creation tests must be run with -Dtests.bwcdir=/path/to/write/indexes
   [junit4] IGNOR/A 0.00s J0 | TestBackwardsCompatibility.testCreateEmptyIndex
   [junit4]    > Assumption #1: backcompat creation tests must be run with -Dtests.bwcdir=/path/to/write/indexes
   [junit4] IGNOR/A 0.00s J0 | TestBackwardsCompatibility.testCreateIndexWithDocValuesUpdates
   [junit4]    > Assumption #1: backcompat creation tests must be run with -Dtests.bwcdir=/path/to/write/indexes
   [junit4] IGNOR/A 0.00s J0 | TestBackwardsCompatibility.testCreateCFS
   [junit4]    > Assumption #1: backcompat creation tests must be run with -Dtests.bwcdir=/path/to/write/indexes
   [junit4] IGNOR/A 0.00s J0 | TestBackwardsCompatibility.testCreateSingleSegmentCFS
   [junit4]    > Assumption #1: backcompat creation tests must be run with -Dtests.bwcdir=/path/to/write/indexes
   [junit4] IGNOR/A 0.00s J0 | TestBackwardsCompatibility.testCreateNoCFS
   [junit4]    > Assumption #1: backcompat creation tests must be run with -Dtests.bwcdir=/path/to/write/indexes
   [junit4] IGNOR/A 0.00s J0 | TestBackwardsCompatibility.testCreateMoreTermsIndex
   [junit4]    > Assumption #1: backcompat creation tests must be run with -Dtests.bwcdir=/path/to/write/indexes
   [junit4]   2> NOTE: test params are: codec=Asserting(Lucene70): {content6=PostingsFormat(name=MockRandom), content5=PostingsFormat(name=Memory), content4=PostingsFormat(name=LuceneFixedGap), content3=Lucene50(blocksize=128), content2=PostingsFormat(name=MockRandom), fie?ld=PostingsFormat(name=MockRandom), utf8=PostingsFormat(name=LuceneFixedGap), id=PostingsFormat(name=MockRandom), content=PostingsFormat(name=LuceneFixedGap), autf8=Lucene50(blocksize=128)}, docValues:{ndv2=DocValuesFormat(name=Asserting), ndv1=DocValuesFormat(name=Direct), utf8=DocValuesFormat(name=Direct), fie?ld=DocValuesFormat(name=Lucene70), dvShort=DocValuesFormat(name=Asserting), dvInt=DocValuesFormat(name=Direct), longPoint2d=DocValuesFormat(name=Asserting), dvBytesSortedVar=DocValuesFormat(name=Lucene70), dvSortedSet=DocValuesFormat(name=Lucene70), content=DocValuesFormat(name=Direct), floatPoint1d=DocValuesFormat(name=Lucene70), bdv2=DocValuesFormat(name=Asserting), bdv2_c=DocValuesFormat(name=Asserting), intPoint1d=DocValuesFormat(name=Lucene70), bdv1=DocValuesFormat(name=Direct), bdv1_c=DocValuesFormat(name=Lucene70), doublePoint2d=DocValuesFormat(name=Lucene70), dvBytesDerefVar=DocValuesFormat(name=Asserting), id=DocValuesFormat(name=Lucene70), binaryPoint2d=DocValuesFormat(name=Direct), dvSortedNumeric=DocValuesFormat(name=Asserting), dvBytesDerefFixed=DocValuesFormat(name=Direct), autf8=DocValuesFormat(name=Asserting), dvBytesSortedFixed=DocValuesFormat(name=Asserting), dvBytesStraightVar=DocValuesFormat(name=Lucene70), dvBytesStraightFixed=DocValuesFormat(name=Lucene70), dvLong=DocValuesFormat(name=Asserting), longPoint1d=DocValuesFormat(name=Direct), floatPoint2d=DocValuesFormat(name=Asserting), dvDouble=DocValuesFormat(name=Lucene70), dvFloat=DocValuesFormat(name=Asserting), content6=DocValuesFormat(name=Lucene70), content5=DocValuesFormat(name=Lucene70), dvPacked=DocValuesFormat(name=Asserting), intPoint2d=DocValuesFormat(name=Lucene70), content4=DocValuesFormat(name=Direct), content3=DocValuesFormat(name=Asserting), content2=DocValuesFormat(name=Lucene70), doublePoint1d=DocValuesFormat(name=Asserting), dvByte=DocValuesFormat(name=Asserting), ndv1_c=DocValuesFormat(name=Lucene70), ndv2_c=DocValuesFormat(name=Asserting), binaryPoint1d=DocValuesFormat(name=Asserting)}, maxPointsInLeafNode=387, maxMBSortInHeap=7.273675366455976, sim=Asserting(org.apache.lucene.search.similarities.AssertingSimilarity@3c48d4a), locale=ja, timezone=Etc/GMT+9
   [junit4]   2> NOTE: Windows 10 10.0 amd64/Oracle Corporation 1.8.0_144 (64-bit)/cpus=3,threads=1,free=59846120,total=97320960
   [junit4]   2> NOTE: All tests run in this JVM: [TestBackwardsCompatibility]
   [junit4]   2> NOTE: reproduce with: ant test  -Dtestcase=TestBackwardsCompatibility -Dtests.seed=8270FB84E1E763B0 -Dtests.slow=true -Dtests.locale=ja -Dtests.timezone=Etc/GMT+9 -Dtests.asserts=true -Dtests.file.encoding=US-ASCII
   [junit4] ERROR   0.00s J0 | TestBackwardsCompatibility (suite) <<<
   [junit4]    > Throwable #1: java.io.IOException: Could not remove the following files (in the order of attempts):
   [junit4]    >    C:\Users\jenkins\workspace\Lucene-Solr-master-Windows\lucene\build\backward-codecs\test\J0\temp\lucene.index.TestBackwardsCompatibility_8270FB84E1E763B0-001\5.2.0-nocfs-001: java.nio.file.DirectoryNotEmptyException: C:\Users\jenkins\workspace\Lucene-Solr-master-Windows\lucene\build\backward-codecs\test\J0\temp\lucene.index.TestBackwardsCompatibility_8270FB84E1E763B0-001\5.2.0-nocfs-001
   [junit4]    > 	at __randomizedtesting.SeedInfo.seed([8270FB84E1E763B0]:0)
   [junit4]    > 	at org.apache.lucene.util.IOUtils.rm(IOUtils.java:329)
   [junit4]    > 	at java.lang.Thread.run(Thread.java:748)
   [junit4] Completed [3/3 (1!)] on J0 in 24.64s, 30 tests, 1 error, 8 skipped <<< FAILURES!

[...truncated 1714 lines...]
   [junit4] Suite: org.apache.lucene.codecs.memory.TestMemoryPostingsFormat
   [junit4]   2> NOTE: test params are: codec=Asserting(Lucene70): {}, docValues:{}, maxPointsInLeafNode=1723, maxMBSortInHeap=6.781240634383336, sim=Asserting(org.apache.lucene.search.similarities.AssertingSimilarity@4cb7dd2c), locale=fr-BE, timezone=Asia/Macau
   [junit4]   2> NOTE: Windows 10 10.0 amd64/Oracle Corporation 1.8.0_144 (64-bit)/cpus=3,threads=1,free=79084424,total=97320960
   [junit4]   2> NOTE: All tests run in this JVM: [TestSimpleTextCompoundFormat, TestBloomPostingsFormat, TestFSTPostingsFormat, TestSimpleTextDocValuesFormat, TestMemoryPostingsFormat]
   [junit4]   2> NOTE: reproduce with: ant test  -Dtestcase=TestMemoryPostingsFormat -Dtests.seed=B5D6AE7BB991AEAB -Dtests.slow=true -Dtests.locale=fr-BE -Dtests.timezone=Asia/Macau -Dtests.asserts=true -Dtests.file.encoding=US-ASCII
   [junit4] ERROR   0.00s J1 | TestMemoryPostingsFormat (suite) <<<
   [junit4]    > Throwable #1: java.io.IOException: Could not remove the following files (in the order of attempts):
   [junit4]    >    C:\Users\jenkins\workspace\Lucene-Solr-master-Windows\lucene\build\codecs\test\J1\temp\lucene.codecs.memory.TestMemoryPostingsFormat_B5D6AE7BB991AEAB-001\testPostingsFormat-003: java.nio.file.AccessDeniedException: C:\Users\jenkins\workspace\Lucene-Solr-master-Windows\lucene\build\codecs\test\J1\temp\lucene.codecs.memory.TestMemoryPostingsFormat_B5D6AE7BB991AEAB-001\testPostingsFormat-003
   [junit4]    >    C:\Users\jenkins\workspace\Lucene-Solr-master-Windows\lucene\build\codecs\test\J1\temp\lucene.codecs.memory.TestMemoryPostingsFormat_B5D6AE7BB991AEAB-001: java.nio.file.DirectoryNotEmptyException: C:\Users\jenkins\workspace\Lucene-Solr-master-Windows\lucene\build\codecs\test\J1\temp\lucene.codecs.memory.TestMemoryPostingsFormat_B5D6AE7BB991AEAB-001
   [junit4]    > 	at __randomizedtesting.SeedInfo.seed([B5D6AE7BB991AEAB]:0)
   [junit4]    > 	at org.apache.lucene.util.IOUtils.rm(IOUtils.java:329)
   [junit4]    > 	at java.lang.Thread.run(Thread.java:748)
   [junit4] Completed [10/20 (1!)] on J1 in 2.55s, 25 tests, 1 error <<< FAILURES!

[...truncated 5843 lines...]
   [junit4] Suite: org.apache.solr.cloud.autoscaling.sim.TestTriggerIntegration
   [junit4]   2> Creating dataDir: C:\Users\jenkins\workspace\Lucene-Solr-master-Windows\solr\build\solr-core\test\J1\temp\solr.cloud.autoscaling.sim.TestTriggerIntegration_9423561C831E4B71-001\init-core-data-001
   [junit4]   2> 863741 WARN  (SUITE-TestTriggerIntegration-seed#[9423561C831E4B71]-worker) [    ] o.a.s.SolrTestCaseJ4 startTrackingSearchers: numOpens=1 numCloses=1
   [junit4]   2> 863742 INFO  (SUITE-TestTriggerIntegration-seed#[9423561C831E4B71]-worker) [    ] o.a.s.SolrTestCaseJ4 Using PointFields (NUMERIC_POINTS_SYSPROP=true) w/NUMERIC_DOCVALUES_SYSPROP=true
   [junit4]   2> 863746 INFO  (SUITE-TestTriggerIntegration-seed#[9423561C831E4B71]-worker) [    ] o.a.s.SolrTestCaseJ4 Randomized ssl (false) and clientAuth (false) via: @org.apache.solr.util.RandomizeSSL(reason=, value=NaN, ssl=NaN, clientAuth=NaN)
   [junit4]   2> 863746 INFO  (SUITE-TestTriggerIntegration-seed#[9423561C831E4B71]-worker) [    ] o.a.s.SolrTestCaseJ4 SecureRandom sanity checks: test.solr.allowed.securerandom=null & java.security.egd=file:/dev/./urandom
   [junit4]   2> 863762 DEBUG (Simulated OverseerAutoScalingTriggerThread) [    ] o.a.s.c.a.OverseerTriggerThread Adding .autoAddReplicas trigger
   [junit4]   2> 863762 DEBUG (Simulated OverseerAutoScalingTriggerThread) [    ] o.a.s.c.a.OverseerTriggerThread Refreshing /autoscaling.json with znode version 0
   [junit4]   2> 863763 DEBUG (Simulated OverseerAutoScalingTriggerThread) [    ] o.a.s.c.a.NodeLostTrigger Initial livenodes: [127.0.0.1:10001_solr, 127.0.0.1:10000_solr]
   [junit4]   2> 863763 DEBUG (Simulated OverseerAutoScalingTriggerThread) [    ] o.a.s.c.a.OverseerTriggerThread Current znodeVersion 0, lastZnodeVersion -1
   [junit4]   2> 863763 DEBUG (Simulated OverseerAutoScalingTriggerThread) [    ] o.a.s.c.a.OverseerTriggerThread Processed trigger updates upto znodeVersion 0
   [junit4]   2> 863765 DEBUG (Simulated OverseerAutoScalingTriggerThread) [    ] o.a.s.c.a.OverseerTriggerThread -- clean old nodeAdded markers
   [junit4]   2> 863765 DEBUG (Simulated OverseerAutoScalingTriggerThread) [    ] o.a.s.c.a.OverseerTriggerThread Current znodeVersion 0, lastZnodeVersion 0
   [junit4]   2> 863766 INFO  (TEST-TestTriggerIntegration.testNodeMarkersRegistration-seed#[9423561C831E4B71]) [    ] o.a.s.SolrTestCaseJ4 ###Starting testNodeMarkersRegistration
   [junit4]   2> 863766 DEBUG (TEST-TestTriggerIntegration.testNodeMarkersRegistration-seed#[9423561C831E4B71]) [    ] o.a.s.c.a.OverseerTriggerThread Refreshing /autoscaling.json with znode version 1
   [junit4]   2> 863766 DEBUG (Simulated OverseerAutoScalingTriggerThread) [    ] o.a.s.c.a.OverseerTriggerThread Processed trigger updates upto znodeVersion 1
   [junit4]   2> 863767 DEBUG (Simulated OverseerAutoScalingTriggerThread) [    ] o.a.s.c.a.OverseerTriggerThread -- clean old nodeLost markers
   [junit4]   2> 863768 DEBUG (Simulated OverseerAutoScalingTriggerThread) [    ] o.a.s.c.a.OverseerTriggerThread -- clean old nodeAdded markers
   [junit4]   2> 863768 DEBUG (Simulated OverseerAutoScalingTriggerThread) [    ] o.a.s.c.a.OverseerTriggerThread Current znodeVersion 1, lastZnodeVersion 1
   [junit4]   2> 863768 INFO  (TEST-TestTriggerIntegration.testNodeMarkersRegistration-seed#[9423561C831E4B71]) [    ] o.a.s.c.a.s.SimCloudManager === Restarting OverseerTriggerThread and clearing object cache...
   [junit4]   2> 863769 WARN  (Simulated OverseerAutoScalingTriggerThread) [    ] o.a.s.c.a.OverseerTriggerThread OverseerTriggerThread woken up but we are closed, exiting.
   [junit4]   2> 863769 DEBUG (TEST-TestTriggerIntegration.testNodeMarkersRegistration-seed#[9423561C831E4B71]) [    ] o.a.s.c.a.OverseerTriggerThread OverseerTriggerThread has been closed explicitly
   [junit4]   2> 863770 DEBUG (Simulated OverseerAutoScalingTriggerThread) [    ] o.a.s.c.a.OverseerTriggerThread Adding .autoAddReplicas trigger
   [junit4]   2> 863770 DEBUG (Simulated OverseerAutoScalingTriggerThread) [    ] o.a.s.c.a.OverseerTriggerThread Refreshing /autoscaling.json with znode version 2
   [junit4]   2> 863770 DEBUG (Simulated OverseerAutoScalingTriggerThread) [    ] o.a.s.c.a.NodeLostTrigger Initial livenodes: [127.0.0.1:10001_solr, 127.0.0.1:10000_solr]
   [junit4]   2> 863770 DEBUG (Simulated OverseerAutoScalingTriggerThread) [    ] o.a.s.c.a.OverseerTriggerThread Current znodeVersion 2, lastZnodeVersion -1
   [junit4]   2> 863770 DEBUG (Simulated OverseerAutoScalingTriggerThread) [    ] o.a.s.c.a.OverseerTriggerThread Processed trigger updates upto znodeVersion 2
   [junit4]   2> 863770 DEBUG (Simulated OverseerAutoScalingTriggerThread) [    ] o.a.s.c.a.OverseerTriggerThread -- clean old nodeAdded markers
   [junit4]   2> 863770 DEBUG (Simulated OverseerAutoScalingTriggerThread) [    ] o.a.s.c.a.OverseerTriggerThread Current znodeVersion 2, lastZnodeVersion 2
   [junit4]   2> 863771 DEBUG (ScheduledTrigger-3139-thread-1) [    ] o.a.s.c.a.NodeLostTrigger Running NodeLostTrigger: .auto_add_replicas with currently live nodes: 2
   [junit4]   2> 863792 DEBUG (ScheduledTrigger-3139-thread-1) [    ] o.a.s.c.a.NodeLostTrigger Running NodeLostTrigger: .auto_add_replicas with currently live nodes: 2
   [junit4]   2> 863813 DEBUG (ScheduledTrigger-3139-thread-2) [    ] o.a.s.c.a.NodeLostTrigger Running NodeLostTrigger: .auto_add_replicas with currently live nodes: 2
   [junit4]   2> 863834 DEBUG (ScheduledTrigger-3139-thread-1) [    ] o.a.s.c.a.NodeLostTrigger Running NodeLostTrigger: .auto_add_replicas with currently live nodes: 2
   [junit4]   2> 863855 DEBUG (ScheduledTrigger-3139-thread-1) [    ] o.a.s.c.a.NodeLostTrigger Running NodeLostTrigger: .auto_add_replicas with currently live nodes: 2
   [junit4]   2> 863876 DEBUG (ScheduledTrigger-3139-thread-2) [    ] o.a.s.c.a.NodeLostTrigger Running NodeLostTrigger: .auto_add_replicas with currently live nodes: 3
   [junit4]   2> 863877 INFO  (TEST-TestTriggerIntegration.testNodeMarkersRegistration-seed#[9423561C831E4B71]) [    ] o.a.s.c.a.s.TestTriggerIntegration ====== KILL OVERSEER 1
   [junit4]   2> 863877 INFO  (TEST-TestTriggerIntegration.testNodeMarkersRegistration-seed#[9423561C831E4B71]) [    ] o.a.s.c.a.s.SimCloudManager === Restarting OverseerTriggerThread and clearing object cache...
   [junit4]   2> 863877 WARN  (Simulated OverseerAutoScalingTriggerThread) [    ] o.a.s.c.a.OverseerTriggerThread Interrupted
   [junit4]   2> java.lang.InterruptedException
   [junit4]   2> 	at java.util.concurrent.locks.AbstractQueuedSynchronizer$ConditionObject.reportInterruptAfterWait(AbstractQueuedSynchronizer.java:2014)
   [junit4]   2> 	at java.util.concurrent.locks.AbstractQueuedSynchronizer$ConditionObject.await(AbstractQueuedSynchronizer.java:2048)
   [junit4]   2> 	at org.apache.solr.cloud.autoscaling.OverseerTriggerThread.run(OverseerTriggerThread.java:166)
   [junit4]   2> 	at java.lang.Thread.run(Thread.java:748)
   [junit4]   2> 863878 DEBUG (TEST-TestTriggerIntegration.testNodeMarkersRegistration-seed#[9423561C831E4B71]) [    ] o.a.s.c.a.OverseerTriggerThread OverseerTriggerThread has been closed explicitly
   [junit4]   2> 863879 DEBUG (Simulated OverseerAutoScalingTriggerThread) [    ] o.a.s.c.a.OverseerTriggerThread Refreshing /autoscaling.json with znode version 2
   [junit4]   2> 863879 DEBUG (Simulated OverseerAutoScalingTriggerThread) [    ] o.a.s.c.a.NodeLostTrigger Initial livenodes: [127.0.0.1:10001_solr, 127.0.0.1:10002_solr]
   [junit4]   2> 863880 DEBUG (Simulated OverseerAutoScalingTriggerThread) [    ] o.a.s.c.a.OverseerTriggerThread Current znodeVersion 2, lastZnodeVersion -1
   [junit4]   2> 863880 DEBUG (Simulated OverseerAutoScalingTriggerThread) [    ] o.a.s.c.a.OverseerTriggerThread Processed trigger updates upto znodeVersion 2
   [junit4]   2> 863880 DEBUG (Simulated OverseerAutoScalingTriggerThread) [    ] o.a.s.c.a.NodeLostTrigger Adding lost node from marker path: 127.0.0.1:10000_solr
   [junit4]   2> 863880 DEBUG (Simulated OverseerAutoScalingTriggerThread) [    ] o.a.s.c.a.OverseerTriggerThread -- clean old nodeAdded markers
   [junit4]   2> 863880 DEBUG (Simulated OverseerAutoScalingTriggerThread) [    ] o.a.s.c.a.OverseerTriggerThread Current znodeVersion 2, lastZnodeVersion 2
   [junit4]   2> 863881 DEBUG (ScheduledTrigger-3142-thread-1) [    ] o.a.s.c.a.NodeLostTrigger Running NodeLostTrigger: .auto_add_replicas with currently live nodes: 2
   [junit4]   2> 863881 DEBUG (ScheduledTrigger-3142-thread-1) [    ] o.a.s.c.a.NodeLostTrigger Tracking lost node: 127.0.0.1:10000_solr
   [junit4]   2> 863902 DEBUG (ScheduledTrigger-3142-thread-1) [    ] o.a.s.c.a.NodeLostTrigger Running NodeLostTrigger: .auto_add_replicas with currently live nodes: 2
   [junit4]   2> 863923 DEBUG (ScheduledTrigger-3142-thread-2) [    ] o.a.s.c.a.NodeLostTrigger Running NodeLostTrigger: .auto_add_replicas with currently live nodes: 2
   [junit4]   2> 863945 DEBUG (ScheduledTrigger-3142-thread-2) [    ] o.a.s.c.a.NodeLostTrigger Running NodeLostTrigger: .auto_add_replicas with currently live nodes: 2
   [junit4]   2> 863966 DEBUG (ScheduledTrigger-3142-thread-2) [    ] o.a.s.c.a.NodeLostTrigger Running NodeLostTrigger: .auto_add_replicas with currently live nodes: 2
   [junit4]   2> 863980 INFO  (TEST-TestTriggerIntegration.testNodeMarkersRegistration-seed#[9423561C831E4B71]) [    ] o.a.s.c.a.s.TestTriggerIntegration ====== ADD TRIGGERS
   [junit4]   2> 863987 DEBUG (ScheduledTrigger-3142-thread-1) [    ] o.a.s.c.a.NodeLostTrigger Running NodeLostTrigger: .auto_add_replicas with currently live nodes: 2
   [junit4]   2> 863991 DEBUG (simCloudManagerPool-3141-thread-1) [    ] o.a.s.c.a.AutoScalingHandler Verified autoscaling configuration
   [junit4]   2> 863991 DEBUG (simCloudManagerPool-3141-thread-1) [    ] o.a.s.c.a.OverseerTriggerThread Refreshing /autoscaling.json with znode version 3
   [junit4]   2> 863991 DEBUG (simCloudManagerPool-3141-thread-1) [    ] o.a.s.c.a.NodeLostTrigger Initial livenodes: [127.0.0.1:10001_solr, 127.0.0.1:10002_solr]
   [junit4]   2> 864000 DEBUG (simCloudManagerPool-3141-thread-1) [    ] o.a.s.c.a.NodeAddedTrigger Initial livenodes: [127.0.0.1:10001_solr, 127.0.0.1:10002_solr]
   [junit4]   2> 864000 DEBUG (simCloudManagerPool-3141-thread-1) [    ] o.a.s.c.a.NodeAddedTrigger NodeAddedTrigger node_added_trigger instantiated with properties: {event=nodeAdded, waitFor=1, actions=[{name=test, class=org.apache.solr.cloud.autoscaling.sim.TestTriggerIntegration$TestEventMarkerAction}], enabled=true}
   [junit4]   2> 864001 DEBUG (Simulated OverseerAutoScalingTriggerThread) [    ] o.a.s.c.a.OverseerTriggerThread Processed trigger updates upto znodeVersion 3
   [junit4]   2> 864003 INFO  (Simulated OverseerAutoScalingTriggerThread) [    ] o.a.s.c.a.s.TestTriggerIntegration TestEventMarkerAction init
   [junit4]   2> 864004 DEBUG (Simulated OverseerAutoScalingTriggerThread) [    ] o.a.s.c.a.OverseerTriggerThread Current znodeVersion 3, lastZnodeVersion 3
   [junit4]   2> 864004 DEBUG (ScheduledTrigger-3142-thread-3) [    ] o.a.s.c.a.NodeAddedTrigger Running NodeAddedTrigger node_added_trigger
   [junit4]   2> 864005 DEBUG (ScheduledTrigger-3142-thread-3) [    ] o.a.s.c.a.NodeAddedTrigger Found livenodes: 2
   [junit4]   2> 864006 DEBUG (simCloudManagerPool-3141-thread-2) [    ] o.a.s.c.a.AutoScalingHandler Verified autoscaling configuration
   [junit4]   2> 864006 DEBUG (simCloudManagerPool-3141-thread-2) [    ] o.a.s.c.a.OverseerTriggerThread Refreshing /autoscaling.json with znode version 4
   [junit4]   2> 864007 DEBUG (simCloudManagerPool-3141-thread-2) [    ] o.a.s.c.a.NodeLostTrigger Initial livenodes: [127.0.0.1:10001_solr, 127.0.0.1:10002_solr]
   [junit4]   2> 864007 DEBUG (simCloudManagerPool-3141-thread-2) [    ] o.a.s.c.a.NodeLostTrigger Initial livenodes: [127.0.0.1:10001_solr, 127.0.0.1:10002_solr]
   [junit4]   2> 864007 DEBUG (simCloudManagerPool-3141-thread-2) [    ] o.a.s.c.a.NodeAddedTrigger Initial livenodes: [127.0.0.1:10001_solr, 127.0.0.1:10002_solr]
   [junit4]   2> 864007 DEBUG (simCloudManagerPool-3141-thread-2) [    ] o.a.s.c.a.NodeAddedTrigger NodeAddedTrigger node_added_trigger instantiated with properties: {event=nodeAdded, waitFor=1, actions=[{name=test, class=org.apache.solr.cloud.autoscaling.sim.TestTriggerIntegration$TestEventMarkerAction}], enabled=true}
   [junit4]   2> 864007 DEBUG (Simulated OverseerAutoScalingTriggerThread) [    ] o.a.s.c.a.OverseerTriggerThread Processed trigger updates upto znodeVersion 4
   [junit4]   2> 864007 INFO  (Simulated OverseerAutoScalingTriggerThread) [    ] o.a.s.c.a.s.TestTriggerIntegration TestEventMarkerAction init
   [junit4]   2> 864007 DEBUG (Simulated OverseerAutoScalingTriggerThread) [    ] o.a.s.c.a.OverseerTriggerThread Current znodeVersion 4, lastZnodeVersion 4
   [junit4]   2> 864007 INFO  (TEST-TestTriggerIntegration.testNodeMarkersRegistration-seed#[9423561C831E4B71]) [    ] o.a.s.c.a.s.TestTriggerIntegration ====== ADD NODE 1
   [junit4]   2> 864009 DEBUG (ScheduledTrigger-3142-thread-1) [    ] o.a.s.c.a.NodeLostTrigger Running NodeLostTrigger: .auto_add_replicas with currently live nodes: 3
   [junit4]   2> 864009 DEBUG (ScheduledTrigger-3142-thread-1) [    ] o.a.s.c.a.NodeLostTrigger Running NodeLostTrigger: node_lost_trigger with currently live nodes: 3
   [junit4]   2> 864028 DEBUG (ScheduledTrigger-3142-thread-3) [    ] o.a.s.c.a.NodeAddedTrigger Running NodeAddedTrigger node_added_trigger
   [junit4]   2> 864028 DEBUG (ScheduledTrigger-3142-thread-3) [    ] o.a.s.c.a.NodeAddedTrigger Found livenodes: 3
   [junit4]   2> 864028 DEBUG (ScheduledTrigger-3142-thread-3) [    ] o.a.s.c.a.NodeAddedTrigger Tracking new node: 127.0.0.1:10003_solr at time 804774811172332
   [junit4]   2> 864029 DEBUG (ScheduledTrigger-3142-thread-3) [    ] o.a.s.c.a.NodeLostTrigger Running NodeLostTrigger: .auto_add_replicas with currently live nodes: 3
   [junit4]   2> 864029 DEBUG (ScheduledTrigger-3142-thread-3) [    ] o.a.s.c.a.NodeLostTrigger Running NodeLostTrigger: node_lost_trigger with currently live nodes: 3
   [junit4]   2> 864048 DEBUG (ScheduledTrigger-3142-thread-2) [    ] o.a.s.c.a.NodeAddedTrigger Running NodeAddedTrigger node_added_trigger
   [junit4]   2> 864048 DEBUG (ScheduledTrigger-3142-thread-2) [    ] o.a.s.c.a.NodeAddedTrigger Found livenodes: 3
   [junit4]   2> 864048 DEBUG (ScheduledTrigger-3142-thread-2) [    ] o.a.s.c.a.NodeAddedTrigger NodeAddedTrigger node_added_trigger firing registered processor for nodes: [127.0.0.1:10003_solr] added at times [804774811172332], now=804775872321082
   [junit4]   2> 864049 DEBUG (ScheduledTrigger-3142-thread-2) [    ] o.a.s.c.a.ScheduledTriggers ++++++++ Cooldown inactive - processing event: {
   [junit4]   2>   "id":"2dbf03cbe7decT20eaax7ym9lak0h2aba8pgj2l",
   [junit4]   2>   "source":"node_added_trigger",
   [junit4]   2>   "eventTime":804774811172332,
   [junit4]   2>   "eventType":"NODEADDED",
   [junit4]   2>   "properties":{
   [junit4]   2>     "eventTimes":[804774811172332],
   [junit4]   2>     "nodeNames":["127.0.0.1:10003_solr"]}}
   [junit4]   2> 864051 DEBUG (AutoscalingActionExecutor-3143-thread-1) [    ] o.a.s.c.a.ScheduledTriggers -- processing actions for {
   [junit4]   2>   "id":"2dbf03cbe7decT20eaax7ym9lak0h2aba8pgj2l",
   [junit4]   2>   "source":"node_added_trigger",
   [junit4]   2>   "eventTime":804774811172332,
   [junit4]   2>   "eventType":"NODEADDED",
   [junit4]   2>   "properties":{
   [junit4]   2>     "eventTimes":[804774811172332],
   [junit4]   2>     "_enqueue_time_":804775888392232,
   [junit4]   2>     "nodeNames":["127.0.0.1:10003_solr"]}}
   [junit4]   2> 864052 DEBUG (AutoscalingActionExecutor-3143-thread-1) [    ] o.a.s.c.a.ScheduledTriggers -- processing took 42 ms for event id=2dbf03cbe7decT20eaax7ym9lak0h2aba8pgj2l
   [junit4]   2> 864072 DEBUG (ScheduledTrigger-3142-thread-4) [    ] o.a.s.c.a.NodeLostTrigger Running NodeLostTrigger: .auto_add_replicas with currently live nodes: 3
   [junit4]   2> 864072 DEBUG (ScheduledTrigger-3142-thread-4) [    ] o.a.s.c.a.NodeLostTrigger Running NodeLostTrigger: node_lost_trigger with currently live nodes: 3
   [junit4]   2> 864072 DEBUG (ScheduledTrigger-3142-thread-4) [    ] o.a.s.c.a.NodeAddedTrigger Running NodeAddedTrigger node_added_trigger
   [junit4]   2> 864072 DEBUG (ScheduledTrigger-3142-thread-4) [    ] o.a.s.c.a.NodeAddedTrigger Found livenodes: 3
   [junit4]   2> 864094 DEBUG (ScheduledTrigger-3142-thread-4) [    ] o.a.s.c.a.NodeLostTrigger Running NodeLostTrigger: .auto_add_replicas with currently live nodes: 3
   [junit4]   2> 864094 DEBUG (ScheduledTrigger-3142-thread-4) [    ] o.a.s.c.a.NodeLostTrigger Running NodeLostTrigger: node_lost_trigger with currently live nodes: 3
   [junit4]   2> 864094 DEBUG (ScheduledTrigger-3142-thread-4) [    ] o.a.s.c.a.NodeAddedTrigger Running NodeAddedTrigger node_added_trigger
   [junit4]   2> 864094 DEBUG (ScheduledTrigger-3142-thread-4) [    ] o.a.s.c.a.NodeAddedTrigger Found livenodes: 3
   [junit4]   2> 864108 INFO  (TEST-TestTriggerIntegration.testNodeMarkersRegistration-seed#[9423561C831E4B71]) [    ] o.a.s.c.a.s.TestTriggerIntegration ====== KILL OVERSEER 2
   [junit4]   2> 864108 INFO  (TEST-TestTriggerIntegration.testNodeMarkersRegistration-seed#[9423561C831E4B71]) [    ] o.a.s.c.a.s.SimCloudManager === Restarting OverseerTriggerThread and clearing object cache...
   [junit4]   2> 864114 DEBUG (TEST-TestTriggerIntegration.testNodeMarkersRegistration-seed#[9423561C831E4B71]) [    ] o.a.s.c.a.OverseerTriggerThread OverseerTriggerThread has been closed explicitly
   [junit4]   2> 864117 WARN  (Simulated OverseerAutoScalingTriggerThread) [    ] o.a.s.c.a.OverseerTriggerThread OverseerTriggerThread woken up but we are closed, exiting.
   [junit4]   2> 864118 DEBUG (Simulated OverseerAutoScalingTriggerThread) [    ] o.a.s.c.a.OverseerTriggerThread Refreshing /autoscaling.json with znode version 4
   [junit4]   2> 864118 DEBUG (Simulated OverseerAutoScalingTriggerThread) [    ] o.a.s.c.a.NodeLostTrigger Initial livenodes: [127.0.0.1:10002_solr, 127.0.0.1:10003_solr]
   [junit4]   2> 864118 DEBUG (Simulated OverseerAutoScalingTriggerThread) [    ] o.a.s.c.a.NodeLostTrigger Initial livenodes: [127.0.0.1:10002_solr, 127.0.0.1:10003_solr]
   [junit4]   2> 864118 DEBUG (Simulated OverseerAutoScalingTriggerThread) [    ] o.a.s.c.a.NodeAddedTrigger Initial livenodes: [127.0.0.1:10002_solr, 127.0.0.1:10003_solr]
   [junit4]   2> 864118 DEBUG (Simulated OverseerAutoScalingTriggerThread) [    ] o.a.s.c.a.NodeAddedTrigger NodeAddedTrigger node_added_trigger instantiated with properties: {event=nodeAdded, waitFor=1, actions=[{name=test, class=org.apache.solr.cloud.autoscaling.sim.TestTriggerIntegration$TestEventMarkerAction}], enabled=true}
   [junit4]   2> 864118 DEBUG (Simulated OverseerAutoScalingTriggerThread) [    ] o.a.s.c.a.OverseerTriggerThread Current znodeVersion 4, lastZnodeVersion -1
   [junit4]   2> 864118 DEBUG (Simulated OverseerAutoScalingTriggerThread) [    ] o.a.s.c.a.OverseerTriggerThread Processed trigger updates upto znodeVersion 4
   [junit4]   2> 864118 INFO  (Simulated OverseerAutoScalingTriggerThread) [    ] o.a.s.c.a.s.TestTriggerIntegration TestEventMarkerAction init
   [junit4]   2> 864119 DEBUG (Simulated OverseerAutoScalingTriggerThread) [    ] o.a.s.c.a.NodeLostTrigger Adding lost node from marker path: 127.0.0.1:10001_solr
   [junit4]   2> 864119 INFO  (Simulated OverseerAutoScalingTriggerThread) [    ] o.a.s.c.a.s.TestTriggerIntegration TestEventMarkerAction init
   [junit4]   2> 864119 DEBUG (Simulated OverseerAutoScalingTriggerThread) [    ] o.a.s.c.a.OverseerTriggerThread Current znodeVersion 4, lastZnodeVersion 4
   [junit4]   2> 864119 DEBUG (ScheduledTrigger-3145-thread-1) [    ] o.a.s.c.a.NodeLostTrigger Running NodeLostTrigger: node_lost_trigger with currently live nodes: 2
   [junit4]   2> 864119 DEBUG (ScheduledTrigger-3145-thread-1) [    ] o.a.s.c.a.NodeLostTrigger Tracking lost node: 127.0.0.1:10001_solr
   [junit4]   2> 864119 DEBUG (ScheduledTrigger-3145-thread-1) [    ] o.a.s.c.a.NodeAddedTrigger Running NodeAddedTrigger node_added_trigger
   [junit4]   2> 864119 DEBUG (ScheduledTrigger-3145-thread-1) [    ] o.a.s.c.a.NodeAddedTrigger Found livenodes: 2
   [junit4]   2> 864119 DEBUG (ScheduledTrigger-3145-thread-1) [    ] o.a.s.c.a.NodeLostTrigger Running NodeLostTrigger: .auto_add_replicas with currently live nodes: 2
   [junit4]   2> 864119 DEBUG (ScheduledTrigger-3145-thread-1) [    ] o.a.s.c.a.NodeLostTrigger Tracking lost node: 127.0.0.1:10001_solr
   [junit4]   2> 864144 DEBUG (ScheduledTrigger-3145-thread-2) [    ] o.a.s.c.a.NodeAddedTrigger Running NodeAddedTrigger node_added_trigger
   [junit4]   2> 864144 DEBUG (ScheduledTrigger-3145-thread-2) [    ] o.a.s.c.a.NodeAddedTrigger Found livenodes: 2
   [junit4]   2> 864144 DEBUG (ScheduledTrigger-3145-thread-3) [    ] o.a.s.c.a.NodeLostTrigger Running NodeLostTrigger: .auto_add_replicas with currently live nodes: 2
   [junit4]   2> 864145 DEBUG (ScheduledTrigger-3145-thread-1) [    ] o.a.s.c.a.NodeLostTrigger Running NodeLostTrigger: node_lost_trigger with currently live nodes: 2
   [junit4]   2> 864145 DEBUG (ScheduledTrigger-3145-thread-1) [    ] o.a.s.c.a.NodeLostTrigger NodeLostTrigger firing registered processor for lost nodes: [127.0.0.1:10001_solr]
   [junit4]   2> 864145 DEBUG (ScheduledTrigger-3145-thread-1) [    ] o.a.s.c.a.ScheduledTriggers ++++++++ Cooldown inactive - processing event: {
   [junit4]   2>   "id":"2dbf14dd77d44T20eaax7ym9lak0h2aba8pgj2o",
   [junit4]   2>   "source":"node_lost_trigger",
   [junit4]   2>   "eventTime":804779392990532,
   [junit4]   2>   "eventType":"NODELOST",
   [junit4]   2>   "properties":{
   [junit4]   2>     "eventTimes":[804779392990532],
   [junit4]   2>     "nodeNames":["127.0.0.1:10001_solr"]}}
   [junit4]   2> 864146 DEBUG (AutoscalingActionExecutor-3146-thread-1) [    ] o.a.s.c.a.ScheduledTriggers -- processing actions for {
   [junit4]   2>   "id":"2dbf14dd77d44T20eaax7ym9lak0h2aba8pgj2o",
   [junit4]   2>   "source":"node_lost_trigger",
   [junit4]   2>   "eventTime":804779392990532,
   [junit4]   2>   "eventType":"NODELOST",
   [junit4]   2>   "properties":{
   [junit4]   2>     "eventTimes":[804779392990532],
   [junit4]   2>     "_enqueue_time_":804780697012232,
   [junit4]   2>     "nodeNames":["127.0.0.1:10001_solr"]}}
   [junit4]   2> 864146 INFO  (TEST-TestTriggerIntegration.testNodeMarkersRegistration-seed#[9423561C831E4B71]) [    ] o.a.s.SolrTestCaseJ4 ###Ending testNodeMarkersRegistration
   [junit4]   2> 864146 INFO  (TEST-TestTriggerIntegration.testNodeMarkersRegistration-seed#[9423561C831E4B71]) [    ] o.a.s.c.a.s.SimSolrCloudTestCase 
   [junit4]   2> 
   [junit4]   2> 864146 INFO  (TEST-TestTriggerIntegration.testNodeMarkersRegistration-seed#[9423561C831E4B71]) [    ] o.a.s.c.a.s.SimSolrCloudTestCase #############################################
   [junit4]   2> 864146 INFO  (TEST-TestTriggerIntegration.testNodeMarkersRegistration-seed#[9423561C831E4B71]) [    ] o.a.s.c.a.s.SimSolrCloudTestCase ############ FINAL CLUSTER STATS ############
   [junit4]   2> 864146 INFO  (TEST-TestTriggerIntegration.testNodeMarkersRegistration-seed#[9423561C831E4B71]) [    ] o.a.s.c.a.s.SimSolrCloudTestCase #############################################
   [junit4]   2> 
   [junit4]   2> 864146 INFO  (TEST-TestTriggerIntegration.testNodeMarkersRegistration-seed#[9423561C831E4B71]) [    ] o.a.s.c.a.s.SimSolrCloudTestCase ## Live nodes:		2
   [junit4]   2> 864146 INFO  (TEST-TestTriggerIntegration.testNodeMarkersRegistration-seed#[9423561C831E4B71]) [    ] o.a.s.c.a.s.SimSolrCloudTestCase ## Empty nodes:	2
   [junit4]   2> 864147 INFO  (TEST-TestTriggerIntegration.testNodeMarkersRegistration-seed#[9423561C831E4B71]) [    ] o.a.s.c.a.s.SimSolrCloudTestCase ## Dead nodes:		2
   [junit4]   2> 864147 INFO  (TEST-TestTriggerIntegration.testNodeMarkersRegistration-seed#[9423561C831E4B71]) [    ] o.a.s.c.a.s.SimSolrCloudTestCase ##		127.0.0.1:10000_solr
   [junit4]   2> 864147 INFO  (TEST-TestTriggerIntegration.testNodeMarkersRegistration-seed#[9423561C831E4B71]) [    ] o.a.s.c.a.s.SimSolrCloudTestCase ##		127.0.0.1:10001_solr
   [junit4]   2> 864148 INFO  (TEST-TestTriggerIntegration.testNodeMarkersRegistration-seed#[9423561C831E4B71]) [    ] o.a.s.c.a.s.SimSolrCloudTestCase ## Collections:	[]
   [junit4]   2> 864148 INFO  (TEST-TestTriggerIntegration.testNodeMarkersRegistration-seed#[9423561C831E4B71]) [    ] o.a.s.c.a.s.SimSolrCloudTestCase ## Max replicas per node:	0
   [junit4]   2> 864148 INFO  (TEST-TestTriggerIntegration.testNodeMarkersRegistration-seed#[9423561C831E4B71]) [    ] o.a.s.c.a.s.SimSolrCloudTestCase ## Min replicas per node:	0
   [junit4]   2> 864148 INFO  (TEST-TestTriggerIntegration.testNodeMarkersRegistration-seed#[9423561C831E4B71]) [    ] o.a.s.c.a.s.SimSolrCloudTestCase ## Total replicas:		0
   [junit4]   2> 864148 INFO  (TEST-TestTriggerIntegration.testNodeMarkersRegistration-seed#[9423561C831E4B71]) [    ] o.a.s.c.a.s.SimSolrCloudTestCase ######### Final Solr op counts ##########
   [junit4]   2> 864149 INFO  (TEST-TestTriggerIntegration.testNodeMarkersRegistration-seed#[9423561C831E4B71]) [    ] o.a.s.c.a.s.SimSolrCloudTestCase ##		- autoscaling        2
   [junit4]   2> 864149 INFO  (TEST-TestTriggerIntegration.testNodeMarkersRegistration-seed#[9423561C831E4B71]) [    ] o.a.s.c.a.s.SimSolrCloudTestCase ##		- update             3
   [junit4]   2> 864149 INFO  (TEST-TestTriggerIntegration.testNodeMarkersRegistration-seed#[9423561C831E4B71]) [    ] o.a.s.c.a.s.SimSolrCloudTestCase ######### Autoscaling event counts ###########
   [junit4]   2> 864149 DEBUG (AutoscalingActionExecutor-3146-thread-1) [    ] o.a.s.c.a.ScheduledTriggers -- processing took 182 ms for event id=2dbf14dd77d44T20eaax7ym9lak0h2aba8pgj2o
   [junit4]   2> NOTE: reproduce with: ant test  -Dtestcase=TestTriggerIntegration -Dtests.method=testNodeMarkersRegistration -Dtests.seed=9423561C831E4B71 -Dtests.slow=true -Dtests.locale=pt-BR -Dtests.timezone=America/Panama -Dtests.asserts=true -Dtests.file.encoding=UTF-8
   [junit4] ERROR   0.39s J1 | TestTriggerIntegration.testNodeMarkersRegistration <<<
   [junit4]    > Throwable #1: java.util.ConcurrentModificationException
   [junit4]    > 	at __randomizedtesting.SeedInfo.seed([9423561C831E4B71:8C99DE108D2B869E]:0)
   [junit4]    > 	at java.util.ArrayList$Itr.checkForComodification(ArrayList.java:901)
   [junit4]    > 	at java.util.ArrayList$Itr.next(ArrayList.java:851)
   [junit4]    > 	at org.apache.solr.cloud.autoscaling.sim.SimSolrCloudTestCase.tearDown(SimSolrCloudTestCase.java:141)
   [junit4]    > 	at java.lang.Thread.run(Thread.java:748)
   [junit4]   2> 864155 INFO  (TEST-TestTriggerIntegration.testNodeLostTriggerRestoreState-seed#[9423561C831E4B71]) [    ] o.a.s.SolrTestCaseJ4 ###Starting testNodeLostTriggerRestoreState
   [junit4]   2> 864155 DEBUG (TEST-TestTriggerIntegration.testNodeLostTriggerRestoreState-seed#[9423561C831E4B71]) [    ] o.a.s.c.a.OverseerTriggerThread Refreshing /autoscaling.json with znode version 5
   [junit4]   2> 864155 DEBUG (Simulated OverseerAutoScalingTriggerThread) [    ] o.a.s.c.a.OverseerTriggerThread Processed trigger updates upto znodeVersion 5
   [junit4]   2> 864155 DEBUG (TEST-TestTriggerIntegration.testNodeLostTriggerRestoreState-seed#[9423561C831E4B71]) [    ] o.a.s.c.a.s.SimNodeStateProvider - removing dead node values: 127.0.0.1:10001_solr
   [junit4]   2> 864156 DEBUG (TEST-TestTriggerIntegration.testNodeLostTriggerRestoreState-seed#[9423561C831E4B71]) [    ] o.a.s.c.a.s.SimNodeStateProvider - removing dead node values: 127.0.0.1:10000_solr
   [junit4]   2> 864156 INFO  (TEST-TestTriggerIntegration.testNodeLostTriggerRestoreState-seed#[9423561C831E4B71]) [    ] o.a.s.c.a.s.SimCloudManager === Restarting OverseerTriggerThread and clearing object cache...
   [junit4]   2> 864156 DEBUG (Simulated OverseerAutoScalingTriggerThread) [    ] o.a.s.c.a.OverseerTriggerThread -- clean old nodeLost markers
   [junit4]   2> 864157 DEBUG (Simulated OverseerAutoScalingTriggerThread) [    ] o.a.s.c.a.OverseerTriggerThread -- clean old nodeAdded markers
   [junit4]   2> 864157 DEBUG (TEST-TestTriggerIntegration.testNodeLostTriggerRestoreState-seed#[9423561C831E4B71]) [    ] o.a.s.c.a.OverseerTriggerThread OverseerTriggerThread has been closed explicitly
   [junit4]   2> 864157 WARN  (Simulated OverseerAutoScalingTriggerThread) [    ] o.a.s.c.a.OverseerTriggerThread Interrupted
   [junit4]   2> java.lang.InterruptedException
   [junit4]   2> 	at java.util.concurrent.locks.AbstractQueuedSynchronizer.acquireInterruptibly(AbstractQueuedSynchronizer.java:1220)
   [junit4]   2> 	at java.util.concurrent.locks.ReentrantLock.lockInterruptibly(ReentrantLock.java:335)
   [junit4]   2> 	at org.apache.solr.cloud.autoscaling.OverseerTriggerThread.run(OverseerTriggerThread.java:154)
   [junit4]   2> 	at java.lang.Thread.run(Thread.java:748)
   [junit4]   2> 864158 DEBUG (Simulated OverseerAutoScalingTriggerThread) [    ] o.a.s.c.a.OverseerTriggerThread Adding .autoAddReplicas trigger
   [junit4]   2> 864158 DEBUG (Simulated OverseerAutoScalingTriggerThread) [    ] o.a.s.c.a.OverseerTriggerThread Refreshing /autoscaling.json with znode version 6
   [junit4]   2> 864158 DEBUG (Simulated OverseerAutoScalingTriggerThread) [    ] o.a.s.c.a.NodeLostTrigger Initial livenodes: [127.0.0.1:10002_solr, 127.0.0.1:10003_solr]
   [junit4]   2> 864158 DEBUG (Simulated OverseerAutoScalingTriggerThread) [    ] o.a.s.c.a.OverseerTriggerThread Current znodeVersion 6, lastZnodeVersion -1
   [junit4]   2> 864158 DEBUG (Simulated OverseerAutoScalingTriggerThread) [    ] o.a.s.c.a.OverseerTriggerThread Processed trigger updates upto znodeVersion 6
   [junit4]   2> 864158 DEBUG (Simulated OverseerAutoScalingTriggerThread) [    ] o.a.s.c.a.OverseerTriggerThread -- clean old nodeAdded markers
   [junit4]   2> 864158 DEBUG (Simulated OverseerAutoScalingTriggerThread) [    ] o.a.s.c.a.OverseerTriggerThread Current znodeVersion 6, lastZnodeVersion 6
   [junit4]   2> 864158 DEBUG (ScheduledTrigger-3148-thread-1) [    ] o.a.s.c.a.NodeLostTrigger Running NodeLostTrigger: .auto_add_replicas with currently live nodes: 2
   [junit4]   2> 864180 DEBUG (ScheduledTrigger-3148-thread-1) [    ] o.a.s.c.a.NodeLostTrigger Running NodeLostTrigger: .auto_add_replicas with currently live nodes: 2
   [junit4]   2> 864201 DEBUG (ScheduledTrigger-3148-thread-2) [    ] o.a.s.c.a.NodeLostTrigger Running NodeLostTrigger: .auto_add_replicas with currently live nodes: 2
   [junit4]   2> 864222 DEBUG (ScheduledTrigger-3148-thread-1) [    ] o.a.s.c.a.NodeLostTrigger Running NodeLostTrigger: .auto_add_replicas with currently live nodes: 2
   [junit4]   2> 864243 DEBUG (ScheduledTrigger-3148-thread-1) [    ] o.a.s.c.a.NodeLostTrigger Running NodeLostTrigger: .auto_add_replicas with currently live nodes: 2
   [junit4]   2> 864259 DEBUG (simCloudManagerPool-3147-thread-1) [    ] o.a.s.c.a.AutoScalingHandler Verified autoscaling configuration
   [junit4]   2> 864259 DEBUG (simCloudManagerPool-3147-thread-1) [    ] o.a.s.c.a.OverseerTriggerThread Refreshing /autoscaling.json with znode version 7
   [junit4]   2> 864260 DEBUG (simCloudManagerPool-3147-thread-1) [    ] o.a.s.c.a.NodeLostTrigger Initial livenodes: [127.0.0.1:10004_solr, 127.0.0.1:10002_solr, 127.0.0.1:10003_solr]
   [junit4]   2> 864260 DEBUG (simCloudManagerPool-3147-thread-1) [    ] o.a.s.c.a.NodeLostTrigger Initial livenodes: [127.0.0.1:10004_solr, 127.0.0.1:10002_solr, 127.0.0.1:10003_solr]
   [junit4]   2> 864260 DEBUG (Simulated OverseerAutoScalingTriggerThread) [    ] o.a.s.c.a.OverseerTriggerThread Processed trigger updates upto znodeVersion 7
   [junit4]   2> 864260 INFO  (Simulated OverseerAutoScalingTriggerThread) [    ] o.a.s.c.a.s.TestTriggerIntegration TestTriggerAction init
   [junit4]   2> 864261 DEBUG (Simulated OverseerAutoScalingTriggerThread) [    ] o.a.s.c.a.OverseerTriggerThread -- clean old nodeAdded markers
   [junit4]   2> 864261 DEBUG (Simulated OverseerAutoScalingTriggerThread) [    ] o.a.s.c.a.OverseerTriggerThread Current znodeVersion 7, lastZnodeVersion 7
   [junit4]   2> 864261 DEBUG (ScheduledTrigger-3148-thread-4) [    ] o.a.s.c.a.NodeLostTrigger Running NodeLostTrigger: node_lost_restore_trigger with currently live nodes: 3
   [junit4]   2> 864264 DEBUG (ScheduledTrigger-3148-thread-1) [    ] o.a.s.c.a.NodeLostTrigger Running NodeLostTrigger: .auto_add_replicas with currently live nodes: 2
   [junit4]   2> 864284 DEBUG (ScheduledTrigger-3148-thread-4) [    ] o.a.s.c.a.NodeLostTrigger Running NodeLostTrigger: node_lost_restore_trigger with currently live nodes: 2
   [junit4]   2> 864284 DEBUG (ScheduledTrigger-3148-thread-2) [    ] o.a.s.c.a.NodeLostTrigger Running NodeLostTrigger: .auto_add_replicas with currently live nodes: 2
   [junit4]   2> 864284 DEBUG (ScheduledTrigger-3148-thread-4) [    ] o.a.s.c.a.NodeLostTrigger Tracking lost node: 127.0.0.1:10004_solr
   [junit4]   2> 864293 DEBUG (simCloudManagerPool-3147-thread-2) [    ] o.a.s.c.a.AutoScalingHandler Verified autoscaling configuration
   [junit4]   2> 864293 DEBUG (simCloudManagerPool-3147-thread-2) [    ] o.a.s.c.a.OverseerTriggerThread Refreshing /autoscaling.json with znode version 8
   [junit4]   2> 864293 DEBUG (simCloudManagerPool-3147-thread-2) [    ] o.a.s.c.a.NodeLostTrigger Initial livenodes: [127.0.0.1:10002_solr, 127.0.0.1:10003_solr]
   [junit4]   2> 864293 DEBUG (simCloudManagerPool-3147-thread-2) [    ] o.a.s.c.a.NodeLostTrigger Initial livenodes: [127.0.0.1:10002_solr, 127.0.0.1:10003_solr]
   [junit4]   2> 864293 DEBUG (Simulated OverseerAutoScalingTriggerThread) [    ] o.a.s.c.a.OverseerTriggerThread Processed trigger updates upto znodeVersion 8
   [junit4]   2> 864294 INFO  (Simulated OverseerAutoScalingTriggerThread) [    ] o.a.s.c.a.s.TestTriggerIntegration TestTriggerAction init
   [junit4]   2> 864294 DEBUG (Simulated OverseerAutoScalingTriggerThread) [    ] o.a.s.c.a.NodeLostTrigger Adding lost node from marker path: 127.0.0.1:10004_solr
   [junit4]   2> 864294 DEBUG (Simulated OverseerAutoScalingTriggerThread) [    ] o.a.s.c.a.OverseerTriggerThread -- clean old nodeAdded markers
   [junit4]   2> 864294 DEBUG (ScheduledTrigger-3148-thread-1) [    ] o.a.s.c.a.NodeLostTrigger Running NodeLostTrigger: node_lost_restore_trigger with currently live nodes: 2
   [junit4]   2> 864294 DEBUG (Simulated OverseerAutoScalingTriggerThread) [    ] o.a.s.c.a.OverseerTriggerThread Current znodeVersion 8, lastZnodeVersion 8
   [junit4]   2> 864294 DEBUG (ScheduledTrigger-3148-thread-1) [    ] o.a.s.c.a.NodeLostTrigger NodeLostTrigger firing registered processor for lost nodes: [127.0.0.1:10004_solr]
   [junit4]   2> 864294 DEBUG (ScheduledTrigger-3148-thread-1) [    ] o.a.s.c.a.ScheduledTriggers ++++++++ Cooldown inactive - processing event: {
   [junit4]   2>   "id":"2dbf357837cc4T20eaax7ym9lak0h2aba8pgj2r",
   [junit4]   2>   "source":"node_lost_restore_trigger",
   [junit4]   2>   "eventTime":804788145192132,
   [junit4]   2>   "eventType":"NODELOST",
   [junit4]   2>   "properties":{
   [junit4]   2>     "eventTimes":[804788145192132],
   [junit4]   2>     "nodeNames":["127.0.0.1:10004_solr"]}}
   [junit4]   2> 864295 DEBUG (AutoscalingActionExecutor-3149-thread-1) [    ] o.a.s.c.a.ScheduledTriggers -- processing actions for {
   [junit4]   2>   "id":"2dbf357837cc4T20eaax7ym9lak0h2aba8pgj2r",
   [junit4]   2>   "source":"node_lost_restore_trigger",
   [junit4]   2>   "eventTime":804788145192132,
   [junit4]   2>   "eventType":"NODELOST",
   [junit4]   2>   "properties":{
   [junit4]   2>     "eventTimes":[804788145192132],
   [junit4]   2>     "_enqueue_time_":804788158361932,
   [junit4]   2>     "nodeNames":["127.0.0.1:10004_solr"]}}
   [junit4]   2> 864295 INFO  (TEST-TestTriggerIntegration.testNodeLostTriggerRestoreState-seed#[9423561C831E4B71]) [    ] o.a.s.SolrTestCaseJ4 ###Ending testNodeLostTriggerRestoreState
   [junit4]   2> 864295 INFO  (TEST-TestTriggerIntegration.testNodeLostTriggerRestoreState-seed#[9423561C831E4B71]) [    ] o.a.s.c.a.s.SimSolrCloudTestCase 
   [junit4]   2> 
   [junit4]   2> 864295 INFO  (TEST-TestTriggerIntegration.testNodeLostTriggerRestoreState-seed#[9423561C831E4B71]) [    ] o.a.s.c.a.s.SimSolrCloudTestCase #############################################
   [junit4]   2> 864295 INFO  (TEST-TestTriggerIntegration.testNodeLostTriggerRestoreState-seed#[9423561C831E4B71]) [    ] o.a.s.c.a.s.SimSolrCloudTestCase ############ FINAL CLUSTER STATS ############
   [junit4]   2> 864295 INFO  (TEST-TestTriggerIntegration.testNodeLostTriggerRestoreState-seed#[9423561C831E4B71]) [    ] o.a.s.c.a.s.SimSolrCloudTestCase #############################################
   [junit4]   2> 
   [junit4]   2> 864295 INFO  (TEST-TestTriggerIntegration.testNodeLostTriggerRestoreState-seed#[9423561C831E4B71]) [    ] o.a.s.c.a.s.SimSolrCloudTestCase ## Live nodes:		2
   [junit4]   2> 864295 INFO  (TEST-TestTriggerIntegration.testNodeLostTriggerRestoreState-seed#[9423561C831E4B71]) [    ] o.a.s.c.a.s.SimSolrCloudTestCase ## Empty nodes:	2
   [junit4]   2> 864295 INFO  (TEST-TestTriggerIntegration.testNodeLostTriggerRestoreState-seed#[9423561C831E4B71]) [    ] o.a.s.c.a.s.SimSolrCloudTestCase ## Dead nodes:		1
   [junit4]   2> 864295 INFO  (TEST-TestTriggerIntegration.testNodeLostTriggerRestoreState-seed#[9423561C831E4B71]) [    ] o.a.s.c.a.s.SimSolrCloudTestCase ##		127.0.0.1:10004_solr
   [junit4]   2> 864295 INFO  (TEST-TestTriggerIntegration.testNodeLostTriggerRestoreState-seed#[9423561C831E4B71]) [    ] o.a.s.c.a.s.SimSolrCloudTestCase ## Collections:	[]
   [junit4]   2> 864295 INFO  (TEST-TestTriggerIntegration.testNodeLostTriggerRestoreState-seed#[9423561C831E4B71]) [    ] o.a.s.c.a.s.SimSolrCloudTestCase ## Max replicas per node:	0
   [junit4]   2> 864296 INFO  (TEST-TestTriggerIntegration.testNodeLostTriggerRestoreState-seed#[9423561C831E4B71]) [    ] o.a.s.c.a.s.SimSolrCloudTestCase ## Min replicas per node:	0
   [junit4]   2> 864296 INFO  (TEST-TestTriggerIntegration.testNodeLostTriggerRestoreState-seed#[9423561C831E4B71]) [    ] o.a.s.c.a.s.SimSolrCloudTestCase ## Total replicas:		0
   [junit4]   2> 864296 INFO  (TEST-TestTriggerIntegration.testNodeLostTriggerRestoreState-seed#[9423561C831E4B71]) [    ] o.a.s.c.a.s.SimSolrCloudTestCase ######### Final Solr op counts ##########
   [junit4]   2> 864296 INFO  (TEST-TestTriggerIntegration.testNodeLostTriggerRestoreState-seed#[9423561C831E4B71]) [    ] o.a.s.c.a.s.SimSolrCloudTestCase ##		- autoscaling        2
   [junit4]   2> 864296 INFO  (TEST-TestTriggerIntegration.testNodeLostTriggerRestoreState-seed#[9423561C831E4B71]) [    ] o.a.s.c.a.s.SimSolrCloudTestCase ##		- update             1
   [junit4]   2> 864296 INFO  (TEST-TestTriggerIntegration.testNodeLostTriggerRestoreState-seed#[9423561C831E4B71]) [    ] o.a.s.c.a.s.SimSolrCloudTestCase ######### Autoscaling event counts ###########
   [junit4]   2> 864296 INFO  (TEST-TestTriggerIntegration.testNodeLostTriggerRestoreState-seed#[9423561C831E4B71]) [    ] o.a.s.c.a.s.SimSolrCloudTestCase ## * Trigger: node_lost_restore_trigger
   [junit4]   2> 864297 INFO  (TEST-TestTriggerIntegration.testNodeLostTriggerRestoreState-seed#[9423561C831E4B71]) [    ] o.a.s.c.a.s.SimSolrCloudTestCase ##		- STARTED         1
   [junit4]   2> 864301 DEBUG (AutoscalingActionExecutor-3149-thread-1) [    ] o.a.s.c.a.ScheduledTriggers -- processing took 291 ms for event id=2dbf357837cc4T20eaax7ym9lak0h2aba8pgj2r
   [junit4]   2> 864302 INFO  (TEST-TestTriggerIntegration.testEventFromRestoredState-seed#[9423561C831E4B71]) [    ] o.a.s.SolrTestCaseJ4 ###Starting testEventFromRestoredState
   [junit4]   2> 864302 DEBUG (TEST-TestTriggerIntegration.testEventFromRestoredState-seed#[9423561C831E4B71]) [    ] o.a.s.c.a.OverseerTriggerThread Refreshing /autoscaling.json with znode version 9
   [junit4]   2> 864302 DEBUG (TEST-TestTriggerIntegration.testEventFromRestoredState-seed#[9423561C831E4B71]) [    ] o.a.s.c.a.s.SimNodeStateProvider - removing dead node values: 127.0.0.1:10004_solr
   [junit4]   2> 864302 INFO  (TEST-TestTriggerIntegration.testEventFromRestoredState-seed#[9423561C831E4B71]) [    ] o.a.s.c.a.s.SimCloudManager === Restarting OverseerTriggerThread and clearing object cache...
   [junit4]   2> 864303 WARN  (Simulated OverseerAutoScalingTriggerThread) [    ] o.a.s.c.a.OverseerTriggerThread OverseerTriggerThread woken up but we are closed, exiting.
   [junit4]   2> 864303 DEBUG (TEST-TestTriggerIntegration.testEventFromRestoredState-seed#[9423561C831E4B71]) [    ] o.a.s.c.a.OverseerTriggerThread OverseerTriggerThread has been closed explicitly
   [junit4]   2> 864305 DEBUG (Simulated OverseerAutoScalingTriggerThread) [    ] o.a.s.c.a.OverseerTriggerThread Adding .autoAddReplicas trigger
   [junit4]   2> 864305 DEBUG (Simulated OverseerAutoScalingTriggerThread) [    ] o.a.s.c.a.OverseerTriggerThread Refreshing /autoscaling.json with znode version 10
   [junit4]   2> 864305 DEBUG (Simulated OverseerAutoScalingTriggerThread) [    ] o.a.s.c.a.NodeLostTrigger Initial livenodes: [127.0.0.1:10002_solr, 127.0.0.1:10003_solr]
   [junit4]   2> 864305 DEBUG (Simulated OverseerAutoScalingTriggerThread) [    ] o.a.s.c.a.OverseerTriggerThread Current znodeVersion 10, lastZnodeVersion -1
   [junit4]   2> 864305 DEBUG (Simulated OverseerAutoScalingTriggerThread) [    ] o.a.s.c.a.OverseerTriggerThread Processed trigger updates upto znodeVersion 10
   [junit4]   2> 864306 DEBUG (Simulated OverseerAutoScalingTriggerThread) [    ] o.a.s.c.a.OverseerTriggerThread -- clean old nodeAdded markers
   [junit4]   2> 864306 DEBUG (Simulated OverseerAutoScalingTriggerThread) [    ] o.a.s.c.a.OverseerTriggerThread Current znodeVersion 10, lastZnodeVersion 10
   [junit4]   2> 864306 DEBUG (ScheduledTrigger-3151-thread-1) [    ] o.a.s.c.a.NodeLostTrigger Running NodeLostTrigger: .auto_add_replicas with currently live nodes: 2
   [junit4]   2> 864327 DEBUG (ScheduledTrigger-3151-thread-1) [    ] o.a.s.c.a.NodeLostTrigger Running NodeLostTrigger: .auto_add_replicas with currently live nodes: 2
   [junit4]   2> 864348 DEBUG (ScheduledTrigger-3151-thread-2) [    ] o.a.s.c.a.NodeLostTrigger Running NodeLostTrigger: .auto_add_replicas with currently live nodes: 2
   [junit4]   2> 864369 DEBUG (ScheduledTrigger-3151-thread-1) [    ] o.a.s.c.a.NodeLostTrigger Running NodeLostTrigger: .auto_add_replicas with currently live nodes: 2
   [junit4]   2> 864389 DEBUG (ScheduledTrigger-3151-thread-1) [    ] o.a.s.c.a.NodeLostTrigger Running NodeLostTrigger: .auto_add_replicas with currently live nodes: 2
   [junit4]   2> 864406 DEBUG (simCloudManagerPool-3150-thread-1) [    ] o.a.s.c.a.AutoScalingHandler Verified autoscaling configuration
   [junit4]   2> 864406 DEBUG (simCloudManagerPool-3150-thread-1) [    ] o.a.s.c.a.OverseerTriggerThread Refreshing /autoscaling.json with znode version 11
   [junit4]   2> 864406 DEBUG (simCloudManagerPool-3150-thread-1) [    ] o.a.s.c.a.NodeLostTrigger Initial livenodes: [127.0.0.1:10002_solr, 127.0.0.1:10003_solr]
   [junit4]   2> 864407 DEBUG (simCloudManagerPool-3150-thread-1) [    ] o.a.s.c.a.NodeAddedTrigger Initial livenodes: [127.0.0.1:10002_solr, 127.0.0.1:10003_solr]
   [junit4]   2> 864407 DEBUG (simCloudManagerPool-3150-thread-1) [    ] o.a.s.c.a.NodeAddedTrigger NodeAddedTrigger node_added_trigger instantiated with properties: {event=nodeAdded, waitFor=10, actions=[{name=test, class=org.apache.solr.cloud.autoscaling.sim.TestTriggerIntegration$TestTriggerAction}], enabled=true}
   [junit4]   2> 864407 DEBUG (Simulated OverseerAutoScalingTriggerThread) [    ] o.a.s.c.a.OverseerTriggerThread Processed trigger updates upto znodeVersion 11
   [junit4]   2> 864407 INFO  (Simulated OverseerAutoScalingTriggerThread) [    ] o.a.s.c.a.s.TestTriggerIntegration TestTriggerAction init
   [junit4]   2> 864407 DEBUG (Simulated OverseerAutoScalingTriggerThread) [    ] o.a.s.c.a.OverseerTriggerThread Current znodeVersion 11, lastZnodeVersion 11
   [junit4]   2> 864407 DEBUG (ScheduledTrigger-3151-thread-4) [    ] o.a.s.c.a.NodeAddedTrigger Running NodeAddedTrigger node_added_trigger
   [junit4]   2> 864407 DEBUG (ScheduledTrigger-3151-thread-4) [    ] o.a.s.c.a.NodeAddedTrigger Found livenodes: 3
   [junit4]   2> 864407 DEBUG (ScheduledTrigger-3151-thread-4) [    ] o.a.s.c.a.NodeAddedTrigger Tracking new node: 127.0.0.1:10005_solr at time 804793787689732
   [junit4]   2> 864411 DEBUG (ScheduledTrigger-3151-thread-1) [    ] o.a.s.c.a.NodeLostTrigger Running NodeLostTrigger: .auto_add_replicas with currently live nodes: 3
   [junit4]   2> 864428 DEBUG (ScheduledTrigger-3151-thread-3) [    ] o.a.s.c.a.NodeAddedTrigger Running NodeAddedTrigger node_added_trigger
   [junit4]   2> 864428 DEBUG (ScheduledTrigger-3151-thread-3) [    ] o.a.s.c.a.NodeAddedTrigger Found livenodes: 3
   [junit4]   2> 864431 DEBUG (ScheduledTrigger-3151-thread-2) [    ] o.a.s.c.a.NodeLostTrigger Running NodeLostTrigger: .auto_add_replicas with currently live nodes: 3
   [junit4]   2> 864448 DEBUG (ScheduledTrigger-3151-thread-4) [    ] o.a.s.c.a.NodeAddedTrigger Running NodeAddedTrigger node_added_trigger
   [junit4]   2> 864448 DEBUG (ScheduledTrigger-3151-thread-4) [    ] o.a.s.c.a.NodeAddedTrigger Found livenodes: 3
   [junit4]   2> 864452 DEBUG (ScheduledTrigger-3151-thread-1) [    ] o.a.s.c.a.NodeLostTrigger Running NodeLostTrigger: .auto_add_replicas with currently live nodes: 3
   [junit4]   2> 864469 DEBUG (ScheduledTrigger-3151-thread-3) [    ] o.a.s.c.a.NodeAddedTrigger Running NodeAddedTrigger node_added_trigger
   [junit4]   2> 864469 DEBUG (ScheduledTrigger-3151-thread-3) [    ] o.a.s.c.a.NodeAddedTrigger Found livenodes: 3
   [junit4]   2> 864474 DEBUG (ScheduledTrigger-3151-thread-2) [    ] o.a.s.c.a.NodeLostTrigger Running NodeLostTrigger: .auto_add_replicas with currently live nodes: 3
   [junit4]   2> 864490 DEBUG (ScheduledTrigger-3151-thread-4) [    ] o.a.s.c.a.NodeAddedTrigger Running NodeAddedTrigger node_added_trigger
   [junit4]   2> 864490 DEBUG (ScheduledTrigger-3151-thread-4) [    ] o.a.s.c.a.NodeAddedTrigger Found livenodes: 3
   [junit4]   2> 864496 DEBUG (ScheduledTrigger-3151-thread-1) [    ] o.a.s.c.a.NodeLostTrigger Running NodeLostTrigger: .auto_add_replicas with currently live nodes: 3
   [junit4]   2> 864511 DEBUG (ScheduledTrigger-3151-thread-3) [    ] o.a.s.c.a.NodeAddedTrigger Running NodeAddedTrigger node_added_trigger
   [junit4]   2> 864511 DEBUG (ScheduledTrigger-3151-thread-3) [    ] o.a.s.c.a.NodeAddedTrigger Found livenodes: 3
   [junit4]   2> 864517 DEBUG (ScheduledTrigger-3151-thread-2) [    ] o.a.s.c.a.NodeLostTrigger Running NodeLostTrigger: .auto_add_replicas with currently live nodes: 3
   [junit4]   2> 864532 DEBUG (ScheduledTrigger-3151-thread-4) [    ] o.a.s.c.a.NodeAddedTrigger Running NodeAddedTrigger node_added_trigger
   [junit4]   2> 864532 DEBUG (ScheduledTrigger-3151-thread-4) [    ] o.a.s.c.a.NodeAddedTrigger Found livenodes: 3
   [junit4]   2> 864538 DEBUG (ScheduledTrigger-3151-thread-1) [    ] o.a.s.c.a.NodeLostTrigger Running NodeLostTrigger: .auto_add_replicas with currently live nodes: 3
   [junit4]   2> 864553 DEBUG (ScheduledTrigger-3151-thread-3) [    ] o.a.s.c.a.NodeAddedTrigger Running NodeAddedTrigger node_added_trigger
   [junit4]   2> 864553 DEBUG (ScheduledTrigger-3151-thread-3) [    ] o.a.s.c.a.NodeAddedTrigger Found livenodes: 3
   [junit4]   2> 864558 DEBUG (ScheduledTrigger-3151-thread-2) [    ] o.a.s.c.a.NodeLostTrigger Running NodeLostTrigger: .auto_add_replicas with currently live nodes: 3
   [junit4]   2> 864574 DEBUG (ScheduledTrigger-3151-thread-4) [    ] o.a.s.c.a.NodeAddedTrigger Running NodeAddedTrigger node_added_trigger
   [junit4]   2> 864574 DEBUG (ScheduledTrigger-3151-thread-4) [    ] o.a.s.c.a.NodeAddedTrigger Found livenodes: 3
   [junit4]   2> 864579 DEBUG (ScheduledTrigger-3151-thread-1) [    ] o.a.s.c.a.NodeLostTrigger Running NodeLostTrigger: .auto_add_replicas with currently live nodes: 3
   [junit4]   2> 864595 DEBUG (ScheduledTrigger-3151-thread-3) [    ] o.a.s.c.a.NodeAddedTrigger Running NodeAddedTrigger node_added_trigger
   [junit4]   2> 864595 DEBUG (ScheduledTrigger-3151-thread-3) [    ] o.a.s.c.a.NodeAddedTrigger Found livenodes: 3
   [junit4]   2> 864600 DEBUG (ScheduledTrigger-3151-thread-2) [    ] o.a.s.c.a.NodeLostTrigger Running NodeLostTrigger: .auto_add_replicas with currently live nodes: 3
   [junit4]   2> 864615 DEBUG (ScheduledTrigger-3151-thread-4) [    ] o.a.s.c.a.NodeAddedTrigger Running NodeAddedTrigger node_added_trigger
   [junit4]   2> 864615 DEBUG (ScheduledTrigger-3151-thread-4) [    ] o.a.s.c.a.NodeAddedTrigger Found livenodes: 3
   [junit4]   2> 864615 DEBUG (ScheduledTrigger-3151-thread-4) [    ] o.a.s.c.a.NodeAddedTrigger NodeAddedTrigger node_added_trigger firing registered processor for nodes: [127.0.0.1:10005_solr] added at times [804793787689732], now=804804200634932
   [junit4]   2> 864615 DEBUG (ScheduledTrigger-3151-thread-4) [    ] o.a.s.c.a.ScheduledTriggers ++++++++ Cooldown inactive - processing event: {
   [junit4]   2>   "id":"2dbf4a7d52b04T20eaax7ym9lak0h2aba8pgj2u",
   [junit4]   2>   "source":"node_added_trigger",
   [junit4]   2>   "eventTime":804793787689732,
   [junit4]   2>   "eventType":"NODEADDED",
   [junit4]   2>   "properties":{
   [junit4]   2>     "eventTimes":[804793787689732],
   [junit4]   2>     "nodeNames":["127.0.0.1:10005_solr"]}}
   [junit4]   2> 864616 DEBUG (AutoscalingActionExecutor-3152-thread-1) [    ] o.a.s.c.a.ScheduledTriggers -- processing actions for {
   [junit4]   2>   "id":"2dbf4a7d52b04T20eaax7ym9lak0h2aba8pgj2u",
   [junit4]   2>   "source":"node_added_trigger",
   [junit4]   2>   "eventTime":804793787689732,
   [junit4]   2>   "eventType":"NODEADDED",
   [junit4]   2>   "properties":{
   [junit4]   2>     "eventTimes":[804793787689732],
   [junit4]   2>     "_enqueue_time_":804804207674932,
   [junit4]   2>     "nodeNames":["127.0.0.1:10005_solr"]}}
   [junit4]   2> 864616 DEBUG (AutoscalingActionExecutor-3152-thread-1) [    ] o.a.s.c.a.ScheduledTriggers -- processing took 33 ms for event id=2dbf4a7d52b04T20eaax7ym9lak0h2aba8pgj2u
   [junit4]   2> 864621 DEBUG (ScheduledTrigger-3151-thread-1) [    ] o.a.s.c.a.NodeLostTrigger Running NodeLostTrigger: .auto_add_replicas with currently live nodes: 4
   [junit4]   2> 864637 DEBUG (ScheduledTrigger-3151-thread-3) [    ] o.a.s.c.a.NodeAddedTrigger Running NodeAddedTrigger node_added_trigger
   [junit4]   2> 864637 DEBUG (ScheduledTrigger-3151-thread-3) [    ] o.a.s.c.a.NodeAddedTrigger Found livenodes: 4
   [junit4]   2> 864637 DEBUG (ScheduledTrigger-3151-thread-3) [    ] o.a.s.c.a.NodeAddedTrigger Tracking new node: 127.0.0.1:10006_solr at time 804805273929432
   [junit4]   2> 864644 DEBUG (ScheduledTrigger-3151-thread-2) [    ] o.a.s.c.a.NodeLostTrigger Running NodeLostTrigger: .auto_add_replicas with currently live nodes: 4
   [junit4]   2> 864658 DEBUG (ScheduledTrigger-3151-thread-4) [    ] o.a.s.c.a.NodeAddedTrigger Running NodeAddedTrigger node_added_trigger
   [junit4]   2> 864658 DEBUG (ScheduledTrigger-3151-thread-4) [    ] o.a.s.c.a.NodeAddedTrigger Found livenodes: 4
   [junit4]   2> 864668 DEBUG (ScheduledTrigger-3151-thread-1) [    ] o.a.s.c.a.NodeLostTrigger Running NodeLostTrigger: .auto_add_replicas with currently live nodes: 4
   [junit4]   2> 864679 DEBUG (ScheduledTrigger-3151-thread-3) [    ] o.a.s.c.a.NodeAddedTrigger Running NodeAddedTrigger node_added_trigger
   [junit4]   2> 864679 DEBUG (ScheduledTrigger-3151-thread-3) [    ] o.a.s.c.a.NodeAddedTrigger Found livenodes: 4
   [junit4]   2> 864689 DEBUG (ScheduledTrigger-3151-thread-2) [    ] o.a.s.c.a.NodeLostTrigger Running NodeLostTrigger: .auto_add_replicas with currently live nodes: 4
   [junit4]   2> 864700 DEBUG (ScheduledTrigger-3151-thread-4) [    ] o.a.s.c.a.NodeAddedTrigger Running NodeAddedTrigger node_added_trigger
   [junit4]   2> 864700 DEBUG (ScheduledTrigger-3151-thread-4) [    ] o.a.s.c.a.NodeAddedTrigger Found livenodes: 4
   [junit4]   2> 864709 DEBUG (ScheduledTrigger-3151-thread-1) [    ] o.a.s.c.a.NodeLostTrigger Running NodeLostTrigger: .auto_add_replicas with currently live nodes: 4
   [junit4]   2> 864721 DEBUG (ScheduledTrigger-3151-thread-3) [    ] o.a.s.c.a.NodeAddedTrigger Running NodeAddedTrigger node_added_trigger
   [junit4]   2> 864721 DEBUG (ScheduledTrigger-3151-thread-3) [    ] o.a.s.c.a.NodeAddedTrigger Found livenodes: 4
   [junit4]   2> 864730 DEBUG (ScheduledTrigger-3151-thread-2) [    ] o.a.s.c.a.NodeLostTrigger Running NodeLostTrigger: .auto_add_replicas with currently live nodes: 4
   [junit4]   2> 864741 DEBUG (ScheduledTrigger-3151-thread-4) [    ] o.a.s.c.a.NodeAddedTrigger Running NodeAddedTrigger node_added_trigger
   [junit4]   2> 864741 DEBUG (ScheduledTrigger-3151-thread-4) [    ] o.a.s.c.a.NodeAddedTrigger Found livenodes: 4
   [junit4]   2> 864751 DEBUG (ScheduledTrigger-3151-thread-1) [    ] o.a.s.c.a.NodeLostTrigger Running NodeLostTrigger: .auto_add_replicas with currently live nodes: 4
   [junit4]   2> 864762 DEBUG (ScheduledTrigger-3151-thread-3) [    ] o.a.s.c.a.NodeAddedTrigger Running NodeAddedTrigger node_added_trigger
   [junit4]   2> 864762 DEBUG (ScheduledTrigger-3151-thread-3) [    ] o.a.s.c.a.NodeAddedTrigger Found livenodes: 4
   [junit4]   2> 864771 DEBUG (ScheduledTrigger-3151-thread-2) [    ] o.a.s.c.a.NodeLostTrigger Running NodeLostTrigger: .auto_add_replicas with currently live nodes: 4
   [junit4]   2> 864783 DEBUG (ScheduledTrigger-3151-thread-4) [    ] o.a.s.c.a.NodeAddedTrigger Running NodeAddedTrigger node_added_trigger
   [junit4]   2> 864783 DEBUG (ScheduledTrigger-3151-thread-4) [    ] o.a.s.c.a.NodeAddedTrigger Found livenodes: 4
   [junit4]   2> 864792 DEBUG (ScheduledTrigger-3151-thread-1) [    ] o.a.s.c.a.NodeLostTrigger Running NodeLostTrigger: .auto_add_replicas with currently live nodes: 4
   [junit4]   2> 864804 DEBUG (ScheduledTrigger-3151-thread-3) [    ] o.a.s.c.a.NodeAddedTrigger Running NodeAddedTrigger node_added_trigger
   [junit4]   2> 864804 DEBUG (ScheduledTrigger-3151-thread-3) [    ] o.a.s.c.a.NodeAddedTrigger Found livenodes: 4
   [junit4]   2> 864812 DEBUG (ScheduledTrigger-3151-thread-2) [    ] o.a.s.c.a.NodeLostTrigger Running NodeLostTrigger: .auto_add_replicas with currently live nodes: 4
   [junit4]   2> 864817 INFO  (TEST-TestTriggerIntegration.testEventFromRestoredState-seed#[9423561C831E4B71]) [    ] o.a.s.c.a.s.SimCloudManager === Restarting OverseerTriggerThread and clearing object cache...
   [junit4]   2> 864817 WARN  (Simulated OverseerAutoScalingTriggerThread) [    ] o.a.s.c.a.OverseerTriggerThread OverseerTriggerThread woken up but we are closed, exiting.
   [junit4]   2> 864817 DEBUG (TEST-TestTriggerIntegration.testEventFromRestoredState-seed#[9423561C831E4B71]) [    ] o.a.s.c.a.OverseerTriggerThread OverseerTriggerThread has been closed explicitly
   [junit4]   2> 864818 DEBUG (Simulated OverseerAutoScalingTriggerThread) [    ] o.a.s.c.a.OverseerTriggerThread Refreshing /autoscaling.json with znode version 11
   [junit4]   2> 864818 DEBUG (Simulated OverseerAutoScalingTriggerThread) [    ] o.a.s.c.a.NodeLostTrigger Initial livenodes: [127.0.0.1:10006_solr, 127.0.0.1:10005_solr, 127.0.0.1:10002_solr, 127.0.0.1:10003_solr]
   [junit4]   2> 864818 DEBUG (Simulated OverseerAutoScalingTriggerThread) [    ] o.a.s.c.a.NodeAddedTrigger Initial livenodes: [127.0.0.1:10006_solr, 127.0.0.1:10005_solr, 127.0.0.1:10002_solr, 127.0.0.1:10003_solr]
   [junit4]   2> 864818 DEBUG (Simulated OverseerAutoScalingTriggerThread) [    ] o.a.s.c.a.NodeAddedTrigger NodeAddedTrigger node_added_trigger instantiated with properties: {event=nodeAdded, waitFor=10, actions=[{name=test, class=org.apache.solr.cloud.autoscaling.sim.TestTriggerIntegration$TestTriggerAction}], enabled=true}
   [junit4]   2> 864818 DEBUG (Simulated OverseerAutoScalingTriggerThread) [    ] o.a.s.c.a.OverseerTriggerThread Current znodeVersion 11, lastZnodeVersion -1
   [junit4]   2> 864818 DEBUG (Simulated OverseerAutoScalingTriggerThread) [    ] o.a.s.c.a.OverseerTriggerThread Processed trigger updates upto znodeVersion 11
   [junit4]   2> 864818 INFO  (Simulated OverseerAutoScalingTriggerThread) [    ] o.a.s.c.a.s.TestTriggerIntegration TestTriggerAction init
   [junit4]   2> 864818 DEBUG (Simulated OverseerAutoScalingTriggerThread) [    ] o.a.s.c.a.NodeAddedTrigger Adding node from marker path: 127.0.0.1:10006_solr
   [junit4]   2> 864819 DEBUG (Simulated OverseerAutoScalingTriggerThread) [    ] o.a.s.c.a.OverseerTriggerThread Current znodeVersion 11, lastZnodeVersion 11
   [junit4]   2> 864819 DEBUG (ScheduledTrigger-3154-thread-1) [    ] o.a.s.c.a.NodeLostTrigger Running NodeLostTrigger: .auto_add_replicas with currently live nodes: 4
   [junit4]   2> 864819 DEBUG (ScheduledTrigger-3154-thread-2) [    ] o.a.s.c.a.NodeAddedTrigger Running NodeAddedTrigger node_added_trigger
   [junit4]   2> 864819 DEBUG (ScheduledTrigger-3154-thread-2) [    ] o.a.s.c.a.NodeAddedTrigger Found livenodes: 4
   [junit4]   2> 864841 DEBUG (ScheduledTrigger-3154-thread-2) [    ] o.a.s.c.a.NodeAddedTrigger Running NodeAddedTrigger node_added_trigger
   [junit4]   2> 864841 DEBUG (ScheduledTrigger-3154-thread-2) [    ] o.a.s.c.a.NodeAddedTrigger Found livenodes: 4
   [junit4]   2> 864841 DEBUG (ScheduledTrigger-3154-thread-2) [    ] o.a.s.c.a.NodeAddedTrigger NodeAddedTrigger node_added_trigger firing registered processor for nodes: [127.0.0.1:10006_solr] added at times [804805273929432], now=804815470042582
   [junit4]   2> 864841 DEBUG (ScheduledTrigger-3154-thread-2) [    ] o.a.s.c.a.ScheduledTriggers ++++++++ Cooldown inactive - processing event: {
   [junit4]   2>   "id":"2dbf7547746d8T20eaax7ym9lak0h2aba8pgj2x",
   [junit4]   2>   "source":"node_added_trigger",
   [junit4]   2>   "eventTime":804805273929432,
   [junit

[...truncated too long message...]

ventQueue-seed#[9423561C831E4B71]) [    ] o.a.s.c.a.s.SimSolrCloudTestCase ######### Final Solr op counts ##########
   [junit4]   2> 866947 INFO  (TEST-TestTriggerIntegration.testEventQueue-seed#[9423561C831E4B71]) [    ] o.a.s.c.a.s.SimSolrCloudTestCase ##		- autoscaling        1
   [junit4]   2> 866947 INFO  (TEST-TestTriggerIntegration.testEventQueue-seed#[9423561C831E4B71]) [    ] o.a.s.c.a.s.SimSolrCloudTestCase ##		- update             3
   [junit4]   2> 866948 INFO  (TEST-TestTriggerIntegration.testEventQueue-seed#[9423561C831E4B71]) [    ] o.a.s.c.a.s.SimSolrCloudTestCase ######### Autoscaling event counts ###########
   [junit4]   2> 866948 INFO  (TEST-TestTriggerIntegration.testEventQueue-seed#[9423561C831E4B71]) [    ] o.a.s.c.a.s.SimSolrCloudTestCase ## * Trigger: node_added_trigger1
   [junit4]   2> 866948 INFO  (TEST-TestTriggerIntegration.testEventQueue-seed#[9423561C831E4B71]) [    ] o.a.s.c.a.s.SimSolrCloudTestCase ##		- STARTED         2
   [junit4]   2> 866948 INFO  (TEST-TestTriggerIntegration.testEventQueue-seed#[9423561C831E4B71]) [    ] o.a.s.c.a.s.SimSolrCloudTestCase ##		- SUCCEEDED       1
   [junit4]   2> 866949 WARN  (Simulated OverseerAutoScalingTriggerThread) [    ] o.a.s.c.a.OverseerTriggerThread OverseerTriggerThread woken up but we are closed, exiting.
   [junit4]   2> 866949 DEBUG (SUITE-TestTriggerIntegration-seed#[9423561C831E4B71]-worker) [    ] o.a.s.c.a.OverseerTriggerThread OverseerTriggerThread has been closed explicitly
   [junit4]   2> NOTE: leaving temporary files on disk at: C:\Users\jenkins\workspace\Lucene-Solr-master-Windows\solr\build\solr-core\test\J1\temp\solr.cloud.autoscaling.sim.TestTriggerIntegration_9423561C831E4B71-001
   [junit4]   2> NOTE: test params are: codec=Asserting(Lucene70): {}, docValues:{}, maxPointsInLeafNode=228, maxMBSortInHeap=7.863613926115086, sim=Asserting(org.apache.lucene.search.similarities.AssertingSimilarity@37d428c5), locale=pt-BR, timezone=America/Panama
   [junit4]   2> NOTE: Windows 10 10.0 amd64/Oracle Corporation 1.8.0_144 (64-bit)/cpus=3,threads=1,free=65090792,total=307679232
   [junit4]   2> NOTE: All tests run in this JVM: [HealthCheckHandlerTest, PeerSyncTest, TestMissingGroups, TestTolerantUpdateProcessorRandomCloud, TestWordDelimiterFilterFactory, TestConfig, TestUseDocValuesAsStored2, TestSQLHandler, OverseerModifyCollectionTest, TestFunctionQuery, StatelessScriptUpdateProcessorFactoryTest, NumberUtilsTest, TestCloudJSONFacetJoinDomain, TestCustomStream, JvmMetricsTest, LeaderInitiatedRecoveryOnShardRestartTest, CollectionsAPIAsyncDistributedZkTest, TestCSVLoader, AnalysisAfterCoreReloadTest, TestXmlQParserPlugin, TestHashPartitioner, HdfsCollectionsAPIDistributedZkTest, TestTlogReplica, SynonymTokenizerTest, BasicAuthStandaloneTest, UUIDUpdateProcessorFallbackTest, TestValueSourceCache, DistribDocExpirationUpdateProcessorTest, DeleteLastCustomShardedReplicaTest, TestTrieFacet, TestFieldCacheReopen, ExternalFileFieldSortTest, TestCrossCoreJoin, ClassificationUpdateProcessorIntegrationTest, TestSizeLimitedDistributedMap, FileUtilsTest, TestSolrIndexConfig, AutoAddReplicasIntegrationTest, AliasIntegrationTest, TestReloadAndDeleteDocs, TestBackupRepositoryFactory, HdfsRestartWhileUpdatingTest, TestSolrCoreSnapshots, AnalyticsQueryTest, TestUnifiedSolrHighlighter, RollingRestartTest, TestAuthorizationFramework, TestSolrJ, DeleteReplicaTest, DeleteStatusTest, DistributedIntervalFacetingTest, SolrGangliaReporterTest, TestPartialUpdateDeduplication, TlogReplayBufferedWhileIndexingTest, TestSolrQueryParser, PreAnalyzedFieldTest, TestLuceneIndexBackCompat, TestFileDictionaryLookup, TestGroupingSearch, CoreAdminCreateDiscoverTest, SearchHandlerTest, ConnectionManagerTest, ZkStateReaderTest, OverseerStatusTest, CollectionStateFormat2Test, TestReqParamsAPI, CloneFieldUpdateProcessorFactoryTest, TestCloudDeleteByQuery, TestFastWriter, TestRTGBase, UtilsToolTest, PeerSyncReplicationTest, SuggestComponentTest, TestAnalyzedSuggestions, TestSolrCoreParser, MoveReplicaTest, TestInitParams, CdcrRequestHandlerTest, LeaderElectionContextKeyTest, LoggingHandlerTest, DocValuesMissingTest, TestConfigReload, FileBasedSpellCheckerTest, TestSubQueryTransformerDistrib, TestHdfsCloudBackupRestore, TestComponentsName, TestSolrDeletionPolicy1, VMParamsZkACLAndCredentialsProvidersTest, TestSimpleTextCodec, JSONWriterTest, TestHighFrequencyDictionaryFactory, UpdateLogTest, TestTriggerIntegration]
   [junit4] Completed [209/765 (1!)] on J1 in 3.23s, 11 tests, 1 error <<< FAILURES!

[...truncated 4247 lines...]
   [junit4] Suite: org.apache.solr.update.processor.TestOpenNLPExtractNamedEntitiesUpdateProcessorFactory
   [junit4]   2> Creating dataDir: C:\Users\jenkins\workspace\Lucene-Solr-master-Windows\solr\build\contrib\solr-analysis-extras\test\J1\temp\solr.update.processor.TestOpenNLPExtractNamedEntitiesUpdateProcessorFactory_29E97630D59D36B6-001\init-core-data-001
   [junit4]   2> NOTE: test params are: codec=Asserting(Lucene70): {}, docValues:{}, maxPointsInLeafNode=1832, maxMBSortInHeap=5.958972204581297, sim=Asserting(org.apache.lucene.search.similarities.AssertingSimilarity@1d6cf907), locale=hr-HR, timezone=Europe/Amsterdam
   [junit4]   2> NOTE: Windows 10 10.0 amd64/Oracle Corporation 1.8.0_144 (64-bit)/cpus=3,threads=1,free=57092072,total=97320960
   [junit4]   2> NOTE: All tests run in this JVM: [TestFoldingMultitermExtrasQuery, TestOpenNLPExtractNamedEntitiesUpdateProcessorFactory]
   [junit4]   2> NOTE: reproduce with: ant test  -Dtestcase=TestOpenNLPExtractNamedEntitiesUpdateProcessorFactory -Dtests.seed=29E97630D59D36B6 -Dtests.slow=true -Dtests.locale=hr-HR -Dtests.timezone=Europe/Amsterdam -Dtests.asserts=true -Dtests.file.encoding=Cp1252
   [junit4] ERROR   0.00s J1 | TestOpenNLPExtractNamedEntitiesUpdateProcessorFactory (suite) <<<
   [junit4]    > Throwable #1: java.io.IOException: Could not remove the following files (in the order of attempts):
   [junit4]    >    C:\Users\jenkins\workspace\Lucene-Solr-master-Windows\solr\build\contrib\solr-analysis-extras\test\J1\temp\solr.update.processor.TestOpenNLPExtractNamedEntitiesUpdateProcessorFactory_29E97630D59D36B6-001\tempDir-001\collection1\conf: java.nio.file.DirectoryNotEmptyException: C:\Users\jenkins\workspace\Lucene-Solr-master-Windows\solr\build\contrib\solr-analysis-extras\test\J1\temp\solr.update.processor.TestOpenNLPExtractNamedEntitiesUpdateProcessorFactory_29E97630D59D36B6-001\tempDir-001\collection1\conf
   [junit4]    >    C:\Users\jenkins\workspace\Lucene-Solr-master-Windows\solr\build\contrib\solr-analysis-extras\test\J1\temp\solr.update.processor.TestOpenNLPExtractNamedEntitiesUpdateProcessorFactory_29E97630D59D36B6-001\tempDir-001\collection1: java.nio.file.DirectoryNotEmptyException: C:\Users\jenkins\workspace\Lucene-Solr-master-Windows\solr\build\contrib\solr-analysis-extras\test\J1\temp\solr.update.processor.TestOpenNLPExtractNamedEntitiesUpdateProcessorFactory_29E97630D59D36B6-001\tempDir-001\collection1
   [junit4]    >    C:\Users\jenkins\workspace\Lucene-Solr-master-Windows\solr\build\contrib\solr-analysis-extras\test\J1\temp\solr.update.processor.TestOpenNLPExtractNamedEntitiesUpdateProcessorFactory_29E97630D59D36B6-001\tempDir-001: java.nio.file.DirectoryNotEmptyException: C:\Users\jenkins\workspace\Lucene-Solr-master-Windows\solr\build\contrib\solr-analysis-extras\test\J1\temp\solr.update.processor.TestOpenNLPExtractNamedEntitiesUpdateProcessorFactory_29E97630D59D36B6-001\tempDir-001
   [junit4]    >    C:\Users\jenkins\workspace\Lucene-Solr-master-Windows\solr\build\contrib\solr-analysis-extras\test\J1\temp\solr.update.processor.TestOpenNLPExtractNamedEntitiesUpdateProcessorFactory_29E97630D59D36B6-001\tempDir-001\collection1\conf\en-test-ner-person.bin: java.nio.file.AccessDeniedException: C:\Users\jenkins\workspace\Lucene-Solr-master-Windows\solr\build\contrib\solr-analysis-extras\test\J1\temp\solr.update.processor.TestOpenNLPExtractNamedEntitiesUpdateProcessorFactory_29E97630D59D36B6-001\tempDir-001\collection1\conf\en-test-ner-person.bin
   [junit4]    >    C:\Users\jenkins\workspace\Lucene-Solr-master-Windows\solr\build\contrib\solr-analysis-extras\test\J1\temp\solr.update.processor.TestOpenNLPExtractNamedEntitiesUpdateProcessorFactory_29E97630D59D36B6-001\tempDir-001\collection1\conf\en-test-sent.bin: java.nio.file.AccessDeniedException: C:\Users\jenkins\workspace\Lucene-Solr-master-Windows\solr\build\contrib\solr-analysis-extras\test\J1\temp\solr.update.processor.TestOpenNLPExtractNamedEntitiesUpdateProcessorFactory_29E97630D59D36B6-001\tempDir-001\collection1\conf\en-test-sent.bin
   [junit4]    >    C:\Users\jenkins\workspace\Lucene-Solr-master-Windows\solr\build\contrib\solr-analysis-extras\test\J1\temp\solr.update.processor.TestOpenNLPExtractNamedEntitiesUpdateProcessorFactory_29E97630D59D36B6-001\tempDir-001\collection1\conf\en-test-tokenizer.bin: java.nio.file.AccessDeniedException: C:\Users\jenkins\workspace\Lucene-Solr-master-Windows\solr\build\contrib\solr-analysis-extras\test\J1\temp\solr.update.processor.TestOpenNLPExtractNamedEntitiesUpdateProcessorFactory_29E97630D59D36B6-001\tempDir-001\collection1\conf\en-test-tokenizer.bin
   [junit4]    >    C:\Users\jenkins\workspace\Lucene-Solr-master-Windows\solr\build\contrib\solr-analysis-extras\test\J1\temp\solr.update.processor.TestOpenNLPExtractNamedEntitiesUpdateProcessorFactory_29E97630D59D36B6-001: java.nio.file.DirectoryNotEmptyException: C:\Users\jenkins\workspace\Lucene-Solr-master-Windows\solr\build\contrib\solr-analysis-extras\test\J1\temp\solr.update.processor.TestOpenNLPExtractNamedEntitiesUpdateProcessorFactory_29E97630D59D36B6-001
   [junit4]    > 	at __randomizedtesting.SeedInfo.seed([29E97630D59D36B6]:0)
   [junit4]    > 	at org.apache.lucene.util.IOUtils.rm(IOUtils.java:329)
   [junit4]    > 	at java.lang.Thread.run(Thread.java:748)
   [junit4] Completed [4/5 (1!)] on J1 in 3.24s, 8 tests, 1 error <<< FAILURES!

[...truncated 45703 lines...]

Mime
View raw message