lucene-dev mailing list archives

Site index · List index
Message view « Date » · « Thread »
Top « Date » · « Thread »
From Policeman Jenkins Server <jenk...@thetaphi.de>
Subject [JENKINS] Lucene-Solr-7.2-Windows (32bit/jdk1.8.0_144) - Build # 33 - Still Unstable!
Date Wed, 10 Jan 2018 14:30:14 GMT
Build: https://jenkins.thetaphi.de/job/Lucene-Solr-7.2-Windows/33/
Java: 32bit/jdk1.8.0_144 -server -XX:+UseG1GC

7 tests failed.
FAILED:  junit.framework.TestSuite.org.apache.lucene.index.TestBagOfPositions

Error Message:
Could not remove the following files (in the order of attempts):    C:\Users\jenkins\workspace\Lucene-Solr-7.2-Windows\lucene\build\core\test\J1\temp\lucene.index.TestBagOfPositions_CCA3023343FDDA70-001\bagofpositions-001: java.nio.file.AccessDeniedException: C:\Users\jenkins\workspace\Lucene-Solr-7.2-Windows\lucene\build\core\test\J1\temp\lucene.index.TestBagOfPositions_CCA3023343FDDA70-001\bagofpositions-001    C:\Users\jenkins\workspace\Lucene-Solr-7.2-Windows\lucene\build\core\test\J1\temp\lucene.index.TestBagOfPositions_CCA3023343FDDA70-001: java.nio.file.DirectoryNotEmptyException: C:\Users\jenkins\workspace\Lucene-Solr-7.2-Windows\lucene\build\core\test\J1\temp\lucene.index.TestBagOfPositions_CCA3023343FDDA70-001 

Stack Trace:
java.io.IOException: Could not remove the following files (in the order of attempts):
   C:\Users\jenkins\workspace\Lucene-Solr-7.2-Windows\lucene\build\core\test\J1\temp\lucene.index.TestBagOfPositions_CCA3023343FDDA70-001\bagofpositions-001: java.nio.file.AccessDeniedException: C:\Users\jenkins\workspace\Lucene-Solr-7.2-Windows\lucene\build\core\test\J1\temp\lucene.index.TestBagOfPositions_CCA3023343FDDA70-001\bagofpositions-001
   C:\Users\jenkins\workspace\Lucene-Solr-7.2-Windows\lucene\build\core\test\J1\temp\lucene.index.TestBagOfPositions_CCA3023343FDDA70-001: java.nio.file.DirectoryNotEmptyException: C:\Users\jenkins\workspace\Lucene-Solr-7.2-Windows\lucene\build\core\test\J1\temp\lucene.index.TestBagOfPositions_CCA3023343FDDA70-001

	at __randomizedtesting.SeedInfo.seed([CCA3023343FDDA70]:0)
	at org.apache.lucene.util.IOUtils.rm(IOUtils.java:329)
	at org.apache.lucene.util.TestRuleTemporaryFilesCleanup.afterAlways(TestRuleTemporaryFilesCleanup.java:216)
	at com.carrotsearch.randomizedtesting.rules.TestRuleAdapter$1.afterAlways(TestRuleAdapter.java:31)
	at com.carrotsearch.randomizedtesting.rules.StatementAdapter.evaluate(StatementAdapter.java:43)
	at com.carrotsearch.randomizedtesting.rules.StatementAdapter.evaluate(StatementAdapter.java:36)
	at org.apache.lucene.util.TestRuleAssertionsRequired$1.evaluate(TestRuleAssertionsRequired.java:53)
	at org.apache.lucene.util.TestRuleMarkFailure$1.evaluate(TestRuleMarkFailure.java:47)
	at org.apache.lucene.util.TestRuleIgnoreAfterMaxFailures$1.evaluate(TestRuleIgnoreAfterMaxFailures.java:64)
	at org.apache.lucene.util.TestRuleIgnoreTestSuites$1.evaluate(TestRuleIgnoreTestSuites.java:54)
	at com.carrotsearch.randomizedtesting.rules.StatementAdapter.evaluate(StatementAdapter.java:36)
	at com.carrotsearch.randomizedtesting.ThreadLeakControl$StatementRunner.run(ThreadLeakControl.java:368)
	at java.lang.Thread.run(Thread.java:748)


FAILED:  junit.framework.TestSuite.org.apache.lucene.store.TestFileSwitchDirectory

Error Message:
Could not remove the following files (in the order of attempts):    C:\Users\jenkins\workspace\Lucene-Solr-7.2-Windows\lucene\build\core\test\J1\temp\lucene.store.TestFileSwitchDirectory_CCA3023343FDDA70-001\foo-015: java.nio.file.DirectoryNotEmptyException: C:\Users\jenkins\workspace\Lucene-Solr-7.2-Windows\lucene\build\core\test\J1\temp\lucene.store.TestFileSwitchDirectory_CCA3023343FDDA70-001\foo-015    C:\Users\jenkins\workspace\Lucene-Solr-7.2-Windows\lucene\build\core\test\J1\temp\lucene.store.TestFileSwitchDirectory_CCA3023343FDDA70-001\foo-002: java.nio.file.DirectoryNotEmptyException: C:\Users\jenkins\workspace\Lucene-Solr-7.2-Windows\lucene\build\core\test\J1\temp\lucene.store.TestFileSwitchDirectory_CCA3023343FDDA70-001\foo-002    C:\Users\jenkins\workspace\Lucene-Solr-7.2-Windows\lucene\build\core\test\J1\temp\lucene.store.TestFileSwitchDirectory_CCA3023343FDDA70-001\foo-002\extra0: java.nio.file.AccessDeniedException: C:\Users\jenkins\workspace\Lucene-Solr-7.2-Windows\lucene\build\core\test\J1\temp\lucene.store.TestFileSwitchDirectory_CCA3023343FDDA70-001\foo-002\extra0    C:\Users\jenkins\workspace\Lucene-Solr-7.2-Windows\lucene\build\core\test\J1\temp\lucene.store.TestFileSwitchDirectory_CCA3023343FDDA70-001: java.nio.file.DirectoryNotEmptyException: C:\Users\jenkins\workspace\Lucene-Solr-7.2-Windows\lucene\build\core\test\J1\temp\lucene.store.TestFileSwitchDirectory_CCA3023343FDDA70-001 

Stack Trace:
java.io.IOException: Could not remove the following files (in the order of attempts):
   C:\Users\jenkins\workspace\Lucene-Solr-7.2-Windows\lucene\build\core\test\J1\temp\lucene.store.TestFileSwitchDirectory_CCA3023343FDDA70-001\foo-015: java.nio.file.DirectoryNotEmptyException: C:\Users\jenkins\workspace\Lucene-Solr-7.2-Windows\lucene\build\core\test\J1\temp\lucene.store.TestFileSwitchDirectory_CCA3023343FDDA70-001\foo-015
   C:\Users\jenkins\workspace\Lucene-Solr-7.2-Windows\lucene\build\core\test\J1\temp\lucene.store.TestFileSwitchDirectory_CCA3023343FDDA70-001\foo-002: java.nio.file.DirectoryNotEmptyException: C:\Users\jenkins\workspace\Lucene-Solr-7.2-Windows\lucene\build\core\test\J1\temp\lucene.store.TestFileSwitchDirectory_CCA3023343FDDA70-001\foo-002
   C:\Users\jenkins\workspace\Lucene-Solr-7.2-Windows\lucene\build\core\test\J1\temp\lucene.store.TestFileSwitchDirectory_CCA3023343FDDA70-001\foo-002\extra0: java.nio.file.AccessDeniedException: C:\Users\jenkins\workspace\Lucene-Solr-7.2-Windows\lucene\build\core\test\J1\temp\lucene.store.TestFileSwitchDirectory_CCA3023343FDDA70-001\foo-002\extra0
   C:\Users\jenkins\workspace\Lucene-Solr-7.2-Windows\lucene\build\core\test\J1\temp\lucene.store.TestFileSwitchDirectory_CCA3023343FDDA70-001: java.nio.file.DirectoryNotEmptyException: C:\Users\jenkins\workspace\Lucene-Solr-7.2-Windows\lucene\build\core\test\J1\temp\lucene.store.TestFileSwitchDirectory_CCA3023343FDDA70-001

	at __randomizedtesting.SeedInfo.seed([CCA3023343FDDA70]:0)
	at org.apache.lucene.util.IOUtils.rm(IOUtils.java:329)
	at org.apache.lucene.util.TestRuleTemporaryFilesCleanup.afterAlways(TestRuleTemporaryFilesCleanup.java:216)
	at com.carrotsearch.randomizedtesting.rules.TestRuleAdapter$1.afterAlways(TestRuleAdapter.java:31)
	at com.carrotsearch.randomizedtesting.rules.StatementAdapter.evaluate(StatementAdapter.java:43)
	at com.carrotsearch.randomizedtesting.rules.StatementAdapter.evaluate(StatementAdapter.java:36)
	at org.apache.lucene.util.TestRuleAssertionsRequired$1.evaluate(TestRuleAssertionsRequired.java:53)
	at org.apache.lucene.util.TestRuleMarkFailure$1.evaluate(TestRuleMarkFailure.java:47)
	at org.apache.lucene.util.TestRuleIgnoreAfterMaxFailures$1.evaluate(TestRuleIgnoreAfterMaxFailures.java:64)
	at org.apache.lucene.util.TestRuleIgnoreTestSuites$1.evaluate(TestRuleIgnoreTestSuites.java:54)
	at com.carrotsearch.randomizedtesting.rules.StatementAdapter.evaluate(StatementAdapter.java:36)
	at com.carrotsearch.randomizedtesting.ThreadLeakControl$StatementRunner.run(ThreadLeakControl.java:368)
	at java.lang.Thread.run(Thread.java:748)


FAILED:  junit.framework.TestSuite.org.apache.solr.analytics.value.CastingLongValueStreamTest

Error Message:
Could not remove the following files (in the order of attempts):    C:\Users\jenkins\workspace\Lucene-Solr-7.2-Windows\solr\build\contrib\solr-analytics\test\J0\temp\solr.analytics.value.CastingLongValueStreamTest_7035074319678CF-001\init-core-data-001: java.nio.file.AccessDeniedException: C:\Users\jenkins\workspace\Lucene-Solr-7.2-Windows\solr\build\contrib\solr-analytics\test\J0\temp\solr.analytics.value.CastingLongValueStreamTest_7035074319678CF-001\init-core-data-001    C:\Users\jenkins\workspace\Lucene-Solr-7.2-Windows\solr\build\contrib\solr-analytics\test\J0\temp\solr.analytics.value.CastingLongValueStreamTest_7035074319678CF-001: java.nio.file.DirectoryNotEmptyException: C:\Users\jenkins\workspace\Lucene-Solr-7.2-Windows\solr\build\contrib\solr-analytics\test\J0\temp\solr.analytics.value.CastingLongValueStreamTest_7035074319678CF-001 

Stack Trace:
java.io.IOException: Could not remove the following files (in the order of attempts):
   C:\Users\jenkins\workspace\Lucene-Solr-7.2-Windows\solr\build\contrib\solr-analytics\test\J0\temp\solr.analytics.value.CastingLongValueStreamTest_7035074319678CF-001\init-core-data-001: java.nio.file.AccessDeniedException: C:\Users\jenkins\workspace\Lucene-Solr-7.2-Windows\solr\build\contrib\solr-analytics\test\J0\temp\solr.analytics.value.CastingLongValueStreamTest_7035074319678CF-001\init-core-data-001
   C:\Users\jenkins\workspace\Lucene-Solr-7.2-Windows\solr\build\contrib\solr-analytics\test\J0\temp\solr.analytics.value.CastingLongValueStreamTest_7035074319678CF-001: java.nio.file.DirectoryNotEmptyException: C:\Users\jenkins\workspace\Lucene-Solr-7.2-Windows\solr\build\contrib\solr-analytics\test\J0\temp\solr.analytics.value.CastingLongValueStreamTest_7035074319678CF-001

	at __randomizedtesting.SeedInfo.seed([7035074319678CF]:0)
	at org.apache.lucene.util.IOUtils.rm(IOUtils.java:329)
	at org.apache.lucene.util.TestRuleTemporaryFilesCleanup.afterAlways(TestRuleTemporaryFilesCleanup.java:216)
	at com.carrotsearch.randomizedtesting.rules.TestRuleAdapter$1.afterAlways(TestRuleAdapter.java:31)
	at com.carrotsearch.randomizedtesting.rules.StatementAdapter.evaluate(StatementAdapter.java:43)
	at com.carrotsearch.randomizedtesting.rules.StatementAdapter.evaluate(StatementAdapter.java:36)
	at org.apache.lucene.util.TestRuleAssertionsRequired$1.evaluate(TestRuleAssertionsRequired.java:53)
	at org.apache.lucene.util.TestRuleMarkFailure$1.evaluate(TestRuleMarkFailure.java:47)
	at org.apache.lucene.util.TestRuleIgnoreAfterMaxFailures$1.evaluate(TestRuleIgnoreAfterMaxFailures.java:64)
	at org.apache.lucene.util.TestRuleIgnoreTestSuites$1.evaluate(TestRuleIgnoreTestSuites.java:54)
	at com.carrotsearch.randomizedtesting.rules.StatementAdapter.evaluate(StatementAdapter.java:36)
	at com.carrotsearch.randomizedtesting.ThreadLeakControl$StatementRunner.run(ThreadLeakControl.java:368)
	at java.lang.Thread.run(Thread.java:748)


FAILED:  junit.framework.TestSuite.org.apache.solr.handler.component.SuggestComponentContextFilterQueryTest

Error Message:
Could not remove the following files (in the order of attempts):    C:\Users\jenkins\workspace\Lucene-Solr-7.2-Windows\solr\build\solr-core\test\J1\temp\solr.handler.component.SuggestComponentContextFilterQueryTest_E472B5BB95C8634-001\init-core-data-001: java.nio.file.DirectoryNotEmptyException: C:\Users\jenkins\workspace\Lucene-Solr-7.2-Windows\solr\build\solr-core\test\J1\temp\solr.handler.component.SuggestComponentContextFilterQueryTest_E472B5BB95C8634-001\init-core-data-001    C:\Users\jenkins\workspace\Lucene-Solr-7.2-Windows\solr\build\solr-core\test\J1\temp\solr.handler.component.SuggestComponentContextFilterQueryTest_E472B5BB95C8634-001\init-core-data-001\suggest_context_implemented_but_not_configured: java.nio.file.AccessDeniedException: C:\Users\jenkins\workspace\Lucene-Solr-7.2-Windows\solr\build\solr-core\test\J1\temp\solr.handler.component.SuggestComponentContextFilterQueryTest_E472B5BB95C8634-001\init-core-data-001\suggest_context_implemented_but_not_configured    C:\Users\jenkins\workspace\Lucene-Solr-7.2-Windows\solr\build\solr-core\test\J1\temp\solr.handler.component.SuggestComponentContextFilterQueryTest_E472B5BB95C8634-001: java.nio.file.DirectoryNotEmptyException: C:\Users\jenkins\workspace\Lucene-Solr-7.2-Windows\solr\build\solr-core\test\J1\temp\solr.handler.component.SuggestComponentContextFilterQueryTest_E472B5BB95C8634-001 

Stack Trace:
java.io.IOException: Could not remove the following files (in the order of attempts):
   C:\Users\jenkins\workspace\Lucene-Solr-7.2-Windows\solr\build\solr-core\test\J1\temp\solr.handler.component.SuggestComponentContextFilterQueryTest_E472B5BB95C8634-001\init-core-data-001: java.nio.file.DirectoryNotEmptyException: C:\Users\jenkins\workspace\Lucene-Solr-7.2-Windows\solr\build\solr-core\test\J1\temp\solr.handler.component.SuggestComponentContextFilterQueryTest_E472B5BB95C8634-001\init-core-data-001
   C:\Users\jenkins\workspace\Lucene-Solr-7.2-Windows\solr\build\solr-core\test\J1\temp\solr.handler.component.SuggestComponentContextFilterQueryTest_E472B5BB95C8634-001\init-core-data-001\suggest_context_implemented_but_not_configured: java.nio.file.AccessDeniedException: C:\Users\jenkins\workspace\Lucene-Solr-7.2-Windows\solr\build\solr-core\test\J1\temp\solr.handler.component.SuggestComponentContextFilterQueryTest_E472B5BB95C8634-001\init-core-data-001\suggest_context_implemented_but_not_configured
   C:\Users\jenkins\workspace\Lucene-Solr-7.2-Windows\solr\build\solr-core\test\J1\temp\solr.handler.component.SuggestComponentContextFilterQueryTest_E472B5BB95C8634-001: java.nio.file.DirectoryNotEmptyException: C:\Users\jenkins\workspace\Lucene-Solr-7.2-Windows\solr\build\solr-core\test\J1\temp\solr.handler.component.SuggestComponentContextFilterQueryTest_E472B5BB95C8634-001

	at __randomizedtesting.SeedInfo.seed([E472B5BB95C8634]:0)
	at org.apache.lucene.util.IOUtils.rm(IOUtils.java:329)
	at org.apache.lucene.util.TestRuleTemporaryFilesCleanup.afterAlways(TestRuleTemporaryFilesCleanup.java:216)
	at com.carrotsearch.randomizedtesting.rules.TestRuleAdapter$1.afterAlways(TestRuleAdapter.java:31)
	at com.carrotsearch.randomizedtesting.rules.StatementAdapter.evaluate(StatementAdapter.java:43)
	at com.carrotsearch.randomizedtesting.rules.StatementAdapter.evaluate(StatementAdapter.java:36)
	at org.apache.lucene.util.TestRuleAssertionsRequired$1.evaluate(TestRuleAssertionsRequired.java:53)
	at org.apache.lucene.util.TestRuleMarkFailure$1.evaluate(TestRuleMarkFailure.java:47)
	at org.apache.lucene.util.TestRuleIgnoreAfterMaxFailures$1.evaluate(TestRuleIgnoreAfterMaxFailures.java:64)
	at org.apache.lucene.util.TestRuleIgnoreTestSuites$1.evaluate(TestRuleIgnoreTestSuites.java:54)
	at com.carrotsearch.randomizedtesting.rules.StatementAdapter.evaluate(StatementAdapter.java:36)
	at com.carrotsearch.randomizedtesting.ThreadLeakControl$StatementRunner.run(ThreadLeakControl.java:368)
	at java.lang.Thread.run(Thread.java:748)


FAILED:  junit.framework.TestSuite.org.apache.solr.metrics.reporters.solr.SolrCloudReportersTest

Error Message:
Could not remove the following files (in the order of attempts):    C:\Users\jenkins\workspace\Lucene-Solr-7.2-Windows\solr\build\solr-core\test\J0\temp\solr.metrics.reporters.solr.SolrCloudReportersTest_E472B5BB95C8634-001\tempDir-003\zookeeper\server1\data\version-2: java.nio.file.DirectoryNotEmptyException: C:\Users\jenkins\workspace\Lucene-Solr-7.2-Windows\solr\build\solr-core\test\J0\temp\solr.metrics.reporters.solr.SolrCloudReportersTest_E472B5BB95C8634-001\tempDir-003\zookeeper\server1\data\version-2    C:\Users\jenkins\workspace\Lucene-Solr-7.2-Windows\solr\build\solr-core\test\J0\temp\solr.metrics.reporters.solr.SolrCloudReportersTest_E472B5BB95C8634-001\tempDir-003\zookeeper\server1\data: java.nio.file.DirectoryNotEmptyException: C:\Users\jenkins\workspace\Lucene-Solr-7.2-Windows\solr\build\solr-core\test\J0\temp\solr.metrics.reporters.solr.SolrCloudReportersTest_E472B5BB95C8634-001\tempDir-003\zookeeper\server1\data    C:\Users\jenkins\workspace\Lucene-Solr-7.2-Windows\solr\build\solr-core\test\J0\temp\solr.metrics.reporters.solr.SolrCloudReportersTest_E472B5BB95C8634-001\tempDir-003\zookeeper\server1: java.nio.file.DirectoryNotEmptyException: C:\Users\jenkins\workspace\Lucene-Solr-7.2-Windows\solr\build\solr-core\test\J0\temp\solr.metrics.reporters.solr.SolrCloudReportersTest_E472B5BB95C8634-001\tempDir-003\zookeeper\server1    C:\Users\jenkins\workspace\Lucene-Solr-7.2-Windows\solr\build\solr-core\test\J0\temp\solr.metrics.reporters.solr.SolrCloudReportersTest_E472B5BB95C8634-001\tempDir-003\zookeeper: java.nio.file.DirectoryNotEmptyException: C:\Users\jenkins\workspace\Lucene-Solr-7.2-Windows\solr\build\solr-core\test\J0\temp\solr.metrics.reporters.solr.SolrCloudReportersTest_E472B5BB95C8634-001\tempDir-003\zookeeper    C:\Users\jenkins\workspace\Lucene-Solr-7.2-Windows\solr\build\solr-core\test\J0\temp\solr.metrics.reporters.solr.SolrCloudReportersTest_E472B5BB95C8634-001\tempDir-003: java.nio.file.DirectoryNotEmptyException: C:\Users\jenkins\workspace\Lucene-Solr-7.2-Windows\solr\build\solr-core\test\J0\temp\solr.metrics.reporters.solr.SolrCloudReportersTest_E472B5BB95C8634-001\tempDir-003    C:\Users\jenkins\workspace\Lucene-Solr-7.2-Windows\solr\build\solr-core\test\J0\temp\solr.metrics.reporters.solr.SolrCloudReportersTest_E472B5BB95C8634-001\tempDir-003\zookeeper\server1\data\version-2\log.1: java.nio.file.AccessDeniedException: C:\Users\jenkins\workspace\Lucene-Solr-7.2-Windows\solr\build\solr-core\test\J0\temp\solr.metrics.reporters.solr.SolrCloudReportersTest_E472B5BB95C8634-001\tempDir-003\zookeeper\server1\data\version-2\log.1    C:\Users\jenkins\workspace\Lucene-Solr-7.2-Windows\solr\build\solr-core\test\J0\temp\solr.metrics.reporters.solr.SolrCloudReportersTest_E472B5BB95C8634-001: java.nio.file.DirectoryNotEmptyException: C:\Users\jenkins\workspace\Lucene-Solr-7.2-Windows\solr\build\solr-core\test\J0\temp\solr.metrics.reporters.solr.SolrCloudReportersTest_E472B5BB95C8634-001 

Stack Trace:
java.io.IOException: Could not remove the following files (in the order of attempts):
   C:\Users\jenkins\workspace\Lucene-Solr-7.2-Windows\solr\build\solr-core\test\J0\temp\solr.metrics.reporters.solr.SolrCloudReportersTest_E472B5BB95C8634-001\tempDir-003\zookeeper\server1\data\version-2: java.nio.file.DirectoryNotEmptyException: C:\Users\jenkins\workspace\Lucene-Solr-7.2-Windows\solr\build\solr-core\test\J0\temp\solr.metrics.reporters.solr.SolrCloudReportersTest_E472B5BB95C8634-001\tempDir-003\zookeeper\server1\data\version-2
   C:\Users\jenkins\workspace\Lucene-Solr-7.2-Windows\solr\build\solr-core\test\J0\temp\solr.metrics.reporters.solr.SolrCloudReportersTest_E472B5BB95C8634-001\tempDir-003\zookeeper\server1\data: java.nio.file.DirectoryNotEmptyException: C:\Users\jenkins\workspace\Lucene-Solr-7.2-Windows\solr\build\solr-core\test\J0\temp\solr.metrics.reporters.solr.SolrCloudReportersTest_E472B5BB95C8634-001\tempDir-003\zookeeper\server1\data
   C:\Users\jenkins\workspace\Lucene-Solr-7.2-Windows\solr\build\solr-core\test\J0\temp\solr.metrics.reporters.solr.SolrCloudReportersTest_E472B5BB95C8634-001\tempDir-003\zookeeper\server1: java.nio.file.DirectoryNotEmptyException: C:\Users\jenkins\workspace\Lucene-Solr-7.2-Windows\solr\build\solr-core\test\J0\temp\solr.metrics.reporters.solr.SolrCloudReportersTest_E472B5BB95C8634-001\tempDir-003\zookeeper\server1
   C:\Users\jenkins\workspace\Lucene-Solr-7.2-Windows\solr\build\solr-core\test\J0\temp\solr.metrics.reporters.solr.SolrCloudReportersTest_E472B5BB95C8634-001\tempDir-003\zookeeper: java.nio.file.DirectoryNotEmptyException: C:\Users\jenkins\workspace\Lucene-Solr-7.2-Windows\solr\build\solr-core\test\J0\temp\solr.metrics.reporters.solr.SolrCloudReportersTest_E472B5BB95C8634-001\tempDir-003\zookeeper
   C:\Users\jenkins\workspace\Lucene-Solr-7.2-Windows\solr\build\solr-core\test\J0\temp\solr.metrics.reporters.solr.SolrCloudReportersTest_E472B5BB95C8634-001\tempDir-003: java.nio.file.DirectoryNotEmptyException: C:\Users\jenkins\workspace\Lucene-Solr-7.2-Windows\solr\build\solr-core\test\J0\temp\solr.metrics.reporters.solr.SolrCloudReportersTest_E472B5BB95C8634-001\tempDir-003
   C:\Users\jenkins\workspace\Lucene-Solr-7.2-Windows\solr\build\solr-core\test\J0\temp\solr.metrics.reporters.solr.SolrCloudReportersTest_E472B5BB95C8634-001\tempDir-003\zookeeper\server1\data\version-2\log.1: java.nio.file.AccessDeniedException: C:\Users\jenkins\workspace\Lucene-Solr-7.2-Windows\solr\build\solr-core\test\J0\temp\solr.metrics.reporters.solr.SolrCloudReportersTest_E472B5BB95C8634-001\tempDir-003\zookeeper\server1\data\version-2\log.1
   C:\Users\jenkins\workspace\Lucene-Solr-7.2-Windows\solr\build\solr-core\test\J0\temp\solr.metrics.reporters.solr.SolrCloudReportersTest_E472B5BB95C8634-001: java.nio.file.DirectoryNotEmptyException: C:\Users\jenkins\workspace\Lucene-Solr-7.2-Windows\solr\build\solr-core\test\J0\temp\solr.metrics.reporters.solr.SolrCloudReportersTest_E472B5BB95C8634-001

	at __randomizedtesting.SeedInfo.seed([E472B5BB95C8634]:0)
	at org.apache.lucene.util.IOUtils.rm(IOUtils.java:329)
	at org.apache.lucene.util.TestRuleTemporaryFilesCleanup.afterAlways(TestRuleTemporaryFilesCleanup.java:216)
	at com.carrotsearch.randomizedtesting.rules.TestRuleAdapter$1.afterAlways(TestRuleAdapter.java:31)
	at com.carrotsearch.randomizedtesting.rules.StatementAdapter.evaluate(StatementAdapter.java:43)
	at com.carrotsearch.randomizedtesting.rules.StatementAdapter.evaluate(StatementAdapter.java:36)
	at org.apache.lucene.util.TestRuleAssertionsRequired$1.evaluate(TestRuleAssertionsRequired.java:53)
	at org.apache.lucene.util.TestRuleMarkFailure$1.evaluate(TestRuleMarkFailure.java:47)
	at org.apache.lucene.util.TestRuleIgnoreAfterMaxFailures$1.evaluate(TestRuleIgnoreAfterMaxFailures.java:64)
	at org.apache.lucene.util.TestRuleIgnoreTestSuites$1.evaluate(TestRuleIgnoreTestSuites.java:54)
	at com.carrotsearch.randomizedtesting.rules.StatementAdapter.evaluate(StatementAdapter.java:36)
	at com.carrotsearch.randomizedtesting.ThreadLeakControl$StatementRunner.run(ThreadLeakControl.java:368)
	at java.lang.Thread.run(Thread.java:748)


FAILED:  org.apache.solr.util.UtilsToolTest.testNonexisting

Error Message:
Unable to delete directory C:\Users\jenkins\workspace\Lucene-Solr-7.2-Windows\solr\build\solr-core\test\J1\temp\solr.util.UtilsToolTest_E472B5BB95C8634-001\Utils Tool Test-001.

Stack Trace:
java.io.IOException: Unable to delete directory C:\Users\jenkins\workspace\Lucene-Solr-7.2-Windows\solr\build\solr-core\test\J1\temp\solr.util.UtilsToolTest_E472B5BB95C8634-001\Utils Tool Test-001.
	at __randomizedtesting.SeedInfo.seed([E472B5BB95C8634:A2256337D9B4F65B]:0)
	at org.apache.commons.io.FileUtils.deleteDirectory(FileUtils.java:1581)
	at org.apache.solr.util.UtilsToolTest.tearDown(UtilsToolTest.java:80)
	at sun.reflect.NativeMethodAccessorImpl.invoke0(Native Method)
	at sun.reflect.NativeMethodAccessorImpl.invoke(NativeMethodAccessorImpl.java:62)
	at sun.reflect.DelegatingMethodAccessorImpl.invoke(DelegatingMethodAccessorImpl.java:43)
	at java.lang.reflect.Method.invoke(Method.java:498)
	at com.carrotsearch.randomizedtesting.RandomizedRunner.invoke(RandomizedRunner.java:1737)
	at com.carrotsearch.randomizedtesting.RandomizedRunner$10.evaluate(RandomizedRunner.java:992)
	at com.carrotsearch.randomizedtesting.rules.SystemPropertiesRestoreRule$1.evaluate(SystemPropertiesRestoreRule.java:57)
	at org.apache.lucene.util.TestRuleSetupTeardownChained$1.evaluate(TestRuleSetupTeardownChained.java:49)
	at org.apache.lucene.util.AbstractBeforeAfterRule$1.evaluate(AbstractBeforeAfterRule.java:45)
	at org.apache.lucene.util.TestRuleThreadAndTestName$1.evaluate(TestRuleThreadAndTestName.java:48)
	at org.apache.lucene.util.TestRuleIgnoreAfterMaxFailures$1.evaluate(TestRuleIgnoreAfterMaxFailures.java:64)
	at org.apache.lucene.util.TestRuleMarkFailure$1.evaluate(TestRuleMarkFailure.java:47)
	at com.carrotsearch.randomizedtesting.rules.StatementAdapter.evaluate(StatementAdapter.java:36)
	at com.carrotsearch.randomizedtesting.ThreadLeakControl$StatementRunner.run(ThreadLeakControl.java:368)
	at com.carrotsearch.randomizedtesting.ThreadLeakControl.forkTimeoutingTask(ThreadLeakControl.java:817)
	at com.carrotsearch.randomizedtesting.ThreadLeakControl$3.evaluate(ThreadLeakControl.java:468)
	at com.carrotsearch.randomizedtesting.RandomizedRunner.runSingleTest(RandomizedRunner.java:943)
	at com.carrotsearch.randomizedtesting.RandomizedRunner$5.evaluate(RandomizedRunner.java:829)
	at com.carrotsearch.randomizedtesting.RandomizedRunner$6.evaluate(RandomizedRunner.java:879)
	at com.carrotsearch.randomizedtesting.RandomizedRunner$7.evaluate(RandomizedRunner.java:890)
	at com.carrotsearch.randomizedtesting.rules.StatementAdapter.evaluate(StatementAdapter.java:36)
	at com.carrotsearch.randomizedtesting.rules.SystemPropertiesRestoreRule$1.evaluate(SystemPropertiesRestoreRule.java:57)
	at org.apache.lucene.util.AbstractBeforeAfterRule$1.evaluate(AbstractBeforeAfterRule.java:45)
	at com.carrotsearch.randomizedtesting.rules.StatementAdapter.evaluate(StatementAdapter.java:36)
	at org.apache.lucene.util.TestRuleStoreClassName$1.evaluate(TestRuleStoreClassName.java:41)
	at com.carrotsearch.randomizedtesting.rules.NoShadowingOrOverridesOnMethodsRule$1.evaluate(NoShadowingOrOverridesOnMethodsRule.java:40)
	at com.carrotsearch.randomizedtesting.rules.NoShadowingOrOverridesOnMethodsRule$1.evaluate(NoShadowingOrOverridesOnMethodsRule.java:40)
	at com.carrotsearch.randomizedtesting.rules.StatementAdapter.evaluate(StatementAdapter.java:36)
	at com.carrotsearch.randomizedtesting.rules.StatementAdapter.evaluate(StatementAdapter.java:36)
	at com.carrotsearch.randomizedtesting.rules.StatementAdapter.evaluate(StatementAdapter.java:36)
	at org.apache.lucene.util.TestRuleAssertionsRequired$1.evaluate(TestRuleAssertionsRequired.java:53)
	at org.apache.lucene.util.TestRuleMarkFailure$1.evaluate(TestRuleMarkFailure.java:47)
	at org.apache.lucene.util.TestRuleIgnoreAfterMaxFailures$1.evaluate(TestRuleIgnoreAfterMaxFailures.java:64)
	at org.apache.lucene.util.TestRuleIgnoreTestSuites$1.evaluate(TestRuleIgnoreTestSuites.java:54)
	at com.carrotsearch.randomizedtesting.rules.StatementAdapter.evaluate(StatementAdapter.java:36)
	at com.carrotsearch.randomizedtesting.ThreadLeakControl$StatementRunner.run(ThreadLeakControl.java:368)
	at java.lang.Thread.run(Thread.java:748)


FAILED:  junit.framework.TestSuite.org.apache.solr.client.solrj.request.SchemaTest

Error Message:
Could not remove the following files (in the order of attempts):    C:\Users\jenkins\workspace\Lucene-Solr-7.2-Windows\solr\build\solr-solrj\test\J0\temp\solr.client.solrj.request.SchemaTest_CADC92DE8529D9C1-001\tempDir-010\multicore\core0: java.nio.file.DirectoryNotEmptyException: C:\Users\jenkins\workspace\Lucene-Solr-7.2-Windows\solr\build\solr-solrj\test\J0\temp\solr.client.solrj.request.SchemaTest_CADC92DE8529D9C1-001\tempDir-010\multicore\core0    C:\Users\jenkins\workspace\Lucene-Solr-7.2-Windows\solr\build\solr-solrj\test\J0\temp\solr.client.solrj.request.SchemaTest_CADC92DE8529D9C1-001\tempDir-010\multicore: java.nio.file.DirectoryNotEmptyException: C:\Users\jenkins\workspace\Lucene-Solr-7.2-Windows\solr\build\solr-solrj\test\J0\temp\solr.client.solrj.request.SchemaTest_CADC92DE8529D9C1-001\tempDir-010\multicore    C:\Users\jenkins\workspace\Lucene-Solr-7.2-Windows\solr\build\solr-solrj\test\J0\temp\solr.client.solrj.request.SchemaTest_CADC92DE8529D9C1-001\tempDir-010: java.nio.file.DirectoryNotEmptyException: C:\Users\jenkins\workspace\Lucene-Solr-7.2-Windows\solr\build\solr-solrj\test\J0\temp\solr.client.solrj.request.SchemaTest_CADC92DE8529D9C1-001\tempDir-010 

Stack Trace:
java.io.IOException: Could not remove the following files (in the order of attempts):
   C:\Users\jenkins\workspace\Lucene-Solr-7.2-Windows\solr\build\solr-solrj\test\J0\temp\solr.client.solrj.request.SchemaTest_CADC92DE8529D9C1-001\tempDir-010\multicore\core0: java.nio.file.DirectoryNotEmptyException: C:\Users\jenkins\workspace\Lucene-Solr-7.2-Windows\solr\build\solr-solrj\test\J0\temp\solr.client.solrj.request.SchemaTest_CADC92DE8529D9C1-001\tempDir-010\multicore\core0
   C:\Users\jenkins\workspace\Lucene-Solr-7.2-Windows\solr\build\solr-solrj\test\J0\temp\solr.client.solrj.request.SchemaTest_CADC92DE8529D9C1-001\tempDir-010\multicore: java.nio.file.DirectoryNotEmptyException: C:\Users\jenkins\workspace\Lucene-Solr-7.2-Windows\solr\build\solr-solrj\test\J0\temp\solr.client.solrj.request.SchemaTest_CADC92DE8529D9C1-001\tempDir-010\multicore
   C:\Users\jenkins\workspace\Lucene-Solr-7.2-Windows\solr\build\solr-solrj\test\J0\temp\solr.client.solrj.request.SchemaTest_CADC92DE8529D9C1-001\tempDir-010: java.nio.file.DirectoryNotEmptyException: C:\Users\jenkins\workspace\Lucene-Solr-7.2-Windows\solr\build\solr-solrj\test\J0\temp\solr.client.solrj.request.SchemaTest_CADC92DE8529D9C1-001\tempDir-010

	at __randomizedtesting.SeedInfo.seed([CADC92DE8529D9C1]:0)
	at org.apache.lucene.util.IOUtils.rm(IOUtils.java:329)
	at org.apache.lucene.util.TestRuleTemporaryFilesCleanup.afterAlways(TestRuleTemporaryFilesCleanup.java:216)
	at com.carrotsearch.randomizedtesting.rules.TestRuleAdapter$1.afterAlways(TestRuleAdapter.java:31)
	at com.carrotsearch.randomizedtesting.rules.StatementAdapter.evaluate(StatementAdapter.java:43)
	at com.carrotsearch.randomizedtesting.rules.StatementAdapter.evaluate(StatementAdapter.java:36)
	at org.apache.lucene.util.TestRuleAssertionsRequired$1.evaluate(TestRuleAssertionsRequired.java:53)
	at org.apache.lucene.util.TestRuleMarkFailure$1.evaluate(TestRuleMarkFailure.java:47)
	at org.apache.lucene.util.TestRuleIgnoreAfterMaxFailures$1.evaluate(TestRuleIgnoreAfterMaxFailures.java:64)
	at org.apache.lucene.util.TestRuleIgnoreTestSuites$1.evaluate(TestRuleIgnoreTestSuites.java:54)
	at com.carrotsearch.randomizedtesting.rules.StatementAdapter.evaluate(StatementAdapter.java:36)
	at com.carrotsearch.randomizedtesting.ThreadLeakControl$StatementRunner.run(ThreadLeakControl.java:368)
	at java.lang.Thread.run(Thread.java:748)




Build Log:
[...truncated 577 lines...]
   [junit4] Suite: org.apache.lucene.store.TestFileSwitchDirectory
   [junit4] IGNOR/A 0.01s J1 | TestFileSwitchDirectory.testFsyncDoesntCreateNewFiles
   [junit4]    > Assumption #1: test only works for FSDirectory subclasses
   [junit4] IGNOR/A 0.01s J1 | TestFileSwitchDirectory.testPendingDeletions
   [junit4]    > Assumption #1: we can only install VirusCheckingFS on an FSDirectory
   [junit4]   2> NOTE: test params are: codec=Asserting(Lucene70): {}, docValues:{}, maxPointsInLeafNode=1028, maxMBSortInHeap=5.294802243045715, sim=RandomSimilarity(queryNorm=false): {}, locale=id, timezone=Etc/GMT+6
   [junit4]   2> NOTE: Windows 10 10.0 x86/Oracle Corporation 1.8.0_144 (32-bit)/cpus=3,threads=1,free=211185592,total=331350016
   [junit4]   2> NOTE: All tests run in this JVM: [TestCheckIndex, TestSegmentTermDocs, TestSpanContainQuery, TestFastDecompressionMode, TestStressAdvance, TestLucene60FieldInfoFormat, LimitedFiniteStringsIteratorTest, TestUniqueTermCount, TestBoolean2, TestWildcard, TestFixedBitSet, TestLucene70NormsFormat, TestStopFilter, TestBytesRefHash, TestTermsEnum2, TestTransactionRollback, TestBasics, TestDeletionPolicy, Test2BPostings, TestIndexWriterForceMerge, TestDocValuesScoring, TestSloppyMath, TestDelegatingAnalyzerWrapper, TestTermVectorsReader, TestSimpleExplanations, TestBytesRefArray, TestSimilarityBase, TestIndexedDISI, TestSubScorerFreqs, TestIndexWriterReader, Test2BBKDPoints, TestFieldReuse, TestParallelTermEnum, TestSortedNumericSortField, TestIndexWriterConfig, TestStressNRT, TestOrdinalMap, TestAllFilesHaveChecksumFooter, TestIndexingSequenceNumbers, TestPerFieldDocValuesFormat, TestDirectMonotonic, TestIndexWriterCommit, TestByteBlockPool, TestDocumentWriter, TestLongValuesSource, TestSimpleExplanationsWithFillerDocs, TestNoMergeScheduler, TestDirectoryReaderReopen, TestIndexWriterDelete, TestFieldValueQuery, TestCachingTokenFilter, Test2BTerms, TestComplexExplanationsOfNonMatches, TestIndexCommit, TestOperations, TestBlockPostingsFormat3, TestCharArraySet, TestSmallFloat, TestDemo, TestStringMSBRadixSorter, TestTopFieldCollector, TestField, TestSimilarity, Test2BNumericDocValues, TestDirectory, TestLucene50CompoundFormat, TestTragicIndexWriterDeadlock, TestStressIndexing2, TestQueryBuilder, TestRateLimiter, TestTermRangeQuery, TestLogMergePolicy, TestPrefixInBooleanQuery, TestIndexWriterMaxDocs, TestIndexTooManyDocs, TestCharTermAttributeImpl, TestFileSwitchDirectory]
   [junit4]   2> NOTE: reproduce with: ant test  -Dtestcase=TestFileSwitchDirectory -Dtests.seed=CCA3023343FDDA70 -Dtests.slow=true -Dtests.locale=id -Dtests.timezone=Etc/GMT+6 -Dtests.asserts=true -Dtests.file.encoding=UTF-8
   [junit4] ERROR   0.00s J1 | TestFileSwitchDirectory (suite) <<<
   [junit4]    > Throwable #1: java.io.IOException: Could not remove the following files (in the order of attempts):
   [junit4]    >    C:\Users\jenkins\workspace\Lucene-Solr-7.2-Windows\lucene\build\core\test\J1\temp\lucene.store.TestFileSwitchDirectory_CCA3023343FDDA70-001\foo-015: java.nio.file.DirectoryNotEmptyException: C:\Users\jenkins\workspace\Lucene-Solr-7.2-Windows\lucene\build\core\test\J1\temp\lucene.store.TestFileSwitchDirectory_CCA3023343FDDA70-001\foo-015
   [junit4]    >    C:\Users\jenkins\workspace\Lucene-Solr-7.2-Windows\lucene\build\core\test\J1\temp\lucene.store.TestFileSwitchDirectory_CCA3023343FDDA70-001\foo-002: java.nio.file.DirectoryNotEmptyException: C:\Users\jenkins\workspace\Lucene-Solr-7.2-Windows\lucene\build\core\test\J1\temp\lucene.store.TestFileSwitchDirectory_CCA3023343FDDA70-001\foo-002
   [junit4]    >    C:\Users\jenkins\workspace\Lucene-Solr-7.2-Windows\lucene\build\core\test\J1\temp\lucene.store.TestFileSwitchDirectory_CCA3023343FDDA70-001\foo-002\extra0: java.nio.file.AccessDeniedException: C:\Users\jenkins\workspace\Lucene-Solr-7.2-Windows\lucene\build\core\test\J1\temp\lucene.store.TestFileSwitchDirectory_CCA3023343FDDA70-001\foo-002\extra0
   [junit4]    >    C:\Users\jenkins\workspace\Lucene-Solr-7.2-Windows\lucene\build\core\test\J1\temp\lucene.store.TestFileSwitchDirectory_CCA3023343FDDA70-001: java.nio.file.DirectoryNotEmptyException: C:\Users\jenkins\workspace\Lucene-Solr-7.2-Windows\lucene\build\core\test\J1\temp\lucene.store.TestFileSwitchDirectory_CCA3023343FDDA70-001
   [junit4]    > 	at __randomizedtesting.SeedInfo.seed([CCA3023343FDDA70]:0)
   [junit4]    > 	at org.apache.lucene.util.IOUtils.rm(IOUtils.java:329)
   [junit4]    > 	at java.lang.Thread.run(Thread.java:748)
   [junit4] Completed [106/458 (1!)] on J1 in 1.64s, 43 tests, 1 error, 2 skipped <<< FAILURES!

[...truncated 542 lines...]
   [junit4] Suite: org.apache.lucene.index.TestBagOfPositions
   [junit4]   2> NOTE: test params are: codec=Lucene70, sim=RandomSimilarity(queryNorm=true): {field=DFR I(ne)L2}, locale=sl, timezone=Africa/Algiers
   [junit4]   2> NOTE: Windows 10 10.0 x86/Oracle Corporation 1.8.0_144 (32-bit)/cpus=3,threads=1,free=42285768,total=95420416
   [junit4]   2> NOTE: All tests run in this JVM: [TestCheckIndex, TestSegmentTermDocs, TestSpanContainQuery, TestFastDecompressionMode, TestStressAdvance, TestLucene60FieldInfoFormat, LimitedFiniteStringsIteratorTest, TestUniqueTermCount, TestBoolean2, TestWildcard, TestFixedBitSet, TestLucene70NormsFormat, TestStopFilter, TestBytesRefHash, TestTermsEnum2, TestTransactionRollback, TestBasics, TestDeletionPolicy, Test2BPostings, TestIndexWriterForceMerge, TestDocValuesScoring, TestSloppyMath, TestDelegatingAnalyzerWrapper, TestTermVectorsReader, TestSimpleExplanations, TestBytesRefArray, TestSimilarityBase, TestIndexedDISI, TestSubScorerFreqs, TestIndexWriterReader, Test2BBKDPoints, TestFieldReuse, TestParallelTermEnum, TestSortedNumericSortField, TestIndexWriterConfig, TestStressNRT, TestOrdinalMap, TestAllFilesHaveChecksumFooter, TestIndexingSequenceNumbers, TestPerFieldDocValuesFormat, TestDirectMonotonic, TestIndexWriterCommit, TestByteBlockPool, TestDocumentWriter, TestLongValuesSource, TestSimpleExplanationsWithFillerDocs, TestNoMergeScheduler, TestDirectoryReaderReopen, TestIndexWriterDelete, TestFieldValueQuery, TestCachingTokenFilter, Test2BTerms, TestComplexExplanationsOfNonMatches, TestIndexCommit, TestOperations, TestBlockPostingsFormat3, TestCharArraySet, TestSmallFloat, TestDemo, TestStringMSBRadixSorter, TestTopFieldCollector, TestField, TestSimilarity, Test2BNumericDocValues, TestDirectory, TestLucene50CompoundFormat, TestTragicIndexWriterDeadlock, TestStressIndexing2, TestQueryBuilder, TestRateLimiter, TestTermRangeQuery, TestLogMergePolicy, TestPrefixInBooleanQuery, TestIndexWriterMaxDocs, TestIndexTooManyDocs, TestCharTermAttributeImpl, TestFileSwitchDirectory, TestCustomTermFreq, TestPostingsOffsets, TestSentinelIntSet, TestTotalHitCountCollector, TestSleepingLockWrapper, TermInSetQueryTest, TestDisjunctionMaxQuery, TestIndexWriterLockRelease, TestIndexWriterOutOfFileDescriptors, TestAutomatonQuery, TestSegmentInfos, TestReqExclBulkScorer, TestForTooMuchCloning, TestTermVectorsWriter, TestDocIDMerger, TestGeoUtils, Test2BPostingsBytes, TestFixedLengthBytesRefArray, TestSimpleFSLockFactory, TestIndexWriterOnDiskFull, TestPerFieldPostingsFormat2, TestIndexReaderClose, TestMultiLevelSkipList, TestSetOnce, TestTermVectors, TestMultiTermsEnum, TestFieldType, TestMultiTermQueryRewrites, TestPayloads, TestIndexWriterOnJRECrash, TestAllFilesCheckIndexHeader, TestTermsEnum, TestEarlyTerminatingSortingCollector, TestCustomSearcherSort, TestSpanFirstQuery, TestIntroSelector, TestIndexWriter, TestIndexWriterMerging, TestFSTs, TestBytesStore, TestPackedInts, TestGraphTokenizers, TestShardSearching, TestIndexWriterExceptions, TestSearcherManager, TestSloppyPhraseQuery, TestNRTThreads, TestPersistentSnapshotDeletionPolicy, TestAtomicUpdate, TestNorms, TestTimeLimitingCollector, TestSearchAfter, TestConcurrentMergeScheduler, TestHighCompressionMode, TestDocumentsWriterStallControl, TestNeverDelete, TestTopDocsMerge, TestLongPostings, TestStressIndexing, TestRollingUpdates, TestSnapshotDeletionPolicy, TestIndexWriterUnicode, TestNRTReaderWithThreads, TestPerFieldPostingsFormat, TestLevenshteinAutomata, TestByteSlices, TestBufferedIndexInput, TestConsistentFieldNumbers, TestWeakIdentityMap, TestSegmentMerger, TestPhraseQuery, TestCollectionUtil, TestBagOfPositions]
   [junit4]   2> NOTE: reproduce with: ant test  -Dtestcase=TestBagOfPositions -Dtests.seed=CCA3023343FDDA70 -Dtests.slow=true -Dtests.locale=sl -Dtests.timezone=Africa/Algiers -Dtests.asserts=true -Dtests.file.encoding=UTF-8
   [junit4] ERROR   0.00s J1 | TestBagOfPositions (suite) <<<
   [junit4]    > Throwable #1: java.io.IOException: Could not remove the following files (in the order of attempts):
   [junit4]    >    C:\Users\jenkins\workspace\Lucene-Solr-7.2-Windows\lucene\build\core\test\J1\temp\lucene.index.TestBagOfPositions_CCA3023343FDDA70-001\bagofpositions-001: java.nio.file.AccessDeniedException: C:\Users\jenkins\workspace\Lucene-Solr-7.2-Windows\lucene\build\core\test\J1\temp\lucene.index.TestBagOfPositions_CCA3023343FDDA70-001\bagofpositions-001
   [junit4]    >    C:\Users\jenkins\workspace\Lucene-Solr-7.2-Windows\lucene\build\core\test\J1\temp\lucene.index.TestBagOfPositions_CCA3023343FDDA70-001: java.nio.file.DirectoryNotEmptyException: C:\Users\jenkins\workspace\Lucene-Solr-7.2-Windows\lucene\build\core\test\J1\temp\lucene.index.TestBagOfPositions_CCA3023343FDDA70-001
   [junit4]    > 	at __randomizedtesting.SeedInfo.seed([CCA3023343FDDA70]:0)
   [junit4]    > 	at org.apache.lucene.util.IOUtils.rm(IOUtils.java:329)
   [junit4]    > 	at java.lang.Thread.run(Thread.java:748)
   [junit4] Completed [269/458 (2!)] on J1 in 5.73s, 1 test, 1 error <<< FAILURES!

[...truncated 11225 lines...]
   [junit4] Suite: org.apache.solr.handler.component.SuggestComponentContextFilterQueryTest
   [junit4]   2> Creating dataDir: C:\Users\jenkins\workspace\Lucene-Solr-7.2-Windows\solr\build\solr-core\test\J1\temp\solr.handler.component.SuggestComponentContextFilterQueryTest_E472B5BB95C8634-001\init-core-data-001
   [junit4]   2> 920962 INFO  (SUITE-SuggestComponentContextFilterQueryTest-seed#[E472B5BB95C8634]-worker) [    ] o.a.s.SolrTestCaseJ4 Using PointFields (NUMERIC_POINTS_SYSPROP=true) w/NUMERIC_DOCVALUES_SYSPROP=false
   [junit4]   2> 920970 INFO  (SUITE-SuggestComponentContextFilterQueryTest-seed#[E472B5BB95C8634]-worker) [    ] o.a.s.SolrTestCaseJ4 Randomized ssl (false) and clientAuth (false) via: @org.apache.solr.util.RandomizeSSL(reason=, value=NaN, ssl=NaN, clientAuth=NaN)
   [junit4]   2> 920970 INFO  (SUITE-SuggestComponentContextFilterQueryTest-seed#[E472B5BB95C8634]-worker) [    ] o.a.s.SolrTestCaseJ4 SecureRandom sanity checks: test.solr.allowed.securerandom=null & java.security.egd=file:/dev/./urandom
   [junit4]   2> 920971 INFO  (SUITE-SuggestComponentContextFilterQueryTest-seed#[E472B5BB95C8634]-worker) [    ] o.a.s.SolrTestCaseJ4 ####initCore
   [junit4]   2> 920972 INFO  (SUITE-SuggestComponentContextFilterQueryTest-seed#[E472B5BB95C8634]-worker) [    ] o.a.s.c.SolrResourceLoader [null] Added 2 libs to classloader, from paths: [/C:/Users/jenkins/workspace/Lucene-Solr-7.2-Windows/solr/core/src/test-files/solr/collection1/lib, /C:/Users/jenkins/workspace/Lucene-Solr-7.2-Windows/solr/core/src/test-files/solr/collection1/lib/classes]
   [junit4]   2> 921015 INFO  (SUITE-SuggestComponentContextFilterQueryTest-seed#[E472B5BB95C8634]-worker) [    ] o.a.s.c.SolrConfig Using Lucene MatchVersion: 7.2.1
   [junit4]   2> 921028 INFO  (SUITE-SuggestComponentContextFilterQueryTest-seed#[E472B5BB95C8634]-worker) [    ] o.a.s.s.IndexSchema [null] Schema name=test
   [junit4]   2> 921098 INFO  (SUITE-SuggestComponentContextFilterQueryTest-seed#[E472B5BB95C8634]-worker) [    ] o.a.s.s.IndexSchema Loaded schema test/1.0 with uniqueid field id
   [junit4]   2> 921168 INFO  (SUITE-SuggestComponentContextFilterQueryTest-seed#[E472B5BB95C8634]-worker) [    ] o.a.s.m.r.SolrJmxReporter JMX monitoring for 'solr.node' (registry 'solr.node') enabled at server: com.sun.jmx.mbeanserver.JmxMBeanServer@1ba7cbb
   [junit4]   2> 921173 INFO  (SUITE-SuggestComponentContextFilterQueryTest-seed#[E472B5BB95C8634]-worker) [    ] o.a.s.m.r.SolrJmxReporter JMX monitoring for 'solr.jvm' (registry 'solr.jvm') enabled at server: com.sun.jmx.mbeanserver.JmxMBeanServer@1ba7cbb
   [junit4]   2> 921173 INFO  (SUITE-SuggestComponentContextFilterQueryTest-seed#[E472B5BB95C8634]-worker) [    ] o.a.s.m.r.SolrJmxReporter JMX monitoring for 'solr.jetty' (registry 'solr.jetty') enabled at server: com.sun.jmx.mbeanserver.JmxMBeanServer@1ba7cbb
   [junit4]   2> 921174 INFO  (coreLoadExecutor-3238-thread-1) [    ] o.a.s.c.TransientSolrCoreCacheDefault Allocating transient cache for 2147483647 transient cores
   [junit4]   2> 921175 INFO  (coreLoadExecutor-3238-thread-1) [    x:collection1] o.a.s.c.SolrResourceLoader [null] Added 2 libs to classloader, from paths: [/C:/Users/jenkins/workspace/Lucene-Solr-7.2-Windows/solr/core/src/test-files/solr/collection1/lib, /C:/Users/jenkins/workspace/Lucene-Solr-7.2-Windows/solr/core/src/test-files/solr/collection1/lib/classes]
   [junit4]   2> 921217 INFO  (coreLoadExecutor-3238-thread-1) [    x:collection1] o.a.s.c.SolrConfig Using Lucene MatchVersion: 7.2.1
   [junit4]   2> 921225 INFO  (coreLoadExecutor-3238-thread-1) [    x:collection1] o.a.s.s.IndexSchema [collection1] Schema name=test
   [junit4]   2> 921288 INFO  (coreLoadExecutor-3238-thread-1) [    x:collection1] o.a.s.s.IndexSchema Loaded schema test/1.0 with uniqueid field id
   [junit4]   2> 921296 INFO  (coreLoadExecutor-3238-thread-1) [    x:collection1] o.a.s.c.CoreContainer Creating SolrCore 'collection1' using configuration from instancedir C:\Users\jenkins\workspace\Lucene-Solr-7.2-Windows\solr\core\src\test-files\solr\collection1, trusted=true
   [junit4]   2> 921296 INFO  (coreLoadExecutor-3238-thread-1) [    x:collection1] o.a.s.m.r.SolrJmxReporter JMX monitoring for 'solr.core.collection1' (registry 'solr.core.collection1') enabled at server: com.sun.jmx.mbeanserver.JmxMBeanServer@1ba7cbb
   [junit4]   2> 921297 INFO  (coreLoadExecutor-3238-thread-1) [    x:collection1] o.a.s.c.SolrCore solr.RecoveryStrategy.Builder
   [junit4]   2> 921297 INFO  (coreLoadExecutor-3238-thread-1) [    x:collection1] o.a.s.c.SolrCore [[collection1] ] Opening new SolrCore at [C:\Users\jenkins\workspace\Lucene-Solr-7.2-Windows\solr\core\src\test-files\solr\collection1], dataDir=[C:\Users\jenkins\workspace\Lucene-Solr-7.2-Windows\solr\build\solr-core\test\J1\temp\solr.handler.component.SuggestComponentContextFilterQueryTest_E472B5BB95C8634-001\init-core-data-001\]
   [junit4]   2> 921300 INFO  (coreLoadExecutor-3238-thread-1) [    x:collection1] o.a.s.u.RandomMergePolicy RandomMergePolicy wrapping class org.apache.lucene.index.LogByteSizeMergePolicy: [LogByteSizeMergePolicy: minMergeSize=1677721, mergeFactor=43, maxMergeSize=2147483648, maxMergeSizeForForcedMerge=9223372036854775807, calibrateSizeByDeletes=false, maxMergeDocs=2147483647, maxCFSSegmentSizeMB=8.796093022207999E12, noCFSRatio=0.6942385404176161]
   [junit4]   2> 921365 INFO  (coreLoadExecutor-3238-thread-1) [    x:collection1] o.a.s.u.CommitTracker Hard AutoCommit: disabled
   [junit4]   2> 921365 INFO  (coreLoadExecutor-3238-thread-1) [    x:collection1] o.a.s.u.CommitTracker Soft AutoCommit: disabled
   [junit4]   2> 921366 INFO  (coreLoadExecutor-3238-thread-1) [    x:collection1] o.a.s.u.RandomMergePolicy RandomMergePolicy wrapping class org.apache.lucene.index.TieredMergePolicy: [TieredMergePolicy: maxMergeAtOnce=31, maxMergeAtOnceExplicit=23, maxMergedSegmentMB=76.1318359375, floorSegmentMB=1.3935546875, forceMergeDeletesPctAllowed=0.28041949839248237, segmentsPerTier=18.0, maxCFSSegmentSizeMB=8.796093022207999E12, noCFSRatio=0.0
   [junit4]   2> 921366 INFO  (coreLoadExecutor-3238-thread-1) [    x:collection1] o.a.s.s.SolrIndexSearcher Opening [Searcher@aae5c1[collection1] main]
   [junit4]   2> 921367 WARN  (coreLoadExecutor-3238-thread-1) [    x:collection1] o.a.s.r.ManagedResourceStorage Cannot write to config directory C:\Users\jenkins\workspace\Lucene-Solr-7.2-Windows\solr\core\src\test-files\solr\collection1\conf; switching to use InMemory storage instead.
   [junit4]   2> 921367 INFO  (coreLoadExecutor-3238-thread-1) [    x:collection1] o.a.s.h.c.SuggestComponent Initializing SuggestComponent
   [junit4]   2> 921367 INFO  (coreLoadExecutor-3238-thread-1) [    x:collection1] o.a.s.s.s.SolrSuggester init: {name=suggest_blended_infix_suggester,lookupImpl=BlendedInfixLookupFactory,dictionaryImpl=DocumentDictionaryFactory,field=cat,weightField=price,contextField=my_contexts_t,suggestAnalyzerFieldType=text,buildOnCommit=false,buildOnStartup=false,storeDir=suggest_blended_infix_suggester,indexPath=suggest_blended_infix_suggester,highlight=false}
   [junit4]   2> 921369 INFO  (coreLoadExecutor-3238-thread-1) [    x:collection1] o.a.s.s.s.SolrSuggester Dictionary loaded with params: {name=suggest_blended_infix_suggester,lookupImpl=BlendedInfixLookupFactory,dictionaryImpl=DocumentDictionaryFactory,field=cat,weightField=price,contextField=my_contexts_t,suggestAnalyzerFieldType=text,buildOnCommit=false,buildOnStartup=false,storeDir=suggest_blended_infix_suggester,indexPath=suggest_blended_infix_suggester,highlight=false}
   [junit4]   2> 921369 INFO  (coreLoadExecutor-3238-thread-1) [    x:collection1] o.a.s.s.s.SolrSuggester init: {name=suggest_blended_infix_suggester_string,lookupImpl=BlendedInfixLookupFactory,dictionaryImpl=DocumentDictionaryFactory,field=cat,weightField=price,contextField=my_contexts_s,suggestAnalyzerFieldType=text,buildOnCommit=false,buildOnStartup=false,storeDir=suggest_blended_infix_suggester_string,indexPath=suggest_blended_infix_suggester_string,highlight=false}
   [junit4]   2> 921370 INFO  (coreLoadExecutor-3238-thread-1) [    x:collection1] o.a.s.s.s.SolrSuggester Dictionary loaded with params: {name=suggest_blended_infix_suggester_string,lookupImpl=BlendedInfixLookupFactory,dictionaryImpl=DocumentDictionaryFactory,field=cat,weightField=price,contextField=my_contexts_s,suggestAnalyzerFieldType=text,buildOnCommit=false,buildOnStartup=false,storeDir=suggest_blended_infix_suggester_string,indexPath=suggest_blended_infix_suggester_string,highlight=false}
   [junit4]   2> 921370 INFO  (coreLoadExecutor-3238-thread-1) [    x:collection1] o.a.s.s.s.SolrSuggester init: {name=suggest_lookup_has_no_context_implementation,lookupImpl=AnalyzingLookupFactory,dictionaryImpl=DocumentDictionaryFactory,field=cat,weightField=price,suggestAnalyzerFieldType=text,buildOnCommit=false,buildOnStartup=false,storeDir=suggest_lookup_has_no_context_implementation,indexPath=suggest_lookup_has_no_context_implementation,highlight=false}
   [junit4]   2> 921370 INFO  (coreLoadExecutor-3238-thread-1) [    x:collection1] o.a.s.s.s.SolrSuggester Dictionary loaded with params: {name=suggest_lookup_has_no_context_implementation,lookupImpl=AnalyzingLookupFactory,dictionaryImpl=DocumentDictionaryFactory,field=cat,weightField=price,suggestAnalyzerFieldType=text,buildOnCommit=false,buildOnStartup=false,storeDir=suggest_lookup_has_no_context_implementation,indexPath=suggest_lookup_has_no_context_implementation,highlight=false}
   [junit4]   2> 921370 INFO  (coreLoadExecutor-3238-thread-1) [    x:collection1] o.a.s.s.s.SolrSuggester init: {name=suggest_context_filtering_not_implemented,lookupImpl=AnalyzingLookupFactory,dictionaryImpl=DocumentDictionaryFactory,field=cat,weightField=price,suggestAnalyzerFieldType=text,buildOnCommit=false,buildOnStartup=false,contextField=my_contexts_t,storeDir=suggest_context_filtering_not_implemented,indexPath=suggest_context_filtering_not_implemented,highlight=false}
   [junit4]   2> 921371 INFO  (coreLoadExecutor-3238-thread-1) [    x:collection1] o.a.s.s.s.SolrSuggester Dictionary loaded with params: {name=suggest_context_filtering_not_implemented,lookupImpl=AnalyzingLookupFactory,dictionaryImpl=DocumentDictionaryFactory,field=cat,weightField=price,suggestAnalyzerFieldType=text,buildOnCommit=false,buildOnStartup=false,contextField=my_contexts_t,storeDir=suggest_context_filtering_not_implemented,indexPath=suggest_context_filtering_not_implemented,highlight=false}
   [junit4]   2> 921371 INFO  (coreLoadExecutor-3238-thread-1) [    x:collection1] o.a.s.s.s.SolrSuggester init: {name=suggest_context_implemented_but_not_configured,lookupImpl=BlendedInfixLookupFactory,dictionaryImpl=DocumentDictionaryFactory,field=cat,weightField=price,suggestAnalyzerFieldType=text,buildOnCommit=false,buildOnStartup=false,storeDir=suggest_context_implemented_but_not_configured,indexPath=suggest_context_implemented_but_not_configured,highlight=false}
   [junit4]   2> 921372 INFO  (coreLoadExecutor-3238-thread-1) [    x:collection1] o.a.s.s.s.SolrSuggester Dictionary loaded with params: {name=suggest_context_implemented_but_not_configured,lookupImpl=BlendedInfixLookupFactory,dictionaryImpl=DocumentDictionaryFactory,field=cat,weightField=price,suggestAnalyzerFieldType=text,buildOnCommit=false,buildOnStartup=false,storeDir=suggest_context_implemented_but_not_configured,indexPath=suggest_context_implemented_but_not_configured,highlight=false}
   [junit4]   2> 921372 INFO  (coreLoadExecutor-3238-thread-1) [    x:collection1] o.a.s.h.ReplicationHandler Commits will be reserved for 10000ms.
   [junit4]   2> 921373 INFO  (searcherExecutor-3239-thread-1-processing-x:collection1) [    x:collection1] o.a.s.c.SolrCore [collection1] Registered new searcher Searcher@aae5c1[collection1] main{ExitableDirectoryReader(UninvertingDirectoryReader())}
   [junit4]   2> 921374 INFO  (SUITE-SuggestComponentContextFilterQueryTest-seed#[E472B5BB95C8634]-worker) [    ] o.a.s.SolrTestCaseJ4 ####initCore end
   [junit4]   2> 921377 INFO  (TEST-SuggestComponentContextFilterQueryTest.testStringContext-seed#[E472B5BB95C8634]) [    ] o.a.s.SolrTestCaseJ4 ###Starting testStringContext
   [junit4]   2> 921377 INFO  (TEST-SuggestComponentContextFilterQueryTest.testStringContext-seed#[E472B5BB95C8634]) [    ] o.a.s.u.DirectUpdateHandler2 [collection1] REMOVING ALL DOCUMENTS FROM INDEX
   [junit4]   2> 921377 INFO  (TEST-SuggestComponentContextFilterQueryTest.testStringContext-seed#[E472B5BB95C8634]) [    ] o.a.s.u.p.LogUpdateProcessorFactory [collection1]  webapp=null path=null params={}{deleteByQuery=*:*} 0 0
   [junit4]   2> 921383 INFO  (TEST-SuggestComponentContextFilterQueryTest.testStringContext-seed#[E472B5BB95C8634]) [    ] o.a.s.u.p.LogUpdateProcessorFactory [collection1]  webapp=null path=null params={}{add=[0]} 0 1
   [junit4]   2> 921384 INFO  (TEST-SuggestComponentContextFilterQueryTest.testStringContext-seed#[E472B5BB95C8634]) [    ] o.a.s.u.p.LogUpdateProcessorFactory [collection1]  webapp=null path=null params={}{add=[1]} 0 0
   [junit4]   2> 921384 INFO  (TEST-SuggestComponentContextFilterQueryTest.testStringContext-seed#[E472B5BB95C8634]) [    ] o.a.s.u.p.LogUpdateProcessorFactory [collection1]  webapp=null path=null params={}{add=[7]} 0 0
   [junit4]   2> 921384 INFO  (TEST-SuggestComponentContextFilterQueryTest.testStringContext-seed#[E472B5BB95C8634]) [    ] o.a.s.u.p.LogUpdateProcessorFactory [collection1]  webapp=null path=null params={}{add=[8]} 0 0
   [junit4]   2> 921385 INFO  (TEST-SuggestComponentContextFilterQueryTest.testStringContext-seed#[E472B5BB95C8634]) [    ] o.a.s.u.p.LogUpdateProcessorFactory [collection1]  webapp=null path=null params={}{add=[9]} 0 0
   [junit4]   2> 921385 INFO  (TEST-SuggestComponentContextFilterQueryTest.testStringContext-seed#[E472B5BB95C8634]) [    ] o.a.s.u.DirectUpdateHandler2 start commit{,optimize=false,openSearcher=true,waitSearcher=true,expungeDeletes=false,softCommit=false,prepareCommit=false}
   [junit4]   2> 921385 INFO  (TEST-SuggestComponentContextFilterQueryTest.testStringContext-seed#[E472B5BB95C8634]) [    ] o.a.s.u.SolrIndexWriter Calling setCommitData with IW:org.apache.solr.update.SolrIndexWriter@13d13d6 commitCommandVersion:0
   [junit4]   2> 921414 INFO  (TEST-SuggestComponentContextFilterQueryTest.testStringContext-seed#[E472B5BB95C8634]) [    ] o.a.s.s.SolrIndexSearcher Opening [Searcher@1ec0db9[collection1] main]
   [junit4]   2> 921415 INFO  (TEST-SuggestComponentContextFilterQueryTest.testStringContext-seed#[E472B5BB95C8634]) [    ] o.a.s.u.DirectUpdateHandler2 end_commit_flush
   [junit4]   2> 921416 INFO  (searcherExecutor-3239-thread-1) [    ] o.a.s.c.SolrCore [collection1] Registered new searcher Searcher@1ec0db9[collection1] main{ExitableDirectoryReader(UninvertingDirectoryReader(Uninverting(_0(7.2.1):C5)))}
   [junit4]   2> 921416 INFO  (TEST-SuggestComponentContextFilterQueryTest.testStringContext-seed#[E472B5BB95C8634]) [    ] o.a.s.u.p.LogUpdateProcessorFactory [collection1]  webapp=null path=null params={}{commit=} 0 31
   [junit4]   2> 921416 INFO  (TEST-SuggestComponentContextFilterQueryTest.testStringContext-seed#[E472B5BB95C8634]) [    ] o.a.s.h.c.SuggestComponent SuggestComponent prepare with : qt=/suggest&suggest.build=true&indent=off&suggest.q=examp&suggest.count=5&suggest=true&suggest.dictionary=suggest_blended_infix_suggester_string&wt=xml&suggest.cfq=Ctx4
   [junit4]   2> 921416 INFO  (TEST-SuggestComponentContextFilterQueryTest.testStringContext-seed#[E472B5BB95C8634]) [    ] o.a.s.s.s.SolrSuggester SolrSuggester.build(suggest_blended_infix_suggester_string)
   [junit4]   2> 921490 ERROR (TEST-SuggestComponentContextFilterQueryTest.testStringContext-seed#[E472B5BB95C8634]) [    ] o.a.s.s.s.SolrSuggester Store Lookup build failed
   [junit4]   2> 921490 INFO  (TEST-SuggestComponentContextFilterQueryTest.testStringContext-seed#[E472B5BB95C8634]) [    ] o.a.s.h.c.SuggestComponent SuggestComponent process with : qt=/suggest&suggest.build=true&indent=off&suggest.q=examp&suggest.count=5&suggest=true&suggest.dictionary=suggest_blended_infix_suggester_string&wt=xml&suggest.cfq=Ctx4
   [junit4]   2> 921691 INFO  (TEST-SuggestComponentContextFilterQueryTest.testStringContext-seed#[E472B5BB95C8634]) [    ] o.a.s.c.S.Request [collection1]  webapp=null path=null params={qt=/suggest&suggest.build=true&suggest.q=examp&suggest.dictionary=suggest_blended_infix_suggester_string&wt=xml&suggest.cfq=Ctx4} status=0 QTime=274
   [junit4]   2> 921691 INFO  (TEST-SuggestComponentContextFilterQueryTest.testStringContext-seed#[E472B5BB95C8634]) [    ] o.a.s.h.c.SuggestComponent SuggestComponent prepare with : qt=/suggest&suggest.build=true&indent=off&suggest.q=examp&suggest.count=5&suggest=true&suggest.dictionary=suggest_blended_infix_suggester_string&wt=xml&suggest.cfq=ctx4
   [junit4]   2> 921691 INFO  (TEST-SuggestComponentContextFilterQueryTest.testStringContext-seed#[E472B5BB95C8634]) [    ] o.a.s.s.s.SolrSuggester SolrSuggester.build(suggest_blended_infix_suggester_string)
   [junit4]   2> 921723 ERROR (TEST-SuggestComponentContextFilterQueryTest.testStringContext-seed#[E472B5BB95C8634]) [    ] o.a.s.s.s.SolrSuggester Store Lookup build failed
   [junit4]   2> 921723 INFO  (TEST-SuggestComponentContextFilterQueryTest.testStringContext-seed#[E472B5BB95C8634]) [    ] o.a.s.h.c.SuggestComponent SuggestComponent process with : qt=/suggest&suggest.build=true&indent=off&suggest.q=examp&suggest.count=5&suggest=true&suggest.dictionary=suggest_blended_infix_suggester_string&wt=xml&suggest.cfq=ctx4
   [junit4]   2> 921724 INFO  (TEST-SuggestComponentContextFilterQueryTest.testStringContext-seed#[E472B5BB95C8634]) [    ] o.a.s.c.S.Request [collection1]  webapp=null path=null params={qt=/suggest&suggest.build=true&suggest.q=examp&suggest.dictionary=suggest_blended_infix_suggester_string&wt=xml&suggest.cfq=ctx4} status=0 QTime=32
   [junit4]   2> 921724 INFO  (TEST-SuggestComponentContextFilterQueryTest.testStringContext-seed#[E472B5BB95C8634]) [    ] o.a.s.SolrTestCaseJ4 ###Ending testStringContext
   [junit4]   2> 921726 INFO  (TEST-SuggestComponentContextFilterQueryTest.testContextFilterOK-seed#[E472B5BB95C8634]) [    ] o.a.s.SolrTestCaseJ4 ###Starting testContextFilterOK
   [junit4]   2> 921727 INFO  (TEST-SuggestComponentContextFilterQueryTest.testContextFilterOK-seed#[E472B5BB95C8634]) [    ] o.a.s.u.DirectUpdateHandler2 [collection1] REMOVING ALL DOCUMENTS FROM INDEX
   [junit4]   2> 921727 INFO  (TEST-SuggestComponentContextFilterQueryTest.testContextFilterOK-seed#[E472B5BB95C8634]) [    ] o.a.s.u.p.LogUpdateProcessorFactory [collection1]  webapp=null path=null params={}{deleteByQuery=*:*} 0 0
   [junit4]   2> 921728 INFO  (TEST-SuggestComponentContextFilterQueryTest.testContextFilterOK-seed#[E472B5BB95C8634]) [    ] o.a.s.u.p.LogUpdateProcessorFactory [collection1]  webapp=null path=null params={}{add=[0]} 0 0
   [junit4]   2> 921728 INFO  (TEST-SuggestComponentContextFilterQueryTest.testContextFilterOK-seed#[E472B5BB95C8634]) [    ] o.a.s.u.p.LogUpdateProcessorFactory [collection1]  webapp=null path=null params={}{add=[1]} 0 0
   [junit4]   2> 921728 INFO  (TEST-SuggestComponentContextFilterQueryTest.testContextFilterOK-seed#[E472B5BB95C8634]) [    ] o.a.s.u.p.LogUpdateProcessorFactory [collection1]  webapp=null path=null params={}{add=[7]} 0 0
   [junit4]   2> 921728 INFO  (TEST-SuggestComponentContextFilterQueryTest.testContextFilterOK-seed#[E472B5BB95C8634]) [    ] o.a.s.u.p.LogUpdateProcessorFactory [collection1]  webapp=null path=null params={}{add=[8]} 0 0
   [junit4]   2> 921729 INFO  (TEST-SuggestComponentContextFilterQueryTest.testContextFilterOK-seed#[E472B5BB95C8634]) [    ] o.a.s.u.p.LogUpdateProcessorFactory [collection1]  webapp=null path=null params={}{add=[9]} 0 0
   [junit4]   2> 921729 INFO  (TEST-SuggestComponentContextFilterQueryTest.testContextFilterOK-seed#[E472B5BB95C8634]) [    ] o.a.s.u.DirectUpdateHandler2 start commit{,optimize=false,openSearcher=true,waitSearcher=true,expungeDeletes=false,softCommit=false,prepareCommit=false}
   [junit4]   2> 921729 INFO  (TEST-SuggestComponentContextFilterQueryTest.testContextFilterOK-seed#[E472B5BB95C8634]) [    ] o.a.s.u.SolrIndexWriter Calling setCommitData with IW:org.apache.solr.update.SolrIndexWriter@13d13d6 commitCommandVersion:0
   [junit4]   2> 921749 INFO  (TEST-SuggestComponentContextFilterQueryTest.testContextFilterOK-seed#[E472B5BB95C8634]) [    ] o.a.s.s.SolrIndexSearcher Opening [Searcher@1e83126[collection1] main]
   [junit4]   2> 921750 INFO  (TEST-SuggestComponentContextFilterQueryTest.testContextFilterOK-seed#[E472B5BB95C8634]) [    ] o.a.s.u.DirectUpdateHandler2 end_commit_flush
   [junit4]   2> 921751 INFO  (searcherExecutor-3239-thread-1) [    ] o.a.s.c.SolrCore [collection1] Registered new searcher Searcher@1e83126[collection1] main{ExitableDirectoryReader(UninvertingDirectoryReader(Uninverting(_1(7.2.1):C5)))}
   [junit4]   2> 921756 INFO  (TEST-SuggestComponentContextFilterQueryTest.testContextFilterOK-seed#[E472B5BB95C8634]) [    ] o.a.s.u.p.LogUpdateProcessorFactory [collection1]  webapp=null path=null params={}{commit=} 0 27
   [junit4]   2> 921756 INFO  (TEST-SuggestComponentContextFilterQueryTest.testContextFilterOK-seed#[E472B5BB95C8634]) [    ] o.a.s.h.c.SuggestComponent SuggestComponent prepare with : qt=/suggest&suggest.build=true&indent=off&suggest.q=examp&suggest.count=5&suggest=true&suggest.dictionary=suggest_blended_infix_suggester&wt=xml
   [junit4]   2> 921756 INFO  (TEST-SuggestComponentContextFilterQueryTest.testContextFilterOK-seed#[E472B5BB95C8634]) [    ] o.a.s.s.s.SolrSuggester SolrSuggester.build(suggest_blended_infix_suggester)
   [junit4]   2> 921787 ERROR (TEST-SuggestComponentContextFilterQueryTest.testContextFilterOK-seed#[E472B5BB95C8634]) [    ] o.a.s.s.s.SolrSuggester Store Lookup build failed
   [junit4]   2> 921787 INFO  (TEST-SuggestComponentContextFilterQueryTest.testContextFilterOK-seed#[E472B5BB95C8634]) [    ] o.a.s.h.c.SuggestComponent SuggestComponent process with : qt=/suggest&suggest.build=true&indent=off&suggest.q=examp&suggest.count=5&suggest=true&suggest.dictionary=suggest_blended_infix_suggester&wt=xml
   [junit4]   2> 921788 INFO  (TEST-SuggestComponentContextFilterQueryTest.testContextFilterOK-seed#[E472B5BB95C8634]) [    ] o.a.s.c.S.Request [collection1]  webapp=null path=null params={qt=/suggest&suggest.build=true&suggest.q=examp&suggest.dictionary=suggest_blended_infix_suggester&wt=xml} status=0 QTime=31
   [junit4]   2> 921788 INFO  (TEST-SuggestComponentContextFilterQueryTest.testContextFilterOK-seed#[E472B5BB95C8634]) [    ] o.a.s.h.c.SuggestComponent SuggestComponent prepare with : qt=/suggest&suggest.build=true&indent=off&suggest.q=examp&suggest.count=5&suggest=true&suggest.dictionary=suggest_blended_infix_suggester&wt=xml&suggest.cfq=ctx1
   [junit4]   2> 921788 INFO  (TEST-SuggestComponentContextFilterQueryTest.testContextFilterOK-seed#[E472B5BB95C8634]) [    ] o.a.s.s.s.SolrSuggester SolrSuggester.build(suggest_blended_infix_suggester)
   [junit4]   2> 921820 ERROR (TEST-SuggestComponentContextFilterQueryTest.testContextFilterOK-seed#[E472B5BB95C8634]) [    ] o.a.s.s.s.SolrSuggester Store Lookup build failed
   [junit4]   2> 921820 INFO  (TEST-SuggestComponentContextFilterQueryTest.testContextFilterOK-seed#[E472B5BB95C8634]) [    ] o.a.s.h.c.SuggestComponent SuggestComponent process with : qt=/suggest&suggest.build=true&indent=off&suggest.q=examp&suggest.count=5&suggest=true&suggest.dictionary=suggest_blended_infix_suggester&wt=xml&suggest.cfq=ctx1
   [junit4]   2> 921821 INFO  (TEST-SuggestComponentContextFilterQueryTest.testContextFilterOK-seed#[E472B5BB95C8634]) [    ] o.a.s.c.S.Request [collection1]  webapp=null path=null params={qt=/suggest&suggest.build=true&suggest.q=examp&suggest.dictionary=suggest_blended_infix_suggester&wt=xml&suggest.cfq=ctx1} status=0 QTime=32
   [junit4]   2> 921821 INFO  (TEST-SuggestComponentContextFilterQueryTest.testContextFilterOK-seed#[E472B5BB95C8634]) [    ] o.a.s.h.c.SuggestComponent SuggestComponent prepare with : qt=/suggest&suggest.build=true&indent=off&suggest.q=examp&suggest.count=5&suggest=true&suggest.dictionary=suggest_blended_infix_suggester&wt=xml&suggest.cfq=ctx1+OR+CTX2
   [junit4]   2> 921821 INFO  (TEST-SuggestComponentContextFilterQueryTest.testContextFilterOK-seed#[E472B5BB95C8634]) [    ] o.a.s.s.s.SolrSuggester SolrSuggester.build(suggest_blended_infix_suggester)
   [junit4]   2> 921875 ERROR (TEST-SuggestComponentContextFilterQueryTest.testContextFilterOK-seed#[E472B5BB95C8634]) [    ] o.a.s.s.s.SolrSuggester Store Lookup build failed
   [junit4]   2> 921875 INFO  (TEST-SuggestComponentContextFilterQueryTest.testContextFilterOK-seed#[E472B5BB95C8634]) [    ] o.a.s.h.c.SuggestComponent SuggestComponent process with : qt=/suggest&suggest.build=true&indent=off&suggest.q=examp&suggest.count=5&suggest=true&suggest.dictionary=suggest_blended_infix_suggester&wt=xml&suggest.cfq=ctx1+OR+CTX2
   [junit4]   2> 921887 INFO  (TEST-SuggestComponentContextFilterQueryTest.testContextFilterOK-seed#[E472B5BB95C8634]) [    ] o.a.s.c.S.Request [collection1]  webapp=null path=null params={qt=/suggest&suggest.build=true&suggest.q=examp&suggest.dictionary=suggest_blended_infix_suggester&wt=xml&suggest.cfq=ctx1+OR+CTX2} status=0 QTime=65
   [junit4]   2> 921888 INFO  (TEST-SuggestComponentContextFilterQueryTest.testContextFilterOK-seed#[E472B5BB95C8634]) [    ] o.a.s.h.c.SuggestComponent SuggestComponent prepare with : qt=/suggest&suggest.build=true&indent=off&suggest.q=examp&suggest.count=5&suggest=true&suggest.dictionary=suggest_blended_infix_suggester&wt=xml&suggest.cfq=CTX2+AND+CTX3
   [junit4]   2> 921888 INFO  (TEST-SuggestComponentContextFilterQueryTest.testContextFilterOK-seed#[E472B5BB95C8634]) [    ] o.a.s.s.s.SolrSuggester SolrSuggester.build(suggest_blended_infix_suggester)
   [junit4]   2> 921935 ERROR (TEST-SuggestComponentContextFilterQueryTest.testContextFilterOK-seed#[E472B5BB95C8634]) [    ] o.a.s.s.s.SolrSuggester Store Lookup build failed
   [junit4]   2> 921935 INFO  (TEST-SuggestComponentContextFilterQueryTest.testContextFilterOK-seed#[E472B5BB95C8634]) [    ] o.a.s.h.c.SuggestComponent SuggestComponent process with : qt=/suggest&suggest.build=true&indent=off&suggest.q=examp&suggest.count=5&suggest=true&suggest.dictionary=suggest_blended_infix_suggester&wt=xml&suggest.cfq=CTX2+AND+CTX3
   [junit4]   2> 921945 INFO  (TEST-SuggestComponentContextFilterQueryTest.testContextFilterOK-seed#[E472B5BB95C8634]) [    ] o.a.s.c.S.Request [collection1]  webapp=null path=null params={qt=/suggest&suggest.build=true&suggest.q=examp&suggest.dictionary=suggest_blended_infix_suggester&wt=xml&suggest.cfq=CTX2+AND+CTX3} status=0 QTime=57
   [junit4]   2> 921945 INFO  (TEST-SuggestComponentContextFilterQueryTest.testContextFilterOK-seed#[E472B5BB95C8634]) [    ] o.a.s.h.c.SuggestComponent SuggestComponent prepare with : qt=/suggest&suggest.build=true&indent=off&suggest.q=examp&suggest.count=5&suggest=true&suggest.dictionary=suggest_blended_infix_suggester&wt=xml&suggest.cfq=ctx*
   [junit4]   2> 921945 INFO  (TEST-SuggestComponentContextFilterQueryTest.testContextFilterOK-seed#[E472B5BB95C8634]) [    ] o.a.s.s.s.SolrSuggester SolrSuggester.build(suggest_blended_infix_suggester)
   [junit4]   2> 921975 ERROR (TEST-SuggestComponentContextFilterQueryTest.testContextFilterOK-seed#[E472B5BB95C8634]) [    ] o.a.s.s.s.SolrSuggester Store Lookup build failed
   [junit4]   2> 921975 INFO  (TEST-SuggestComponentContextFilterQueryTest.testContextFilterOK-seed#[E472B5BB95C8634]) [    ] o.a.s.h.c.SuggestComponent SuggestComponent process with : qt=/suggest&suggest.build=true&indent=off&suggest.q=examp&suggest.count=5&suggest=true&suggest.dictionary=suggest_blended_infix_suggester&wt=xml&suggest.cfq=ctx*
   [junit4]   2> 921979 INFO  (TEST-SuggestComponentContextFilterQueryTest.testContextFilterOK-seed#[E472B5BB95C8634]) [    ] o.a.s.c.S.Request [collection1]  webapp=null path=null params={qt=/suggest&suggest.build=true&suggest.q=examp&suggest.dictionary=suggest_blended_infix_suggester&wt=xml&suggest.cfq=ctx*} status=0 QTime=33
   [junit4]   2> 921979 INFO  (TEST-SuggestComponentContextFilterQueryTest.testContextFilterOK-seed#[E472B5BB95C8634]) [    ] o.a.s.h.c.SuggestComponent SuggestComponent prepare with : qt=/suggest&suggest.build=true&indent=off&suggest.q=examp&suggest.count=5&suggest=true&suggest.dictionary=suggest_blended_infix_suggester&wt=xml&suggest.cfq=[*+TO+*]
   [junit4]   2> 921979 INFO  (TEST-SuggestComponentContextFilterQueryTest.testContextFilterOK-seed#[E472B5BB95C8634]) [    ] o.a.s.s.s.SolrSuggester SolrSuggester.build(suggest_blended_infix_suggester)
   [junit4]   2> 922010 ERROR (TEST-SuggestComponentContextFilterQueryTest.testContextFilterOK-seed#[E472B5BB95C8634]) [    ] o.a.s.s.s.SolrSuggester Store Lookup build failed
   [junit4]   2> 922010 INFO  (TEST-SuggestComponentContextFilterQueryTest.testContextFilterOK-seed#[E472B5BB95C8634]) [    ] o.a.s.h.c.SuggestComponent SuggestComponent process with : qt=/suggest&suggest.build=true&indent=off&suggest.q=examp&suggest.count=5&suggest=true&suggest.dictionary=suggest_blended_infix_suggester&wt=xml&suggest.cfq=[*+TO+*]
   [junit4]   2> 922014 INFO  (TEST-SuggestComponentContextFilterQueryTest.testContextFilterOK-seed#[E472B5BB95C8634]) [    ] o.a.s.c.S.Request [collection1]  webapp=null path=null params={qt=/suggest&suggest.build=true&suggest.q=examp&suggest.dictionary=suggest_blended_infix_suggester&wt=xml&suggest.cfq=[*+TO+*]} status=0 QTime=35
   [junit4]   2> 922014 INFO  (TEST-SuggestComponentContextFilterQueryTest.testContextFilterOK-seed#[E472B5BB95C8634]) [    ] o.a.s.h.c.SuggestComponent SuggestComponent prepare with : qt=/suggest&suggest.build=true&indent=off&suggest.q=examp&suggest.count=5&suggest=true&suggest.dictionary=suggest_blended_infix_suggester&wt=xml&suggest.cfq=c*1
   [junit4]   2> 922015 INFO  (TEST-SuggestComponentContextFilterQueryTest.testContextFilterOK-seed#[E472B5BB95C8634]) [    ] o.a.s.s.s.SolrSuggester SolrSuggester.build(suggest_blended_infix_suggester)
   [junit4]   2> 922045 ERROR (TEST-SuggestComponentContextFilterQueryTest.testContextFilterOK-seed#[E472B5BB95C8634]) [    ] o.a.s.s.s.SolrSuggester Store Lookup build failed
   [junit4]   2> 922045 INFO  (TEST-SuggestComponentContextFilterQueryTest.testContextFilterOK-seed#[E472B5BB95C8634]) [    ] o.a.s.h.c.SuggestComponent SuggestComponent process with : qt=/suggest&suggest.build=true&indent=off&suggest.q=examp&suggest.count=5&suggest=true&suggest.dictionary=suggest_blended_infix_suggester&wt=xml&suggest.cfq=c*1
   [junit4]   2> 922049 INFO  (TEST-SuggestComponentContextFilterQueryTest.testContextFilterOK-seed#[E472B5BB95C8634]) [    ] o.a.s.c.S.Request [collection1]  webapp=null path=null params={qt=/suggest&suggest.build=true&suggest.q=examp&suggest.dictionary=suggest_blended_infix_suggester&wt=xml&suggest.cfq=c*1} status=0 QTime=34
   [junit4]   2> 922049 INFO  (TEST-SuggestComponentContextFilterQueryTest.testContextFilterOK-seed#[E472B5BB95C8634]) [    ] o.a.s.SolrTestCaseJ4 ###Ending testContextFilterOK
   [junit4]   2> 922051 INFO  (TEST-SuggestComponentContextFilterQueryTest.testExplicitFieldedQuery-seed#[E472B5BB95C8634]) [    ] o.a.s.SolrTestCaseJ4 ###Starting testExplicitFieldedQuery
   [junit4]   2> 922051 INFO  (TEST-SuggestComponentContextFilterQueryTest.testExplicitFieldedQuery-seed#[E472B5BB95C8634]) [    ] o.a.s.u.DirectUpdateHandler2 [collection1] REMOVING ALL DOCUMENTS FROM INDEX
   [junit4]   2> 922051 INFO  (TEST-SuggestComponentContextFilterQueryTest.testExplicitFieldedQuery-seed#[E472B5BB95C8634]) [    ] o.a.s.u.p.LogUpdateProcessorFactory [collection1]  webapp=null path=null params={}{deleteByQuery=*:*} 0 0
   [junit4]   2> 922055 INFO  (TEST-SuggestComponentContextFilterQueryTest.testExplicitFieldedQuery-seed#[E472B5BB95C8634]) [    ] o.a.s.u.p.LogUpdateProcessorFactory [collection1]  webapp=null path=null params={}{add=[0]} 0 3
   [junit4]   2> 922056 INFO  (TEST-SuggestComponentContextFilterQueryTest.testExplicitFieldedQuery-seed#[E472B5BB95C8634]) [    ] o.a.s.u.p.LogUpdateProcessorFactory [collection1]  webapp=null path=null params={}{add=[1]} 0 0
   [junit4]   2> 922056 INFO  (TEST-SuggestComponentContextFilterQueryTest.testExplicitFieldedQuery-seed#[E472B5BB95C8634]) [    ] o.a.s.u.p.LogUpdateProcessorFactory [collection1]  webapp=null path=null params={}{add=[7]} 0 0
   [junit4]   2> 922056 INFO  (TEST-SuggestComponentContextFilterQueryTest.testExplicitFieldedQuery-seed#[E472B5BB95C8634]) [    ] o.a.s.u.p.LogUpdateProcessorFactory [collection1]  webapp=null path=null params={}{add=[8]} 0 0
   [junit4]   2> 922057 INFO  (TEST-SuggestComponentContextFilterQueryTest.testExplicitFieldedQuery-seed#[E472B5BB95C8634]) [    ] o.a.s.u.p.LogUpdateProcessorFactory [collection1]  webapp=null path=null params={}{add=[9]} 0 0
   [junit4]   2> 922057 INFO  (TEST-SuggestComponentContextFilterQueryTest.testExplicitFieldedQuery-seed#[E472B5BB95C8634]) [    ] o.a.s.u.DirectUpdateHandler2 start commit{,optimize=false,openSearcher=true,waitSearcher=true,expungeDeletes=false,softCommit=false,prepareCommit=false}
   [junit4]   2> 922057 INFO  (TEST-SuggestComponentContextFilterQueryTest.testExplicitFieldedQuery-seed#[E472B5BB95C8634]) [    ] o.a.s.u.SolrIndexWriter Calling setCommitData with IW:org.apache.solr.update.SolrIndexWriter@13d13d6 commitCommandVersion:0
   [junit4]   2> 922080 INFO  (TEST-SuggestComponentContextFilterQueryTest.testExplicitFieldedQuery-seed#[E472B5BB95C8634]) [    ] o.a.s.s.SolrIndexSearcher Opening [Searcher@1ce362c[collection1] main]
   [junit4]   2> 922081 INFO  (TEST-SuggestComponentContextFilterQueryTest.testExplicitFieldedQuery-seed#[E472B5BB95C8634]) [    ] o.a.s.u.DirectUpdateHandler2 end_commit_flush
   [junit4]   2> 922082 INFO  (searcherExecutor-3239-thread-1) [    ] o.a.s.c.SolrCore [collection1] Registered new searcher Searcher@1ce362c[collection1] main{ExitableDirectoryReader(UninvertingDirectoryReader(Uninverting(_2(7.2.1):C5)))}
   [junit4]   2> 922085 INFO  (TEST-SuggestComponentContextFilterQueryTest.testExplicitFieldedQuery-seed#[E472B5BB95C8634]) [    ] o.a.s.u.p.LogUpdateProcessorFactory [collection1]  webapp=null path=null params={}{commit=} 0 28
   [junit4]   2> 922086 INFO  (TEST-SuggestComponentContextFilterQueryTest.testExplicitFieldedQuery-seed#[E472B5BB95C8634]) [    ] o.a.s.h.c.SuggestComponent SuggestComponent prepare with : qt=/suggest&suggest.build=true&indent=off&suggest.q=examp&suggest.count=5&suggest=true&suggest.dictionary=suggest_blended_infix_suggester&wt=xml&suggest.cfq=contexts:ctx1
   [junit4]   2> 922086 INFO  (TEST-SuggestComponentContextFilterQueryTest.testExplicitFieldedQuery-seed#[E472B5BB95C8634]) [    ] o.a.s.s.s.SolrSuggester SolrSuggester.build(suggest_blended_infix_suggester)
   [junit4]   2> 922109 ERROR (TEST-SuggestComponentContextFilterQueryTest.testExplicitFieldedQuery-seed#[E472B5BB95C8634]) [    ] o.a.s.s.s.SolrSuggester Store Lookup build failed
   [junit4]   2> 922109 INFO  (TEST-SuggestComponentContextFilterQueryTest.testExplicitFieldedQuery-seed#[E472B5BB95C8634]) [    ] o.a.s.h.c.SuggestComponent SuggestComponent process with : qt=/suggest&suggest.build=true&indent=off&suggest.q=examp&suggest.count=5&suggest=true&suggest.dictionary=suggest_blended_infix_suggester&wt=xml&suggest.cfq=contexts:ctx1
   [junit4]   2> 922110 INFO  (TEST-SuggestComponentContextFilterQueryTest.testExplicitFieldedQuery-seed#[E472B5BB95C8634]) [    ] o.a.s.c.S.Request [collection1]  webapp=null path=null params={qt=/suggest&suggest.build=true&suggest.q=examp&suggest.dictionary=suggest_blended_infix_suggester&wt=xml&suggest.cfq=contexts:ctx1} status=0 QTime=24
   [junit4]   2> 922110 INFO  (TEST-SuggestComponentContextFilterQueryTest.testExplicitFieldedQuery-seed#[E472B5BB95C8634]) [    ] o.a.s.SolrTestCaseJ4 ###Ending testExplicitFieldedQuery
   [junit4]   2> 922113 INFO  (TEST-SuggestComponentContextFilterQueryTest.testContextFilterParamIsIgnoredWhenContextIsNotImplemented-seed#[E472B5BB95C8634]) [    ] o.a.s.SolrTestCaseJ4 ###Starting testContextFilterParamIsIgnoredWhenContextIsNotImplemented
   [junit4]   2> 922113 INFO  (TEST-SuggestComponentContextFilterQueryTest.testContextFilterParamIsIgnoredWhenContextIsNotImplemented-seed#[E472B5BB95C8634]) [    ] o.a.s.u.DirectUpdateHandler2 [collection1] REMOVING ALL DOCUMENTS FROM INDEX
   [junit4]   2> 922113 INFO  (TEST-SuggestComponentContextFilterQueryTest.testContextFilterParamIsIgnoredWhenContextIsNotImplemented-seed#[E472B5BB95C8634]) [    ] o.a.s.u.p.LogUpdateProcessorFactory [collection1]  webapp=null path=null params={}{deleteByQuery=*:*} 0 0
   [junit4]   2> 922114 INFO  (TEST-SuggestComponentContextFilterQueryTest.testContextFilterParamIsIgnoredWhenContextIsNotImplemented-seed#[E472B5BB95C8634]) [    ] o.a.s.u.p.LogUpdateProcessorFactory [collection1]  webapp=null path=null params={}{add=[0]} 0 0
   [junit4]   2> 922115 INFO  (TEST-SuggestComponentContextFilterQueryTest.testContextFilterParamIsIgnoredWhenContextIsNotImplemented-seed#[E472B5BB95C8634]) [    ] o.a.s.u.p.LogUpdateProcessorFactory [collection1]  webapp=null path=null params={}{add=[1]} 0 0
   [junit4]   2> 922115 INFO  (TEST-SuggestComponentContextFilterQueryTest.testContextFilterParamIsIgnoredWhenContextIsNotImplemented-seed#[E472B5BB95C8634]) [    ] o.a.s.u.p.LogUpdateProcessorFactory [collection1]  webapp=null path=null params={}{add=[7]} 0 0
   [junit4]   2> 922115 INFO  (TEST-SuggestComponentContextFilterQueryTest.testContextFilterParamIsIgnoredWhenContextIsNotImplemented-seed#[E472B5BB95C8634]) [    ] o.a.s.u.p.LogUpdateProcessorFactory [collection1]  webapp=null path=null params={}{add=[8]} 0 0
   [junit4]   2> 922115 INFO  (TEST-SuggestComponentContextFilterQueryTest.testContextFilterParamIsIgnoredWhenContextIsNotImplemented-seed#[E472B5BB95C8634]) [    ] o.a.s.u.p.LogUpdateProcessorFactory [collection1]  webapp=null path=null params={}{add=[9]} 0 0
   [junit4]   2> 922115 INFO  (TEST-SuggestComponentContextFilterQueryTest.testContextFilterParamIsIgnoredWhenContextIsNotImplemented-seed#[E472B5BB95C8634]) [    ] o.a.s.u.DirectUpdateHandler2 start commit{,optimize=false,openSearcher=true,waitSearcher=true,expungeDeletes=false,softCommit=false,prepareCommit=false}
   [junit4]   2> 922115 INFO  (TEST-SuggestComponentContextFilterQueryTest.testContextFilterParamIsIgnoredWhenContextIsNotImplemented-seed#[E472B5BB95C8634]) [    ] o.a.s.u.SolrIndexWriter Calling setCommitData with IW:org.apache.solr.update.SolrIndexWriter@13d13d6 commitCommandVersion:0
   [junit4]   2> 922140 INFO  (TEST-SuggestComponentContextFilterQueryTest.testContextFilterParamIsIgnoredWhenContextIsNotImplemented-seed#[E472B5BB95C8634]) [    ] o.a.s.s.SolrIndexSearcher Opening [Searcher@13a8f9a[collection1] main]
   [junit4]   2> 922143 INFO  (TEST-SuggestComponentContextFilterQueryTest.testContextFilterParamIsIgnoredWhenContextIsNotImplemented-seed#[E472B5BB95C8634]) [    ] o.a.s.u.DirectUpdateHandler2 end_commit_flush
   [junit4]   2> 922148 INFO  (searcherExecutor-3239-thread-1) [    ] o.a.s.c.SolrCore [collection1] Registered new searcher Searcher@13a8f9a[collection1] main{ExitableDirectoryReader(UninvertingDirectoryReader(Uninverting(_3(7.2.1):C5)))}
   [junit4]   2> 922150 INFO  (TEST-SuggestComponentContextFilterQueryTest.testContextFilterParamIsIgnoredWhenContextIsNotImplemented-seed#[E472B5BB95C8634]) [    ] o.a.s.u.p.LogUpdateProcessorFactory [collection1]  webapp=null path=null params={}{commit=} 0 34
   [junit4]   2> 922150 INFO  (TEST-SuggestComponentContextFilterQueryTest.testContextFilterParamIsIgnoredWhenContextIsNotImplemented-seed#[E472B5BB95C8634]) [    ] o.a.s.h.c.SuggestComponent SuggestComponent prepare with : qt=/suggest&suggest.build=true&indent=off&suggest.q=examp&suggest.count=5&suggest=true&suggest.dictionary=suggest_lookup_has_no_context_implementation&wt=xml&suggest.cfq=ctx1
   [junit4]   2> 922150 INFO  (TEST-SuggestComponentContextFilterQueryTest.testContextFilterParamIsIgnoredWhenContextIsNotImplemented-seed#[E472B5BB95C8634]) [    ] o.a.s.s.s.SolrSuggester SolrSuggester.build(suggest_lookup_has_no_context_implementation)
   [junit4]   2> 922153 INFO  (TEST-SuggestComponentContextFilterQueryTest.testContextFilterParamIsIgnoredWhenContextIsNotImplemented-seed#[E472B5BB95C8634]) [    ] o.a.s.s.s.SolrSuggester Stored suggest data to: C:\Users\jenkins\workspace\Lucene-Solr-7.2-Windows\solr\build\solr-core\test\J1\temp\solr.handler.component.SuggestComponentContextFilterQueryTest_E472B5BB95C8634-001\init-core-data-001\suggest_lookup_has_no_context_implementation\wfsta.bin
   [junit4]   2> 922153 INFO  (TEST-SuggestComponentContextFilterQueryTest.testContextFilterParamIsIgnoredWhenContextIsNotImplemented-seed#[E472B5BB95C8634]) [    ] o.a.s.h.c.SuggestComponent SuggestComponent process with : qt=/suggest&suggest.build=true&indent=off&suggest.q=examp&suggest.count=5&suggest=true&suggest.dictionary=suggest_lookup_has_no_context_implementation&wt=xml&suggest.cfq=ctx1
   [junit4]   2> 922154 INFO  (TEST-SuggestComponentContextFilterQueryTest.testContextFilterParamIsIgnoredWhenContextIsNotImplemented-seed#[E472B5BB95C8634]) [    ] o.a.s.c.S.Request [collection1]  webapp=null path=null params={qt=/suggest&suggest.build=true&suggest.q=examp&suggest.dictionary=suggest_lookup_has_no_context_implementation&wt=xml&suggest.cfq=ctx1} status=0 QTime=3
   [junit4]   2> 922154 INFO  (TEST-SuggestComponentContextFilterQueryTest.testContextFilterParamIsIgnoredWhenContextIsNotImplemented-seed#[E472B5BB95C8634]) [    ] o.a.s.SolrTestCaseJ4 ###Ending testContextFilterParamIsIgnoredWhenContextIsNotImplemented
   [junit4]   2> 922158 INFO  (TEST-SuggestComponentContextFilterQueryTest.testContextFilteringIsIgnoredWhenContextIsImplementedButNotConfigured-seed#[E472B5BB95C8634]) [    ] o.a.s.SolrTestCaseJ4 ###Starting testContextFilteringIsIgnoredWhenContextIsImplementedButNotConfigured
   [junit4]   2> 922162 INFO  (TEST-SuggestComponentContextFilterQueryTest.testContextFilteringIsIgnoredWhenContextIsImplementedButNotConfigured-seed#[E472B5BB95C8634]) [    ] o.a.s.u.DirectUpdateHandler2 [collection1] REMOVING ALL DOCUMENTS FROM INDEX
   [junit4]   2> 922162 INFO  (TEST-SuggestComponentContextFilterQueryTest.testContextFilteringIsIgnoredWhenContextIsImplementedButNotConfigured-seed#[E472B5BB95C8634]) [    ] o.a.s.u.p.LogUpdateProcessorFactory [collection1]  webapp=null path=null params={}{deleteByQuery=*:*} 0 0
   [junit4]   2> 922163 INFO  (TEST-SuggestComponentContextFilterQueryTest.testContextFilteringIsIgnoredWhenContextIsImplementedButNotConfigured-seed#[E472B5BB95C8634]) [    ] o.a.s.u.p.LogUpdateProcessorFactory [collection1]  webapp=null path=null params={}{add=[0]} 0 0
   [junit4]   2> 922164 INFO  (TEST-SuggestComponentContextFilterQueryTest.testContextFilteringIsIgnoredWhenContextIsImplementedButNotConfigured-seed#[E472B5BB95C8634]) [    ] o.a.s.u.p.LogUpdateProcessorFactory [collection1]  webapp=null path=null params={}{add=[1]} 0 0
   [junit4]   2> 922164 INFO  (TEST-SuggestComponentContextFilterQueryTest.testContextFilteringIsIgnoredWhenContextIsImplementedButNotConfigured-seed#[E472B5BB95C8634]) [    ] o.a.s.u.p.LogUpdateProcessorFactory [collection1]  webapp=null path=null params={}{add=[7]} 0 0
   [junit4]   2> 922166 INFO  (TEST-SuggestComponentContextFilterQueryTest.testContextFilteringIsIgnoredWhenContextIsImplementedButNotConfigured-seed#[E472B5BB95C8634]) [    ] o.a.s.u.p.LogUpdateProcessorFactory [collection1]  webapp=null path=null params={}{add=[8]} 0 1
   [junit4]   2> 922177 INFO  (TEST-SuggestComponentContextFilterQueryTest.testContextFilteringIsIgnoredWhenContextIsImplementedButNotConfigured-seed#[E472B5BB95C8634]) [    ] o.a.s.u.p.LogUpdateProcessorFactory [collection1]  webapp=null path=null params={}{add=[9]} 0 0
   [junit4]   2> 922177 INFO  (TEST-SuggestComponentContextFilterQueryTest.testContextFilteringIsIgnoredWhenContextIsImplementedButNotConfigured-seed#[E472B5BB95C8634]) [    ] o.a.s.u.DirectUpdateHandler2 start commit{,optimize=false,openSearcher=true,waitSearcher=true,expungeDeletes=false,softCommit=false,prepareCommit=false}
   [junit4]   2> 922177 INFO  (TEST-SuggestComponentContextFilterQueryTest.testContextFilteringIsIgnoredWhenContextIsImplementedButNotConfigured-seed#[E472B5BB95C8634]) [    ] o.a.s.u.SolrIndexWriter Calling setCommitData with IW:org.apache.solr.update.SolrIndexWriter@13d13d6 commitCommandVersion:0
   [junit4]   2> 922200 INFO  (TEST-SuggestComponentContextFilterQueryTest.testContextFilteringIsIgnoredWhenContextIsImplementedButNotConfigured-seed#[E472B5BB95C8634]) [    ] o.a.s.s.SolrIndexSearcher Opening [Searcher@f041fe[collection1] main]
   [junit4]   2> 922201 INFO  (TEST-SuggestComponentContextFilterQueryTest.testContextFilteringIsIgnoredWhenContextIsImplementedButNotConfigured-seed#[E472B5BB95C8634]) [    ] o.a.s.u.DirectUpdateHandler2 end_commit_flush
   [junit4]   2> 922213 INFO  (searcherExecutor-3239-thread-1) [    ] o.a.s.c.SolrCore [collection1] Registered new searcher Searcher@f041fe[collection1] main{ExitableDirectoryReader(UninvertingDirectoryReader(Uninverting(_4(7.2.1):C5)))}
   [junit4]   2> 922215 INFO  (TEST-SuggestComponentContextFilterQueryTest.testContextFilteringIsIgnoredWhenContextIsImplementedButNotConfigured-seed#[E472B5BB95C8634]) [    ] o.a.s.u.p.LogUpdateProcessorFactory [collection1]  webapp=null path=null params={}{commit=} 0 38
   [junit4]   2> 922216 INFO  (TEST-SuggestComponentContextFilterQueryTest.testContextFilteringIsIgnoredWhenContextIsImplementedButNotConfigured-seed#[E472B5BB95C8634]) [    ] o.a.s.h.c.SuggestComponent SuggestComponent prepare with : qt=/suggest&suggest.build=true&indent=off&suggest.q=examp&suggest.count=5&suggest=true&suggest.dictionary=suggest_context_implemented_but_not_configured&wt=xml
   [junit4]   2> 922216 INFO  (TEST-SuggestComponentContextFilterQueryTest.testContextFilteringIsIgnoredWhenContextIsImplementedButNotConfigured-seed#[E472B5BB95C8634]) [    ] o.a.s.s.s.SolrSuggester SolrSuggester.build(suggest_context_implemented_but_not_configured)
   [junit4]   2> 922255 ERROR (TEST-SuggestComponentContextFilterQueryTest.testContextFilteringIsIgnoredWhenContextIsImplementedButNotConfigured-seed#[E472B5BB95C8634]) [    ] o.a.s.s.s.SolrSuggester Store Lookup build failed
   [junit4]   2> 922255 INFO  (TEST-SuggestComponentContextFilterQueryTest.testContextFilteringIsIgnoredWhenContextIsImplementedButNotConfigured-seed#[E472B5BB95C8634]) [    ] o.a.s.h.c.SuggestComponent SuggestComponent process with : qt=/suggest&suggest.build=true&indent=off&suggest.q=examp&suggest.count=5&suggest=true&suggest.dictionary=suggest_context_implemented_but_not_configured&wt=xml
   [junit4]   2> 922255 INFO  (TEST-SuggestComponentContextFilterQueryTest.testContextFilteringIsIgnoredWhenContextIsImplementedButNotConfigured-seed#[E472B5BB95C8634]) [    ] o.a.s.c.S.Request [collection1]  webapp=null path=null params={qt=/suggest&suggest.build=true&suggest.q=examp&suggest.dictionary=suggest_context_implemented_but_not_configured&wt=xml} status=0 QTime=38
   [junit4]   2> 922255 INFO  (TEST-SuggestComponentContextFilterQueryTest.testContextFilteringIsIgnoredWhenContextIsImplementedButNotConfigured-seed#[E472B5BB95C8634]) [    ] o.a.s.SolrTestCaseJ4 ###Ending testContextFilteringIsIgnoredWhenContextIsImplementedButNotConfigured
   [junit4]   2> 922257 INFO  (TEST-SuggestComponentContextFilterQueryTest.testContextFilterOnInvalidFieldGivesNoSuggestions-seed#[E472B5BB95C8634]) [    ] o.a.s.SolrTestCaseJ4 ###Starting testContextFilterOnInvalidFieldGivesNoSuggestions
   [junit4]   2> 922257 INFO  (TEST-SuggestComponentContextFilterQueryTest.testContextFilterOnInvalidFieldGivesNoSuggestions-seed#[E472B5BB95C8634]) [    ] o.a.s.u.DirectUpdateHandler2 [collection1] REMOVING ALL DOCUMENTS FROM INDEX
   [junit4]   2> 922257 INFO  (TEST-SuggestComponentContextFilterQueryTest.testContextFilterOnInvalidFieldGivesNoSuggestions-seed#[E472B5BB95C8634]) [    ] o.a.s.u.p.LogUpdateProcessorFactory [collection1]  webapp=null path=null params={}{deleteByQuery=*:*} 0 0
   [junit4]   2> 922258 INFO  (TEST-SuggestComponentContextFilterQueryTest.testContextFilterOnInvalidFieldGivesNoSuggestions-seed#[E472B5BB95C8634]) [    ] o.a.s.u.p.LogUpdateProcessorFactory [collection1]  webapp=null path=null params={}{add=[0]} 0 0
   [junit4]   2> 922259 INFO  (TEST-SuggestComponentContextFilterQueryTest.testContextFilterOnInvalidFieldGivesNoSuggestions-seed#[E472B5BB95C8634]) [    ] o.a.s.u.p.LogUpdateProcessorFactory [collection1]  webapp=null path=null params={}{add=[1]} 0 0
   [junit4]   2> 922259 INFO  (TEST-SuggestComponentContextFilterQueryTest.testContextFilterOnInvalidFieldGivesNoSuggestions-seed#[E472B5BB95C8634]) [    ] o.a.s.u.p.LogUpdateProcessorFactory [collection1]  webapp=null path=null params={}{add=[7]} 0 0
   [junit4]   2> 922259 INFO  (TEST-SuggestComponentContextFilterQueryTest.testContextFilterOnInvalidFieldGivesNoSuggestions-seed#[E472B5BB95C8634]) [    ] o.a.s.u.p.LogUpdateProcessorFactory [collection1]  webapp=null path=null params={}{add=[8]} 0 0
   [junit4]   2> 922259 INFO  (TEST-SuggestComponentContextFilterQueryTest.testContextFilterOnInvalidFieldGivesNoSuggestions-seed#[E472B5BB95C8634]) [    ] o.a.s.u.p.LogUpdateProcessorFactory [collection1]  webapp=null path=null params={}{add=[9]} 0 0
   [junit4]   2> 922260 INFO  (TEST-SuggestComponentContextFilterQueryTest.testContextFilterOnInvalidFieldGivesNoSuggestions-seed#[E472B5BB95C8634]) [    ] o.a.s.u.DirectUpdateHandler2 start commit{,optimize=false,openSearcher=true,waitSearcher=true,expungeDeletes=false,softCommit=false,prepareCommit=false}
   [junit4]   2> 922260 INFO  (TEST-SuggestComponentContextFilterQueryTest.testContextFilterOnInvalidFieldGivesNoSuggestions-seed#[E472B5BB95C8634]) [    ] o.a.s.u.SolrIndexWriter Calling setCommitData with IW:org.apache.solr.update.SolrIndexWriter@13d13d6 commitCommandVersion:0
   [junit4]   2> 922277 INFO  (TEST-SuggestComponentContextFilterQueryTest.testContextFilterOnInvalidFieldGivesNoSuggestions-seed#[E472B5BB95C8634]) [    ] o.a.s.s.SolrIndexSearcher Opening [Searcher@1314c59[collection1] main]
   [junit4]   2> 922278 INFO  (TEST-SuggestComponentContextFilterQueryTest.testContextFilterOnInvalidFieldGivesNoSuggestions-seed#[E472B5BB95C8634]) [    ] o.a.s.u.DirectUpdateHandler2 end_commit_flush
   [junit4]   2> 922291 INFO  (searcherExecutor-3239-thread-1) [    ] o.a.s.c.SolrCore [collection1] Registered new searcher Searcher@1314c59[collection1] main{ExitableDirectoryReader(UninvertingDirectoryReader(Uninverting(_5(7.2.1):C5)))}
   [junit4]   2> 922

[...truncated too long message...]

 o.a.s.m.SolrMetricManager Closing metric reporters for registry=solr.jvm, tag=null
   [junit4]   2> 180419 INFO  (TEST-SchemaTest.addFieldTypeShouldntBeCalledTwiceWithTheSameName-seed#[CADC92DE8529D9C1]) [    ] o.a.s.m.r.SolrJmxReporter Closing reporter [org.apache.solr.metrics.reporters.SolrJmxReporter@542ea2: rootName = null, domain = solr.jvm, service url = null, agent id = null] for registry solr.jvm / com.codahale.metrics.MetricRegistry@17c0b5e
   [junit4]   2> 180422 INFO  (TEST-SchemaTest.addFieldTypeShouldntBeCalledTwiceWithTheSameName-seed#[CADC92DE8529D9C1]) [    ] o.a.s.m.SolrMetricManager Closing metric reporters for registry=solr.jetty, tag=null
   [junit4]   2> 180422 INFO  (TEST-SchemaTest.addFieldTypeShouldntBeCalledTwiceWithTheSameName-seed#[CADC92DE8529D9C1]) [    ] o.a.s.m.r.SolrJmxReporter Closing reporter [org.apache.solr.metrics.reporters.SolrJmxReporter@1d49616: rootName = null, domain = solr.jetty, service url = null, agent id = null] for registry solr.jetty / com.codahale.metrics.MetricRegistry@1439829
   [junit4]   2> 180430 INFO  (coreCloseExecutor-1317-thread-1) [    x:collection1] o.a.s.c.SolrCore [collection1]  CLOSING SolrCore org.apache.solr.core.SolrCore@1ec5087
   [junit4]   2> 180430 INFO  (coreCloseExecutor-1317-thread-1) [    x:collection1] o.a.s.m.SolrMetricManager Closing metric reporters for registry=solr.core.collection1, tag=32264327
   [junit4]   2> 180430 INFO  (coreCloseExecutor-1317-thread-1) [    x:collection1] o.a.s.m.r.SolrJmxReporter Closing reporter [org.apache.solr.metrics.reporters.SolrJmxReporter@693173: rootName = null, domain = solr.core.collection1, service url = null, agent id = null] for registry solr.core.collection1 / com.codahale.metrics.MetricRegistry@ecaa7
   [junit4]   2> 180459 INFO  (TEST-SchemaTest.addFieldTypeShouldntBeCalledTwiceWithTheSameName-seed#[CADC92DE8529D9C1]) [    ] o.e.j.s.h.ContextHandler Stopped o.e.j.s.ServletContextHandler@a61cfc{/solr,null,UNAVAILABLE}
   [junit4]   2> 180461 INFO  (TEST-SchemaTest.addFieldTypeShouldntBeCalledTwiceWithTheSameName-seed#[CADC92DE8529D9C1]) [    ] o.a.s.SolrTestCaseJ4 ###Ending addFieldTypeShouldntBeCalledTwiceWithTheSameName
   [junit4]   2> 180461 INFO  (SUITE-SchemaTest-seed#[CADC92DE8529D9C1]-worker) [    ] o.a.s.SolrTestCaseJ4 ------------------------------------------------------- Done waiting for tracked resources to be released
   [junit4]   2> NOTE: test params are: codec=DummyCompressingStoredFields(storedFieldsFormat=CompressingStoredFieldsFormat(compressionMode=DUMMY, chunkSize=31781, maxDocsPerChunk=9, blockSize=8), termVectorsFormat=CompressingTermVectorsFormat(compressionMode=DUMMY, chunkSize=31781, blockSize=8)), sim=RandomSimilarity(queryNorm=false): {}, locale=en-NZ, timezone=PRT
   [junit4]   2> NOTE: Windows 10 10.0 x86/Oracle Corporation 1.8.0_144 (32-bit)/cpus=3,threads=1,free=114514392,total=192937984
   [junit4]   2> NOTE: All tests run in this JVM: [TestDocumentObjectBinder, RecursiveEvaluatorTest, TestPolicy, NoOpResponseParserTest, TestJsonRecordReader, MultiplyEvaluatorTest, FieldAnalysisResponseTest, CumulativeProbabilityEvaluatorTest, CosineEvaluatorTest, ReverseEvaluatorTest, StreamExpressionToExpessionTest, GreaterThanEvaluatorTest, SolrExampleXMLTest, GetByIdTest, SelectWithEvaluatorsTest, SolrExampleStreamingTest, TestLBHttpSolrClient, JdbcTest, LessThanEvaluatorTest, HyperbolicSineEvaluatorTest, SolrDocumentTest, TestSolrProperties, UsingSolrJRefGuideExamplesTest, TestDelegationTokenRequest, TestCloudSolrClientConnections, TestUpdateRequestCodec, NotEvaluatorTest, AppendEvaluatorTest, CeilingEvaluatorTest, PowerEvaluatorTest, TestHash, TestRetryUtil, TestJavaBinCodec, ShardParamsTest, GraphTest, CommonAdminParamsTest, SolrExampleStreamingBinaryTest, SolrExampleJettyTest, SolrExampleEmbeddedTest, TestBatchUpdate, JettyWebappTest, TestSpellCheckResponse, LargeVolumeJettyTest, SolrParamTest, TermsResponseTest, TestEmbeddedSolrServer, TestCoreAdmin, SolrQueryTest, ModifiableSolrParamsTest, TestFastInputStream, TestXMLEscaping, DocumentAnalysisResponseTest, SolrExceptionTest, ClientUtilsTest, NamedListTest, AnlysisResponseBaseTest, FacetFieldTest, CollectionAdminRequestRequiredParamsTest, BasicHttpSolrClientTest, CloudSolrClientBuilderTest, CloudSolrClientMultiConstructorTest, ConcurrentUpdateSolrClientBuilderTest, ConcurrentUpdateSolrClientTest, HttpSolrClientBuilderTest, HttpSolrClientConPoolTest, HttpSolrClientSSLAuthConPoolTest, StreamingTest, AddEvaluatorTest, AndEvaluatorTest, ArcSineEvaluatorTest, ArrayEvaluatorTest, CoalesceEvaluatorTest, CorrelationEvaluatorTest, EmpiricalDistributionEvaluatorTest, EqualToEvaluatorTest, ExclusiveOrEvaluatorTest, FieldValueEvaluatorTest, FloorEvaluatorTest, LengthEvaluatorTest, LessThanEqualToEvaluatorTest, NormalDistributionEvaluatorTest, NormalizeEvaluatorTest, RawValueEvaluatorTest, RoundEvaluatorTest, SineEvaluatorTest, SquareRootEvaluatorTest, SubtractEvaluatorTest, TangentEvaluatorTest, UniformDistributionEvaluatorTest, UuidEvaluatorTest, StreamExpressionParserTest, ConcatOperationTest, OperationsTest, SchemaTest]
   [junit4]   2> NOTE: reproduce with: ant test  -Dtestcase=SchemaTest -Dtests.seed=CADC92DE8529D9C1 -Dtests.slow=true -Dtests.locale=en-NZ -Dtests.timezone=PRT -Dtests.asserts=true -Dtests.file.encoding=US-ASCII
   [junit4] ERROR   0.00s J0 | SchemaTest (suite) <<<
   [junit4]    > Throwable #1: java.io.IOException: Could not remove the following files (in the order of attempts):
   [junit4]    >    C:\Users\jenkins\workspace\Lucene-Solr-7.2-Windows\solr\build\solr-solrj\test\J0\temp\solr.client.solrj.request.SchemaTest_CADC92DE8529D9C1-001\tempDir-010\multicore\core0: java.nio.file.DirectoryNotEmptyException: C:\Users\jenkins\workspace\Lucene-Solr-7.2-Windows\solr\build\solr-solrj\test\J0\temp\solr.client.solrj.request.SchemaTest_CADC92DE8529D9C1-001\tempDir-010\multicore\core0
   [junit4]    >    C:\Users\jenkins\workspace\Lucene-Solr-7.2-Windows\solr\build\solr-solrj\test\J0\temp\solr.client.solrj.request.SchemaTest_CADC92DE8529D9C1-001\tempDir-010\multicore: java.nio.file.DirectoryNotEmptyException: C:\Users\jenkins\workspace\Lucene-Solr-7.2-Windows\solr\build\solr-solrj\test\J0\temp\solr.client.solrj.request.SchemaTest_CADC92DE8529D9C1-001\tempDir-010\multicore
   [junit4]    >    C:\Users\jenkins\workspace\Lucene-Solr-7.2-Windows\solr\build\solr-solrj\test\J0\temp\solr.client.solrj.request.SchemaTest_CADC92DE8529D9C1-001\tempDir-010: java.nio.file.DirectoryNotEmptyException: C:\Users\jenkins\workspace\Lucene-Solr-7.2-Windows\solr\build\solr-solrj\test\J0\temp\solr.client.solrj.request.SchemaTest_CADC92DE8529D9C1-001\tempDir-010
   [junit4]    > 	at __randomizedtesting.SeedInfo.seed([CADC92DE8529D9C1]:0)
   [junit4]    > 	at org.apache.lucene.util.IOUtils.rm(IOUtils.java:329)
   [junit4]    > 	at java.lang.Thread.run(Thread.java:748)
   [junit4] Completed [122/146 (1!)] on J0 in 16.55s, 35 tests, 1 error <<< FAILURES!

[...truncated 2211 lines...]
   [junit4] Suite: org.apache.solr.analytics.value.CastingLongValueStreamTest
   [junit4]   2> Creating dataDir: C:\Users\jenkins\workspace\Lucene-Solr-7.2-Windows\solr\build\contrib\solr-analytics\test\J0\temp\solr.analytics.value.CastingLongValueStreamTest_7035074319678CF-001\init-core-data-001
   [junit4]   2> NOTE: test params are: codec=Asserting(Lucene70): {}, docValues:{}, maxPointsInLeafNode=723, maxMBSortInHeap=6.725663057375593, sim=RandomSimilarity(queryNorm=true): {}, locale=lt-LT, timezone=Africa/Monrovia
   [junit4]   2> NOTE: Windows 10 10.0 x86/Oracle Corporation 1.8.0_144 (32-bit)/cpus=3,threads=1,free=95420432,total=199229440
   [junit4]   2> NOTE: All tests run in this JVM: [DoubleFieldsTest, QueryFacetTest, ValueFacetTest, CastingAnalyticsValueTest, LTEFunctionTest, LegacyFieldFacetExtrasTest, CastingDateValueTest, FillMissingFunctionTest, LegacyQueryFacetCloudTest, PowerFunctionTest, BooleanFieldsTest, NegateFunctionTest, GTFunctionTest, CastingFloatValueTest, ExpressionFactoryTest, TopFunctionTest, LegacyNoFacetTest, ReplaceFunctionTest, ConcatFunctionTest, LegacyAbstractAnalyticsFacetTest, PivotFacetTest, FloorFunctionTest, LogFunctionTest, StringCastFunctionTest, LegacyAbstractAnalyticsTest, LegacyFunctionTest, LegacyAbstractAnalyticsFacetCloudTest, LegacyFieldFacetCloudTest, LegacyRangeFacetCloudTest, CastingFloatValueStreamTest, CastingLongValueStreamTest]
   [junit4]   2> NOTE: reproduce with: ant test  -Dtestcase=CastingLongValueStreamTest -Dtests.seed=7035074319678CF -Dtests.slow=true -Dtests.locale=lt-LT -Dtests.timezone=Africa/Monrovia -Dtests.asserts=true -Dtests.file.encoding=US-ASCII
   [junit4] ERROR   0.00s J0 | CastingLongValueStreamTest (suite) <<<
   [junit4]    > Throwable #1: java.io.IOException: Could not remove the following files (in the order of attempts):
   [junit4]    >    C:\Users\jenkins\workspace\Lucene-Solr-7.2-Windows\solr\build\contrib\solr-analytics\test\J0\temp\solr.analytics.value.CastingLongValueStreamTest_7035074319678CF-001\init-core-data-001: java.nio.file.AccessDeniedException: C:\Users\jenkins\workspace\Lucene-Solr-7.2-Windows\solr\build\contrib\solr-analytics\test\J0\temp\solr.analytics.value.CastingLongValueStreamTest_7035074319678CF-001\init-core-data-001
   [junit4]    >    C:\Users\jenkins\workspace\Lucene-Solr-7.2-Windows\solr\build\contrib\solr-analytics\test\J0\temp\solr.analytics.value.CastingLongValueStreamTest_7035074319678CF-001: java.nio.file.DirectoryNotEmptyException: C:\Users\jenkins\workspace\Lucene-Solr-7.2-Windows\solr\build\contrib\solr-analytics\test\J0\temp\solr.analytics.value.CastingLongValueStreamTest_7035074319678CF-001
   [junit4]    > 	at __randomizedtesting.SeedInfo.seed([7035074319678CF]:0)
   [junit4]    > 	at org.apache.lucene.util.IOUtils.rm(IOUtils.java:329)
   [junit4]    > 	at java.lang.Thread.run(Thread.java:748)
   [junit4] Completed [74/78 (1!)] on J0 in 0.05s, 4 tests, 1 error <<< FAILURES!

[...truncated 40122 lines...]

Mime
View raw message