lucene-dev mailing list archives

Site index · List index
Message view « Date » · « Thread »
Top « Date » · « Thread »
From Apache Jenkins Server <jenk...@builds.apache.org>
Subject [JENKINS] Lucene-Solr-NightlyTests-7.x - Build # 132 - Failure
Date Sat, 27 Jan 2018 12:23:12 GMT
Build: https://builds.apache.org/job/Lucene-Solr-NightlyTests-7.x/132/

1 tests failed.
FAILED:  org.apache.solr.cloud.FullSolrCloudDistribCmdsTest.test

Error Message:
Captured an uncaught exception in thread: Thread[id=8993, name=Thread-2166, state=RUNNABLE, group=TGRP-FullSolrCloudDistribCmdsTest]

Stack Trace:
com.carrotsearch.randomizedtesting.UncaughtExceptionError: Captured an uncaught exception in thread: Thread[id=8993, name=Thread-2166, state=RUNNABLE, group=TGRP-FullSolrCloudDistribCmdsTest]
Caused by: org.apache.solr.common.SolrException: directUpdatesToLeadersOnly==true but could not find leader(s)
	at __randomizedtesting.SeedInfo.seed([413848E06A1F333F]:0)
	at org.apache.solr.client.solrj.impl.CloudSolrClient.directUpdate(CloudSolrClient.java:507)
	at org.apache.solr.client.solrj.impl.CloudSolrClient.sendRequest(CloudSolrClient.java:1013)
	at org.apache.solr.client.solrj.impl.CloudSolrClient.requestWithRetryOnStaleState(CloudSolrClient.java:884)
	at org.apache.solr.client.solrj.impl.CloudSolrClient.request(CloudSolrClient.java:817)
	at org.apache.solr.client.solrj.SolrRequest.process(SolrRequest.java:194)
	at org.apache.solr.client.solrj.SolrRequest.process(SolrRequest.java:211)
	at org.apache.solr.cloud.FullSolrCloudDistribCmdsTest$1IndexThread.run(FullSolrCloudDistribCmdsTest.java:633)




Build Log:
[...truncated 13553 lines...]
   [junit4] Suite: org.apache.solr.cloud.FullSolrCloudDistribCmdsTest
   [junit4]   2> 3469696 INFO  (SUITE-FullSolrCloudDistribCmdsTest-seed#[413848E06A1F333F]-worker) [    ] o.a.s.SolrTestCaseJ4 SecureRandom sanity checks: test.solr.allowed.securerandom=null & java.security.egd=file:/dev/./urandom
   [junit4]   2> Creating dataDir: /x1/jenkins/jenkins-slave/workspace/Lucene-Solr-NightlyTests-7.x/checkout/solr/build/solr-core/test/J0/temp/solr.cloud.FullSolrCloudDistribCmdsTest_413848E06A1F333F-001/init-core-data-001
   [junit4]   2> 3469696 WARN  (SUITE-FullSolrCloudDistribCmdsTest-seed#[413848E06A1F333F]-worker) [    ] o.a.s.SolrTestCaseJ4 startTrackingSearchers: numOpens=6 numCloses=6
   [junit4]   2> 3469696 INFO  (SUITE-FullSolrCloudDistribCmdsTest-seed#[413848E06A1F333F]-worker) [    ] o.a.s.SolrTestCaseJ4 Using PointFields (NUMERIC_POINTS_SYSPROP=true) w/NUMERIC_DOCVALUES_SYSPROP=false
   [junit4]   2> 3469698 INFO  (SUITE-FullSolrCloudDistribCmdsTest-seed#[413848E06A1F333F]-worker) [    ] o.a.s.SolrTestCaseJ4 Randomized ssl (false) and clientAuth (false) via: @org.apache.solr.SolrTestCaseJ4$SuppressSSL(bugUrl=https://issues.apache.org/jira/browse/SOLR-5776)
   [junit4]   2> 3469698 INFO  (SUITE-FullSolrCloudDistribCmdsTest-seed#[413848E06A1F333F]-worker) [    ] o.a.s.BaseDistributedSearchTestCase Setting hostContext system property: /
   [junit4]   2> 3469876 INFO  (TEST-FullSolrCloudDistribCmdsTest.test-seed#[413848E06A1F333F]) [    ] o.a.s.c.ZkTestServer STARTING ZK TEST SERVER
   [junit4]   2> 3469895 INFO  (Thread-2076) [    ] o.a.s.c.ZkTestServer client port:0.0.0.0/0.0.0.0:0
   [junit4]   2> 3469895 INFO  (Thread-2076) [    ] o.a.s.c.ZkTestServer Starting server
   [junit4]   2> 3470033 ERROR (Thread-2076) [    ] o.a.z.s.ZooKeeperServer ZKShutdownHandler is not registered, so ZooKeeper server won't take any action on ERROR or SHUTDOWN server state changes
   [junit4]   2> 3470033 INFO  (TEST-FullSolrCloudDistribCmdsTest.test-seed#[413848E06A1F333F]) [    ] o.a.s.c.ZkTestServer start zk server on port:41758
   [junit4]   2> 3470134 INFO  (zkConnectionManagerCallback-1585-thread-1) [    ] o.a.s.c.c.ConnectionManager zkClient has connected
   [junit4]   2> 3470295 INFO  (zkConnectionManagerCallback-1587-thread-1) [    ] o.a.s.c.c.ConnectionManager zkClient has connected
   [junit4]   2> 3470298 INFO  (TEST-FullSolrCloudDistribCmdsTest.test-seed#[413848E06A1F333F]) [    ] o.a.s.c.AbstractZkTestCase put /x1/jenkins/jenkins-slave/workspace/Lucene-Solr-NightlyTests-7.x/checkout/solr/core/src/test-files/solr/collection1/conf/solrconfig-tlog.xml to /configs/conf1/solrconfig.xml
   [junit4]   2> 3470299 INFO  (TEST-FullSolrCloudDistribCmdsTest.test-seed#[413848E06A1F333F]) [    ] o.a.s.c.AbstractZkTestCase put /x1/jenkins/jenkins-slave/workspace/Lucene-Solr-NightlyTests-7.x/checkout/solr/core/src/test-files/solr/collection1/conf/schema15.xml to /configs/conf1/schema.xml
   [junit4]   2> 3470303 INFO  (TEST-FullSolrCloudDistribCmdsTest.test-seed#[413848E06A1F333F]) [    ] o.a.s.c.AbstractZkTestCase put /x1/jenkins/jenkins-slave/workspace/Lucene-Solr-NightlyTests-7.x/checkout/solr/core/src/test-files/solr/collection1/conf/solrconfig.snippet.randomindexconfig.xml to /configs/conf1/solrconfig.snippet.randomindexconfig.xml
   [junit4]   2> 3470315 INFO  (TEST-FullSolrCloudDistribCmdsTest.test-seed#[413848E06A1F333F]) [    ] o.a.s.c.AbstractZkTestCase put /x1/jenkins/jenkins-slave/workspace/Lucene-Solr-NightlyTests-7.x/checkout/solr/core/src/test-files/solr/collection1/conf/stopwords.txt to /configs/conf1/stopwords.txt
   [junit4]   2> 3470316 INFO  (TEST-FullSolrCloudDistribCmdsTest.test-seed#[413848E06A1F333F]) [    ] o.a.s.c.AbstractZkTestCase put /x1/jenkins/jenkins-slave/workspace/Lucene-Solr-NightlyTests-7.x/checkout/solr/core/src/test-files/solr/collection1/conf/protwords.txt to /configs/conf1/protwords.txt
   [junit4]   2> 3470335 INFO  (TEST-FullSolrCloudDistribCmdsTest.test-seed#[413848E06A1F333F]) [    ] o.a.s.c.AbstractZkTestCase put /x1/jenkins/jenkins-slave/workspace/Lucene-Solr-NightlyTests-7.x/checkout/solr/core/src/test-files/solr/collection1/conf/currency.xml to /configs/conf1/currency.xml
   [junit4]   2> 3470336 INFO  (TEST-FullSolrCloudDistribCmdsTest.test-seed#[413848E06A1F333F]) [    ] o.a.s.c.AbstractZkTestCase put /x1/jenkins/jenkins-slave/workspace/Lucene-Solr-NightlyTests-7.x/checkout/solr/core/src/test-files/solr/collection1/conf/enumsConfig.xml to /configs/conf1/enumsConfig.xml
   [junit4]   2> 3470336 INFO  (TEST-FullSolrCloudDistribCmdsTest.test-seed#[413848E06A1F333F]) [    ] o.a.s.c.AbstractZkTestCase put /x1/jenkins/jenkins-slave/workspace/Lucene-Solr-NightlyTests-7.x/checkout/solr/core/src/test-files/solr/collection1/conf/open-exchange-rates.json to /configs/conf1/open-exchange-rates.json
   [junit4]   2> 3470342 INFO  (TEST-FullSolrCloudDistribCmdsTest.test-seed#[413848E06A1F333F]) [    ] o.a.s.c.AbstractZkTestCase put /x1/jenkins/jenkins-slave/workspace/Lucene-Solr-NightlyTests-7.x/checkout/solr/core/src/test-files/solr/collection1/conf/mapping-ISOLatin1Accent.txt to /configs/conf1/mapping-ISOLatin1Accent.txt
   [junit4]   2> 3470343 INFO  (TEST-FullSolrCloudDistribCmdsTest.test-seed#[413848E06A1F333F]) [    ] o.a.s.c.AbstractZkTestCase put /x1/jenkins/jenkins-slave/workspace/Lucene-Solr-NightlyTests-7.x/checkout/solr/core/src/test-files/solr/collection1/conf/old_synonyms.txt to /configs/conf1/old_synonyms.txt
   [junit4]   2> 3470359 INFO  (TEST-FullSolrCloudDistribCmdsTest.test-seed#[413848E06A1F333F]) [    ] o.a.s.c.AbstractZkTestCase put /x1/jenkins/jenkins-slave/workspace/Lucene-Solr-NightlyTests-7.x/checkout/solr/core/src/test-files/solr/collection1/conf/synonyms.txt to /configs/conf1/synonyms.txt
   [junit4]   2> 3470379 INFO  (TEST-FullSolrCloudDistribCmdsTest.test-seed#[413848E06A1F333F]) [    ] o.a.s.c.AbstractFullDistribZkTestBase Will use NRT replicas unless explicitly asked otherwise
   [junit4]   2> 3472045 INFO  (TEST-FullSolrCloudDistribCmdsTest.test-seed#[413848E06A1F333F]) [    ] o.e.j.s.Server jetty-9.4.8.v20171121, build timestamp: 2017-11-21T23:27:37+02:00, git hash: 82b8fb23f757335bb3329d540ce37a2a2615f0a8
   [junit4]   2> 3472049 INFO  (TEST-FullSolrCloudDistribCmdsTest.test-seed#[413848E06A1F333F]) [    ] o.e.j.s.session DefaultSessionIdManager workerName=node0
   [junit4]   2> 3472049 INFO  (TEST-FullSolrCloudDistribCmdsTest.test-seed#[413848E06A1F333F]) [    ] o.e.j.s.session No SessionScavenger set, using defaults
   [junit4]   2> 3472049 INFO  (TEST-FullSolrCloudDistribCmdsTest.test-seed#[413848E06A1F333F]) [    ] o.e.j.s.session Scavenging every 600000ms
   [junit4]   2> 3472049 INFO  (TEST-FullSolrCloudDistribCmdsTest.test-seed#[413848E06A1F333F]) [    ] o.e.j.s.h.ContextHandler Started o.e.j.s.ServletContextHandler@5625565b{/,null,AVAILABLE}
   [junit4]   2> 3472050 INFO  (TEST-FullSolrCloudDistribCmdsTest.test-seed#[413848E06A1F333F]) [    ] o.e.j.s.AbstractConnector Started ServerConnector@3b914ba2{HTTP/1.1,[http/1.1]}{127.0.0.1:46887}
   [junit4]   2> 3472050 INFO  (TEST-FullSolrCloudDistribCmdsTest.test-seed#[413848E06A1F333F]) [    ] o.e.j.s.Server Started @3496213ms
   [junit4]   2> 3472050 INFO  (TEST-FullSolrCloudDistribCmdsTest.test-seed#[413848E06A1F333F]) [    ] o.a.s.c.s.e.JettySolrRunner Jetty properties: {solr.data.dir=/x1/jenkins/jenkins-slave/workspace/Lucene-Solr-NightlyTests-7.x/checkout/solr/build/solr-core/test/J0/temp/solr.cloud.FullSolrCloudDistribCmdsTest_413848E06A1F333F-001/tempDir-001/control/data, hostContext=/, hostPort=46887, coreRootDirectory=/x1/jenkins/jenkins-slave/workspace/Lucene-Solr-NightlyTests-7.x/checkout/solr/build/solr-core/test/J0/temp/solr.cloud.FullSolrCloudDistribCmdsTest_413848E06A1F333F-001/control-001/cores}
   [junit4]   2> 3472050 ERROR (TEST-FullSolrCloudDistribCmdsTest.test-seed#[413848E06A1F333F]) [    ] o.a.s.u.StartupLoggingUtils Missing Java Option solr.log.dir. Logging may be missing or incomplete.
   [junit4]   2> 3472050 INFO  (TEST-FullSolrCloudDistribCmdsTest.test-seed#[413848E06A1F333F]) [    ] o.a.s.s.SolrDispatchFilter  ___      _       Welcome to Apache Solr™ version 7.3.0
   [junit4]   2> 3472051 INFO  (TEST-FullSolrCloudDistribCmdsTest.test-seed#[413848E06A1F333F]) [    ] o.a.s.s.SolrDispatchFilter / __| ___| |_ _   Starting in cloud mode on port null
   [junit4]   2> 3472051 INFO  (TEST-FullSolrCloudDistribCmdsTest.test-seed#[413848E06A1F333F]) [    ] o.a.s.s.SolrDispatchFilter \__ \/ _ \ | '_|  Install dir: null
   [junit4]   2> 3472051 INFO  (TEST-FullSolrCloudDistribCmdsTest.test-seed#[413848E06A1F333F]) [    ] o.a.s.s.SolrDispatchFilter |___/\___/_|_|    Start time: 2018-01-27T12:16:06.519Z
   [junit4]   2> 3472053 INFO  (zkConnectionManagerCallback-1589-thread-1) [    ] o.a.s.c.c.ConnectionManager zkClient has connected
   [junit4]   2> 3472054 INFO  (TEST-FullSolrCloudDistribCmdsTest.test-seed#[413848E06A1F333F]) [    ] o.a.s.s.SolrDispatchFilter Loading solr.xml from SolrHome (not found in ZooKeeper)
   [junit4]   2> 3472054 INFO  (TEST-FullSolrCloudDistribCmdsTest.test-seed#[413848E06A1F333F]) [    ] o.a.s.c.SolrXmlConfig Loading container configuration from /x1/jenkins/jenkins-slave/workspace/Lucene-Solr-NightlyTests-7.x/checkout/solr/build/solr-core/test/J0/temp/solr.cloud.FullSolrCloudDistribCmdsTest_413848E06A1F333F-001/control-001/solr.xml
   [junit4]   2> 3472074 INFO  (TEST-FullSolrCloudDistribCmdsTest.test-seed#[413848E06A1F333F]) [    ] o.a.s.c.SolrXmlConfig Configuration parameter autoReplicaFailoverWorkLoopDelay is ignored
   [junit4]   2> 3472074 INFO  (TEST-FullSolrCloudDistribCmdsTest.test-seed#[413848E06A1F333F]) [    ] o.a.s.c.SolrXmlConfig Configuration parameter autoReplicaFailoverBadNodeExpiration is ignored
   [junit4]   2> 3472088 INFO  (TEST-FullSolrCloudDistribCmdsTest.test-seed#[413848E06A1F333F]) [    ] o.a.s.c.SolrXmlConfig MBean server found: com.sun.jmx.mbeanserver.JmxMBeanServer@7f2c603, but no JMX reporters were configured - adding default JMX reporter.
   [junit4]   2> 3472091 INFO  (TEST-FullSolrCloudDistribCmdsTest.test-seed#[413848E06A1F333F]) [    ] o.a.s.c.ZkContainer Zookeeper client=127.0.0.1:41758/solr
   [junit4]   2> 3472100 INFO  (zkConnectionManagerCallback-1593-thread-1) [    ] o.a.s.c.c.ConnectionManager zkClient has connected
   [junit4]   2> 3472187 INFO  (zkConnectionManagerCallback-1595-thread-1-processing-n:127.0.0.1:46887_) [n:127.0.0.1:46887_    ] o.a.s.c.c.ConnectionManager zkClient has connected
   [junit4]   2> 3472481 INFO  (TEST-FullSolrCloudDistribCmdsTest.test-seed#[413848E06A1F333F]) [n:127.0.0.1:46887_    ] o.a.s.c.Overseer Overseer (id=null) closing
   [junit4]   2> 3472499 INFO  (TEST-FullSolrCloudDistribCmdsTest.test-seed#[413848E06A1F333F]) [n:127.0.0.1:46887_    ] o.a.s.c.OverseerElectionContext I am going to be the leader 127.0.0.1:46887_
   [junit4]   2> 3473135 INFO  (TEST-FullSolrCloudDistribCmdsTest.test-seed#[413848E06A1F333F]) [n:127.0.0.1:46887_    ] o.a.s.c.Overseer Overseer (id=99421740364398596-127.0.0.1:46887_-n_0000000000) starting
   [junit4]   2> 3473213 INFO  (TEST-FullSolrCloudDistribCmdsTest.test-seed#[413848E06A1F333F]) [n:127.0.0.1:46887_    ] o.a.s.c.ZkController Register node as live in ZooKeeper:/live_nodes/127.0.0.1:46887_
   [junit4]   2> 3473272 INFO  (zkCallback-1594-thread-1-processing-n:127.0.0.1:46887_) [n:127.0.0.1:46887_    ] o.a.s.c.c.ZkStateReader Updated live nodes from ZooKeeper... (0) -> (1)
   [junit4]   2> 3474073 INFO  (TEST-FullSolrCloudDistribCmdsTest.test-seed#[413848E06A1F333F]) [n:127.0.0.1:46887_    ] o.a.s.m.r.SolrJmxReporter JMX monitoring for 'solr.node' (registry 'solr.node') enabled at server: com.sun.jmx.mbeanserver.JmxMBeanServer@7f2c603
   [junit4]   2> 3474236 INFO  (TEST-FullSolrCloudDistribCmdsTest.test-seed#[413848E06A1F333F]) [n:127.0.0.1:46887_    ] o.a.s.m.r.SolrJmxReporter JMX monitoring for 'solr.jvm' (registry 'solr.jvm') enabled at server: com.sun.jmx.mbeanserver.JmxMBeanServer@7f2c603
   [junit4]   2> 3474237 INFO  (TEST-FullSolrCloudDistribCmdsTest.test-seed#[413848E06A1F333F]) [n:127.0.0.1:46887_    ] o.a.s.m.r.SolrJmxReporter JMX monitoring for 'solr.jetty' (registry 'solr.jetty') enabled at server: com.sun.jmx.mbeanserver.JmxMBeanServer@7f2c603
   [junit4]   2> 3474238 INFO  (TEST-FullSolrCloudDistribCmdsTest.test-seed#[413848E06A1F333F]) [n:127.0.0.1:46887_    ] o.a.s.c.CorePropertiesLocator Found 0 core definitions underneath /x1/jenkins/jenkins-slave/workspace/Lucene-Solr-NightlyTests-7.x/checkout/solr/build/solr-core/test/J0/temp/solr.cloud.FullSolrCloudDistribCmdsTest_413848E06A1F333F-001/control-001/cores
   [junit4]   2> 3474639 INFO  (zkConnectionManagerCallback-1601-thread-1) [    ] o.a.s.c.c.ConnectionManager zkClient has connected
   [junit4]   2> 3474640 INFO  (TEST-FullSolrCloudDistribCmdsTest.test-seed#[413848E06A1F333F]) [    ] o.a.s.c.c.ZkStateReader Updated live nodes from ZooKeeper... (0) -> (1)
   [junit4]   2> 3474659 INFO  (TEST-FullSolrCloudDistribCmdsTest.test-seed#[413848E06A1F333F]) [    ] o.a.s.c.s.i.ZkClientClusterStateProvider Cluster at 127.0.0.1:41758/solr ready
   [junit4]   2> 3474660 INFO  (qtp535968620-8513) [n:127.0.0.1:46887_    ] o.a.s.h.a.CollectionsHandler Invoked Collection Action :create with params replicationFactor=1&collection.configName=conf1&name=control_collection&nrtReplicas=1&action=CREATE&numShards=1&createNodeSet=127.0.0.1:46887_&wt=javabin&version=2 and sendToOCPQueue=true
   [junit4]   2> 3475007 INFO  (OverseerThreadFactory-3639-thread-1-processing-n:127.0.0.1:46887_) [n:127.0.0.1:46887_    ] o.a.s.c.a.c.CreateCollectionCmd Create collection control_collection
   [junit4]   2> 3475124 INFO  (qtp535968620-8517) [n:127.0.0.1:46887_    ] o.a.s.h.a.CoreAdminOperation core create command qt=/admin/cores&collection.configName=conf1&newCollection=true&name=control_collection_shard1_replica_n1&action=CREATE&numShards=1&collection=control_collection&shard=shard1&wt=javabin&version=2&replicaType=NRT
   [junit4]   2> 3475124 INFO  (qtp535968620-8517) [n:127.0.0.1:46887_    ] o.a.s.c.TransientSolrCoreCacheDefault Allocating transient cache for 4 transient cores
   [junit4]   2> 3475246 INFO  (zkCallback-1594-thread-1-processing-n:127.0.0.1:46887_) [n:127.0.0.1:46887_    ] o.a.s.c.c.ZkStateReader A cluster state change: [WatchedEvent state:SyncConnected type:NodeDataChanged path:/collections/control_collection/state.json] for collection [control_collection] has occurred - updating... (live nodes size: [1])
   [junit4]   2> 3477175 INFO  (qtp535968620-8517) [n:127.0.0.1:46887_ c:control_collection s:shard1  x:control_collection_shard1_replica_n1] o.a.s.c.SolrConfig Using Lucene MatchVersion: 7.3.0
   [junit4]   2> 3477337 INFO  (qtp535968620-8517) [n:127.0.0.1:46887_ c:control_collection s:shard1  x:control_collection_shard1_replica_n1] o.a.s.s.IndexSchema [control_collection_shard1_replica_n1] Schema name=test
   [junit4]   2> 3478081 INFO  (qtp535968620-8517) [n:127.0.0.1:46887_ c:control_collection s:shard1  x:control_collection_shard1_replica_n1] o.a.s.s.IndexSchema Loaded schema test/1.6 with uniqueid field id
   [junit4]   2> 3478195 INFO  (qtp535968620-8517) [n:127.0.0.1:46887_ c:control_collection s:shard1  x:control_collection_shard1_replica_n1] o.a.s.c.CoreContainer Creating SolrCore 'control_collection_shard1_replica_n1' using configuration from collection control_collection, trusted=true
   [junit4]   2> 3478196 INFO  (qtp535968620-8517) [n:127.0.0.1:46887_ c:control_collection s:shard1  x:control_collection_shard1_replica_n1] o.a.s.m.r.SolrJmxReporter JMX monitoring for 'solr.core.control_collection.shard1.replica_n1' (registry 'solr.core.control_collection.shard1.replica_n1') enabled at server: com.sun.jmx.mbeanserver.JmxMBeanServer@7f2c603
   [junit4]   2> 3478196 INFO  (qtp535968620-8517) [n:127.0.0.1:46887_ c:control_collection s:shard1  x:control_collection_shard1_replica_n1] o.a.s.c.SolrCore solr.RecoveryStrategy.Builder
   [junit4]   2> 3478196 INFO  (qtp535968620-8517) [n:127.0.0.1:46887_ c:control_collection s:shard1  x:control_collection_shard1_replica_n1] o.a.s.c.SolrCore [[control_collection_shard1_replica_n1] ] Opening new SolrCore at [/x1/jenkins/jenkins-slave/workspace/Lucene-Solr-NightlyTests-7.x/checkout/solr/build/solr-core/test/J0/temp/solr.cloud.FullSolrCloudDistribCmdsTest_413848E06A1F333F-001/control-001/cores/control_collection_shard1_replica_n1], dataDir=[/x1/jenkins/jenkins-slave/workspace/Lucene-Solr-NightlyTests-7.x/checkout/solr/build/solr-core/test/J0/temp/solr.cloud.FullSolrCloudDistribCmdsTest_413848E06A1F333F-001/control-001/cores/control_collection_shard1_replica_n1/data/]
   [junit4]   2> 3478311 INFO  (qtp535968620-8517) [n:127.0.0.1:46887_ c:control_collection s:shard1  x:control_collection_shard1_replica_n1] o.a.s.u.RandomMergePolicy RandomMergePolicy wrapping class org.apache.lucene.index.TieredMergePolicy: [TieredMergePolicy: maxMergeAtOnce=16, maxMergeAtOnceExplicit=46, maxMergedSegmentMB=33.517578125, floorSegmentMB=1.767578125, forceMergeDeletesPctAllowed=8.897027449585455, segmentsPerTier=27.0, maxCFSSegmentSizeMB=8.796093022207999E12, noCFSRatio=0.16469330023994982
   [junit4]   2> 3478314 WARN  (qtp535968620-8517) [n:127.0.0.1:46887_ c:control_collection s:shard1  x:control_collection_shard1_replica_n1] o.a.s.c.RequestHandlers INVALID paramSet a in requestHandler {type = requestHandler,name = /dump,class = DumpRequestHandler,attributes = {initParams=a, name=/dump, class=DumpRequestHandler},args = {defaults={a=A,b=B}}}
   [junit4]   2> 3478647 INFO  (qtp535968620-8517) [n:127.0.0.1:46887_ c:control_collection s:shard1  x:control_collection_shard1_replica_n1] o.a.s.u.UpdateHandler Using UpdateLog implementation: org.apache.solr.update.UpdateLog
   [junit4]   2> 3478647 INFO  (qtp535968620-8517) [n:127.0.0.1:46887_ c:control_collection s:shard1  x:control_collection_shard1_replica_n1] o.a.s.u.UpdateLog Initializing UpdateLog: dataDir= defaultSyncLevel=FLUSH numRecordsToKeep=100 maxNumLogsToKeep=10 numVersionBuckets=65536
   [junit4]   2> 3478648 INFO  (qtp535968620-8517) [n:127.0.0.1:46887_ c:control_collection s:shard1  x:control_collection_shard1_replica_n1] o.a.s.u.CommitTracker Hard AutoCommit: disabled
   [junit4]   2> 3478648 INFO  (qtp535968620-8517) [n:127.0.0.1:46887_ c:control_collection s:shard1  x:control_collection_shard1_replica_n1] o.a.s.u.CommitTracker Soft AutoCommit: disabled
   [junit4]   2> 3478649 INFO  (qtp535968620-8517) [n:127.0.0.1:46887_ c:control_collection s:shard1  x:control_collection_shard1_replica_n1] o.a.s.u.RandomMergePolicy RandomMergePolicy wrapping class org.apache.lucene.index.TieredMergePolicy: [TieredMergePolicy: maxMergeAtOnce=5, maxMergeAtOnceExplicit=2, maxMergedSegmentMB=37.9560546875, floorSegmentMB=1.7431640625, forceMergeDeletesPctAllowed=7.811238212231509, segmentsPerTier=13.0, maxCFSSegmentSizeMB=8.796093022207999E12, noCFSRatio=0.7931536316250646
   [junit4]   2> 3478649 INFO  (qtp535968620-8517) [n:127.0.0.1:46887_ c:control_collection s:shard1  x:control_collection_shard1_replica_n1] o.a.s.s.SolrIndexSearcher Opening [Searcher@697a0cb9[control_collection_shard1_replica_n1] main]
   [junit4]   2> 3478651 INFO  (qtp535968620-8517) [n:127.0.0.1:46887_ c:control_collection s:shard1  x:control_collection_shard1_replica_n1] o.a.s.r.ManagedResourceStorage Configured ZooKeeperStorageIO with znodeBase: /configs/conf1
   [junit4]   2> 3478655 INFO  (qtp535968620-8517) [n:127.0.0.1:46887_ c:control_collection s:shard1  x:control_collection_shard1_replica_n1] o.a.s.r.ManagedResourceStorage Loaded null at path _rest_managed.json using ZooKeeperStorageIO:path=/configs/conf1
   [junit4]   2> 3478656 INFO  (qtp535968620-8517) [n:127.0.0.1:46887_ c:control_collection s:shard1  x:control_collection_shard1_replica_n1] o.a.s.h.ReplicationHandler Commits will be reserved for 10000ms.
   [junit4]   2> 3478656 INFO  (qtp535968620-8517) [n:127.0.0.1:46887_ c:control_collection s:shard1  x:control_collection_shard1_replica_n1] o.a.s.u.UpdateLog Could not find max version in index or recent updates, using new clock 1590747854928871424
   [junit4]   2> 3478659 INFO  (searcherExecutor-3642-thread-1-processing-n:127.0.0.1:46887_ x:control_collection_shard1_replica_n1 s:shard1 c:control_collection) [n:127.0.0.1:46887_ c:control_collection s:shard1  x:control_collection_shard1_replica_n1] o.a.s.c.SolrCore [control_collection_shard1_replica_n1] Registered new searcher Searcher@697a0cb9[control_collection_shard1_replica_n1] main{ExitableDirectoryReader(UninvertingDirectoryReader())}
   [junit4]   2> 3478685 INFO  (qtp535968620-8517) [n:127.0.0.1:46887_ c:control_collection s:shard1  x:control_collection_shard1_replica_n1] o.a.s.c.ShardLeaderElectionContext Enough replicas found to continue.
   [junit4]   2> 3478685 INFO  (qtp535968620-8517) [n:127.0.0.1:46887_ c:control_collection s:shard1  x:control_collection_shard1_replica_n1] o.a.s.c.ShardLeaderElectionContext I may be the new leader - try and sync
   [junit4]   2> 3478685 INFO  (qtp535968620-8517) [n:127.0.0.1:46887_ c:control_collection s:shard1  x:control_collection_shard1_replica_n1] o.a.s.c.SyncStrategy Sync replicas to http://127.0.0.1:46887/control_collection_shard1_replica_n1/
   [junit4]   2> 3478685 INFO  (qtp535968620-8517) [n:127.0.0.1:46887_ c:control_collection s:shard1  x:control_collection_shard1_replica_n1] o.a.s.c.SyncStrategy Sync Success - now sync replicas to me
   [junit4]   2> 3478685 INFO  (qtp535968620-8517) [n:127.0.0.1:46887_ c:control_collection s:shard1  x:control_collection_shard1_replica_n1] o.a.s.c.SyncStrategy http://127.0.0.1:46887/control_collection_shard1_replica_n1/ has no replicas
   [junit4]   2> 3478685 INFO  (qtp535968620-8517) [n:127.0.0.1:46887_ c:control_collection s:shard1  x:control_collection_shard1_replica_n1] o.a.s.c.ShardLeaderElectionContext Found all replicas participating in election, clear LIR
   [junit4]   2> 3478706 INFO  (zkCallback-1594-thread-1-processing-n:127.0.0.1:46887_) [n:127.0.0.1:46887_    ] o.a.s.c.c.ZkStateReader A cluster state change: [WatchedEvent state:SyncConnected type:NodeDataChanged path:/collections/control_collection/state.json] for collection [control_collection] has occurred - updating... (live nodes size: [1])
   [junit4]   2> 3478780 INFO  (qtp535968620-8517) [n:127.0.0.1:46887_ c:control_collection s:shard1  x:control_collection_shard1_replica_n1] o.a.s.c.ShardLeaderElectionContext I am the new leader: http://127.0.0.1:46887/control_collection_shard1_replica_n1/ shard1
   [junit4]   2> 3478780 INFO  (qtp535968620-8517) [n:127.0.0.1:46887_ c:control_collection s:shard1  x:control_collection_shard1_replica_n1] o.a.s.c.ZkController I am the leader, no recovery necessary
   [junit4]   2> 3478782 INFO  (qtp535968620-8517) [n:127.0.0.1:46887_ c:control_collection s:shard1  x:control_collection_shard1_replica_n1] o.a.s.s.HttpSolrCall [admin] webapp=null path=/admin/cores params={qt=/admin/cores&collection.configName=conf1&newCollection=true&name=control_collection_shard1_replica_n1&action=CREATE&numShards=1&collection=control_collection&shard=shard1&wt=javabin&version=2&replicaType=NRT} status=0 QTime=3658
   [junit4]   2> 3478784 INFO  (qtp535968620-8513) [n:127.0.0.1:46887_    ] o.a.s.h.a.CollectionsHandler Wait for new collection to be active for at most 30 seconds. Check all shard replicas
   [junit4]   2> 3478892 INFO  (zkCallback-1594-thread-1-processing-n:127.0.0.1:46887_) [n:127.0.0.1:46887_    ] o.a.s.c.c.ZkStateReader A cluster state change: [WatchedEvent state:SyncConnected type:NodeDataChanged path:/collections/control_collection/state.json] for collection [control_collection] has occurred - updating... (live nodes size: [1])
   [junit4]   2> 3479120 INFO  (OverseerCollectionConfigSetProcessor-99421740364398596-127.0.0.1:46887_-n_0000000000) [n:127.0.0.1:46887_    ] o.a.s.c.OverseerTaskQueue Response ZK path: /overseer/collection-queue-work/qnr-0000000000 doesn't exist.  Requestor may have disconnected from ZooKeeper
   [junit4]   2> 3479784 INFO  (qtp535968620-8513) [n:127.0.0.1:46887_    ] o.a.s.s.HttpSolrCall [admin] webapp=null path=/admin/collections params={replicationFactor=1&collection.configName=conf1&name=control_collection&nrtReplicas=1&action=CREATE&numShards=1&createNodeSet=127.0.0.1:46887_&wt=javabin&version=2} status=0 QTime=5123
   [junit4]   2> 3479824 INFO  (zkConnectionManagerCallback-1605-thread-1) [    ] o.a.s.c.c.ConnectionManager zkClient has connected
   [junit4]   2> 3479825 INFO  (TEST-FullSolrCloudDistribCmdsTest.test-seed#[413848E06A1F333F]) [    ] o.a.s.c.c.ZkStateReader Updated live nodes from ZooKeeper... (0) -> (1)
   [junit4]   2> 3479825 INFO  (TEST-FullSolrCloudDistribCmdsTest.test-seed#[413848E06A1F333F]) [    ] o.a.s.c.s.i.ZkClientClusterStateProvider Cluster at 127.0.0.1:41758/solr ready
   [junit4]   2> 3479825 INFO  (TEST-FullSolrCloudDistribCmdsTest.test-seed#[413848E06A1F333F]) [    ] o.a.s.c.ChaosMonkey monkey: init - expire sessions:false cause connection loss:false
   [junit4]   2> 3479829 INFO  (qtp535968620-8517) [n:127.0.0.1:46887_    ] o.a.s.h.a.CollectionsHandler Invoked Collection Action :create with params replicationFactor=1&collection.configName=conf1&name=collection1&nrtReplicas=1&action=CREATE&numShards=3&createNodeSet=&stateFormat=2&wt=javabin&version=2 and sendToOCPQueue=true
   [junit4]   2> 3479911 INFO  (OverseerThreadFactory-3639-thread-2-processing-n:127.0.0.1:46887_) [n:127.0.0.1:46887_    ] o.a.s.c.a.c.CreateCollectionCmd Create collection collection1
   [junit4]   2> 3479912 WARN  (OverseerThreadFactory-3639-thread-2-processing-n:127.0.0.1:46887_) [n:127.0.0.1:46887_    ] o.a.s.c.a.c.CreateCollectionCmd It is unusual to create a collection (collection1) without cores.
   [junit4]   2> 3480049 INFO  (qtp535968620-8517) [n:127.0.0.1:46887_    ] o.a.s.h.a.CollectionsHandler Wait for new collection to be active for at most 30 seconds. Check all shard replicas
   [junit4]   2> 3480050 INFO  (qtp535968620-8517) [n:127.0.0.1:46887_    ] o.a.s.s.HttpSolrCall [admin] webapp=null path=/admin/collections params={replicationFactor=1&collection.configName=conf1&name=collection1&nrtReplicas=1&action=CREATE&numShards=3&createNodeSet=&stateFormat=2&wt=javabin&version=2} status=0 QTime=221
   [junit4]   2> 3480083 INFO  (OverseerCollectionConfigSetProcessor-99421740364398596-127.0.0.1:46887_-n_0000000000) [n:127.0.0.1:46887_    ] o.a.s.c.OverseerTaskQueue Response ZK path: /overseer/collection-queue-work/qnr-0000000002 doesn't exist.  Requestor may have disconnected from ZooKeeper
   [junit4]   2> 3480677 INFO  (TEST-FullSolrCloudDistribCmdsTest.test-seed#[413848E06A1F333F]) [    ] o.a.s.c.AbstractFullDistribZkTestBase create jetty 1 in directory /x1/jenkins/jenkins-slave/workspace/Lucene-Solr-NightlyTests-7.x/checkout/solr/build/solr-core/test/J0/temp/solr.cloud.FullSolrCloudDistribCmdsTest_413848E06A1F333F-001/shard-1-001 of type NRT
   [junit4]   2> 3480677 INFO  (TEST-FullSolrCloudDistribCmdsTest.test-seed#[413848E06A1F333F]) [    ] o.e.j.s.Server jetty-9.4.8.v20171121, build timestamp: 2017-11-21T23:27:37+02:00, git hash: 82b8fb23f757335bb3329d540ce37a2a2615f0a8
   [junit4]   2> 3480678 INFO  (TEST-FullSolrCloudDistribCmdsTest.test-seed#[413848E06A1F333F]) [    ] o.e.j.s.session DefaultSessionIdManager workerName=node0
   [junit4]   2> 3480678 INFO  (TEST-FullSolrCloudDistribCmdsTest.test-seed#[413848E06A1F333F]) [    ] o.e.j.s.session No SessionScavenger set, using defaults
   [junit4]   2> 3480678 INFO  (TEST-FullSolrCloudDistribCmdsTest.test-seed#[413848E06A1F333F]) [    ] o.e.j.s.session Scavenging every 660000ms
   [junit4]   2> 3480679 INFO  (TEST-FullSolrCloudDistribCmdsTest.test-seed#[413848E06A1F333F]) [    ] o.e.j.s.h.ContextHandler Started o.e.j.s.ServletContextHandler@1234c8a{/,null,AVAILABLE}
   [junit4]   2> 3480679 INFO  (TEST-FullSolrCloudDistribCmdsTest.test-seed#[413848E06A1F333F]) [    ] o.e.j.s.AbstractConnector Started ServerConnector@3b531add{HTTP/1.1,[http/1.1]}{127.0.0.1:51588}
   [junit4]   2> 3480679 INFO  (TEST-FullSolrCloudDistribCmdsTest.test-seed#[413848E06A1F333F]) [    ] o.e.j.s.Server Started @3504843ms
   [junit4]   2> 3480679 INFO  (TEST-FullSolrCloudDistribCmdsTest.test-seed#[413848E06A1F333F]) [    ] o.a.s.c.s.e.JettySolrRunner Jetty properties: {solr.data.dir=/x1/jenkins/jenkins-slave/workspace/Lucene-Solr-NightlyTests-7.x/checkout/solr/build/solr-core/test/J0/temp/solr.cloud.FullSolrCloudDistribCmdsTest_413848E06A1F333F-001/tempDir-001/jetty1, solrconfig=solrconfig.xml, hostContext=/, hostPort=51588, coreRootDirectory=/x1/jenkins/jenkins-slave/workspace/Lucene-Solr-NightlyTests-7.x/checkout/solr/build/solr-core/test/J0/../../../../../../../../../../../x1/jenkins/jenkins-slave/workspace/Lucene-Solr-NightlyTests-7.x/checkout/solr/build/solr-core/test/J0/temp/solr.cloud.FullSolrCloudDistribCmdsTest_413848E06A1F333F-001/shard-1-001/cores}
   [junit4]   2> 3480679 ERROR (TEST-FullSolrCloudDistribCmdsTest.test-seed#[413848E06A1F333F]) [    ] o.a.s.u.StartupLoggingUtils Missing Java Option solr.log.dir. Logging may be missing or incomplete.
   [junit4]   2> 3480680 INFO  (TEST-FullSolrCloudDistribCmdsTest.test-seed#[413848E06A1F333F]) [    ] o.a.s.s.SolrDispatchFilter  ___      _       Welcome to Apache Solr™ version 7.3.0
   [junit4]   2> 3480680 INFO  (TEST-FullSolrCloudDistribCmdsTest.test-seed#[413848E06A1F333F]) [    ] o.a.s.s.SolrDispatchFilter / __| ___| |_ _   Starting in cloud mode on port null
   [junit4]   2> 3480680 INFO  (TEST-FullSolrCloudDistribCmdsTest.test-seed#[413848E06A1F333F]) [    ] o.a.s.s.SolrDispatchFilter \__ \/ _ \ | '_|  Install dir: null
   [junit4]   2> 3480680 INFO  (TEST-FullSolrCloudDistribCmdsTest.test-seed#[413848E06A1F333F]) [    ] o.a.s.s.SolrDispatchFilter |___/\___/_|_|    Start time: 2018-01-27T12:16:15.148Z
   [junit4]   2> 3480681 INFO  (zkConnectionManagerCallback-1607-thread-1) [    ] o.a.s.c.c.ConnectionManager zkClient has connected
   [junit4]   2> 3480687 INFO  (TEST-FullSolrCloudDistribCmdsTest.test-seed#[413848E06A1F333F]) [    ] o.a.s.s.SolrDispatchFilter Loading solr.xml from SolrHome (not found in ZooKeeper)
   [junit4]   2> 3480687 INFO  (TEST-FullSolrCloudDistribCmdsTest.test-seed#[413848E06A1F333F]) [    ] o.a.s.c.SolrXmlConfig Loading container configuration from /x1/jenkins/jenkins-slave/workspace/Lucene-Solr-NightlyTests-7.x/checkout/solr/build/solr-core/test/J0/temp/solr.cloud.FullSolrCloudDistribCmdsTest_413848E06A1F333F-001/shard-1-001/solr.xml
   [junit4]   2> 3480694 INFO  (TEST-FullSolrCloudDistribCmdsTest.test-seed#[413848E06A1F333F]) [    ] o.a.s.c.SolrXmlConfig Configuration parameter autoReplicaFailoverWorkLoopDelay is ignored
   [junit4]   2> 3480694 INFO  (TEST-FullSolrCloudDistribCmdsTest.test-seed#[413848E06A1F333F]) [    ] o.a.s.c.SolrXmlConfig Configuration parameter autoReplicaFailoverBadNodeExpiration is ignored
   [junit4]   2> 3480695 INFO  (TEST-FullSolrCloudDistribCmdsTest.test-seed#[413848E06A1F333F]) [    ] o.a.s.c.SolrXmlConfig MBean server found: com.sun.jmx.mbeanserver.JmxMBeanServer@7f2c603, but no JMX reporters were configured - adding default JMX reporter.
   [junit4]   2> 3481172 INFO  (TEST-FullSolrCloudDistribCmdsTest.test-seed#[413848E06A1F333F]) [    ] o.a.s.c.ZkContainer Zookeeper client=127.0.0.1:41758/solr
   [junit4]   2> 3481174 INFO  (zkConnectionManagerCallback-1611-thread-1) [    ] o.a.s.c.c.ConnectionManager zkClient has connected
   [junit4]   2> 3481311 INFO  (zkConnectionManagerCallback-1613-thread-1-processing-n:127.0.0.1:51588_) [n:127.0.0.1:51588_    ] o.a.s.c.c.ConnectionManager zkClient has connected
   [junit4]   2> 3481357 INFO  (TEST-FullSolrCloudDistribCmdsTest.test-seed#[413848E06A1F333F]) [n:127.0.0.1:51588_    ] o.a.s.c.c.ZkStateReader Updated live nodes from ZooKeeper... (0) -> (1)
   [junit4]   2> 3481358 INFO  (TEST-FullSolrCloudDistribCmdsTest.test-seed#[413848E06A1F333F]) [n:127.0.0.1:51588_    ] o.a.s.c.Overseer Overseer (id=null) closing
   [junit4]   2> 3481380 INFO  (TEST-FullSolrCloudDistribCmdsTest.test-seed#[413848E06A1F333F]) [n:127.0.0.1:51588_    ] o.a.s.c.ZkController Register node as live in ZooKeeper:/live_nodes/127.0.0.1:51588_
   [junit4]   2> 3481424 INFO  (zkCallback-1594-thread-1-processing-n:127.0.0.1:46887_) [n:127.0.0.1:46887_    ] o.a.s.c.c.ZkStateReader Updated live nodes from ZooKeeper... (1) -> (2)
   [junit4]   2> 3481424 INFO  (zkCallback-1604-thread-1) [    ] o.a.s.c.c.ZkStateReader Updated live nodes from ZooKeeper... (1) -> (2)
   [junit4]   2> 3481491 INFO  (zkCallback-1612-thread-1-processing-n:127.0.0.1:51588_) [n:127.0.0.1:51588_    ] o.a.s.c.c.ZkStateReader Updated live nodes from ZooKeeper... (1) -> (2)
   [junit4]   2> 3482029 INFO  (TEST-FullSolrCloudDistribCmdsTest.test-seed#[413848E06A1F333F]) [n:127.0.0.1:51588_    ] o.a.s.m.r.SolrJmxReporter JMX monitoring for 'solr.node' (registry 'solr.node') enabled at server: com.sun.jmx.mbeanserver.JmxMBeanServer@7f2c603
   [junit4]   2> 3489627 WARN  (TEST-FullSolrCloudDistribCmdsTest.test-seed#[413848E06A1F333F]-SendThread(127.0.0.1:41758)) [    ] o.a.z.ClientCnxn Client session timed out, have not heard from server in 8203ms for sessionid 0x161378bcd5f0006
   [junit4]   2> 3489628 WARN  (NIOServerCxn.Factory:0.0.0.0/0.0.0.0:0) [    ] o.a.z.s.NIOServerCnxn caught end of stream exception
   [junit4]   2> EndOfStreamException: Unable to read additional data from client sessionid 0x161378bcd5f0006, likely client has closed socket
   [junit4]   2> 	at org.apache.zookeeper.server.NIOServerCnxn.doIO(NIOServerCnxn.java:239)
   [junit4]   2> 	at org.apache.zookeeper.server.NIOServerCnxnFactory.run(NIOServerCnxnFactory.java:203)
   [junit4]   2> 	at java.lang.Thread.run(Thread.java:748)
   [junit4]   2> 3489632 INFO  (TEST-FullSolrCloudDistribCmdsTest.test-seed#[413848E06A1F333F]) [n:127.0.0.1:51588_    ] o.a.s.m.r.SolrJmxReporter JMX monitoring for 'solr.jvm' (registry 'solr.jvm') enabled at server: com.sun.jmx.mbeanserver.JmxMBeanServer@7f2c603
   [junit4]   2> 3489633 INFO  (TEST-FullSolrCloudDistribCmdsTest.test-seed#[413848E06A1F333F]) [n:127.0.0.1:51588_    ] o.a.s.m.r.SolrJmxReporter JMX monitoring for 'solr.jetty' (registry 'solr.jetty') enabled at server: com.sun.jmx.mbeanserver.JmxMBeanServer@7f2c603
   [junit4]   2> 3489634 INFO  (TEST-FullSolrCloudDistribCmdsTest.test-seed#[413848E06A1F333F]) [n:127.0.0.1:51588_    ] o.a.s.c.CorePropertiesLocator Found 0 core definitions underneath /x1/jenkins/jenkins-slave/workspace/Lucene-Solr-NightlyTests-7.x/checkout/solr/build/solr-core/test/J0/../../../../../../../../../../../x1/jenkins/jenkins-slave/workspace/Lucene-Solr-NightlyTests-7.x/checkout/solr/build/solr-core/test/J0/temp/solr.cloud.FullSolrCloudDistribCmdsTest_413848E06A1F333F-001/shard-1-001/cores
   [junit4]   2> 3489833 WARN  (zkConnectionManagerCallback-1605-thread-1) [    ] o.a.s.c.c.ConnectionManager Watcher org.apache.solr.common.cloud.ConnectionManager@379a4442 name: ZooKeeperConnection Watcher:127.0.0.1:41758/solr got event WatchedEvent state:Disconnected type:None path:null path: null type: None
   [junit4]   2> 3489833 WARN  (zkConnectionManagerCallback-1605-thread-1) [    ] o.a.s.c.c.ConnectionManager zkClient has disconnected
   [junit4]   2> 3490067 INFO  (qtp535968620-8515) [n:127.0.0.1:46887_    ] o.a.s.h.a.CollectionsHandler Invoked Collection Action :addreplica with params node=127.0.0.1:51588_&action=ADDREPLICA&collection=collection1&shard=shard2&type=NRT&wt=javabin&version=2 and sendToOCPQueue=true
   [junit4]   2> 3490086 INFO  (OverseerThreadFactory-3639-thread-3-processing-n:127.0.0.1:46887_) [n:127.0.0.1:46887_    ] o.a.s.c.a.c.AddReplicaCmd Node Identified 127.0.0.1:51588_ for creating new replica
   [junit4]   2> 3490160 INFO  (qtp1947730586-8562) [n:127.0.0.1:51588_    ] o.a.s.h.a.CoreAdminOperation core create command qt=/admin/cores&collection.configName=conf1&name=collection1_shard2_replica_n61&action=CREATE&collection=collection1&shard=shard2&wt=javabin&version=2&replicaType=NRT
   [junit4]   2> 3490232 INFO  (qtp1947730586-8562) [n:127.0.0.1:51588_    ] o.a.s.c.TransientSolrCoreCacheDefault Allocating transient cache for 4 transient cores
   [junit4]   2> 3490410 INFO  (qtp1947730586-8562) [n:127.0.0.1:51588_ c:collection1 s:shard2  x:collection1_shard2_replica_n61] o.a.s.c.SolrConfig Using Lucene MatchVersion: 7.3.0
   [junit4]   2> 3490455 INFO  (qtp1947730586-8562) [n:127.0.0.1:51588_ c:collection1 s:shard2  x:collection1_shard2_replica_n61] o.a.s.s.IndexSchema [collection1_shard2_replica_n61] Schema name=test
   [junit4]   2> 3491390 INFO  (zkConnectionManagerCallback-1605-thread-1) [    ] o.a.s.c.c.ConnectionManager zkClient has connected
   [junit4]   2> 3491403 INFO  (qtp1947730586-8562) [n:127.0.0.1:51588_ c:collection1 s:shard2  x:collection1_shard2_replica_n61] o.a.s.s.IndexSchema Loaded schema test/1.6 with uniqueid field id
   [junit4]   2> 3491635 INFO  (qtp1947730586-8562) [n:127.0.0.1:51588_ c:collection1 s:shard2  x:collection1_shard2_replica_n61] o.a.s.c.CoreContainer Creating SolrCore 'collection1_shard2_replica_n61' using configuration from collection collection1, trusted=true
   [junit4]   2> 3491636 INFO  (qtp1947730586-8562) [n:127.0.0.1:51588_ c:collection1 s:shard2  x:collection1_shard2_replica_n61] o.a.s.m.r.SolrJmxReporter JMX monitoring for 'solr.core.collection1.shard2.replica_n61' (registry 'solr.core.collection1.shard2.replica_n61') enabled at server: com.sun.jmx.mbeanserver.JmxMBeanServer@7f2c603
   [junit4]   2> 3491636 INFO  (qtp1947730586-8562) [n:127.0.0.1:51588_ c:collection1 s:shard2  x:collection1_shard2_replica_n61] o.a.s.c.SolrCore solr.RecoveryStrategy.Builder
   [junit4]   2> 3491636 INFO  (qtp1947730586-8562) [n:127.0.0.1:51588_ c:collection1 s:shard2  x:collection1_shard2_replica_n61] o.a.s.c.SolrCore [[collection1_shard2_replica_n61] ] Opening new SolrCore at [/x1/jenkins/jenkins-slave/workspace/Lucene-Solr-NightlyTests-7.x/checkout/solr/build/solr-core/test/J0/temp/solr.cloud.FullSolrCloudDistribCmdsTest_413848E06A1F333F-001/shard-1-001/cores/collection1_shard2_replica_n61], dataDir=[/x1/jenkins/jenkins-slave/workspace/Lucene-Solr-NightlyTests-7.x/checkout/solr/build/solr-core/test/J0/../../../../../../../../../../../x1/jenkins/jenkins-slave/workspace/Lucene-Solr-NightlyTests-7.x/checkout/solr/build/solr-core/test/J0/temp/solr.cloud.FullSolrCloudDistribCmdsTest_413848E06A1F333F-001/shard-1-001/cores/collection1_shard2_replica_n61/data/]
   [junit4]   2> 3491723 INFO  (qtp1947730586-8562) [n:127.0.0.1:51588_ c:collection1 s:shard2  x:collection1_shard2_replica_n61] o.a.s.u.RandomMergePolicy RandomMergePolicy wrapping class org.apache.lucene.index.TieredMergePolicy: [TieredMergePolicy: maxMergeAtOnce=16, maxMergeAtOnceExplicit=46, maxMergedSegmentMB=33.517578125, floorSegmentMB=1.767578125, forceMergeDeletesPctAllowed=8.897027449585455, segmentsPerTier=27.0, maxCFSSegmentSizeMB=8.796093022207999E12, noCFSRatio=0.16469330023994982
   [junit4]   2> 3491741 WARN  (qtp1947730586-8562) [n:127.0.0.1:51588_ c:collection1 s:shard2  x:collection1_shard2_replica_n61] o.a.s.c.RequestHandlers INVALID paramSet a in requestHandler {type = requestHandler,name = /dump,class = DumpRequestHandler,attributes = {initParams=a, name=/dump, class=DumpRequestHandler},args = {defaults={a=A,b=B}}}
   [junit4]   2> 3492331 INFO  (qtp1947730586-8562) [n:127.0.0.1:51588_ c:collection1 s:shard2  x:collection1_shard2_replica_n61] o.a.s.u.UpdateHandler Using UpdateLog implementation: org.apache.solr.update.UpdateLog
   [junit4]   2> 3492331 INFO  (qtp1947730586-8562) [n:127.0.0.1:51588_ c:collection1 s:shard2  x:collection1_shard2_replica_n61] o.a.s.u.UpdateLog Initializing UpdateLog: dataDir= defaultSyncLevel=FLUSH numRecordsToKeep=100 maxNumLogsToKeep=10 numVersionBuckets=65536
   [junit4]   2> 3492332 INFO  (qtp1947730586-8562) [n:127.0.0.1:51588_ c:collection1 s:shard2  x:collection1_shard2_replica_n61] o.a.s.u.CommitTracker Hard AutoCommit: disabled
   [junit4]   2> 3492332 INFO  (qtp1947730586-8562) [n:127.0.0.1:51588_ c:collection1 s:shard2  x:collection1_shard2_replica_n61] o.a.s.u.CommitTracker Soft AutoCommit: disabled
   [junit4]   2> 3492343 INFO  (qtp1947730586-8562) [n:127.0.0.1:51588_ c:collection1 s:shard2  x:collection1_shard2_replica_n61] o.a.s.u.RandomMergePolicy RandomMergePolicy wrapping class org.apache.lucene.index.TieredMergePolicy: [TieredMergePolicy: maxMergeAtOnce=5, maxMergeAtOnceExplicit=2, maxMergedSegmentMB=37.9560546875, floorSegmentMB=1.7431640625, forceMergeDeletesPctAllowed=7.811238212231509, segmentsPerTier=13.0, maxCFSSegmentSizeMB=8.796093022207999E12, noCFSRatio=0.7931536316250646
   [junit4]   2> 3492351 INFO  (qtp1947730586-8562) [n:127.0.0.1:51588_ c:collection1 s:shard2  x:collection1_shard2_replica_n61] o.a.s.s.SolrIndexSearcher Opening [Searcher@7ea5a67f[collection1_shard2_replica_n61] main]
   [junit4]   2> 3492383 INFO  (qtp1947730586-8562) [n:127.0.0.1:51588_ c:collection1 s:shard2  x:collection1_shard2_replica_n61] o.a.s.r.ManagedResourceStorage Configured ZooKeeperStorageIO with znodeBase: /configs/conf1
   [junit4]   2> 3492384 INFO  (qtp1947730586-8562) [n:127.0.0.1:51588_ c:collection1 s:shard2  x:collection1_shard2_replica_n61] o.a.s.r.ManagedResourceStorage Loaded null at path _rest_managed.json using ZooKeeperStorageIO:path=/configs/conf1
   [junit4]   2> 3492385 INFO  (qtp1947730586-8562) [n:127.0.0.1:51588_ c:collection1 s:shard2  x:collection1_shard2_replica_n61] o.a.s.h.ReplicationHandler Commits will be reserved for 10000ms.
   [junit4]   2> 3492425 INFO  (searcherExecutor-3653-thread-1-processing-n:127.0.0.1:51588_ x:collection1_shard2_replica_n61 s:shard2 c:collection1) [n:127.0.0.1:51588_ c:collection1 s:shard2  x:collection1_shard2_replica_n61] o.a.s.c.SolrCore [collection1_shard2_replica_n61] Registered new searcher Searcher@7ea5a67f[collection1_shard2_replica_n61] main{ExitableDirectoryReader(UninvertingDirectoryReader())}
   [junit4]   2> 3492425 INFO  (qtp1947730586-8562) [n:127.0.0.1:51588_ c:collection1 s:shard2  x:collection1_shard2_replica_n61] o.a.s.u.UpdateLog Could not find max version in index or recent updates, using new clock 1590747869366714368
   [junit4]   2> 3492447 INFO  (qtp1947730586-8562) [n:127.0.0.1:51588_ c:collection1 s:shard2  x:collection1_shard2_replica_n61] o.a.s.c.ShardLeaderElectionContext Enough replicas found to continue.
   [junit4]   2> 3492447 INFO  (qtp1947730586-8562) [n:127.0.0.1:51588_ c:collection1 s:shard2  x:collection1_shard2_replica_n61] o.a.s.c.ShardLeaderElectionContext I may be the new leader - try and sync
   [junit4]   2> 3492447 INFO  (qtp1947730586-8562) [n:127.0.0.1:51588_ c:collection1 s:shard2  x:collection1_shard2_replica_n61] o.a.s.c.SyncStrategy Sync replicas to http://127.0.0.1:51588/collection1_shard2_replica_n61/
   [junit4]   2> 3492447 INFO  (qtp1947730586-8562) [n:127.0.0.1:51588_ c:collection1 s:shard2  x:collection1_shard2_replica_n61] o.a.s.c.SyncStrategy Sync Success - now sync replicas to me
   [junit4]   2> 3492447 INFO  (qtp1947730586-8562) [n:127.0.0.1:51588_ c:collection1 s:shard2  x:collection1_shard2_replica_n61] o.a.s.c.SyncStrategy http://127.0.0.1:51588/collection1_shard2_replica_n61/ has no replicas
   [junit4]   2> 3492447 INFO  (qtp1947730586-8562) [n:127.0.0.1:51588_ c:collection1 s:shard2  x:collection1_shard2_replica_n61] o.a.s.c.ShardLeaderElectionContext Found all replicas participating in election, clear LIR
   [junit4]   2> 3492452 INFO  (qtp1947730586-8562) [n:127.0.0.1:51588_ c:collection1 s:shard2  x:collection1_shard2_replica_n61] o.a.s.c.ShardLeaderElectionContext I am the new leader: http://127.0.0.1:51588/collection1_shard2_replica_n61/ shard2
   [junit4]   2> 3492452 INFO  (zkCallback-1612-thread-1-processing-n:127.0.0.1:51588_) [n:127.0.0.1:51588_    ] o.a.s.c.c.ZkStateReader A cluster state change: [WatchedEvent state:SyncConnected type:NodeDataChanged path:/collections/collection1/state.json] for collection [collection1] has occurred - updating... (live nodes size: [2])
   [junit4]   2> 3492454 INFO  (qtp1947730586-8562) [n:127.0.0.1:51588_ c:collection1 s:shard2  x:collection1_shard2_replica_n61] o.a.s.c.ZkController I am the leader, no recovery necessary
   [junit4]   2> 3492471 INFO  (qtp1947730586-8562) [n:127.0.0.1:51588_ c:collection1 s:shard2  x:collection1_shard2_replica_n61] o.a.s.s.HttpSolrCall [admin] webapp=null path=/admin/cores params={qt=/admin/cores&collection.configName=conf1&name=collection1_shard2_replica_n61&action=CREATE&collection=collection1&shard=shard2&wt=javabin&version=2&replicaType=NRT} status=0 QTime=2311
   [junit4]   2> 3492473 INFO  (qtp535968620-8515) [n:127.0.0.1:46887_    ] o.a.s.s.HttpSolrCall [admin] webapp=null path=/admin/collections params={node=127.0.0.1:51588_&action=ADDREPLICA&collection=collection1&shard=shard2&type=NRT&wt=javabin&version=2} status=0 QTime=2408
   [junit4]   2> 3492556 INFO  (zkCallback-1612-thread-1-processing-n:127.0.0.1:51588_) [n:127.0.0.1:51588_    ] o.a.s.c.c.ZkStateReader A cluster state change: [WatchedEvent state:SyncConnected type:NodeDataChanged path:/collections/collection1/state.json] for collection [collection1] has occurred - updating... (live nodes size: [2])
   [junit4]   2> 3493102 INFO  (TEST-FullSolrCloudDistribCmdsTest.test-seed#[413848E06A1F333F]) [    ] o.a.s.c.AbstractFullDistribZkTestBase create jetty 2 in directory /x1/jenkins/jenkins-slave/workspace/Lucene-Solr-NightlyTests-7.x/checkout/solr/build/solr-core/test/J0/temp/solr.cloud.FullSolrCloudDistribCmdsTest_413848E06A1F333F-001/shard-2-001 of type NRT
   [junit4]   2> 3493103 INFO  (TEST-FullSolrCloudDistribCmdsTest.test-seed#[413848E06A1F333F]) [    ] o.e.j.s.Server jetty-9.4.8.v20171121, build timestamp: 2017-11-21T23:27:37+02:00, git hash: 82b8fb23f757335bb3329d540ce37a2a2615f0a8
   [junit4]   2> 3493103 INFO  (TEST-FullSolrCloudDistribCmdsTest.test-seed#[413848E06A1F333F]) [    ] o.e.j.s.session DefaultSessionIdManager workerName=node0
   [junit4]   2> 3493104 INFO  (TEST-FullSolrCloudDistribCmdsTest.test-seed#[413848E06A1F333F]) [    ] o.e.j.s.session No SessionScavenger set, using defaults
   [junit4]   2> 3493104 INFO  (TEST-FullSolrCloudDistribCmdsTest.test-seed#[413848E06A1F333F]) [    ] o.e.j.s.session Scavenging every 660000ms
   [junit4]   2> 3493104 INFO  (TEST-FullSolrCloudDistribCmdsTest.test-seed#[413848E06A1F333F]) [    ] o.e.j.s.h.ContextHandler Started o.e.j.s.ServletContextHandler@58098819{/,null,AVAILABLE}
   [junit4]   2> 3493104 INFO  (TEST-FullSolrCloudDistribCmdsTest.test-seed#[413848E06A1F333F]) [    ] o.e.j.s.AbstractConnector Started ServerConnector@b58830d{HTTP/1.1,[http/1.1]}{127.0.0.1:35839}
   [junit4]   2> 3493104 INFO  (TEST-FullSolrCloudDistribCmdsTest.test-seed#[413848E06A1F333F]) [    ] o.e.j.s.Server Started @3517268ms
   [junit4]   2> 3493104 INFO  (TEST-FullSolrCloudDistribCmdsTest.test-seed#[413848E06A1F333F]) [    ] o.a.s.c.s.e.JettySolrRunner Jetty properties: {solr.data.dir=/x1/jenkins/jenkins-slave/workspace/Lucene-Solr-NightlyTests-7.x/checkout/solr/build/solr-core/test/J0/temp/solr.cloud.FullSolrCloudDistribCmdsTest_413848E06A1F333F-001/tempDir-001/jetty2, replicaType=NRT, solrconfig=solrconfig.xml, hostContext=/, hostPort=35839, coreRootDirectory=/x1/jenkins/jenkins-slave/workspace/Lucene-Solr-NightlyTests-7.x/checkout/solr/build/solr-core/test/J0/temp/solr.cloud.FullSolrCloudDistribCmdsTest_413848E06A1F333F-001/shard-2-001/cores}
   [junit4]   2> 3493105 ERROR (TEST-FullSolrCloudDistribCmdsTest.test-seed#[413848E06A1F333F]) [    ] o.a.s.u.StartupLoggingUtils Missing Java Option solr.log.dir. Logging may be missing or incomplete.
   [junit4]   2> 3493105 INFO  (TEST-FullSolrCloudDistribCmdsTest.test-seed#[413848E06A1F333F]) [    ] o.a.s.s.SolrDispatchFilter  ___      _       Welcome to Apache Solr™ version 7.3.0
   [junit4]   2> 3493105 INFO  (TEST-FullSolrCloudDistribCmdsTest.test-seed#[413848E06A1F333F]) [    ] o.a.s.s.SolrDispatchFilter / __| ___| |_ _   Starting in cloud mode on port null
   [junit4]   2> 3493105 INFO  (TEST-FullSolrCloudDistribCmdsTest.test-seed#[413848E06A1F333F]) [    ] o.a.s.s.SolrDispatchFilter \__ \/ _ \ | '_|  Install dir: null
   [junit4]   2> 3493105 INFO  (TEST-FullSolrCloudDistribCmdsTest.test-seed#[413848E06A1F333F]) [    ] o.a.s.s.SolrDispatchFilter |___/\___/_|_|    Start time: 2018-01-27T12:16:27.573Z
   [junit4]   2> 3493143 INFO  (zkConnectionManagerCallback-1617-thread-1) [    ] o.a.s.c.c.ConnectionManager zkClient has connected
   [junit4]   2> 3493163 INFO  (TEST-FullSolrCloudDistribCmdsTest.test-seed#[413848E06A1F333F]) [    ] o.a.s.s.SolrDispatchFilter Loading solr.xml from SolrHome (not found in ZooKeeper)
   [junit4]   2> 3493164 INFO  (TEST-FullSolrCloudDistribCmdsTest.test-seed#[413848E06A1F333F]) [    ] o.a.s.c.SolrXmlConfig Loading container configuration from /x1/jenkins/jenkins-slave/workspace/Lucene-Solr-NightlyTests-7.x/checkout/solr/build/solr-core/test/J0/temp/solr.cloud.FullSolrCloudDistribCmdsTest_413848E06A1F333F-001/shard-2-001/solr.xml
   [junit4]   2> 3493167 INFO  (TEST-FullSolrCloudDistribCmdsTest.test-seed#[413848E06A1F333F]) [    ] o.a.s.c.SolrXmlConfig Configuration parameter autoReplicaFailoverWorkLoopDelay is ignored
   [junit4]   2> 3493167 INFO  (TEST-FullSolrCloudDistribCmdsTest.test-seed#[413848E06A1F333F]) [    ] o.a.s.c.SolrXmlConfig Configuration parameter autoReplicaFailoverBadNodeExpiration is ignored
   [junit4]   2> 3493195 INFO  (TEST-FullSolrCloudDistribCmdsTest.test-seed#[413848E06A1F333F]) [    ] o.a.s.c.SolrXmlConfig MBean server found: com.sun.jmx.mbeanserver.JmxMBeanServer@7f2c603, but no JMX reporters were configured - adding default JMX reporter.
   [junit4]   2> 3493213 INFO  (TEST-FullSolrCloudDistribCmdsTest.test-seed#[413848E06A1F333F]) [    ] o.a.s.c.ZkContainer Zookeeper client=127.0.0.1:41758/solr
   [junit4]   2> 3493227 INFO  (zkConnectionManagerCallback-1621-thread-1) [    ] o.a.s.c.c.ConnectionManager zkClient has connected
   [junit4]   2> 3493331 INFO  (zkConnectionManagerCallback-1623-thread-1-processing-n:127.0.0.1:35839_) [n:127.0.0.1:35839_    ] o.a.s.c.c.ConnectionManager zkClient has connected
   [junit4]   2> 3493334 INFO  (TEST-FullSolrCloudDistribCmdsTest.test-seed#[413848E06A1F333F]) [n:127.0.0.1:35839_    ] o.a.s.c.c.ZkStateReader Updated live nodes from ZooKeeper... (0) -> (2)
   [junit4]   2> 3493335 INFO  (TEST-FullSolrCloudDistribCmdsTest.test-seed#[413848E06A1F333F]) [n:127.0.0.1:35839_    ] o.a.s.c.Overseer Overseer (id=null) closing
   [junit4]   2> 3493488 INFO  (TEST-FullSolrCloudDistribCmdsTest.test-seed#[413848E06A1F333F]) [n:127.0.0.1:35839_    ] o.a.s.c.ZkController Register node as live in ZooKeeper:/live_nodes/127.0.0.1:35839_
   [junit4]   2> 3493489 INFO  (zkCallback-1604-thread-4) [    ] o.a.s.c.c.ZkStateReader Updated live nodes from ZooKeeper... (2) -> (3)
   [junit4]   2> 3493489 INFO  (zkCallback-1612-thread-1-processing-n:127.0.0.1:51588_) [n:127.0.0.1:51588_    ] o.a.s.c.c.ZkStateReader Updated live nodes from ZooKeeper... (2) -> (3)
   [junit4]   2> 3493489 INFO  (zkCallback-1594-thread-1-processing-n:127.0.0.1:46887_) [n:127.0.0.1:46887_    ] o.a.s.c.c.ZkStateReader Updated live nodes from ZooKeeper... (2) -> (3)
   [junit4]   2> 3493581 INFO  (zkCallback-1622-thread-1-processing-n:127.0.0.1:35839_) [n:127.0.0.1:35839_    ] o.a.s.c.c.ZkStateReader Updated live nodes from ZooKeeper... (2) -> (3)
   [junit4]   2> 3494091 INFO  (OverseerCollectionConfigSetProcessor-99421740364398596-127.0.0.1:46887_-n_0000000000) [n:127.0.0.1:46887_    ] o.a.s.c.OverseerTaskQueue Response ZK path: /overseer/collection-queue-work/qnr-0000000004 doesn't exist.  Requestor may have disconnected from ZooKeeper
   [junit4]   2> 3495084 INFO  (TEST-FullSolrCloudDistribCmdsTest.test-seed#[413848E06A1F333F]) [n:127.0.0.1:35839_    ] o.a.s.m.r.SolrJmxReporter JMX monitoring for 'solr.node' (registry 'solr.node') enabled at server: com.sun.jmx.mbeanserver.JmxMBeanServer@7f2c603
   [junit4]   2> 3495185 INFO  (TEST-FullSolrCloudDistribCmdsTest.test-seed#[413848E06A1F333F]) [n:127.0.0.1:35839_    ] o.a.s.m.r.SolrJmxReporter JMX monitoring for 'solr.jvm' (registry 'solr.jvm') enabled at server: com.sun.jmx.mbeanserver.JmxMBeanServer@7f2c603
   [junit4]   2> 3495185 INFO  (TEST-FullSolrCloudDistribCmdsTest.test-seed#[413848E06A1F333F]) [n:127.0.0.1:35839_    ] o.a.s.m.r.SolrJmxReporter JMX monitoring for 'solr.jetty' (registry 'solr.jetty') enabled at server: com.sun.jmx.mbeanserver.JmxMBeanServer@7f2c603
   [junit4]   2> 3495187 INFO  (TEST-FullSolrCloudDistribCmdsTest.test-seed#[413848E06A1F333F]) [n:127.0.0.1:35839_    ] o.a.s.c.CorePropertiesLocator Found 0 core definitions underneath /x1/jenkins/jenkins-slave/workspace/Lucene-Solr-NightlyTests-7.x/checkout/solr/build/solr-core/test/J0/temp/solr.cloud.FullSolrCloudDistribCmdsTest_413848E06A1F333F-001/shard-2-001/cores
   [junit4]   2> 3495833 INFO  (qtp1224736313-8598) [n:127.0.0.1:35839_    ] o.a.s.h.a.CollectionsHandler Invoked Collection Action :addreplica with params node=127.0.0.1:35839_&action=ADDREPLICA&collection=collection1&shard=shard3&type=NRT&wt=javabin&version=2 and sendToOCPQueue=true
   [junit4]   2> 3495895 INFO  (OverseerThreadFactory-3639-thread-4-processing-n:127.0.0.1:46887_) [n:127.0.0.1:46887_    ] o.a.s.c.a.c.AddReplicaCmd Node Identified 127.0.0.1:35839_ for creating new replica
   [junit4]   2> 3495916 INFO  (qtp1224736313-8602) [n:127.0.0.1:35839_    ] o.a.s.h.a.CoreAdminOperation core create command qt=/admin/cores&collection.configName=conf1&name=collection1_shard3_replica_n63&action=CREATE&collection=collection1&shard=shard3&wt=javabin&version=2&replicaType=NRT
   [junit4]   2> 3495917 INFO  (qtp1224736313-8602) [n:127.0.0.1:35839_    ] o.a.s.c.TransientSolrCoreCacheDefault Allocating transient cache for 4 transient cores
   [junit4]   2> 3495940 INFO  (zkCallback-1612-thread-1-processing-n:127.0.0.1:51588_) [n:127.0.0.1:51588_    ] o.a.s.c.c.ZkStateReader A cluster state change: [WatchedEvent state:SyncConnected type:NodeDataChanged path:/collections/collection1/state.json] for collection [collection1] has occurred - updating... (live nodes size: [3])
   [junit4]   2> 3495952 INFO  (zkCallback-1622-thread-1-processing-n:127.0.0.1:35839_) [n:127.0.0.1:35839_    ] o.a.s.c.c.ZkStateReader A cluster state change: [WatchedEvent state:SyncConnected type:NodeDataChanged path:/collections/collection1/state.json] for collection [collection1] has occurred - updating... (live nodes size: [3])
   [junit4]   2> 3496974 INFO  (qtp1224736313-8602) [n:127.0.0.1:35839_ c:collection1 s:shard3  x:collection1_shard3_replica_n63] o.a.s.c.SolrConfig Using Lucene MatchVersion: 7.3.0
   [junit4]   2> 3497045 INFO  (qtp1224736313-8602) [n:127.0.0.1:35839_ c:collection1 s:shard3  x:collection1_shard3_replica_n63] o.a.s.s.IndexSchema [collection1_shard3_replica_n63] Schema name=test
   [junit4]   2> 3498182 INFO  (qtp1224736313-8602) [n:127.0.0.1:35839_ c:collection1 s:shard3  x:collection1_shard3_replica_n63] o.a.s.s.IndexSchema Loaded schema test/1.6 with uniqueid field id
   [junit4]   2> 3498342 INFO  (qtp1224736313-8602) [n:127.0.0.1:35839_ c:collection1 s:shard3  x:collection1_shard3_replica_n63] o.a.s.c.CoreContainer Creating SolrCore 'collection1_shard3_replica_n63' using configuration from collection collection1, trusted=true
   [junit4]   2> 3498343 INFO  (qtp1224736313-8602) [n:127.0.0.1:35839_ c:collection1 s:shard3  x:collection1_shard3_replica_n63] o.a.s.m.r.SolrJmxReporter JMX monitoring for 'solr.core.collection1.shard3.replica_n63' (registry 'solr.core.collection1.shard3.replica_n63') enabled at server: com.sun.jmx.mbeanserver.JmxMBeanServer@7f2c603
   [junit4]   2> 3498343 INFO  (qtp1224736313-8602) [n:127.0.0.1:35839_ c:collection1 s:shard3  x:collection1_shard3_replica_n63] o.a.s.c.SolrCore solr.RecoveryStrategy.Builder
   [junit4]   2> 3498343 INFO  (qtp1224736313-8602) [n:127.0.0.1:35839_ c:collection1 s:shard3  x:collection1_shard3_replica_n63] o.a.s.c.SolrCore [[collection1_shard3_replica_n63] ] Opening new SolrCore at [/x1/jenkins/jenkins-slave/workspace/Lucene-Solr-NightlyTests-7.x/checkout/solr/build/solr-core/test/J0/temp/solr.cloud.FullSolrCloudDistribCmdsTest_413848E06A1F333F-001/shard-2-001/cores/collection1_shard3_replica_n63], dataDir=[/x1/jenkins/jenkins-slave/workspace/Lucene-Solr-NightlyTests-7.x/checkout/solr/build/solr-core/test/J0/temp/solr.cloud.FullSolrCloudDistribCmdsTest_413848E06A1F333F-001/shard-2-001/cores/collection1_shard3_replica_n63/data/]
   [junit4]   2> 3498420 INFO  (qtp1224736313-8602) [n:127.0.0.1:35839_ c:collection1 s:shard3  x:collection1_shard3_replica_n63] o.a.s.u.RandomMergePolicy RandomMergePolicy wrapping class org.apache.lucene.index.TieredMergePolicy: [TieredMergePolicy: maxMergeAtOnce=16, maxMergeAtOnceExplicit=46, maxMergedSegmentMB=33.517578125, floorSegmentMB=1.767578125, forceMergeDeletesPctAllowed=8.897027449585455, segmentsPerTier=27.0, maxCFSSegmentSizeMB=8.796093022207999E12, noCFSRatio=0.16469330023994982
   [junit4]   2> 3498481 WARN  (qtp1224736313-8602) [n:127.0.0.1:35839_ c:collection1 s:shard3  x:collection1_shard3_replica_n63] o.a.s.c.RequestHandlers INVALID paramSet a in requestHandler {type = requestHandler,name = /dump,class = DumpRequestHandler,attributes = {initParams=a, name=/dump, class=DumpRequestHandler},args = {defaults={a=A,b=B}}}
   [junit4]   2> 3498872 INFO  (qtp1224736313-8602) [n:127.0.0.1:35839_ c:collection1 s:shard3  x:collection1_shard3_replica_n63] o.a.s.u.UpdateHandler Using UpdateLog implementation: org.apache.solr.update.UpdateLog
   [junit4]   2> 3498872 INFO  (qtp1224736313-8602) [n:127.0.0.1:35839_ c:collection1 s:shard3  x:collection1_shard3_replica_n63] o.a.s.u.UpdateLog Initializing UpdateLog: dataDir= defaultSyncLevel=FLUSH numRecordsToKeep=100 maxNumLogsToKeep=10 numVersionBuckets=65536
   [junit4]   2> 3498874 INFO  (qtp1224736313-8602) [n:127.0.0.1:35839_ c:collection1 s:shard3  x:collection1_shard3_replica_n63] o.a.s.u.CommitTracker Hard AutoCommit: disabled
   [junit4]   2> 3498874 INFO  (qtp1224736313-8602) [n:127.0.0.1:35839_ c:collection1 s:shard3  x:collection1_shard3_replica_n63] o.a.s.u.CommitTracker Soft AutoCommit: disabled
   [junit4]   2> 3498890 INFO  (qtp1224736313-8602) [n:127.0.0.1:35839_ c:collection1 s:shard3  x:collection1_shard3_replica_n63] o.a.s.u.RandomMergePolicy RandomMergePolicy wrapping class org.apache.lucene.index.TieredMergePolicy: [TieredMergePolicy: maxMergeAtOnce=5, maxMergeAtOnceExplicit=2, maxMergedSegmentMB=37.9560546875, floorSegmentMB=1.7431640625, forceMergeDeletesPctAllowed=7.811238212231509, segmentsPerTier=13.0, maxCFSSegmentSizeMB=8.796093022207999E12, noCFSRatio=0.7931536316250646
   [junit4]   2> 3498902 INFO  (qtp1224736313-8602) [n:127.0.0.1:35839_ c:collection1 s:shard3  x:collection1_shard3_replica_n63] o.a.s.s.SolrIndexSearcher Opening [Searcher@687baf7d[collection1_shard3_replica_n63] main]
   [junit4]   2> 3498903 INFO  (qtp1224736313-8602) [n:127.0.0.1:35839_ c:collection1 s:shard3  x:collection1_shard3_replica_n63] o.a.s.r.ManagedResourceStorage Configured ZooKeeperStorageIO with znodeBase: /configs/conf1
   [junit4]   2> 3498903 INFO  (qtp1224736313-8602) [n:127.0.0.1:35839_ c:collection1 s:shard3  x:collection1_shard3_replica_n63] o.a.s.r.ManagedResourceStorage Loaded null at path _rest_managed.json using ZooKeeperStorageIO:path=/configs/conf1
   [junit4]   2> 3498904 INFO  (qtp1224736313-8602) [n:127.0.0.1:35839_ c:collection1 s:shard3  x:collection1_shard3_replica_n63] o.a.s.h.ReplicationHandler Commits will be reserved for 10000ms.
   [junit4]   2> 3498905 INFO  (searcherExecutor-3664-thread-1-processing-n:127.0.0.1:35839_ x:collection1_shard3_replica_n63 s:shard3 c:collection1) [n:127.0.0.1:35839_ c:collection1 s:shard3  x:collection1_shard3_replica_n63] o.a.s.c.SolrCore [collection1_shard3_replica_n63] Registered new searcher Searcher@687baf7d[collection1_shard3_replica_n63] main{ExitableDirectoryReader(UninvertingDirectoryReader())}
   [junit4]   2> 3498905 INFO  (qtp1224736313-8602) [n:127.0.0.1:35839_ c:collection1 s:shard3  x:collection1_shard3_replica_n63] o.a.s.u.UpdateLog Could not find max version in index or recent updates, using new clock 1590747876161486848
   [junit4]   2> 3498935 INFO  (qtp1224736313-8602) [n:127.0.0.1:35839_ c:collection1 s:shard3  x:collection1_shard3_replica_n63] o.a.s.c.ShardLeaderElectionContext Enough replicas found to continue.
   [junit4]   2> 3498935 INFO  (qtp1224736313-8602) [n:127.0.0.1:35839_ c:collection1 s:shard3  x:collection1_shard3_replica_n63] o.a.s.c.ShardLeaderElectionContext I may be the new leader - try and sync
   [junit4]   2> 3498935 INFO  (qtp1224736313-8602) [n:127.0.0.1:35839_ c:collection1 s:shard3  x:collection1_shard3_replica_n63] o.a.s.c.SyncStrategy Sync replicas to http://127.0.0.1:35839/collection1_shard3_replica_n63/
   [junit4]   2> 3498935 INFO  (qtp1224736313-8602) [n:127.0.0.1:35839_ c:collection1 s:shard3  x:collection1_shard3_replica_n63] o.a.s.c.SyncStrategy Sync Success - now sync replicas to me
   [junit4]   2> 3498936 INFO  (qtp1224736313-8602) [n:127.0.0.1:35839_ c:collection1 s:shard3  x:collection1_shard3_replica_n63] o.a.s.c.SyncStrategy http://127.0.0.1:35839/collection1_shard3_replica_n63/ has no replicas
   [junit4]   2> 3498936 INFO  (qtp1224736313-8602) [n:127.0.0.1:35839_ c:collection1 s:shard3  x:collection1_shard3_replica_n63] o.a.s.c.ShardLeaderElectionContext Found all replicas participating in election, clear LIR
   [junit4]   2> 3498953 INFO  (qtp1224736313-8602) [n:127.0.0.1:35839_ c:collection1 s:shard3  x:collection1_shard3_replica_n63] o.a.s.c.ShardLeaderElectionContext I am the new leader: http://127.0.0.1:35839/collection1_shard3_replica_n63/ shard3
   [junit4]   2> 3498959 INFO  (zkCallback-1612-thread-1-processing-n:127.0.0.1:51588_) [n:127.0.0.1:51588_    ] o.a.s.c.c.ZkStateReader A cluster state change: [WatchedEvent state:SyncConnected type:NodeDataChanged path:/collections/collection1/state.json] for collection [collection1] has occurred - updating... (live nodes size: [3])
   [junit4]   2> 3498960 INFO  (zkCallback-1622-thread-1-processing-n:127.0.0.1:35839_) [n:127.0.0.1:35839_    ] o.a.s.c.c.ZkStateReader A cluster state change: [WatchedEvent state:SyncConnected type:NodeDataChanged path:/collections/collection1/state.json] for collection [collection1] has occurred - updating... (live nodes size: [3])
   [junit4]   2> 3498960 INFO  (qtp1224736313-8602) [n:127.0.0.1:35839_ c:collection1 s:shard3  x:collection1_shard3_replica_n63] o.a.s.c.ZkController I am the leader, no recovery necessary
   [junit4]   2> 3498971 INFO  (qtp1224736313-8602) [n:127.0.0.1:35839_ c:collection1 s:shard3  x:collection1_shard3_replica_n63] o.a.s.s.HttpSolrCall [admin] webapp=null path=/admin/cores params={qt=/admin/cores&collection.configName=conf1&name=collection1_shard3_replica_n63&action=CREATE&collection=collection1&shard=shard3&wt=javabin&version=2&replicaType=NRT} status=0 QTime=3055
   [junit4]   2> 3499087 INFO  (zkCallback-1612-thread-1-processing-n:127.0.0.1:51588_) [n:127.0.0.1:51588_    ] o.a.s.c.c.ZkStateReader A cluster state change: [WatchedEvent state:SyncConnected type:NodeDataChanged path:/collections/collection1/state.json] for collection [collection1] has occurred - updating... (live nodes size: [3])
   [junit4]   2> 3499088 INFO  (zkCallback-1622-thread-1-processing-n:127.0.0.1:35839_) [n:127.0.0.1:35839_    ] o.a.s.c.c.ZkStateReader A cluster state change: [WatchedEvent state:SyncConnected type:NodeDataChanged path:/collections/collection1/state.json] for collection [collection1] has occurred - updating... (live nodes size: [3])
   [junit4]   2> 3499089 INFO  (qtp1224736313-8598) [n:127.0.0.1:35839_    ] o.a.s.s.HttpSolrCall [admin] webapp=null path=/admin/collections params={node=127.0.0.1:35839_&action=ADDREPLICA&collection=collection1&shard=shard3&type=NRT&wt=javabin&version=2} status=0 QTime=3256
   [junit4]   2> 3499911 INFO  (OverseerCollectionConfigSetProcessor-99421740364398596-127.0.0.1:46887_-n_0000000000) [n:127.0.0.1:46887_    ] o.a.s.c.OverseerTaskQueue Response ZK path: /overseer/collection-queue-work/qnr-0000000006 doesn't exist.  Requestor may have disconnected from ZooKeeper
   [junit4]   2> 3500060 INFO  (TEST-FullSolrCloudDistribCmdsTest.test-seed#[413848E06A1F333F]) [    ] o.a.s.c.AbstractFullDistribZkTestBase create jetty 3 in directory /x1/jenkins/jenkins-slave/workspace/Lucene-Solr-NightlyTests-7.x/checkout/solr/build/solr-core/test/J0/temp/solr.cloud.FullSolrCloudDistribCmdsTest_413848E06A1F333F-001/shard-3-001 of type NRT
   [junit4]   2> 3500061 INFO  (TEST-FullSolrCloudDistribCmdsTest.test-seed#[413848E06A1F333F]) [    ] o.e.j.s.Server jetty-9.4.8.v20171121, build timestamp: 2017-11-21T23:27:37+02:00, git hash: 82b8fb23f757335bb3329d540ce37a2a2615f0a8
   [junit4]   2> 3500731 INFO  (TEST-FullSolrCloudDistribCmdsTest.test-seed#[413848E06A1F333F]) [    ] o.e.j.s.session DefaultSessionIdManager workerName=node0
   [junit4]   2> 3500731 INFO  (TEST-FullSolrCloudDistribCmdsTest.test-seed#[413848E06A1F333F]) [    ] o.e.j.s.session No SessionScavenger set, using defaults
   [junit4]   2> 3500731 INFO  (TEST-FullSolrCloudDistribCmdsTest.test-seed#[413848E06A1F333F]) [    ] o.e.j.s.session Scavenging every 600000ms
   [junit4]   2> 3500732 INFO  (TEST-FullSolrCloudDistribCmdsTest.test-seed#[413848E06A1F333F]) [    ] o.e.j.s.h.ContextHandler Started o.e.j.s.ServletContextHandler@367a696e{/,null,AVAILABLE}
   [junit4]   2> 3500732 INFO  (TEST-FullSolrCloudDistribCmdsTest.test-seed#[413848E06A1F333F]) [    ] o.e.j.s.AbstractConnector Started ServerConnector@4f033f1b{HTTP/1.1,[http/1.1]}{127.0.0.1:49643}
   [junit4]   2> 3500732 INFO  (TEST-FullSolrCloudDistribCmdsTest.test-seed#[413848E06A1F333F]) [    ] o.e.j.s.Server Started @3524896ms
   [junit4]   2> 3500732 INFO  (TEST-FullSolrCloudDistribCmdsTest.test-seed#[413848E06A1F333F]) [    ] o.a.s.c.s.e.JettySolrRunner Jetty properties: {solr.data.dir=/x1/jenkins/jenkins-slave/workspace/Lucene-Solr-NightlyTests-7.x/checkout/solr/build/solr-core/test/J0/temp/solr.cloud.FullSolrCloudDistribCmdsTest_413848E06A1F333F-001/tempDir-001/jetty3, replicaType=NRT, solrconfig=solrconfig.xml, hostContext=/, hostPort=49643, coreRootDirectory=/x1/jenkins/jenkins-slave/workspace/Lucene-Solr-NightlyTests-7.x/checkout/solr/build/solr-core/test/J0/temp/solr.cloud.FullSolrCloudDistribCmdsTest_413848E06A1F333F-001/shard-3-001/cores}
   [junit4]   2> 3500732 ERROR (TEST-FullSolrCloudDistribCmdsTest.test-seed#[413848E06A1F333F]) [    ] o.a.s.u.StartupLoggingUtils Missing Java Option solr.log.dir. Logging may be missing or incomplete.
   [junit4]   2> 3500836 INFO  (TEST-FullSolrCloudDistribCmdsTest.test-seed#[413848E06A1F333F]) [    ] o.a.s.s.SolrDispatchFilter  ___      _       Welcome to Apache Solr™ version 7.3.0
   [junit4]   2> 3500836 INFO  (TEST-FullSolrCloudDistribCmdsTest.test-seed#[413848E06A1F333F]) [    ] o.a.s.s.SolrDispatchFilter / __| ___| |_ _   Starting in cloud mode on port null
   [junit4]   2> 3500836 INFO  (TEST-FullSolrCloudDistribCmdsTest.test-seed#[413848E06A1F333F]) [    ] o.a.s.s.SolrDispatchFilter \__ \/ _ \ | '_|  Install dir: null
   [junit4]   2> 3500836 INFO  (TEST-FullSolrCloudDistribCmdsTest.test-seed#[413848E06A1F333F]) [    ] o.a.s.s.SolrDispatchFilter |___/\___/_|_|    Start time: 2018-01-27T12:16:35.304Z
   [junit4]   2> 3500977 INFO  (zkConnectionManagerCallback-1627-thread-1) [    ] o.a.s.c.c.ConnectionManager zkClient has connected
   [junit4]   2> 3500979 INFO  (TEST-FullSolrCloudDistribCmdsTest.test-seed#[413848E06A1F333F]) [    ] o.a.s.s.SolrDispatchFilter Loading solr.xml from SolrHome (not found in ZooKeeper)
   [junit4]   2> 3500979 INFO  (TEST-FullSolrCloudDistribCmdsTest.test-seed#[413848E06A1F333F]) [    ] o.a.s.c.SolrXmlConfig Loading container configuration from /x1/jenkins/jenkins-slave/workspace/Lucene-Solr-NightlyTests-7.x/checkout/solr/build/solr-core/test/J0/temp/solr.cloud.FullSolrCloudDistribCmdsTest_413848E06A1F333F-001/shard-3-001/solr.xml
   [junit4]   2> 3501143 INFO  (TEST-FullSolrCloudDistribCmdsTest.test-seed#[413848E06A1F333F]) [    ] o.a.s.c.SolrXmlConfig Configuration parameter autoReplicaFailoverWorkLoopDelay is ignored
   [junit4]   2> 3501143 INFO  (TEST-FullSolrCloudDistribCmdsTest.test-seed#[413848E06A1F333F]) [    ] o.a.s.c.SolrXmlConfig Configuration parameter autoReplicaFailoverBadNodeExpiration is ignored
   [junit4]   2> 3501144 INFO  (TEST-FullSolrCloudDistribCmdsTest.test-seed#[413848E06A1F333F]) [    ] o.a.s.c.SolrXmlConfig MBean server found: com.sun.jmx.mbeanserver.JmxMBeanServer@7f2c603, but no JMX reporters were configured - adding default JMX reporter.
   [junit4]   2> 3501157 INFO  (TEST-FullSolrCloudDistribCmdsTest.test-seed#[413848E06A1F333F]) [    ] o.a.s.c.ZkContainer Zookeeper client=127.0.0.1:41758/solr
   [junit4]   2> 3501215 INFO  (zkConnectionManagerCallback-1631-thread-1) [    ] o.a.s.c.c.ConnectionManager zkClient has connected
   [junit4]   2> 3501221 INFO  (zkConnectionManagerCallback-1633-thread-1-processing-n:127.0.0.1:49643_) [n:127.0.0.1:49643_    ] o.a.s.c.c.ConnectionManager zkClient has connected
   [junit4]   2> 3501244 INFO  (TEST-FullSolrCloudDistribCmdsTest.test-seed#[413848E06A1F333F]) [n:127.0.0.1:49643_    ] o.a.s.c.c.ZkStateReader Updated live nodes from ZooKeeper... (0) -> (3)
   [junit4]   2> 3501245 INFO  (TEST-FullSolrCloudDistribCmdsTest.test-seed#[413848E06A1F333F]) [n:127.0.0.1:49643_    ] o.a.s.c.Overseer Overseer (id=null) closing
   [junit4]   2> 3501246 INFO  (TEST-FullSolrCloudDistribCmdsTest.test-seed#[413848E06A1F333F]) [n:127.0.0.1:49643_    ] o.a.s.c.ZkController Register node as live in ZooKeeper:/live_nodes/127.0.0.1:49643_
   [junit4]   2> 3501247 INFO  (zkCallback-1612-thread-1-processing-n:127.0.0.1:51588_) [n:127.0.0.1:51588_    ] o.a.s.c.c.ZkStateReader Updated live nodes from ZooKeeper... (3) -> (4)
   [junit4]   2> 3501247 INFO  (zkCallback-1604-thread-4) [    ] o.a.s.c.c.ZkStateReader Updated live nodes from ZooKeeper... (3) -> (4)
   [junit4]   2> 3501247 INFO  (zkCallback-1622-thread-1-processing-n:127.0.0.1:35839_) [n:127.0.0.1:35839_    ] o.a.s.c.c.ZkStateReader Updated live nodes from ZooKeeper... (3) -> (4)
   [junit4]   2> 3501248 INFO  (zkCallback-1594-thread-2-processing-n:127.0.0.1:46887_) [n:127.0.0.1:46887_    ] o.a.s.c.c.ZkStateReader Updated live nodes from ZooKeeper... (3) -> (4)
   [junit4]   2> 3501999 INFO  (zkCallback-1632-thread-1-processing-n:127.0.0.1:49643_) [n:127.0.0.1:49643_    ] o.a.s.c.c.ZkStateReader Updated live nodes from ZooKeeper... (3) -> (4)
   [junit4]   2> 3502261 INFO  (TEST-FullSolrCloudDistribCmdsTest.test-seed#[413848E06A1F333F]) [n:127.0.0.1:49643_    ] o.a.s.m.r.SolrJmxReporter JMX monitoring for 'solr.node' (registry 'solr.node') enabled at server: com.sun.jmx.mbeanserver.JmxMBeanServer@7f2c603
   [junit4]   2> 3502303 INFO  (TEST-FullSolrCloudDistribCmdsTest.test-seed#[413848E06A1F333F]) [n:127.0.0.1:49643_    ] o.a.s.m.r.SolrJmxReporter JMX monitoring for 'solr.jvm' (registry 'solr.jvm') enabled at server: com.sun.jmx.mbeanserver.JmxMBeanServer@7f2c603
   [junit4]   2> 3502303 INFO  (TEST-FullSolrCloudDistribCmdsTest.test-seed#[413848E06A1F333F]) [n:127.0.0.1:49643_    ] o.a.s.m.r.SolrJmxReporter JMX monitoring for 'solr.jetty' (registry 'solr.jetty') enabled at server: com.sun.jmx.mbeanserver.JmxMBeanServer@7f2c603
   [junit4]   2> 3502386 INFO  (TEST-FullSolrCloudDistribCmdsTest.test-seed#[413848E06A1F333F]) [n:127.0.0.1:49643_    ] o.a.s.c.CorePropertiesLocator Found 0 core definitions underneath /x1/jenkins/jenkins-slave/workspace/Lucene-Solr-NightlyTests-7.x/checkout/solr/build/solr-core/test/J0/temp/solr.cloud.FullSolrCloudDistribCmdsTest_413848E06A1F333F-001/shard-3-001/cores
   [junit4]   2> 3502831 INFO  (qtp1224736313-8600) [n:127.0.0.1:35839_    ] o.a.s.h.a.CollectionsHandler Invoked Collection Action :addreplica with params node=127.0.0.1:49643_&action=ADDREPLICA&collection=collection1&shard=shard1&type=NRT&wt=javabin&version=2 and sendToOCPQueue=true
   [junit4]   2> 3502837 INFO  (OverseerThreadFactory-3639-thread-5-processing-n:127.0.0.1:46887_) [n:127.0.0.1:46887_    ] o.a.s.c.a.c.AddReplicaCmd Node Identified 127.0.0.1:49643_ for creating new replica
   [junit4]   2> 3502860 INFO  (qtp918081584-8629) [n:127.0.0.1:49643_    ] o.a.s.h.a.CoreAdminOperation core create command qt=/admin/cores&collection.configName=conf1&name=collection1_shard1_replica_n65&action=CREATE&collection=collection1&shard=shard1&wt=javabin&version=2&replicaType=NRT
   [junit4]   2> 3502890 INFO  (qtp918081584-8629) [n:127.0.0.1:49643_    ] o.a.s.c.TransientSolrCoreCacheDefault Allocating transient cache for 4 transient cores
   [junit4]   2> 3502924 INFO  (zkCallback-1612-thread-1-processing-n:127.0.0.1:51588_) [n:127.0.0.1:51588_    ] o.a.s.c.c.ZkStateReader A cluster state change: [WatchedEvent state:SyncConnected type:NodeDataChanged path:/collections/collection1/state.json] for collection [collection1] has occurred - updating... (live nodes size: [4])
   [junit4]   2> 3502931 INFO  (zkCallback-1622-thread-1-processing-n:127.0.0.1:35839_) [n:127.0.0.1:35839_    ] o.a.s.c.c.ZkStateReader A cluster state change: [WatchedEvent state:SyncConnected type:NodeDataChanged path:/collections/collection1/state.json] for collection [collection1] has occurred - updating... (live nodes size: [4])
   [junit4]   2> 3503618 INFO  (qtp918081584-8629) [n:127.0.0.1:49643_ c:collection1 s:shard1  x:collection1_shard1_replica_n65] o.a.s.c.SolrConfig Using Lucene MatchVersion: 7.3.0
   [junit4]   2> 3503850 INFO  (qtp918081584-8629) [n:127.0.0.1:49643_ c:collection1 s:shard1  x:collection1_shard1_replica_n65] o.a.s.s.IndexSchema [collection1_shard1_replica_n65] Schema name=test
   [junit4]   2> 3504619 INFO  (qtp918081584-8629) [n:127.0.0.1:49643_ c:collection1 s:shard1  x:collection1_shard1_replica_n65] o.a.s.s.IndexSchema Loaded schema test/1.6 with uniqueid field id
   [junit4]   2> 3505012 INFO  (qtp918081584-8629) [n:127.0.0.1:49643_ c:collection1 s:shard1  x:collection1_shard1_replica_n65] o.a.s.c.CoreContainer Creating SolrCore 'collection1_shard1_replica_n65' using configuration from collection collection1, trusted=true
   [junit4]   2> 3505013 INFO  (qtp918081584-8629) [n:127.0.0.1:49643_ c:collection1 s:shard1  x:collection1_shard1_replica_n65] o.a.s.m.r.SolrJmxReporter JMX monitoring for 'solr.core.collection1.shard1.replica_n65' (registry 'solr.core.collection1.shard1.replica_n65') enabled at server: com.sun.jmx.mbeanserver.JmxMBeanServer@7f2c603
   [junit4]   2> 3505013 INFO  (qtp918081584-8629) [n:127.0.0.1:49643_ c:collection1 s:shard1  x:collection1_shard1_replica_n65] o.a.s.c.SolrCore solr.RecoveryStrategy.Builder
   [junit4]   2> 3505013 INFO  (qtp918081584-8629) [n:127.0.0.1:49643_ c:collection1 s:shard1  x:collection1_shard1_replica_n65] o.a.s.c.SolrCore [[collection1_shard1_replica_n65] ] Opening new SolrCore at [/x1/jenkins/jenkins-slave/workspace/Lucene-Solr-NightlyTests-7.x/checkout/solr/build/solr-core/test/J0/temp/solr.cloud.FullSolrCloudDistribCmdsTest_413848E06A1F333F-001/shard-3-001/cores/collection1_shard1_replica_n65], dataDir=[/x1/jenkins/jenkins-slave/workspace/Lucene-Solr-NightlyTests-7.x/checkout/solr/build/solr-core/test/J0/temp/solr.cloud.FullSolrCloudDistribCmdsTest_413848E06A1F333F-001/shard-3-001/cores/collection1_shard1_replica_n65/data/]
   [junit4]   2> 3505023 INFO  (qtp918081584-8629) [n:127.0.0.1:49643_ c:collection1 s:shard1  x:collection1_shard1_replica_n65] o.a.s.u.RandomMergePolicy RandomMergePolicy wrapping class org.apache.lucene.index.TieredMergePolicy: [TieredMergePolicy: maxMergeAtOnce=16, maxMergeAtOnceExplicit=46, maxMergedSegmentMB=33.517578125, floorSegmentMB=1.767578125, forceMergeDeletesPctAllowed=8.897027449585455, segmentsPerTier=27.0, maxCFSSegmentSizeMB=8.796093022207999E12, noCFSRatio=0.16469330023994982
   [junit4]   2> 3505055 WARN  (qtp918081584-8629) [n:127.0.0.1:49643_ c:collection1 s:shard1  x:collection1_shard1_replica_n65] o.a.s.c.RequestHandlers INVALID paramSet a in requestHandler {type = requestHandler,name = /dump,class = DumpRequestHandler,attributes = {initParams=a, name=/dump, class=DumpRequestHandler},args = {defaults={a=A,b=B}}}
   [junit4]   2> 3505267 INFO  (qtp918081584-8629) [n:127.0.0.1:49643_ c:collection1 s:shard1  x:collection1_shard1_replica_n65] o.a.s.u.UpdateHandler Using UpdateLog implementation: org.apache.solr.update.UpdateLog
   [junit4]   2> 3505267 INFO  (qtp918081584-8629) [n:127.0.0.1:49643_ c:collection1 s:shard1  x:collection1_shard1_replica_n65] o.a.s.u.UpdateLog Initializing UpdateLog: dataDir= defaultSyncLevel=FLUSH numRecordsToKeep=100 maxNumLogsToKeep=10 numVersionBuckets=65536
   [junit4]   2> 3505268 INFO  (qtp918081584-8629) [n:127.0.0.1:49643_ c:collection1 s:shard1  x:collection1_shard1_replica_n65] o.a.s.u.CommitTracker Hard AutoCommit: disabled
   [junit4]   2> 3505268 INFO  (qtp918081584-8629) [n:127.0.0.1:49643_ c:collection1 s:shard1  x:collection1_shard1_replica_n65] o.a.s.u.CommitTracker Soft AutoCommit: disabled
   [junit4]   2> 3505279 INFO  (qtp918081584-8629) [n:127.0.0.1:49643_ c:collection1 s:shard1  x:collection1_shard1_replica_n65] o.a.s.u.RandomMergePolicy RandomMergePolicy wrapping class org.apache.lucene.index.TieredMergePolicy: [TieredMergePolicy: maxMergeAtOnce=5, maxMergeAtOnceExplicit=2, maxMergedSegmentMB=37.9560546875, floorSegmentMB=1.7431640625, forceMergeDeletesPctAllowed=7.811238212231509, segmentsPerTier=13.0, maxCFSSegmentSizeMB=8.796093022207999E12, noCFSRatio=0.7931536316250646
   [junit4]   2> 3505279 INFO  (qtp918081584-8629) [n:127.0.0.1:49643_ c:collection1 s:shard1  x:collection1_shard1_replica_n65] o.a.s.s.SolrIndexSearcher Opening [Searcher@437177d9[collection1_shard1_replica_n65] main]
   [junit4]   2> 3505311 INFO  (qtp918081584-8629) [n:127.0.0.1:49643_ c:collection1 s:shard1  x:collection1_shard1_replica_n65] o.a.s.r.ManagedResourceStorage Configured ZooKeeperStorageIO with znodeBase: /configs/conf1
   [junit4]   2> 3505311 INFO  (qtp918081584-8629) [n:127.0.0.1:49643_ c:collection1 s:shard1  x:collection1_shard1_replica_n65] o.a.s.r.ManagedResourceStorage Loaded null at path _rest_managed.json using ZooKeeperStorageIO:path=/configs/conf1
   [junit4]   2> 3505312 INFO  (qtp918081584-8629) [n:127.0.0.1:49643_ c:collection1 s:shard1  x:collection1_shard1_replica_n65] o.a.s.h.ReplicationHandler Commits will be reserved for 10000ms.
   [junit4]   2> 3505312 INFO  (qtp918081584-8629) [n:127.0.0.1:49643_ c:collection1 s:shard1  x:collection1_shard1_replica_n65] o.a.s.u.UpdateLog Could not find max version in index or recent updates, using new clock 1590747882879713280
   [junit4]   2> 3505315 INFO  (searcherExecutor-3675-thread-1-processing-n:127.0.0.1:49643_ x:collection1_shard1_replica_n65 s:shard1 c:collection1) [n:127.0.0.1:49643_ c:collection1 s:shard1  x:collection1_shard1_replica_n65] o.a.s.c.SolrCore [collection1_shard1_replica_n65] Registered new searcher Searcher@437177d9[collection1_shard1_replica_n65] main{ExitableDirectoryReader(UninvertingDirectoryReader())}
   [junit4]   2> 3505328 INFO  (qtp918081584-8629) [n:127.0.0.1:49643_ c:collection1 s:shard1  x:collection1_shard1_replica_n65] o.a.s.c.ShardLeaderElectionContext Enough replicas found to continue.
   [junit4]   2> 3505328 INFO  (qtp918081584-8629) [n:127.0.0.1:49643_ c:collection1 s:shard1  x:collection1_shard1_replica_n65] o.a.s.c.ShardLeaderElectionContext I may be the new leader - try and sync
   [junit4]   2> 3505328 INFO  (qtp918081584-8629) [n:127.0.0.1:49643_ c:collection1 s:shard1  x:collection1_shard1_replica_n65] o.a.s.c.SyncStrategy Sync replicas to http://127.0.0.1:49643/collection1_shard1_replica_n65/
   [junit4]   2> 3505328 INFO  (qtp918081584-8629) [n:127.0.0.1:49643_ c:collection1 s:shard1  x:collection1_shard1_replica_n65] o.a.s.c.SyncStrategy Sync Success - now sync replicas to me
   [junit4]   2> 3505328 INFO  (qtp918081584-8629) [n:127.0.0.1:49643_ c:collection1 s:shard1  x:collection1_shard1_replica_n65] o.a.s.c.SyncStrategy http://127.0.0.1:49643/collection1_shard1_replica_n65/ has no replicas
   [junit4]   2> 3505328 INFO  (qtp918081584-8629) [n:127.0.0.1:49643_ c:collection1 s:shard1  x:collection1_shard1_replica_n65] o.a.s.c.ShardLeaderElectionContext Found all replicas participating in election, clear LIR
   [junit4]   2> 3505339 INFO  (qtp918081584-8629) [n:127.0.0.1:49643_ c:collection1 s:shard1  x:collection1_shard1_replica_n65] o.a.s.c.ShardLeaderElectionContext I am the new leader: http://127.0.0.1:49643/collection1_shard1_replica_n65/ shard1
   [junit4]   2> 3505341 INFO  (zkCallback-1612-thread-1-processing-n:127.0.0.1:51588_) [n:127.0.0.1:51588_    ] o.a.s.c.c.ZkStateReader A cluster state change: [WatchedEvent state:SyncConnected type:NodeDataChanged path:/collections/collection1/state.json] for collection [collection1] has occurred - updating... (live nodes size: [4])
   [junit4]   2> 3505438 INFO  (zkCallback-1632-thread-1-processing-n:127.0.0.1:49643_) [n:127.0.0.1:49643_    ] o.a.s.c.c.ZkStateReader A cluster state change: [WatchedEvent state:SyncConnected type:NodeDataChanged path:/collections/collection1/state.json] for collection [collection1] has occurred - updating... (live nodes size: [4])
   [junit4]   2> 3505439 INFO  (zkCallback-1622-thread-1-processing-n:127.0.0.1:35839_) [n:127.0.0.1:35839_    ] o.a.s.c.c.ZkStateReader A cluster state change: [WatchedEvent state:SyncConnected type:NodeDataChanged path:/collections/collection1/state.json] for collection [collection1] has occurred - updating... (live nodes size: [4])
   [junit4]   2> 3505499 INFO  (qtp918081584-8629) [n:127.0.0.1:49643_ c:collection1 s:shard1  x:collection1_shard1_replica_n65] o.a.s.c.ZkController I am the leader, no recovery necessary
   [junit4]   2> 3505500 INFO  (qtp918081584-8629) [n:127.0.0.1:49643_ c:collection1 s:shard1  x:collection1_shard1_replica_n65] o.a.s.s.HttpSolrCall [admin] webapp=null path=/admin/cores params={qt=/admin/cores&collection.configName=conf1&name=collection1_shard1_replica_n65&action=CREATE&collection=collection1&shard=shard1&wt=javabin&version=2&replicaType=NRT} status=0 QTime=2640
   [junit4]   2> 3505532 INFO  (qtp1224736313-8600) [n:127.0.0.1:35839_    ] o.a.s.s.HttpSolrCall [admin] webapp=null path=/admin/collections params={node=127.0.0.1:49643_&action=ADDREPLICA&collection=collection1&shard=shard1&type=NRT&wt=javabin&version=2} status=0 QTime=2700
   [junit4]   2> 3505640 INFO  (zkCallback-1622-thread-1-processing-n:127.0.0.1:35839_) [n:127.0.0.1:35839_    ] o.a.s.c.c.ZkStateReader A cluster state change: [WatchedEvent state:SyncConnected type:NodeDataChanged path:/collections/collection1/state.json] for collection [collection1] has occurred - updating... (live nodes size: [4])
   [junit4]   2> 3505640 INFO  (zkCallback-1612-thread-1-processing-n:127.0.0.1:51588_) [n:127.0.0.1:51588_    ] o.a.s.c.c.ZkStateReader A cluster state change: [WatchedEvent state:SyncConnected type:NodeDataChanged path:/collections/collection1/state.json] for collection [collection1] has occurred - updating... (live nodes size: [4])
   [junit4]   2> 3505640 INFO  (zkCallback-1632-thread-1-processing-n:127.0.0.1:49643_) [n:127.0.0.1:49643_    ] o.a.s.c.c.ZkStateReader A cluster state change: [WatchedEvent state:SyncConnected type:NodeDataChanged path:/collections/collection1/state.json] for collection [collection1] has occurred - updating... (live nodes size: [4])
   [junit4]   2> 3506545 INFO  (TEST-FullSolrCloudDistribCmdsTest.test-seed#[413848E06A1F333F]) [    ] o.a.s.c.AbstractFullDistribZkTestBase create jetty 4 in directory /x1/jenkins/jenkins-slave/workspace/Lucene-Solr-NightlyTests-7.x/checkout/solr/build/solr-core/test/J0/temp/solr.cloud.FullSolrCloudDistribCmdsTest_413848E06A1F333F-001/shard-4-001 of type NRT
   [junit4]   2> 3506546 INFO  (TEST-FullSolrCloudDistribCmdsTest.test-seed#[413848E06A1F333F]) [    ] o.e.j.s.Server jetty-9.4.8.v20171121, build timestamp: 2017-11-21T23:27:37+02:00, git hash: 82b8fb23f757335bb3329d540ce37a2a2615f0a8
   [junit4]   2> 3506546 INFO  (TEST-FullSolrCloudDistribCmdsTest.test-seed#[413848E06A1F333F]) [    ] o.e.j.s.session DefaultSessionIdManager workerName=node0
   [junit4]   2> 3506547 INFO  (TEST-FullSolrCloudDistribCmdsTest.test-seed#[413848E06A1F333F]) [    ] o.e.j.s.session No SessionScavenger set, using defaults
   [junit4]   2> 3506547 INFO  (TEST-FullSolrCloudDistribCmdsTest.test-seed#[413848E06A1F333F]) [    ] o.e.j.s.session Scavenging every 600000ms
   [junit4]   2> 3506547 INFO  (TEST-FullSolrCloudDistribCmdsTest.test-seed#[413848E06A1F333F]) [    ] o.e.j.s.h.ContextHandler Started o.e.j.s.ServletContextHandler@63cfe4a2{/,null,AVAILABLE}
   [junit4]   2> 3506547 INFO  (TEST-FullSolrCloudDistribCmdsTest.test-seed#[413848E06A1F333F]) [    ] o.e.j.s.AbstractConnector Started ServerConnector@438e8687{HTTP/1.1,[http/1.1]}{127.0.0.1:53239}
   [junit4]   2> 3506547 INFO  (TEST-FullSolrCloudDistribCmdsTest.test-seed#[413848E06A1F333F]) [    ] o.e.j.s.Server Started @3530711ms
   [junit4]   2> 3506547 INFO  (TEST-FullSolrCloudDistribCmdsTest.test-seed#[413848E06A1F333F]) [    ] o.a.s.c.s.e.JettySolrRunner Jetty properties: {solr.data.dir=/x1/jenkins/jenkins-slave/workspace/Lucene-Solr-NightlyTests-7.x/checkout/solr/build/solr-core/test/J0/temp/solr.cloud.FullSolrCloudDistribCmdsTest_413848E06A1F333F-001/tempDir-001/jetty4, replicaType=NRT, solrconfig=solrconfig.xml, hostContext=/, hostPort=53239, coreRootDirectory=/x1/jenkins/jenkins-slave/workspace/Lucene-Solr-NightlyTests-7.x/checkout/solr/build/solr-core/test/J0/../../../../../../../../../../../x1/jenkins/jenkins-slave/workspace/Lucene-Solr-NightlyTests-7.x/checkout/solr/build/solr-core/test/J0/temp/solr.cloud.FullSolrCloudDistribCmdsTest_413848E06A1F333F-001/shard-4-001/cores}
   [junit4]   2> 3506548 ERROR (TEST-FullSolrCloudDistribCmdsTest.test-seed#[413848E06A1F333F]) [    ] o.a.s.u.StartupLoggingUtils Missing Java Option solr.log.dir. Logging may be missing or incomplete.
   [junit4]   2> 3506551 INFO  (TEST-FullSolrCloudDistribCmdsTest.test-seed#[413848E06A1F333F]) [    ] o.a.s.s.SolrDispatchFilter  ___      _       Welcome to Apache Solr™ version 7.3.0
   [junit4]   2> 3506551 INFO  (TEST-FullSolrCloudDistribCmdsTest.test-seed#[413848E06A1F333F]) [    ] o.a.s.s.SolrDispatchFilter / __| ___| |_ _   Starting in cloud mode on port null
   [junit4]   2> 3506551 INFO  (TEST-FullSolrCloudDistribCmdsTest.test-seed#[413848E06A1F333F]) [    ] o.a.s.s.SolrDispatchFilter \__ \/ _ \ | '_|  Install dir: null
   [junit4]   2> 3506551 INFO  (TEST-FullSolrCloudDistribCmdsTest.test-seed#[413848E06A1F333F]) [    ] o.a.s.s.SolrDispatchFilter |___/\___/_|_|    Start time: 2018-01-27T12:16:41.019Z
   [junit4]   2> 3506553 INFO  (zkConnectionManagerCallback-1637-thread-1) [    ] o.a.s.c.c.ConnectionManager zkClient has connected
   [junit4]   2> 3506554 INFO  (TEST-FullSolrCloudDistribCmdsTest.test-seed#[413848E06A1F333F]) [    ] o.a.s.s.SolrDispatchFilter Loading solr.xml from SolrHome (not found in ZooKeeper)
   [junit4]   2> 3506554 INFO  (TEST-FullSolrCloudDistribCmdsTest.test-seed#[413848E06A1F333F]) [    ] o.a.s.c.SolrXmlConfig Loading container configuration from /x1/jenkins/jenkins-slave/workspace/Lucene-Solr-NightlyTests-7.x/checkout/solr/build/solr-core/test/J0/temp/solr.cloud.FullSolrCloudDistribCmdsTest_413848E06A1F333F-001/shard-4-001/solr.xml
   [junit4]   2> 3506558 INFO  (TEST-FullSolrCloudDistribCmdsTest.test-seed#[413848E06A1F333F]) [    ] o.a.s.c.SolrXmlConfig Configuration parameter autoReplicaFailoverWorkLoopDelay is ignored
   [junit4]   2> 3506558 INFO  (TEST-FullSolrCloudDistribCmdsTest.test-seed#[413848E06A1F333F]) [    ] o.a.s.c.SolrXmlConfig Configuration parameter autoReplicaFailoverBadNodeExpiration is ignored
   [junit4]   2> 3506559 INFO  (TEST-FullSolrCloudDistribCmdsTest.test-seed#[413848E06A1F333F]) [    ] o.a.s.c.SolrXmlConfig MBean server found: com.sun.jmx.mbeanserver.JmxMBeanServer@7f2c603, but no JMX reporters were configured - adding default JMX reporter.
   [junit4]   2> 3506628 INFO  (TEST-FullSolrCloudDistribCmdsTest.test-seed#[413848E06A1F333F]) [    ] o.a.s.c.ZkContainer Zookeeper client=127.0.0.1:41758/solr
   [junit4]   2> 3506639 INFO  (zkConnectionManagerCallback-1641-thread-1) [    ] o.a.s.c.c.ConnectionManager zkClient has connected
   [junit4]   2> 3506644 INFO  (zkConnectionManagerCallback-1643-thread-1-processing-n:127.0.0.1:53239_) [n:127.0.0.1:53239_    ] o.a.s.c.c.ConnectionManager

[...truncated too long message...]

ightlyTests-7.x/checkout/solr/core/test-lib/apacheds-interceptors-exception-2.0.0-M15.jar:/x1/jenkins/jenkins-slave/workspace/Lucene-Solr-NightlyTests-7.x/checkout/solr/core/test-lib/apacheds-interceptors-journal-2.0.0-M15.jar:/x1/jenkins/jenkins-slave/workspace/Lucene-Solr-NightlyTests-7.x/checkout/solr/core/test-lib/apacheds-interceptors-normalization-2.0.0-M15.jar:/x1/jenkins/jenkins-slave/workspace/Lucene-Solr-NightlyTests-7.x/checkout/solr/core/test-lib/apacheds-interceptors-operational-2.0.0-M15.jar:/x1/jenkins/jenkins-slave/workspace/Lucene-Solr-NightlyTests-7.x/checkout/solr/core/test-lib/apacheds-interceptors-referral-2.0.0-M15.jar:/x1/jenkins/jenkins-slave/workspace/Lucene-Solr-NightlyTests-7.x/checkout/solr/core/test-lib/apacheds-interceptors-schema-2.0.0-M15.jar:/x1/jenkins/jenkins-slave/workspace/Lucene-Solr-NightlyTests-7.x/checkout/solr/core/test-lib/apacheds-interceptors-subtree-2.0.0-M15.jar:/x1/jenkins/jenkins-slave/workspace/Lucene-Solr-NightlyTests-7.x/checkout/solr/core/test-lib/apacheds-interceptors-trigger-2.0.0-M15.jar:/x1/jenkins/jenkins-slave/workspace/Lucene-Solr-NightlyTests-7.x/checkout/solr/core/test-lib/apacheds-jdbm-partition-2.0.0-M15.jar:/x1/jenkins/jenkins-slave/workspace/Lucene-Solr-NightlyTests-7.x/checkout/solr/core/test-lib/apacheds-jdbm1-2.0.0-M2.jar:/x1/jenkins/jenkins-slave/workspace/Lucene-Solr-NightlyTests-7.x/checkout/solr/core/test-lib/apacheds-kerberos-codec-2.0.0-M15.jar:/x1/jenkins/jenkins-slave/workspace/Lucene-Solr-NightlyTests-7.x/checkout/solr/core/test-lib/apacheds-ldif-partition-2.0.0-M15.jar:/x1/jenkins/jenkins-slave/workspace/Lucene-Solr-NightlyTests-7.x/checkout/solr/core/test-lib/apacheds-mavibot-partition-2.0.0-M15.jar:/x1/jenkins/jenkins-slave/workspace/Lucene-Solr-NightlyTests-7.x/checkout/solr/core/test-lib/apacheds-protocol-kerberos-2.0.0-M15.jar:/x1/jenkins/jenkins-slave/workspace/Lucene-Solr-NightlyTests-7.x/checkout/solr/core/test-lib/apacheds-protocol-ldap-2.0.0-M15.jar:/x1/jenkins/jenkins-slave/workspace/Lucene-Solr-NightlyTests-7.x/checkout/solr/core/test-lib/apacheds-protocol-shared-2.0.0-M15.jar:/x1/jenkins/jenkins-slave/workspace/Lucene-Solr-NightlyTests-7.x/checkout/solr/core/test-lib/apacheds-xdbm-partition-2.0.0-M15.jar:/x1/jenkins/jenkins-slave/workspace/Lucene-Solr-NightlyTests-7.x/checkout/solr/core/test-lib/api-all-1.0.0-M20.jar:/x1/jenkins/jenkins-slave/workspace/Lucene-Solr-NightlyTests-7.x/checkout/solr/core/test-lib/bcprov-jdk15on-1.54.jar:/x1/jenkins/jenkins-slave/workspace/Lucene-Solr-NightlyTests-7.x/checkout/solr/core/test-lib/byte-buddy-1.6.2.jar:/x1/jenkins/jenkins-slave/workspace/Lucene-Solr-NightlyTests-7.x/checkout/solr/core/test-lib/commons-collections-3.2.2.jar:/x1/jenkins/jenkins-slave/workspace/Lucene-Solr-NightlyTests-7.x/checkout/solr/core/test-lib/commons-math3-3.6.1.jar:/x1/jenkins/jenkins-slave/workspace/Lucene-Solr-NightlyTests-7.x/checkout/solr/core/test-lib/ehcache-core-2.4.4.jar:/x1/jenkins/jenkins-slave/workspace/Lucene-Solr-NightlyTests-7.x/checkout/solr/core/test-lib/hadoop-common-2.7.4-tests.jar:/x1/jenkins/jenkins-slave/workspace/Lucene-Solr-NightlyTests-7.x/checkout/solr/core/test-lib/hadoop-hdfs-2.7.4-tests.jar:/x1/jenkins/jenkins-slave/workspace/Lucene-Solr-NightlyTests-7.x/checkout/solr/core/test-lib/hadoop-minikdc-2.7.4.jar:/x1/jenkins/jenkins-slave/workspace/Lucene-Solr-NightlyTests-7.x/checkout/solr/core/test-lib/htrace-core-3.2.0-incubating.jar:/x1/jenkins/jenkins-slave/workspace/Lucene-Solr-NightlyTests-7.x/checkout/solr/core/test-lib/jersey-core-1.9.jar:/x1/jenkins/jenkins-slave/workspace/Lucene-Solr-NightlyTests-7.x/checkout/solr/core/test-lib/jersey-server-1.9.jar:/x1/jenkins/jenkins-slave/workspace/Lucene-Solr-NightlyTests-7.x/checkout/solr/core/test-lib/jetty-6.1.26.jar:/x1/jenkins/jenkins-slave/workspace/Lucene-Solr-NightlyTests-7.x/checkout/solr/core/test-lib/jetty-sslengine-6.1.26.jar:/x1/jenkins/jenkins-slave/workspace/Lucene-Solr-NightlyTests-7.x/checkout/solr/core/test-lib/jetty-util-6.1.26.jar:/x1/jenkins/jenkins-slave/workspace/Lucene-Solr-NightlyTests-7.x/checkout/solr/core/test-lib/mina-core-2.0.0-M5.jar:/x1/jenkins/jenkins-slave/workspace/Lucene-Solr-NightlyTests-7.x/checkout/solr/core/test-lib/mockito-core-2.6.2.jar:/x1/jenkins/jenkins-slave/workspace/Lucene-Solr-NightlyTests-7.x/checkout/solr/core/test-lib/netty-all-4.0.36.Final.jar:/x1/jenkins/jenkins-slave/workspace/Lucene-Solr-NightlyTests-7.x/checkout/solr/core/test-lib/objenesis-2.5.jar:/x1/jenkins/jenkins-slave/workspace/Lucene-Solr-NightlyTests-7.x/checkout/lucene/build/analysis/icu/lucene-analyzers-icu-7.3.0-SNAPSHOT.jar:/x1/jenkins/jenkins-slave/workspace/Lucene-Solr-NightlyTests-7.x/checkout/solr/build/contrib/solr-analysis-extras/classes/java:/x1/jenkins/jenkins-slave/workspace/Lucene-Solr-NightlyTests-7.x/checkout/lucene/build/queryparser/classes/test:/x1/jenkins/jenkins-slave/workspace/Lucene-Solr-NightlyTests-7.x/checkout/lucene/build/backward-codecs/classes/test:/x1/jenkins/jenkins-slave/workspace/Lucene-Solr-NightlyTests-7.x/checkout/solr/contrib/analysis-extras/lib/icu4j-60.2.jar:/home/jenkins/tools/ant/apache-ant-1.8.4/lib/ant-launcher.jar:/x1/jenkins/.ant/lib/ivy-2.4.0.jar:/home/jenkins/tools/ant/apache-ant-1.8.4/lib/ant-junit.jar:/home/jenkins/tools/ant/apache-ant-1.8.4/lib/ant-apache-log4j.jar:/home/jenkins/tools/ant/apache-ant-1.8.4/lib/ant-junit4.jar:/home/jenkins/tools/ant/apache-ant-1.8.4/lib/ant-jai.jar:/home/jenkins/tools/ant/apache-ant-1.8.4/lib/ant-javamail.jar:/home/jenkins/tools/ant/apache-ant-1.8.4/lib/ant-apache-bsf.jar:/home/jenkins/tools/ant/apache-ant-1.8.4/lib/ant-commons-net.jar:/home/jenkins/tools/ant/apache-ant-1.8.4/lib/ant-antlr.jar:/home/jenkins/tools/ant/apache-ant-1.8.4/lib/ant-jsch.jar:/home/jenkins/tools/ant/apache-ant-1.8.4/lib/ant-apache-oro.jar:/home/jenkins/tools/ant/apache-ant-1.8.4/lib/ant-commons-logging.jar:/home/jenkins/tools/ant/apache-ant-1.8.4/lib/ant.jar:/home/jenkins/tools/ant/apache-ant-1.8.4/lib/ant-netrexx.jar:/home/jenkins/tools/ant/apache-ant-1.8.4/lib/ant-testutil.jar:/home/jenkins/tools/ant/apache-ant-1.8.4/lib/ant-jdepend.jar:/home/jenkins/tools/ant/apache-ant-1.8.4/lib/ant-apache-bcel.jar:/home/jenkins/tools/ant/apache-ant-1.8.4/lib/ant-apache-xalan2.jar:/home/jenkins/tools/ant/apache-ant-1.8.4/lib/ant-apache-resolver.jar:/home/jenkins/tools/ant/apache-ant-1.8.4/lib/ant-jmf.jar:/home/jenkins/tools/ant/apache-ant-1.8.4/lib/ant-apache-regexp.jar:/home/jenkins/tools/ant/apache-ant-1.8.4/lib/ant-swing.jar:/usr/local/asfpackages/java/jdk1.8.0_144/lib/tools.jar:/x1/jenkins/.ivy2/cache/com.carrotsearch.randomizedtesting/junit4-ant/jars/junit4-ant-2.5.3.jar com.carrotsearch.ant.tasks.junit4.slave.SlaveMainSafe -eventsfile /x1/jenkins/jenkins-slave/workspace/Lucene-Solr-NightlyTests-7.x/checkout/solr/build/solr-core/test/temp/junit4-J2-20180127_111750_0407261422035694181531.events @/x1/jenkins/jenkins-slave/workspace/Lucene-Solr-NightlyTests-7.x/checkout/solr/build/solr-core/test/temp/junit4-J2-20180127_111750_040649427971287641024.suites -stdin
   [junit4] ERROR: JVM J2 ended with an exception: Forked process returned with error code: 1. Very likely a JVM crash.  See process stdout at: /x1/jenkins/jenkins-slave/workspace/Lucene-Solr-NightlyTests-7.x/checkout/solr/build/solr-core/test/temp/junit4-J2-20180127_111750_0402217687271029544061.sysout See process stderr at: /x1/jenkins/jenkins-slave/workspace/Lucene-Solr-NightlyTests-7.x/checkout/solr/build/solr-core/test/temp/junit4-J2-20180127_111750_040437854281876322359.syserr
   [junit4] 	at com.carrotsearch.ant.tasks.junit4.JUnit4.executeSlave(JUnit4.java:1519)
   [junit4] 	at com.carrotsearch.ant.tasks.junit4.JUnit4.access$000(JUnit4.java:126)
   [junit4] 	at com.carrotsearch.ant.tasks.junit4.JUnit4$2.call(JUnit4.java:982)
   [junit4] 	at com.carrotsearch.ant.tasks.junit4.JUnit4$2.call(JUnit4.java:979)
   [junit4] 	at java.util.concurrent.FutureTask.run(FutureTask.java:266)
   [junit4] 	at java.util.concurrent.ThreadPoolExecutor.runWorker(ThreadPoolExecutor.java:1149)
   [junit4] 	at java.util.concurrent.ThreadPoolExecutor$Worker.run(ThreadPoolExecutor.java:624)
   [junit4] 	at java.lang.Thread.run(Thread.java:748)

BUILD FAILED
/x1/jenkins/jenkins-slave/workspace/Lucene-Solr-NightlyTests-7.x/checkout/build.xml:844: The following error occurred while executing this line:
/x1/jenkins/jenkins-slave/workspace/Lucene-Solr-NightlyTests-7.x/checkout/build.xml:780: The following error occurred while executing this line:
/x1/jenkins/jenkins-slave/workspace/Lucene-Solr-NightlyTests-7.x/checkout/build.xml:59: The following error occurred while executing this line:
/x1/jenkins/jenkins-slave/workspace/Lucene-Solr-NightlyTests-7.x/checkout/solr/build.xml:262: The following error occurred while executing this line:
/x1/jenkins/jenkins-slave/workspace/Lucene-Solr-NightlyTests-7.x/checkout/solr/common-build.xml:556: The following error occurred while executing this line:
/x1/jenkins/jenkins-slave/workspace/Lucene-Solr-NightlyTests-7.x/checkout/lucene/common-build.xml:1513: The following error occurred while executing this line:
/x1/jenkins/jenkins-slave/workspace/Lucene-Solr-NightlyTests-7.x/checkout/lucene/common-build.xml:1038: At least one slave process threw an exception, first: Forked process returned with error code: 1. Very likely a JVM crash.  See process stdout at: /x1/jenkins/jenkins-slave/workspace/Lucene-Solr-NightlyTests-7.x/checkout/solr/build/solr-core/test/temp/junit4-J0-20180127_111750_0394542072230644756303.sysout See process stderr at: /x1/jenkins/jenkins-slave/workspace/Lucene-Solr-NightlyTests-7.x/checkout/solr/build/solr-core/test/temp/junit4-J0-20180127_111750_0398222997951544076924.syserr

Total time: 705 minutes 57 seconds
Build step 'Invoke Ant' marked build as failure
Archiving artifacts
[Fast Archiver] No artifacts from Lucene-Solr-NightlyTests-7.x #131 to compare, so performing full copy of artifacts
Recording test results
Email was triggered for: Failure - Any
Sending email for trigger: Failure - Any

Mime
View raw message