lucene-dev mailing list archives

Site index · List index
Message view « Date » · « Thread »
Top « Date » · « Thread »
From Policeman Jenkins Server <jenk...@thetaphi.de>
Subject [JENKINS] Lucene-Solr-master-Linux (32bit/jdk1.8.0_144) - Build # 21249 - Failure!
Date Tue, 09 Jan 2018 18:56:13 GMT
Build: https://jenkins.thetaphi.de/job/Lucene-Solr-master-Linux/21249/
Java: 32bit/jdk1.8.0_144 -client -XX:+UseG1GC

1 tests failed.
FAILED:  org.apache.solr.client.solrj.embedded.TestEmbeddedSolrServerSchemaAPI.testSchemaAddFieldAndFailOnImmutable

Error Message:
error processing commands

Stack Trace:
org.apache.solr.api.ApiBag$ExceptionWithErrObject: error processing commands, errors: [{errorMessages=schema is not editable}], 
	at __randomizedtesting.SeedInfo.seed([5681ECCDE8309A75:CD35031CB5A6F064]:0)
	at org.apache.solr.handler.SchemaHandler.handleRequestBody(SchemaHandler.java:92)
	at org.apache.solr.handler.RequestHandlerBase.handleRequest(RequestHandlerBase.java:177)
	at org.apache.solr.core.SolrCore.execute(SolrCore.java:2503)
	at org.apache.solr.client.solrj.embedded.EmbeddedSolrServer.request(EmbeddedSolrServer.java:180)
	at org.apache.solr.client.solrj.SolrRequest.process(SolrRequest.java:194)
	at org.apache.solr.client.solrj.SolrRequest.process(SolrRequest.java:211)
	at org.apache.solr.client.solrj.embedded.TestEmbeddedSolrServerSchemaAPI.testSchemaAddFieldAndFailOnImmutable(TestEmbeddedSolrServerSchemaAPI.java:105)
	at sun.reflect.NativeMethodAccessorImpl.invoke0(Native Method)
	at sun.reflect.NativeMethodAccessorImpl.invoke(NativeMethodAccessorImpl.java:62)
	at sun.reflect.DelegatingMethodAccessorImpl.invoke(DelegatingMethodAccessorImpl.java:43)
	at java.lang.reflect.Method.invoke(Method.java:498)
	at com.carrotsearch.randomizedtesting.RandomizedRunner.invoke(RandomizedRunner.java:1737)
	at com.carrotsearch.randomizedtesting.RandomizedRunner$8.evaluate(RandomizedRunner.java:934)
	at com.carrotsearch.randomizedtesting.RandomizedRunner$9.evaluate(RandomizedRunner.java:970)
	at com.carrotsearch.randomizedtesting.RandomizedRunner$10.evaluate(RandomizedRunner.java:984)
	at com.carrotsearch.randomizedtesting.rules.SystemPropertiesRestoreRule$1.evaluate(SystemPropertiesRestoreRule.java:57)
	at org.apache.lucene.util.TestRuleSetupTeardownChained$1.evaluate(TestRuleSetupTeardownChained.java:49)
	at org.apache.lucene.util.AbstractBeforeAfterRule$1.evaluate(AbstractBeforeAfterRule.java:45)
	at org.apache.lucene.util.TestRuleThreadAndTestName$1.evaluate(TestRuleThreadAndTestName.java:48)
	at org.apache.lucene.util.TestRuleIgnoreAfterMaxFailures$1.evaluate(TestRuleIgnoreAfterMaxFailures.java:64)
	at org.apache.lucene.util.TestRuleMarkFailure$1.evaluate(TestRuleMarkFailure.java:47)
	at com.carrotsearch.randomizedtesting.rules.StatementAdapter.evaluate(StatementAdapter.java:36)
	at com.carrotsearch.randomizedtesting.ThreadLeakControl$StatementRunner.run(ThreadLeakControl.java:368)
	at com.carrotsearch.randomizedtesting.ThreadLeakControl.forkTimeoutingTask(ThreadLeakControl.java:817)
	at com.carrotsearch.randomizedtesting.ThreadLeakControl$3.evaluate(ThreadLeakControl.java:468)
	at com.carrotsearch.randomizedtesting.RandomizedRunner.runSingleTest(RandomizedRunner.java:943)
	at com.carrotsearch.randomizedtesting.RandomizedRunner$5.evaluate(RandomizedRunner.java:829)
	at com.carrotsearch.randomizedtesting.RandomizedRunner$6.evaluate(RandomizedRunner.java:879)
	at com.carrotsearch.randomizedtesting.RandomizedRunner$7.evaluate(RandomizedRunner.java:890)
	at com.carrotsearch.randomizedtesting.rules.StatementAdapter.evaluate(StatementAdapter.java:36)
	at com.carrotsearch.randomizedtesting.rules.SystemPropertiesRestoreRule$1.evaluate(SystemPropertiesRestoreRule.java:57)
	at org.apache.lucene.util.AbstractBeforeAfterRule$1.evaluate(AbstractBeforeAfterRule.java:45)
	at com.carrotsearch.randomizedtesting.rules.StatementAdapter.evaluate(StatementAdapter.java:36)
	at org.apache.lucene.util.TestRuleStoreClassName$1.evaluate(TestRuleStoreClassName.java:41)
	at com.carrotsearch.randomizedtesting.rules.NoShadowingOrOverridesOnMethodsRule$1.evaluate(NoShadowingOrOverridesOnMethodsRule.java:40)
	at com.carrotsearch.randomizedtesting.rules.NoShadowingOrOverridesOnMethodsRule$1.evaluate(NoShadowingOrOverridesOnMethodsRule.java:40)
	at com.carrotsearch.randomizedtesting.rules.StatementAdapter.evaluate(StatementAdapter.java:36)
	at com.carrotsearch.randomizedtesting.rules.StatementAdapter.evaluate(StatementAdapter.java:36)
	at com.carrotsearch.randomizedtesting.rules.StatementAdapter.evaluate(StatementAdapter.java:36)
	at org.apache.lucene.util.TestRuleAssertionsRequired$1.evaluate(TestRuleAssertionsRequired.java:53)
	at org.apache.lucene.util.TestRuleMarkFailure$1.evaluate(TestRuleMarkFailure.java:47)
	at org.apache.lucene.util.TestRuleIgnoreAfterMaxFailures$1.evaluate(TestRuleIgnoreAfterMaxFailures.java:64)
	at org.apache.lucene.util.TestRuleIgnoreTestSuites$1.evaluate(TestRuleIgnoreTestSuites.java:54)
	at com.carrotsearch.randomizedtesting.rules.StatementAdapter.evaluate(StatementAdapter.java:36)
	at com.carrotsearch.randomizedtesting.ThreadLeakControl$StatementRunner.run(ThreadLeakControl.java:368)
	at java.lang.Thread.run(Thread.java:748)




Build Log:
[...truncated 13392 lines...]
   [junit4] Suite: org.apache.solr.client.solrj.embedded.TestEmbeddedSolrServerSchemaAPI
   [junit4]   2> Creating dataDir: /home/jenkins/workspace/Lucene-Solr-master-Linux/solr/build/solr-core/test/J0/temp/solr.client.solrj.embedded.TestEmbeddedSolrServerSchemaAPI_5681ECCDE8309A75-001/init-core-data-001
   [junit4]   2> 1873329 WARN  (SUITE-TestEmbeddedSolrServerSchemaAPI-seed#[5681ECCDE8309A75]-worker) [    ] o.a.s.SolrTestCaseJ4 startTrackingSearchers: numOpens=2 numCloses=2
   [junit4]   2> 1873329 INFO  (SUITE-TestEmbeddedSolrServerSchemaAPI-seed#[5681ECCDE8309A75]-worker) [    ] o.a.s.SolrTestCaseJ4 Using PointFields (NUMERIC_POINTS_SYSPROP=true) w/NUMERIC_DOCVALUES_SYSPROP=false
   [junit4]   2> 1873332 INFO  (SUITE-TestEmbeddedSolrServerSchemaAPI-seed#[5681ECCDE8309A75]-worker) [    ] o.a.s.SolrTestCaseJ4 Randomized ssl (false) and clientAuth (true) via: @org.apache.solr.util.RandomizeSSL(reason=, ssl=NaN, value=NaN, clientAuth=NaN)
   [junit4]   2> 1873332 INFO  (SUITE-TestEmbeddedSolrServerSchemaAPI-seed#[5681ECCDE8309A75]-worker) [    ] o.a.s.SolrTestCaseJ4 SecureRandom sanity checks: test.solr.allowed.securerandom=null & java.security.egd=file:/dev/./urandom
   [junit4]   2> 1873334 INFO  (SUITE-TestEmbeddedSolrServerSchemaAPI-seed#[5681ECCDE8309A75]-worker) [    ] o.a.s.SolrTestCaseJ4 ####initCore
   [junit4]   2> 1873345 INFO  (SUITE-TestEmbeddedSolrServerSchemaAPI-seed#[5681ECCDE8309A75]-worker) [    ] o.a.s.c.SolrConfig Using Lucene MatchVersion: 8.0.0
   [junit4]   2> 1873352 INFO  (SUITE-TestEmbeddedSolrServerSchemaAPI-seed#[5681ECCDE8309A75]-worker) [    ] o.a.s.s.ManagedIndexSchemaFactory The schema is configured as managed, but managed schema resource managed-schema not found - loading non-managed schema schema.xml instead
   [junit4]   2> 1873354 INFO  (SUITE-TestEmbeddedSolrServerSchemaAPI-seed#[5681ECCDE8309A75]-worker) [    ] o.a.s.s.IndexSchema [null] Schema name=tiny
   [junit4]   2> 1873356 INFO  (SUITE-TestEmbeddedSolrServerSchemaAPI-seed#[5681ECCDE8309A75]-worker) [    ] o.a.s.s.IndexSchema Loaded schema tiny/1.1 with uniqueid field id
   [junit4]   2> 1873356 INFO  (SUITE-TestEmbeddedSolrServerSchemaAPI-seed#[5681ECCDE8309A75]-worker) [    ] o.a.s.s.ManagedIndexSchema Upgraded to managed schema at /home/jenkins/workspace/Lucene-Solr-master-Linux/solr/build/solr-core/test/J0/temp/solr.client.solrj.embedded.TestEmbeddedSolrServerSchemaAPI_5681ECCDE8309A75-001/tmp-home-001/collection1/conf/managed-schema
   [junit4]   2> 1873364 INFO  (SUITE-TestEmbeddedSolrServerSchemaAPI-seed#[5681ECCDE8309A75]-worker) [    ] o.a.s.s.ManagedIndexSchemaFactory After upgrading to managed schema, renamed the non-managed schema /home/jenkins/workspace/Lucene-Solr-master-Linux/solr/build/solr-core/test/J0/temp/solr.client.solrj.embedded.TestEmbeddedSolrServerSchemaAPI_5681ECCDE8309A75-001/tmp-home-001/collection1/conf/schema.xml to /home/jenkins/workspace/Lucene-Solr-master-Linux/solr/build/solr-core/test/J0/temp/solr.client.solrj.embedded.TestEmbeddedSolrServerSchemaAPI_5681ECCDE8309A75-001/tmp-home-001/collection1/conf/schema.xml.bak
   [junit4]   2> 1873390 INFO  (SUITE-TestEmbeddedSolrServerSchemaAPI-seed#[5681ECCDE8309A75]-worker) [    ] o.a.s.m.r.SolrJmxReporter JMX monitoring for 'solr.node' (registry 'solr.node') enabled at server: com.sun.jmx.mbeanserver.JmxMBeanServer@b84d1a
   [junit4]   2> 1873398 INFO  (SUITE-TestEmbeddedSolrServerSchemaAPI-seed#[5681ECCDE8309A75]-worker) [    ] o.a.s.m.r.SolrJmxReporter JMX monitoring for 'solr.jvm' (registry 'solr.jvm') enabled at server: com.sun.jmx.mbeanserver.JmxMBeanServer@b84d1a
   [junit4]   2> 1873398 INFO  (SUITE-TestEmbeddedSolrServerSchemaAPI-seed#[5681ECCDE8309A75]-worker) [    ] o.a.s.m.r.SolrJmxReporter JMX monitoring for 'solr.jetty' (registry 'solr.jetty') enabled at server: com.sun.jmx.mbeanserver.JmxMBeanServer@b84d1a
   [junit4]   2> 1873422 INFO  (coreLoadExecutor-7876-thread-1) [    ] o.a.s.c.TransientSolrCoreCacheDefault Allocating transient cache for 2147483647 transient cores
   [junit4]   2> 1873431 INFO  (coreLoadExecutor-7876-thread-1) [    x:collection1] o.a.s.c.SolrConfig Using Lucene MatchVersion: 8.0.0
   [junit4]   2> 1873437 INFO  (coreLoadExecutor-7876-thread-1) [    x:collection1] o.a.s.s.IndexSchema [collection1] Schema name=tiny
   [junit4]   2> 1873439 INFO  (coreLoadExecutor-7876-thread-1) [    x:collection1] o.a.s.s.IndexSchema Loaded schema tiny/1.1 with uniqueid field id
   [junit4]   2> 1873439 INFO  (coreLoadExecutor-7876-thread-1) [    x:collection1] o.a.s.c.CoreContainer Creating SolrCore 'collection1' using configuration from instancedir /home/jenkins/workspace/Lucene-Solr-master-Linux/solr/build/solr-core/test/J0/temp/solr.client.solrj.embedded.TestEmbeddedSolrServerSchemaAPI_5681ECCDE8309A75-001/tmp-home-001/collection1, trusted=true
   [junit4]   2> 1873440 INFO  (coreLoadExecutor-7876-thread-1) [    x:collection1] o.a.s.m.r.SolrJmxReporter JMX monitoring for 'solr.core.collection1' (registry 'solr.core.collection1') enabled at server: com.sun.jmx.mbeanserver.JmxMBeanServer@b84d1a
   [junit4]   2> 1873440 INFO  (coreLoadExecutor-7876-thread-1) [    x:collection1] o.a.s.c.SolrCore solr.RecoveryStrategy.Builder
   [junit4]   2> 1873440 INFO  (coreLoadExecutor-7876-thread-1) [    x:collection1] o.a.s.c.SolrCore [[collection1] ] Opening new SolrCore at [/home/jenkins/workspace/Lucene-Solr-master-Linux/solr/build/solr-core/test/J0/temp/solr.client.solrj.embedded.TestEmbeddedSolrServerSchemaAPI_5681ECCDE8309A75-001/tmp-home-001/collection1], dataDir=[/home/jenkins/workspace/Lucene-Solr-master-Linux/solr/build/solr-core/test/J0/temp/solr.client.solrj.embedded.TestEmbeddedSolrServerSchemaAPI_5681ECCDE8309A75-001/init-core-data-001/]
   [junit4]   2> 1873442 INFO  (coreLoadExecutor-7876-thread-1) [    x:collection1] o.a.s.u.RandomMergePolicy RandomMergePolicy wrapping class org.apache.lucene.index.TieredMergePolicy: [TieredMergePolicy: maxMergeAtOnce=36, maxMergeAtOnceExplicit=11, maxMergedSegmentMB=45.2861328125, floorSegmentMB=0.349609375, forceMergeDeletesPctAllowed=0.4530753369548146, segmentsPerTier=24.0, maxCFSSegmentSizeMB=8.796093022207999E12, noCFSRatio=1.0
   [junit4]   2> 1873471 WARN  (coreLoadExecutor-7876-thread-1) [    x:collection1] o.a.s.c.RequestHandlers INVALID paramSet a in requestHandler {type = requestHandler,name = /dump,class = DumpRequestHandler,attributes = {initParams=a, name=/dump, registerPath=/solr,/v2, class=DumpRequestHandler},args = {defaults={a=A,b=B}}}
   [junit4]   2> 1873518 INFO  (coreLoadExecutor-7876-thread-1) [    x:collection1] o.a.s.u.UpdateHandler Using UpdateLog implementation: org.apache.solr.update.UpdateLog
   [junit4]   2> 1873518 INFO  (coreLoadExecutor-7876-thread-1) [    x:collection1] o.a.s.u.UpdateLog Initializing UpdateLog: dataDir= defaultSyncLevel=FLUSH numRecordsToKeep=100 maxNumLogsToKeep=10 numVersionBuckets=65536
   [junit4]   2> 1873519 INFO  (coreLoadExecutor-7876-thread-1) [    x:collection1] o.a.s.u.CommitTracker Hard AutoCommit: disabled
   [junit4]   2> 1873519 INFO  (coreLoadExecutor-7876-thread-1) [    x:collection1] o.a.s.u.CommitTracker Soft AutoCommit: disabled
   [junit4]   2> 1873520 INFO  (coreLoadExecutor-7876-thread-1) [    x:collection1] o.a.s.u.RandomMergePolicy RandomMergePolicy wrapping class org.apache.lucene.index.TieredMergePolicy: [TieredMergePolicy: maxMergeAtOnce=12, maxMergeAtOnceExplicit=26, maxMergedSegmentMB=1.806640625, floorSegmentMB=0.609375, forceMergeDeletesPctAllowed=1.5158997786021355, segmentsPerTier=50.0, maxCFSSegmentSizeMB=8.796093022207999E12, noCFSRatio=0.32888592762073393
   [junit4]   2> 1873521 INFO  (coreLoadExecutor-7876-thread-1) [    x:collection1] o.a.s.s.SolrIndexSearcher Opening [Searcher@1c578f5[collection1] main]
   [junit4]   2> 1873521 INFO  (coreLoadExecutor-7876-thread-1) [    x:collection1] o.a.s.r.ManagedResourceStorage File-based storage initialized to use dir: /home/jenkins/workspace/Lucene-Solr-master-Linux/solr/build/solr-core/test/J0/temp/solr.client.solrj.embedded.TestEmbeddedSolrServerSchemaAPI_5681ECCDE8309A75-001/tmp-home-001/collection1/conf
   [junit4]   2> 1873522 INFO  (coreLoadExecutor-7876-thread-1) [    x:collection1] o.a.s.h.ReplicationHandler Commits will be reserved for 10000ms.
   [junit4]   2> 1873523 INFO  (searcherExecutor-7877-thread-1-processing-x:collection1) [    x:collection1] o.a.s.c.SolrCore [collection1] Registered new searcher Searcher@1c578f5[collection1] main{ExitableDirectoryReader(UninvertingDirectoryReader())}
   [junit4]   2> 1873523 INFO  (coreLoadExecutor-7876-thread-1) [    x:collection1] o.a.s.u.UpdateLog Could not find max version in index or recent updates, using new clock 1589140639149195264
   [junit4]   2> 1873525 INFO  (SUITE-TestEmbeddedSolrServerSchemaAPI-seed#[5681ECCDE8309A75]-worker) [    ] o.a.s.SolrTestCaseJ4 ####initCore end
   [junit4]   2> 1873528 INFO  (TEST-TestEmbeddedSolrServerSchemaAPI.testSchemaAddFieldAndFailOnImmutable-seed#[5681ECCDE8309A75]) [    ] o.a.s.SolrTestCaseJ4 ###Starting testSchemaAddFieldAndFailOnImmutable
   [junit4]   2> 1873528 INFO  (TEST-TestEmbeddedSolrServerSchemaAPI.testSchemaAddFieldAndFailOnImmutable-seed#[5681ECCDE8309A75]) [    ] o.a.s.c.S.Request [collection1]  webapp=null path=/schema/fields/VerificationTest params={} status=404 QTime=0
   [junit4]   2> 1873529 ERROR (TEST-TestEmbeddedSolrServerSchemaAPI.testSchemaAddFieldAndFailOnImmutable-seed#[5681ECCDE8309A75]) [    ] o.a.s.h.RequestHandlerBase org.apache.solr.api.ApiBag$ExceptionWithErrObject: error processing commands, errors: [{errorMessages=schema is not editable}], 
   [junit4]   2> 	at org.apache.solr.handler.SchemaHandler.handleRequestBody(SchemaHandler.java:92)
   [junit4]   2> 	at org.apache.solr.handler.RequestHandlerBase.handleRequest(RequestHandlerBase.java:177)
   [junit4]   2> 	at org.apache.solr.core.SolrCore.execute(SolrCore.java:2503)
   [junit4]   2> 	at org.apache.solr.client.solrj.embedded.EmbeddedSolrServer.request(EmbeddedSolrServer.java:180)
   [junit4]   2> 	at org.apache.solr.client.solrj.SolrRequest.process(SolrRequest.java:194)
   [junit4]   2> 	at org.apache.solr.client.solrj.SolrRequest.process(SolrRequest.java:211)
   [junit4]   2> 	at org.apache.solr.client.solrj.embedded.TestEmbeddedSolrServerSchemaAPI.testSchemaAddFieldAndFailOnImmutable(TestEmbeddedSolrServerSchemaAPI.java:105)
   [junit4]   2> 	at sun.reflect.NativeMethodAccessorImpl.invoke0(Native Method)
   [junit4]   2> 	at sun.reflect.NativeMethodAccessorImpl.invoke(NativeMethodAccessorImpl.java:62)
   [junit4]   2> 	at sun.reflect.DelegatingMethodAccessorImpl.invoke(DelegatingMethodAccessorImpl.java:43)
   [junit4]   2> 	at java.lang.reflect.Method.invoke(Method.java:498)
   [junit4]   2> 	at com.carrotsearch.randomizedtesting.RandomizedRunner.invoke(RandomizedRunner.java:1737)
   [junit4]   2> 	at com.carrotsearch.randomizedtesting.RandomizedRunner$8.evaluate(RandomizedRunner.java:934)
   [junit4]   2> 	at com.carrotsearch.randomizedtesting.RandomizedRunner$9.evaluate(RandomizedRunner.java:970)
   [junit4]   2> 	at com.carrotsearch.randomizedtesting.RandomizedRunner$10.evaluate(RandomizedRunner.java:984)
   [junit4]   2> 	at com.carrotsearch.randomizedtesting.rules.SystemPropertiesRestoreRule$1.evaluate(SystemPropertiesRestoreRule.java:57)
   [junit4]   2> 	at org.apache.lucene.util.TestRuleSetupTeardownChained$1.evaluate(TestRuleSetupTeardownChained.java:49)
   [junit4]   2> 	at org.apache.lucene.util.AbstractBeforeAfterRule$1.evaluate(AbstractBeforeAfterRule.java:45)
   [junit4]   2> 	at org.apache.lucene.util.TestRuleThreadAndTestName$1.evaluate(TestRuleThreadAndTestName.java:48)
   [junit4]   2> 	at org.apache.lucene.util.TestRuleIgnoreAfterMaxFailures$1.evaluate(TestRuleIgnoreAfterMaxFailures.java:64)
   [junit4]   2> 	at org.apache.lucene.util.TestRuleMarkFailure$1.evaluate(TestRuleMarkFailure.java:47)
   [junit4]   2> 	at com.carrotsearch.randomizedtesting.rules.StatementAdapter.evaluate(StatementAdapter.java:36)
   [junit4]   2> 	at com.carrotsearch.randomizedtesting.ThreadLeakControl$StatementRunner.run(ThreadLeakControl.java:368)
   [junit4]   2> 	at com.carrotsearch.randomizedtesting.ThreadLeakControl.forkTimeoutingTask(ThreadLeakControl.java:817)
   [junit4]   2> 	at com.carrotsearch.randomizedtesting.ThreadLeakControl$3.evaluate(ThreadLeakControl.java:468)
   [junit4]   2> 	at com.carrotsearch.randomizedtesting.RandomizedRunner.runSingleTest(RandomizedRunner.java:943)
   [junit4]   2> 	at com.carrotsearch.randomizedtesting.RandomizedRunner$5.evaluate(RandomizedRunner.java:829)
   [junit4]   2> 	at com.carrotsearch.randomizedtesting.RandomizedRunner$6.evaluate(RandomizedRunner.java:879)
   [junit4]   2> 	at com.carrotsearch.randomizedtesting.RandomizedRunner$7.evaluate(RandomizedRunner.java:890)
   [junit4]   2> 	at com.carrotsearch.randomizedtesting.rules.StatementAdapter.evaluate(StatementAdapter.java:36)
   [junit4]   2> 	at com.carrotsearch.randomizedtesting.rules.SystemPropertiesRestoreRule$1.evaluate(SystemPropertiesRestoreRule.java:57)
   [junit4]   2> 	at org.apache.lucene.util.AbstractBeforeAfterRule$1.evaluate(AbstractBeforeAfterRule.java:45)
   [junit4]   2> 	at com.carrotsearch.randomizedtesting.rules.StatementAdapter.evaluate(StatementAdapter.java:36)
   [junit4]   2> 	at org.apache.lucene.util.TestRuleStoreClassName$1.evaluate(TestRuleStoreClassName.java:41)
   [junit4]   2> 	at com.carrotsearch.randomizedtesting.rules.NoShadowingOrOverridesOnMethodsRule$1.evaluate(NoShadowingOrOverridesOnMethodsRule.java:40)
   [junit4]   2> 	at com.carrotsearch.randomizedtesting.rules.NoShadowingOrOverridesOnMethodsRule$1.evaluate(NoShadowingOrOverridesOnMethodsRule.java:40)
   [junit4]   2> 	at com.carrotsearch.randomizedtesting.rules.StatementAdapter.evaluate(StatementAdapter.java:36)
   [junit4]   2> 	at com.carrotsearch.randomizedtesting.rules.StatementAdapter.evaluate(StatementAdapter.java:36)
   [junit4]   2> 	at com.carrotsearch.randomizedtesting.rules.StatementAdapter.evaluate(StatementAdapter.java:36)
   [junit4]   2> 	at org.apache.lucene.util.TestRuleAssertionsRequired$1.evaluate(TestRuleAssertionsRequired.java:53)
   [junit4]   2> 	at org.apache.lucene.util.TestRuleMarkFailure$1.evaluate(TestRuleMarkFailure.java:47)
   [junit4]   2> 	at org.apache.lucene.util.TestRuleIgnoreAfterMaxFailures$1.evaluate(TestRuleIgnoreAfterMaxFailures.java:64)
   [junit4]   2> 	at org.apache.lucene.util.TestRuleIgnoreTestSuites$1.evaluate(TestRuleIgnoreTestSuites.java:54)
   [junit4]   2> 	at com.carrotsearch.randomizedtesting.rules.StatementAdapter.evaluate(StatementAdapter.java:36)
   [junit4]   2> 	at com.carrotsearch.randomizedtesting.ThreadLeakControl$StatementRunner.run(ThreadLeakControl.java:368)
   [junit4]   2> 	at java.lang.Thread.run(Thread.java:748)
   [junit4]   2> 
   [junit4]   2> 1873529 INFO  (TEST-TestEmbeddedSolrServerSchemaAPI.testSchemaAddFieldAndFailOnImmutable-seed#[5681ECCDE8309A75]) [    ] o.a.s.c.S.Request [collection1]  webapp=null path=/schema params={} status=400 QTime=0
   [junit4]   2> 1873529 INFO  (TEST-TestEmbeddedSolrServerSchemaAPI.testSchemaAddFieldAndFailOnImmutable-seed#[5681ECCDE8309A75]) [    ] o.a.s.SolrTestCaseJ4 ###Ending testSchemaAddFieldAndFailOnImmutable
   [junit4]   2> NOTE: reproduce with: ant test  -Dtestcase=TestEmbeddedSolrServerSchemaAPI -Dtests.method=testSchemaAddFieldAndFailOnImmutable -Dtests.seed=5681ECCDE8309A75 -Dtests.multiplier=3 -Dtests.slow=true -Dtests.locale=en-AU -Dtests.timezone=America/Indiana/Winamac -Dtests.asserts=true -Dtests.file.encoding=ISO-8859-1
   [junit4] ERROR   0.01s J0 | TestEmbeddedSolrServerSchemaAPI.testSchemaAddFieldAndFailOnImmutable <<<
   [junit4]    > Throwable #1: org.apache.solr.api.ApiBag$ExceptionWithErrObject: error processing commands, errors: [{errorMessages=schema is not editable}], 
   [junit4]    > 	at __randomizedtesting.SeedInfo.seed([5681ECCDE8309A75:CD35031CB5A6F064]:0)
   [junit4]    > 	at org.apache.solr.handler.SchemaHandler.handleRequestBody(SchemaHandler.java:92)
   [junit4]    > 	at org.apache.solr.handler.RequestHandlerBase.handleRequest(RequestHandlerBase.java:177)
   [junit4]    > 	at org.apache.solr.core.SolrCore.execute(SolrCore.java:2503)
   [junit4]    > 	at org.apache.solr.client.solrj.embedded.EmbeddedSolrServer.request(EmbeddedSolrServer.java:180)
   [junit4]    > 	at org.apache.solr.client.solrj.SolrRequest.process(SolrRequest.java:194)
   [junit4]    > 	at org.apache.solr.client.solrj.SolrRequest.process(SolrRequest.java:211)
   [junit4]    > 	at org.apache.solr.client.solrj.embedded.TestEmbeddedSolrServerSchemaAPI.testSchemaAddFieldAndFailOnImmutable(TestEmbeddedSolrServerSchemaAPI.java:105)
   [junit4]    > 	at java.lang.Thread.run(Thread.java:748)
   [junit4]   2> 1873532 INFO  (TEST-TestEmbeddedSolrServerSchemaAPI.testSchemaAddFieldAndVerifyExistence-seed#[5681ECCDE8309A75]) [    ] o.a.s.SolrTestCaseJ4 ###Starting testSchemaAddFieldAndVerifyExistence
   [junit4]   2> 1873532 INFO  (TEST-TestEmbeddedSolrServerSchemaAPI.testSchemaAddFieldAndVerifyExistence-seed#[5681ECCDE8309A75]) [    ] o.a.s.c.S.Request [collection1]  webapp=null path=/schema/fields/VerificationTest params={} status=404 QTime=0
   [junit4]   2> 1873532 INFO  (TEST-TestEmbeddedSolrServerSchemaAPI.testSchemaAddFieldAndVerifyExistence-seed#[5681ECCDE8309A75]) [    ] o.a.s.SolrTestCaseJ4 ###Ending testSchemaAddFieldAndVerifyExistence
   [junit4] IGNOR/A 0.00s J0 | TestEmbeddedSolrServerSchemaAPI.testSchemaAddFieldAndVerifyExistence
   [junit4]    > Assumption #1: it needs to ammend schema
   [junit4]   2> 1873533 INFO  (SUITE-TestEmbeddedSolrServerSchemaAPI-seed#[5681ECCDE8309A75]-worker) [    ] o.a.s.c.CoreContainer Shutting down CoreContainer instance=33368670
   [junit4]   2> 1873533 INFO  (SUITE-TestEmbeddedSolrServerSchemaAPI-seed#[5681ECCDE8309A75]-worker) [    ] o.a.s.m.SolrMetricManager Closing metric reporters for registry=solr.node, tag=null
   [junit4]   2> 1873533 INFO  (SUITE-TestEmbeddedSolrServerSchemaAPI-seed#[5681ECCDE8309A75]-worker) [    ] o.a.s.m.r.SolrJmxReporter Closing reporter [org.apache.solr.metrics.reporters.SolrJmxReporter@1a477fc: rootName = null, domain = solr.node, service url = null, agent id = null] for registry solr.node / com.codahale.metrics.MetricRegistry@e669a7
   [junit4]   2> 1873537 INFO  (SUITE-TestEmbeddedSolrServerSchemaAPI-seed#[5681ECCDE8309A75]-worker) [    ] o.a.s.m.SolrMetricManager Closing metric reporters for registry=solr.jvm, tag=null
   [junit4]   2> 1873538 INFO  (SUITE-TestEmbeddedSolrServerSchemaAPI-seed#[5681ECCDE8309A75]-worker) [    ] o.a.s.m.r.SolrJmxReporter Closing reporter [org.apache.solr.metrics.reporters.SolrJmxReporter@ee6a95: rootName = null, domain = solr.jvm, service url = null, agent id = null] for registry solr.jvm / com.codahale.metrics.MetricRegistry@1a29d
   [junit4]   2> 1873542 INFO  (SUITE-TestEmbeddedSolrServerSchemaAPI-seed#[5681ECCDE8309A75]-worker) [    ] o.a.s.m.SolrMetricManager Closing metric reporters for registry=solr.jetty, tag=null
   [junit4]   2> 1873542 INFO  (SUITE-TestEmbeddedSolrServerSchemaAPI-seed#[5681ECCDE8309A75]-worker) [    ] o.a.s.m.r.SolrJmxReporter Closing reporter [org.apache.solr.metrics.reporters.SolrJmxReporter@1766682: rootName = null, domain = solr.jetty, service url = null, agent id = null] for registry solr.jetty / com.codahale.metrics.MetricRegistry@3e3985
   [junit4]   2> 1873542 INFO  (coreCloseExecutor-7882-thread-1) [    x:collection1] o.a.s.c.SolrCore [collection1]  CLOSING SolrCore org.apache.solr.core.SolrCore@1236b0
   [junit4]   2> 1873542 INFO  (coreCloseExecutor-7882-thread-1) [    x:collection1] o.a.s.m.SolrMetricManager Closing metric reporters for registry=solr.core.collection1, tag=1193648
   [junit4]   2> 1873542 INFO  (coreCloseExecutor-7882-thread-1) [    x:collection1] o.a.s.m.r.SolrJmxReporter Closing reporter [org.apache.solr.metrics.reporters.SolrJmxReporter@115ec1b: rootName = null, domain = solr.core.collection1, service url = null, agent id = null] for registry solr.core.collection1 / com.codahale.metrics.MetricRegistry@f4a0d7
   [junit4]   2> 1873551 INFO  (SUITE-TestEmbeddedSolrServerSchemaAPI-seed#[5681ECCDE8309A75]-worker) [    ] o.a.s.SolrTestCaseJ4 ###deleteCore
   [junit4]   2> 1873551 INFO  (SUITE-TestEmbeddedSolrServerSchemaAPI-seed#[5681ECCDE8309A75]-worker) [    ] o.a.s.c.CoreContainer Shutting down CoreContainer instance=33368670
   [junit4]   2> 1873551 INFO  (SUITE-TestEmbeddedSolrServerSchemaAPI-seed#[5681ECCDE8309A75]-worker) [    ] o.a.s.m.SolrMetricManager Closing metric reporters for registry=solr.node, tag=null
   [junit4]   2> 1873551 INFO  (SUITE-TestEmbeddedSolrServerSchemaAPI-seed#[5681ECCDE8309A75]-worker) [    ] o.a.s.m.SolrMetricManager Closing metric reporters for registry=solr.jvm, tag=null
   [junit4]   2> 1873551 INFO  (SUITE-TestEmbeddedSolrServerSchemaAPI-seed#[5681ECCDE8309A75]-worker) [    ] o.a.s.m.SolrMetricManager Closing metric reporters for registry=solr.jetty, tag=null
   [junit4]   2> NOTE: leaving temporary files on disk at: /home/jenkins/workspace/Lucene-Solr-master-Linux/solr/build/solr-core/test/J0/temp/solr.client.solrj.embedded.TestEmbeddedSolrServerSchemaAPI_5681ECCDE8309A75-001
   [junit4]   2> NOTE: test params are: codec=Asserting(Lucene70): {}, docValues:{}, maxPointsInLeafNode=1481, maxMBSortInHeap=5.365135230437662, sim=Asserting(org.apache.lucene.search.similarities.AssertingSimilarity@18ad168), locale=en-AU, timezone=America/Indiana/Winamac
   [junit4]   2> NOTE: Linux 4.10.0-40-generic i386/Oracle Corporation 1.8.0_144 (32-bit)/cpus=8,threads=1,free=333158720,total=536870912
   [junit4]   2> NOTE: All tests run in this JVM: [TestQueryWrapperFilter, TestStreamBody, TestPostingsSolrHighlighter, TestCodecSupport, DocValuesMissingTest, TestSlowCompositeReaderWrapper, DocValuesTest, DistributedMLTComponentTest, ActionThrottleTest, NoCacheHeaderTest, ChaosMonkeyNothingIsSafeWithPullReplicasTest, TestCloudDeleteByQuery, ExternalFileFieldSortTest, URLClassifyProcessorTest, TestFieldCollectionResource, ResourceLoaderTest, TestXmlQParser, NodeLostTriggerTest, TestSolrDeletionPolicy1, TestGraphMLResponseWriter, TestReplicationHandlerBackup, CollectionsAPISolrJTest, SolrCoreMetricManagerTest, FacetPivotSmallTest, SpatialRPTFieldTypeTest, TestUpdate, TestSQLHandler, TestStressVersions, TestRequestForwarding, MergeStrategyTest, TestCustomDocTransformer, SolrJmxReporterCloudTest, TestBadConfig, BasicDistributedZkTest, UpdateParamsTest, TestIBSimilarityFactory, TestJoin, SoftAutoCommitTest, DateFieldTest, TestAuthorizationFramework, TestDocBasedVersionConstraints, TestLeaderInitiatedRecoveryThread, TestPHPSerializedResponseWriter, DataDrivenBlockJoinTest, TestWordDelimiterFilterFactory, HdfsRecoveryZkTest, BlockJoinFacetDistribTest, SearchHandlerTest, TestDistributedSearch, TestNumericTerms32, PrimitiveFieldTypeTest, TestRandomFaceting, LeaderInitiatedRecoveryOnCommitTest, TestPhraseSuggestions, TestExactSharedStatsCache, TestShardHandlerFactory, CdcrBootstrapTest, DocumentBuilderTest, TestDistribDocBasedVersion, SyncSliceTest, TestUtils, TestComputePlanAction, IgnoreCommitOptimizeUpdateProcessorFactoryTest, SpellCheckComponentTest, SpatialFilterTest, TestRecovery, DeleteInactiveReplicaTest, HLLUtilTest, HdfsCollectionsAPIDistributedZkTest, TestManagedResourceStorage, ShufflingReplicaListTransformerTest, TestSolrQueryResponse, TestLuceneIndexBackCompat, OverseerStatusTest, BlockDirectoryTest, CoreSorterTest, TestNodeLostTrigger, TestHttpShardHandlerFactory, TestMergePolicyConfig, TestCloudSearcherWarming, HdfsDirectoryFactoryTest, DateMathParserTest, TestConfigSetsAPIZkFailure, JsonLoaderTest, RequestLoggingTest, BasicAuthIntegrationTest, SuggestComponentTest, ZkControllerTest, TestCloudSchemaless, MigrateRouteKeyTest, ComputePlanActionTest, TestGenericDistributedQueue, TestInPlaceUpdatesDistrib, TestSearcherReuse, PreAnalyzedFieldManagedSchemaCloudTest, TestManagedSynonymGraphFilterFactory, CollectionStateFormat2Test, OverseerCollectionConfigSetProcessorTest, TestFoldingMultitermQuery, TestStressLiveNodes, TestSweetSpotSimilarityFactory, TestSort, TestLegacyNumericUtils, HttpTriggerListenerTest, TestHdfsCloudBackupRestore, TestCloudPivotFacet, TestFastOutputStream, DistributedFacetExistsSmallTest, TestCollectionsAPIViaSolrCloudCluster, TestCollectionAPIs, TestTriggerIntegration, TestFieldCacheReopen, AddBlockUpdateTest, JavabinLoaderTest, TestNumericRangeQuery32, ResponseHeaderTest, IndexSchemaRuntimeFieldTest, QueryParsingTest, TestSchemaSimilarityResource, HdfsBasicDistributedZkTest, LeaderElectionIntegrationTest, DistributedQueueTest, SegmentsInfoRequestHandlerTest, ExplicitHLLTest, TestFieldCacheVsDocValues, BasicDistributedZk2Test, UnloadDistributedZkTest, OpenCloseCoreStressTest, ShardRoutingTest, BasicZkTest, RecoveryZkTest, TestReplicationHandler, TestZkChroot, TestRandomDVFaceting, SolrCoreTest, PeerSyncTest, ShowFileRequestHandlerTest, DistributedQueryElevationComponentTest, SpellCheckCollatorTest, SuggesterWFSTTest, DirectUpdateHandlerOptimizeTest, DefaultValueUpdateProcessorTest, TestRemoteStreaming, DocValuesMultiTest, SolrInfoBeanTest, IndexBasedSpellCheckerTest, TestQueryUtils, TestReversedWildcardFilterFactory, TestOmitPositions, TermsComponentTest, TestIndexingPerformance, RequiredFieldsTest, LoggingHandlerTest, SolrPluginUtilsTest, TestAnalyzedSuggestions, PingRequestHandlerTest, TestComponentsName, TestQuerySenderListener, AlternateDirectoryTest, TestSolrIndexConfig, TestQuerySenderNoQuery, ResponseLogComponentTest, SolrIndexConfigTest, BadComponentTest, TestStressRecovery, SampleTest, MinimalSchemaTest, OutputWriterTest, TestXIncludeConfig, TestLMDirichletSimilarityFactory, ScriptEngineTest, PreAnalyzedFieldTest, TestSuggestSpellingConverter, SpellingQueryConverterTest, DOMUtilTest, RAMDirectoryFactoryTest, ClusterStateTest, TestSolrJ, TestDocumentBuilder, ZkNodePropsTest, SliceStateTest, SystemInfoHandlerTest, UUIDFieldTest, FileUtilsTest, CircularListTest, TestRTGBase, CursorPagingTest, DistributedIntervalFacetingTest, TestCrossCoreJoin, TestCursorMarkWithoutUniqueKey, TestHighlightDedupGrouping, TestEmbeddedSolrServerAdminHandler, TestEmbeddedSolrServerConstructors, TestEmbeddedSolrServerSchemaAPI]
   [junit4] Completed [493/767 (1!)] on J0 in 0.25s, 2 tests, 1 error, 1 skipped <<< FAILURES!

[...truncated 43621 lines...]
-ecj-javadoc-lint-tests:
    [mkdir] Created dir: /tmp/ecj418130115
 [ecj-lint] Compiling 153 source files to /tmp/ecj418130115
 [ecj-lint] invalid Class-Path header in manifest of jar file: /home/jenkins/.ivy2/cache/org.restlet.jee/org.restlet/jars/org.restlet-2.3.0.jar
 [ecj-lint] invalid Class-Path header in manifest of jar file: /home/jenkins/.ivy2/cache/org.restlet.jee/org.restlet.ext.servlet/jars/org.restlet.ext.servlet-2.3.0.jar
 [ecj-lint] ----------
 [ecj-lint] 1. WARNING in /home/jenkins/workspace/Lucene-Solr-master-Linux/solr/solrj/src/test/org/apache/solr/client/solrj/io/stream/StreamExpressionTest.java (at line 234)
 [ecj-lint] 	SolrStream solrStream = new SolrStream(shardUrls.get(0), solrParams);
 [ecj-lint] 	           ^^^^^^^^^^
 [ecj-lint] Resource leak: 'solrStream' is never closed
 [ecj-lint] ----------
 [ecj-lint] ----------
 [ecj-lint] 2. WARNING in /home/jenkins/workspace/Lucene-Solr-master-Linux/solr/solrj/src/test/org/apache/solr/client/solrj/io/stream/StreamExpressionToExpessionTest.java (at line 77)
 [ecj-lint] 	stream = new CloudSolrStream(StreamExpressionParser.parse("search(collection1, q=*:*, fl=\"id,a_s,a_i,a_f\", sort=\"a_f asc, a_i asc\", fq=\"a_s:one\", fq=\"a_s:two\")"), factory);
 [ecj-lint] 	^^^^^^^^^^^^^^^^^^^^^^^^^^^^^^^^^^^^^^^^^^^^^^^^^^^^^^^^^^^^^^^^^^^^^^^^^^^^^^^^^^^^^^^^^^^^^^^^^^^^^^^^^^^^^^^^^^^^^^^^^^^^^^^^^^^^^^^^^^^^^^^^^^^^^^^^^^^^^^^^^^^^^^^^^^^^^^^^^^^
 [ecj-lint] Resource leak: 'stream' is never closed
 [ecj-lint] ----------
 [ecj-lint] 3. WARNING in /home/jenkins/workspace/Lucene-Solr-master-Linux/solr/solrj/src/test/org/apache/solr/client/solrj/io/stream/StreamExpressionToExpessionTest.java (at line 102)
 [ecj-lint] 	stream = new SelectStream(StreamExpressionParser.parse("select(\"a_s as fieldA\", search(collection1, q=*:*, fl=\"id,a_s,a_i,a_f\", sort=\"a_f asc, a_i asc\"))"), factory);
 [ecj-lint] 	^^^^^^^^^^^^^^^^^^^^^^^^^^^^^^^^^^^^^^^^^^^^^^^^^^^^^^^^^^^^^^^^^^^^^^^^^^^^^^^^^^^^^^^^^^^^^^^^^^^^^^^^^^^^^^^^^^^^^^^^^^^^^^^^^^^^^^^^^^^^^^^^^^^^^^^^^^^^^^^^^^^^^^^^^^^
 [ecj-lint] Resource leak: 'stream' is never closed
 [ecj-lint] ----------
 [ecj-lint] 4. WARNING in /home/jenkins/workspace/Lucene-Solr-master-Linux/solr/solrj/src/test/org/apache/solr/client/solrj/io/stream/StreamExpressionToExpessionTest.java (at line 119)
 [ecj-lint] 	stream = new DaemonStream(StreamExpressionParser.parse("daemon(search(collection1, q=*:*, fl=\"id,a_s,a_i,a_f\", sort=\"a_f asc, a_i asc\"), id=\"blah\", runInterval=\"1000\", queueSize=\"100\")"), factory);
 [ecj-lint] 	^^^^^^^^^^^^^^^^^^^^^^^^^^^^^^^^^^^^^^^^^^^^^^^^^^^^^^^^^^^^^^^^^^^^^^^^^^^^^^^^^^^^^^^^^^^^^^^^^^^^^^^^^^^^^^^^^^^^^^^^^^^^^^^^^^^^^^^^^^^^^^^^^^^^^^^^^^^^^^^^^^^^^^^^^^^^^^^^^^^^^^^^^^^^^^^^^^^^^^^^^^^^^^
 [ecj-lint] Resource leak: 'stream' is never closed
 [ecj-lint] ----------
 [ecj-lint] 5. WARNING in /home/jenkins/workspace/Lucene-Solr-master-Linux/solr/solrj/src/test/org/apache/solr/client/solrj/io/stream/StreamExpressionToExpessionTest.java (at line 137)
 [ecj-lint] 	stream = new TopicStream(StreamExpressionParser.parse("topic(collection2, collection1, q=*:*, fl=\"id,a_s,a_i,a_f\", id=\"blah\", checkpointEvery=1000)"), factory);
 [ecj-lint] 	^^^^^^^^^^^^^^^^^^^^^^^^^^^^^^^^^^^^^^^^^^^^^^^^^^^^^^^^^^^^^^^^^^^^^^^^^^^^^^^^^^^^^^^^^^^^^^^^^^^^^^^^^^^^^^^^^^^^^^^^^^^^^^^^^^^^^^^^^^^^^^^^^^^^^^^^^^^^^^^^^^^
 [ecj-lint] Resource leak: 'stream' is never closed
 [ecj-lint] ----------
 [ecj-lint] 6. WARNING in /home/jenkins/workspace/Lucene-Solr-master-Linux/solr/solrj/src/test/org/apache/solr/client/solrj/io/stream/StreamExpressionToExpessionTest.java (at line 153)
 [ecj-lint] 	stream = new StatsStream(StreamExpressionParser.parse("stats(collection1, q=*:*, fl=\"id,a_s,a_i,a_f\", sort=\"a_f asc, a_i asc\", sum(a_i), avg(a_i), count(*), min(a_i), max(a_i))"), factory);
 [ecj-lint] 	^^^^^^^^^^^^^^^^^^^^^^^^^^^^^^^^^^^^^^^^^^^^^^^^^^^^^^^^^^^^^^^^^^^^^^^^^^^^^^^^^^^^^^^^^^^^^^^^^^^^^^^^^^^^^^^^^^^^^^^^^^^^^^^^^^^^^^^^^^^^^^^^^^^^^^^^^^^^^^^^^^^^^^^^^^^^^^^^^^^^^^^^^^^^^^^^
 [ecj-lint] Resource leak: 'stream' is never closed
 [ecj-lint] ----------
 [ecj-lint] 7. WARNING in /home/jenkins/workspace/Lucene-Solr-master-Linux/solr/solrj/src/test/org/apache/solr/client/solrj/io/stream/StreamExpressionToExpessionTest.java (at line 174)
 [ecj-lint] 	stream = new UniqueStream(StreamExpressionParser.parse("unique(search(collection1, q=*:*, fl=\"id,a_s,a_i,a_f\", sort=\"a_f asc, a_i asc\"), over=\"a_f\")"), factory);
 [ecj-lint] 	^^^^^^^^^^^^^^^^^^^^^^^^^^^^^^^^^^^^^^^^^^^^^^^^^^^^^^^^^^^^^^^^^^^^^^^^^^^^^^^^^^^^^^^^^^^^^^^^^^^^^^^^^^^^^^^^^^^^^^^^^^^^^^^^^^^^^^^^^^^^^^^^^^^^^^^^^^^^^^^^^^^^^^
 [ecj-lint] Resource leak: 'stream' is never closed
 [ecj-lint] ----------
 [ecj-lint] 8. WARNING in /home/jenkins/workspace/Lucene-Solr-master-Linux/solr/solrj/src/test/org/apache/solr/client/solrj/io/stream/StreamExpressionToExpessionTest.java (at line 187)
 [ecj-lint] 	stream = new MergeStream(StreamExpressionParser.parse("merge("
 [ecj-lint]                               + "search(collection1, q=\"id:(0 3 4)\", fl=\"id,a_s,a_i,a_f\", sort=\"a_f asc, a_s asc\"),"
 [ecj-lint]                               + "search(collection1, q=\"id:(1 2)\", fl=\"id,a_s,a_i,a_f\", sort=\"a_f asc, a_s asc\"),"
 [ecj-lint]                               + "on=\"a_f asc, a_s asc\")"), factory);
 [ecj-lint] 	^^^^^^^^^^^^^^^^^^^^^^^^^^^^^^^^^^^^^^^^^^^^^^^^^^^^^^^^^^^^^^^^^^^^^^^^^^^^^^^^^^^^^^^^^^^^^^^^^^^^^^^^^^^^^^^^^^^^^^^^^^^^^^^^^^^^^^^^^^^^^^^^^^^^^^^^^^^^^^^^^^^^^^^^^^^^^^^^^^^^^^^^^^^^^^^^^^^^^^^^^^^^^^^^^^^^^^^^^^^^^^^^^^^^^^^^^^^^^^^^^^^^^^^^^^^^^^^^^^^^^^^^^^^^^^^^^^^^^^^^^^^^^^^^^^^^^^^^^^^^^^^^^^^^^^^^^^^^^^^^^^^^^^^^^^^^^^^^^^^^^^^^^^^^^^^^^^^^^^^^^^^^^^^^^^^^^^^^
 [ecj-lint] Resource leak: 'stream' is never closed
 [ecj-lint] ----------
 [ecj-lint] 9. WARNING in /home/jenkins/workspace/Lucene-Solr-master-Linux/solr/solrj/src/test/org/apache/solr/client/solrj/io/stream/StreamExpressionToExpessionTest.java (at line 204)
 [ecj-lint] 	stream = new RankStream(StreamExpressionParser.parse("top("
 [ecj-lint]                                               + "n=3,"
 [ecj-lint]                                               + "search(collection1, q=*:*, fl=\"id,a_s,a_i,a_f\", sort=\"a_f asc,a_i asc\"),"
 [ecj-lint]                                               + "sort=\"a_f asc, a_i asc\")"), factory);
 [ecj-lint] 	^^^^^^^^^^^^^^^^^^^^^^^^^^^^^^^^^^^^^^^^^^^^^^^^^^^^^^^^^^^^^^^^^^^^^^^^^^^^^^^^^^^^^^^^^^^^^^^^^^^^^^^^^^^^^^^^^^^^^^^^^^^^^^^^^^^^^^^^^^^^^^^^^^^^^^^^^^^^^^^^^^^^^^^^^^^^^^^^^^^^^^^^^^^^^^^^^^^^^^^^^^^^^^^^^^^^^^^^^^^^^^^^^^^^^^^^^^^^^^^^^^^^^^^^^^^^^^^^^^^^^^^^^^^^^^^^^^^^^^^^^^^^^^^^^^^^^^^^^^^^^^^^^^^^^^^^^^^^^^^^^^^^^^^^^
 [ecj-lint] Resource leak: 'stream' is never closed
 [ecj-lint] ----------
 [ecj-lint] 10. WARNING in /home/jenkins/workspace/Lucene-Solr-master-Linux/solr/solrj/src/test/org/apache/solr/client/solrj/io/stream/StreamExpressionToExpessionTest.java (at line 222)
 [ecj-lint] 	stream = new ReducerStream(StreamExpressionParser.parse("reduce("
 [ecj-lint]                                                   + "search(collection1, q=*:*, fl=\"id,a_s,a_i,a_f\", sort=\"a_s desc, a_f asc\"),"
 [ecj-lint]                                                   + "by=\"a_s\", group(sort=\"a_i desc\", n=\"5\"))"), factory);
 [ecj-lint] 	^^^^^^^^^^^^^^^^^^^^^^^^^^^^^^^^^^^^^^^^^^^^^^^^^^^^^^^^^^^^^^^^^^^^^^^^^^^^^^^^^^^^^^^^^^^^^^^^^^^^^^^^^^^^^^^^^^^^^^^^^^^^^^^^^^^^^^^^^^^^^^^^^^^^^^^^^^^^^^^^^^^^^^^^^^^^^^^^^^^^^^^^^^^^^^^^^^^^^^^^^^^^^^^^^^^^^^^^^^^^^^^^^^^^^^^^^^^^^^^^^^^^^^^^^^^^^^^^^^^^^^^^^^^^^^^^^^^^^^^^^^^^^^^^^^^^^^^^^^^^^^^^^^^^^^
 [ecj-lint] Resource leak: 'stream' is never closed
 [ecj-lint] ----------
 [ecj-lint] 11. WARNING in /home/jenkins/workspace/Lucene-Solr-master-Linux/solr/solrj/src/test/org/apache/solr/client/solrj/io/stream/StreamExpressionToExpessionTest.java (at line 241)
 [ecj-lint] 	UpdateStream updateStream = new UpdateStream(expression, factory);
 [ecj-lint] 	             ^^^^^^^^^^^^
 [ecj-lint] Resource leak: 'updateStream' is never closed
 [ecj-lint] ----------
 [ecj-lint] 12. WARNING in /home/jenkins/workspace/Lucene-Solr-master-Linux/solr/solrj/src/test/org/apache/solr/client/solrj/io/stream/StreamExpressionToExpessionTest.java (at line 256)
 [ecj-lint] 	stream = new FacetStream(StreamExpressionParser.parse("facet("
 [ecj-lint]                                                         +   "collection1, "
 [ecj-lint]                                                         +   "q=\"*:*\", "
 [ecj-lint]                                                         +   "buckets=\"a_s\", "
 [ecj-lint]                                                         +   "bucketSorts=\"sum(a_i) asc\", "
 [ecj-lint]                                                         +   "bucketSizeLimit=100, "
 [ecj-lint]                                                         +   "sum(a_i), sum(a_f), "
 [ecj-lint]                                                         +   "min(a_i), min(a_f), "
 [ecj-lint]                                                         +   "max(a_i), max(a_f), "
 [ecj-lint]                                                         +   "avg(a_i), avg(a_f), "
 [ecj-lint]                                                         +   "count(*)"
 [ecj-lint]                                                         + ")"), factory);
 [ecj-lint] 	^^^^^^^^^^^^^^^^^^^^^^^^^^^^^^^^^^^^^^^^^^^^^^^^^^^^^^^^^^^^^^^^^^^^^^^^^^^^^^^^^^^^^^^^^^^^^^^^^^^^^^^^^^^^^^^^^^^^^^^^^^^^^^^^^^^^^^^^^^^^^^^^^^^^^^^^^^^^^^^^^^^^^^^^^^^^^^^^^^^^^^^^^^^^^^^^^^^^^^^^^^^^^^^^^^^^^^^^^^^^^^^^^^^^^^^^^^^^^^^^^^^^^^^^^^^^^^^^^^^^^^^^^^^^^^^^^^^^^^^^^^^^^^^^^^^^^^^^^^^^^^^^^^^^^^^^^^^^^^^^^^^^^^^^^^^^^^^^^^^^^^^^^^^^^^^^^^^^^^^^^^^^^^^^^^^^^^^^^^^^^^^^^^^^^^^^^^^^^^^^^^^^^^^^^^^^^^^^^^^^^^^^^^^^^^^^^^^^^^^^^^^^^^^^^^^^^^^^^^^^^^^^^^^^^^^^^^^^^^^^^^^^^^^^^^^^^^^^^^^^^^^^^^^^^^^^^^^^^^^^^^^^^^^^^^^^^^^^^^^^^^^^^^^^^^^^^^^^^^^^^^^^^^^^^^^^^^^^^^^^^^^^^^^^^^^^^^^^^^^^^^^^^^^^^^^^^^^^^^^^^^^^^^^^^^^^^^^^^^^^^^^^^^^^^^^^^^^^^^^^^^^^^^^^^^^^^^^^^^^^^^^^^^^^^^^^^^^^^^^^^^^^^^^^^^^^^^^^^^^^^^^^^^^^^^^^^^^^^^^^^^^^^^^^^^^^^^^^^^^^^^^^^^^^^^^^^^^^^^^^^^^^^^^^^^^^^^^^^^^^^^^^^^^^^^^^^^^^^^^^^^^^^^^^^^^^^^^^^^^^^^^^^^^^^^^^^^^^^^^^^^^^^^^^^^^^^^^^^^^^^^^^^^^^^^^^^^^^^^^^^^^^^^^^^^^^^^^^^^^^^^^^^^^^^^^^^^^^^^^^^^^^^
 [ecj-lint] Resource leak: 'stream' is never closed
 [ecj-lint] ----------
 [ecj-lint] 13. WARNING in /home/jenkins/workspace/Lucene-Solr-master-Linux/solr/solrj/src/test/org/apache/solr/client/solrj/io/stream/StreamExpressionToExpessionTest.java (at line 292)
 [ecj-lint] 	stream = new JDBCStream(StreamExpressionParser.parse("jdbc(connection=\"jdbc:hsqldb:mem:.\", sql=\"select PEOPLE.ID, PEOPLE.NAME, COUNTRIES.COUNTRY_NAME from PEOPLE inner join COUNTRIES on PEOPLE.COUNTRY_CODE = COUNTRIES.CODE order by PEOPLE.ID\", sort=\"ID asc\")"), factory);
 [ecj-lint] 	^^^^^^^^^^^^^^^^^^^^^^^^^^^^^^^^^^^^^^^^^^^^^^^^^^^^^^^^^^^^^^^^^^^^^^^^^^^^^^^^^^^^^^^^^^^^^^^^^^^^^^^^^^^^^^^^^^^^^^^^^^^^^^^^^^^^^^^^^^^^^^^^^^^^^^^^^^^^^^^^^^^^^^^^^^^^^^^^^^^^^^^^^^^^^^^^^^^^^^^^^^^^^^^^^^^^^^^^^^^^^^^^^^^^^^^^^^^^^^^^^^^^^^^^^^^^^^^^^^^^^^^^^^^^^^^^^^^^
 [ecj-lint] Resource leak: 'stream' is never closed
 [ecj-lint] ----------
 [ecj-lint] 14. WARNING in /home/jenkins/workspace/Lucene-Solr-master-Linux/solr/solrj/src/test/org/apache/solr/client/solrj/io/stream/StreamExpressionToExpessionTest.java (at line 305)
 [ecj-lint] 	stream = new IntersectStream(StreamExpressionParser.parse("intersect("
 [ecj-lint]                               + "search(collection1, q=\"id:(0 3 4)\", fl=\"id,a_s,a_i,a_f\", sort=\"a_f asc, a_s asc\"),"
 [ecj-lint]                               + "search(collection1, q=\"id:(1 2)\", fl=\"id,a_s,a_i,a_f\", sort=\"a_f asc, a_s asc\"),"
 [ecj-lint]                               + "on=\"a_f, a_s\")"), factory);
 [ecj-lint] 	^^^^^^^^^^^^^^^^^^^^^^^^^^^^^^^^^^^^^^^^^^^^^^^^^^^^^^^^^^^^^^^^^^^^^^^^^^^^^^^^^^^^^^^^^^^^^^^^^^^^^^^^^^^^^^^^^^^^^^^^^^^^^^^^^^^^^^^^^^^^^^^^^^^^^^^^^^^^^^^^^^^^^^^^^^^^^^^^^^^^^^^^^^^^^^^^^^^^^^^^^^^^^^^^^^^^^^^^^^^^^^^^^^^^^^^^^^^^^^^^^^^^^^^^^^^^^^^^^^^^^^^^^^^^^^^^^^^^^^^^^^^^^^^^^^^^^^^^^^^^^^^^^^^^^^^^^^^^^^^^^^^^^^^^^^^^^^^^^^^^^^^^^^^^^^^^^^^^^^^^^^^^^^^^^^^^^^^^
 [ecj-lint] Resource leak: 'stream' is never closed
 [ecj-lint] ----------
 [ecj-lint] 15. WARNING in /home/jenkins/workspace/Lucene-Solr-master-Linux/solr/solrj/src/test/org/apache/solr/client/solrj/io/stream/StreamExpressionToExpessionTest.java (at line 321)
 [ecj-lint] 	stream = new ComplementStream(StreamExpressionParser.parse("complement("
 [ecj-lint]                               + "search(collection1, q=\"id:(0 3 4)\", fl=\"id,a_s,a_i,a_f\", sort=\"a_f asc, a_s asc\"),"
 [ecj-lint]                               + "search(collection1, q=\"id:(1 2)\", fl=\"id,a_s,a_i,a_f\", sort=\"a_f asc, a_s asc\"),"
 [ecj-lint]                               + "on=\"a_f, a_s\")"), factory);
 [ecj-lint] 	^^^^^^^^^^^^^^^^^^^^^^^^^^^^^^^^^^^^^^^^^^^^^^^^^^^^^^^^^^^^^^^^^^^^^^^^^^^^^^^^^^^^^^^^^^^^^^^^^^^^^^^^^^^^^^^^^^^^^^^^^^^^^^^^^^^^^^^^^^^^^^^^^^^^^^^^^^^^^^^^^^^^^^^^^^^^^^^^^^^^^^^^^^^^^^^^^^^^^^^^^^^^^^^^^^^^^^^^^^^^^^^^^^^^^^^^^^^^^^^^^^^^^^^^^^^^^^^^^^^^^^^^^^^^^^^^^^^^^^^^^^^^^^^^^^^^^^^^^^^^^^^^^^^^^^^^^^^^^^^^^^^^^^^^^^^^^^^^^^^^^^^^^^^^^^^^^^^^^^^^^^^^^^^^^^^^^^^^^^
 [ecj-lint] Resource leak: 'stream' is never closed
 [ecj-lint] ----------
 [ecj-lint] 16. WARNING in /home/jenkins/workspace/Lucene-Solr-master-Linux/solr/solrj/src/test/org/apache/solr/client/solrj/io/stream/StreamExpressionToExpessionTest.java (at line 340)
 [ecj-lint] 	CloudSolrStream firstStream = new CloudSolrStream(StreamExpressionParser.parse(originalExpressionString), factory);
 [ecj-lint] 	                ^^^^^^^^^^^
 [ecj-lint] Resource leak: 'firstStream' is never closed
 [ecj-lint] ----------
 [ecj-lint] 17. WARNING in /home/jenkins/workspace/Lucene-Solr-master-Linux/solr/solrj/src/test/org/apache/solr/client/solrj/io/stream/StreamExpressionToExpessionTest.java (at line 343)
 [ecj-lint] 	CloudSolrStream secondStream = new CloudSolrStream(StreamExpressionParser.parse(firstExpressionString), factory);
 [ecj-lint] 	                ^^^^^^^^^^^^
 [ecj-lint] Resource leak: 'secondStream' is never closed
 [ecj-lint] ----------
 [ecj-lint] 18. WARNING in /home/jenkins/workspace/Lucene-Solr-master-Linux/solr/solrj/src/test/org/apache/solr/client/solrj/io/stream/StreamExpressionToExpessionTest.java (at line 353)
 [ecj-lint] 	FeaturesSelectionStream stream = new FeaturesSelectionStream(StreamExpressionParser.parse(expr), factory);
 [ecj-lint] 	                        ^^^^^^
 [ecj-lint] Resource leak: 'stream' is never closed
 [ecj-lint] ----------
 [ecj-lint] 19. WARNING in /home/jenkins/workspace/Lucene-Solr-master-Linux/solr/solrj/src/test/org/apache/solr/client/solrj/io/stream/StreamExpressionToExpessionTest.java (at line 373)
 [ecj-lint] 	TextLogitStream logitStream = new TextLogitStream(StreamExpressionParser.parse(expr), factory);
 [ecj-lint] 	                ^^^^^^^^^^^
 [ecj-lint] Resource leak: 'logitStream' is never closed
 [ecj-lint] ----------
 [ecj-lint] ----------
 [ecj-lint] 20. WARNING in /home/jenkins/workspace/Lucene-Solr-master-Linux/solr/solrj/src/test/org/apache/solr/client/solrj/io/stream/StreamExpressionToExplanationTest.java (at line 76)
 [ecj-lint] 	stream = new CloudSolrStream(StreamExpressionParser.parse("search(collection1, q=*:*, fl=\"id,a_s,a_i,a_f\", sort=\"a_f asc, a_i asc\")"), factory);
 [ecj-lint] 	^^^^^^^^^^^^^^^^^^^^^^^^^^^^^^^^^^^^^^^^^^^^^^^^^^^^^^^^^^^^^^^^^^^^^^^^^^^^^^^^^^^^^^^^^^^^^^^^^^^^^^^^^^^^^^^^^^^^^^^^^^^^^^^^^^^^^^^^^^^^^^^^^^^
 [ecj-lint] Resource leak: 'stream' is never closed
 [ecj-lint] ----------
 [ecj-lint] 21. WARNING in /home/jenkins/workspace/Lucene-Solr-master-Linux/solr/solrj/src/test/org/apache/solr/client/solrj/io/stream/StreamExpressionToExplanationTest.java (at line 89)
 [ecj-lint] 	stream = new SelectStream(StreamExpressionParser.parse("select(\"a_s as fieldA\", search(collection1, q=*:*, fl=\"id,a_s,a_i,a_f\", sort=\"a_f asc, a_i asc\"))"), factory);
 [ecj-lint] 	^^^^^^^^^^^^^^^^^^^^^^^^^^^^^^^^^^^^^^^^^^^^^^^^^^^^^^^^^^^^^^^^^^^^^^^^^^^^^^^^^^^^^^^^^^^^^^^^^^^^^^^^^^^^^^^^^^^^^^^^^^^^^^^^^^^^^^^^^^^^^^^^^^^^^^^^^^^^^^^^^^^^^^^^^^^
 [ecj-lint] Resource leak: 'stream' is never closed
 [ecj-lint] ----------
 [ecj-lint] 22. WARNING in /home/jenkins/workspace/Lucene-Solr-master-Linux/solr/solrj/src/test/org/apache/solr/client/solrj/io/stream/StreamExpressionToExplanationTest.java (at line 101)
 [ecj-lint] 	stream = new DaemonStream(StreamExpressionParser.parse("daemon(search(collection1, q=*:*, fl=\"id,a_s,a_i,a_f\", sort=\"a_f asc, a_i asc\"), id=\"blah\", runInterval=\"1000\", queueSize=\"100\")"), factory);
 [ecj-lint] 	^^^^^^^^^^^^^^^^^^^^^^^^^^^^^^^^^^^^^^^^^^^^^^^^^^^^^^^^^^^^^^^^^^^^^^^^^^^^^^^^^^^^^^^^^^^^^^^^^^^^^^^^^^^^^^^^^^^^^^^^^^^^^^^^^^^^^^^^^^^^^^^^^^^^^^^^^^^^^^^^^^^^^^^^^^^^^^^^^^^^^^^^^^^^^^^^^^^^^^^^^^^^^^
 [ecj-lint] Resource leak: 'stream' is never closed
 [ecj-lint] ----------
 [ecj-lint] 23. WARNING in /home/jenkins/workspace/Lucene-Solr-master-Linux/solr/solrj/src/test/org/apache/solr/client/solrj/io/stream/StreamExpressionToExplanationTest.java (at line 113)
 [ecj-lint] 	stream = new TopicStream(StreamExpressionParser.parse("topic(collection2, collection1, q=*:*, fl=\"id,a_s,a_i,a_f\", id=\"blah\", checkpointEvery=1000)"), factory);
 [ecj-lint] 	^^^^^^^^^^^^^^^^^^^^^^^^^^^^^^^^^^^^^^^^^^^^^^^^^^^^^^^^^^^^^^^^^^^^^^^^^^^^^^^^^^^^^^^^^^^^^^^^^^^^^^^^^^^^^^^^^^^^^^^^^^^^^^^^^^^^^^^^^^^^^^^^^^^^^^^^^^^^^^^^^^^
 [ecj-lint] Resource leak: 'stream' is never closed
 [ecj-lint] ----------
 [ecj-lint] 24. WARNING in /home/jenkins/workspace/Lucene-Solr-master-Linux/solr/solrj/src/test/org/apache/solr/client/solrj/io/stream/StreamExpressionToExplanationTest.java (at line 126)
 [ecj-lint] 	stream = new StatsStream(StreamExpressionParser.parse("stats(collection1, q=*:*, fl=\"id,a_s,a_i,a_f\", sort=\"a_f asc, a_i asc\", sum(a_i), avg(a_i), count(*), min(a_i), max(a_i))"), factory);
 [ecj-lint] 	^^^^^^^^^^^^^^^^^^^^^^^^^^^^^^^^^^^^^^^^^^^^^^^^^^^^^^^^^^^^^^^^^^^^^^^^^^^^^^^^^^^^^^^^^^^^^^^^^^^^^^^^^^^^^^^^^^^^^^^^^^^^^^^^^^^^^^^^^^^^^^^^^^^^^^^^^^^^^^^^^^^^^^^^^^^^^^^^^^^^^^^^^^^^^^^^
 [ecj-lint] Resource leak: 'stream' is never closed
 [ecj-lint] ----------
 [ecj-lint] 25. WARNING in /home/jenkins/workspace/Lucene-Solr-master-Linux/solr/solrj/src/test/org/apache/solr/client/solrj/io/stream/StreamExpressionToExplanationTest.java (at line 139)
 [ecj-lint] 	stream = new UniqueStream(StreamExpressionParser.parse("unique(search(collection1, q=*:*, fl=\"id,a_s,a_i,a_f\", sort=\"a_f asc, a_i asc\"), over=\"a_f\")"), factory);
 [ecj-lint] 	^^^^^^^^^^^^^^^^^^^^^^^^^^^^^^^^^^^^^^^^^^^^^^^^^^^^^^^^^^^^^^^^^^^^^^^^^^^^^^^^^^^^^^^^^^^^^^^^^^^^^^^^^^^^^^^^^^^^^^^^^^^^^^^^^^^^^^^^^^^^^^^^^^^^^^^^^^^^^^^^^^^^^^
 [ecj-lint] Resource leak: 'stream' is never closed
 [ecj-lint] ----------
 [ecj-lint] 26. WARNING in /home/jenkins/workspace/Lucene-Solr-master-Linux/solr/solrj/src/test/org/apache/solr/client/solrj/io/stream/StreamExpressionToExplanationTest.java (at line 151)
 [ecj-lint] 	stream = new MergeStream(StreamExpressionParser.parse("merge("
 [ecj-lint]                               + "search(collection1, q=\"id:(0 3 4)\", fl=\"id,a_s,a_i,a_f\", sort=\"a_f asc, a_s asc\"),"
 [ecj-lint]                               + "search(collection1, q=\"id:(1 2)\", fl=\"id,a_s,a_i,a_f\", sort=\"a_f asc, a_s asc\"),"
 [ecj-lint]                               + "on=\"a_f asc, a_s asc\")"), factory);
 [ecj-lint] 	^^^^^^^^^^^^^^^^^^^^^^^^^^^^^^^^^^^^^^^^^^^^^^^^^^^^^^^^^^^^^^^^^^^^^^^^^^^^^^^^^^^^^^^^^^^^^^^^^^^^^^^^^^^^^^^^^^^^^^^^^^^^^^^^^^^^^^^^^^^^^^^^^^^^^^^^^^^^^^^^^^^^^^^^^^^^^^^^^^^^^^^^^^^^^^^^^^^^^^^^^^^^^^^^^^^^^^^^^^^^^^^^^^^^^^^^^^^^^^^^^^^^^^^^^^^^^^^^^^^^^^^^^^^^^^^^^^^^^^^^^^^^^^^^^^^^^^^^^^^^^^^^^^^^^^^^^^^^^^^^^^^^^^^^^^^^^^^^^^^^^^^^^^^^^^^^^^^^^^^^^^^^^^^^^^^^^^^^
 [ecj-lint] Resource leak: 'stream' is never closed
 [ecj-lint] ----------
 [ecj-lint] 27. WARNING in /home/jenkins/workspace/Lucene-Solr-master-Linux/solr/solrj/src/test/org/apache/solr/client/solrj/io/stream/StreamExpressionToExplanationTest.java (at line 168)
 [ecj-lint] 	stream = new RankStream(StreamExpressionParser.parse("top("
 [ecj-lint]                                               + "n=3,"
 [ecj-lint]                                               + "search(collection1, q=*:*, fl=\"id,a_s,a_i,a_f\", sort=\"a_f asc,a_i asc\"),"
 [ecj-lint]                                               + "sort=\"a_f asc, a_i asc\")"), factory);
 [ecj-lint] 	^^^^^^^^^^^^^^^^^^^^^^^^^^^^^^^^^^^^^^^^^^^^^^^^^^^^^^^^^^^^^^^^^^^^^^^^^^^^^^^^^^^^^^^^^^^^^^^^^^^^^^^^^^^^^^^^^^^^^^^^^^^^^^^^^^^^^^^^^^^^^^^^^^^^^^^^^^^^^^^^^^^^^^^^^^^^^^^^^^^^^^^^^^^^^^^^^^^^^^^^^^^^^^^^^^^^^^^^^^^^^^^^^^^^^^^^^^^^^^^^^^^^^^^^^^^^^^^^^^^^^^^^^^^^^^^^^^^^^^^^^^^^^^^^^^^^^^^^^^^^^^^^^^^^^^^^^^^^^^^^^^^^^^^^^
 [ecj-lint] Resource leak: 'stream' is never closed
 [ecj-lint] ----------
 [ecj-lint] 28. WARNING in /home/jenkins/workspace/Lucene-Solr-master-Linux/solr/solrj/src/test/org/apache/solr/client/solrj/io/stream/StreamExpressionToExplanationTest.java (at line 185)
 [ecj-lint] 	stream = new ReducerStream(StreamExpressionParser.parse("reduce("
 [ecj-lint]                                                   + "search(collection1, q=*:*, fl=\"id,a_s,a_i,a_f\", sort=\"a_s desc, a_f asc\"),"
 [ecj-lint]                                                   + "by=\"a_s\", group(sort=\"a_i desc\", n=\"5\"))"), factory);
 [ecj-lint] 	^^^^^^^^^^^^^^^^^^^^^^^^^^^^^^^^^^^^^^^^^^^^^^^^^^^^^^^^^^^^^^^^^^^^^^^^^^^^^^^^^^^^^^^^^^^^^^^^^^^^^^^^^^^^^^^^^^^^^^^^^^^^^^^^^^^^^^^^^^^^^^^^^^^^^^^^^^^^^^^^^^^^^^^^^^^^^^^^^^^^^^^^^^^^^^^^^^^^^^^^^^^^^^^^^^^^^^^^^^^^^^^^^^^^^^^^^^^^^^^^^^^^^^^^^^^^^^^^^^^^^^^^^^^^^^^^^^^^^^^^^^^^^^^^^^^^^^^^^^^^^^^^^^^^^^
 [ecj-lint] Resource leak: 'stream' is never closed
 [ecj-lint] ----------
 [ecj-lint] 29. WARNING in /home/jenkins/workspace/Lucene-Solr-master-Linux/solr/solrj/src/test/org/apache/solr/client/solrj/io/stream/StreamExpressionToExplanationTest.java (at line 205)
 [ecj-lint] 	UpdateStream updateStream = new UpdateStream(expression, factory);
 [ecj-lint] 	             ^^^^^^^^^^^^
 [ecj-lint] Resource leak: 'updateStream' is never closed
 [ecj-lint] ----------
 [ecj-lint] 30. WARNING in /home/jenkins/workspace/Lucene-Solr-master-Linux/solr/solrj/src/test/org/apache/solr/client/solrj/io/stream/StreamExpressionToExplanationTest.java (at line 224)
 [ecj-lint] 	stream = new FacetStream(StreamExpressionParser.parse("facet("
 [ecj-lint]                                                         +   "collection1, "
 [ecj-lint]                                                         +   "q=\"*:*\", "
 [ecj-lint]                                                         +   "buckets=\"a_s\", "
 [ecj-lint]                                                         +   "bucketSorts=\"sum(a_i) asc\", "
 [ecj-lint]                                                         +   "bucketSizeLimit=100, "
 [ecj-lint]                                                         +   "sum(a_i), sum(a_f), "
 [ecj-lint]                                                         +   "min(a_i), min(a_f), "
 [ecj-lint]                                                         +   "max(a_i), max(a_f), "
 [ecj-lint]                                                         +   "avg(a_i), avg(a_f), "
 [ecj-lint]                                                         +   "count(*)"
 [ecj-lint]                                                         + ")"), factory);
 [ecj-lint] 	^^^^^^^^^^^^^^^^^^^^^^^^^^^^^^^^^^^^^^^^^^^^^^^^^^^^^^^^^^^^^^^^^^^^^^^^^^^^^^^^^^^^^^^^^^^^^^^^^^^^^^^^^^^^^^^^^^^^^^^^^^^^^^^^^^^^^^^^^^^^^^^^^^^^^^^^^^^^^^^^^^^^^^^^^^^^^^^^^^^^^^^^^^^^^^^^^^^^^^^^^^^^^^^^^^^^^^^^^^^^^^^^^^^^^^^^^^^^^^^^^^^^^^^^^^^^^^^^^^^^^^^^^^^^^^^^^^^^^^^^^^^^^^^^^^^^^^^^^^^^^^^^^^^^^^^^^^^^^^^^^^^^^^^^^^^^^^^^^^^^^^^^^^^^^^^^^^^^^^^^^^^^^^^^^^^^^^^^^^^^^^^^^^^^^^^^^^^^^^^^^^^^^^^^^^^^^^^^^^^^^^^^^^^^^^^^^^^^^^^^^^^^^^^^^^^^^^^^^^^^^^^^^^^^^^^^^^^^^^^^^^^^^^^^^^^^^^^^^^^^^^^^^^^^^^^^^^^^^^^^^^^^^^^^^^^^^^^^^^^^^^^^^^^^^^^^^^^^^^^^^^^^^^^^^^^^^^^^^^^^^^^^^^^^^^^^^^^^^^^^^^^^^^^^^^^^^^^^^^^^^^^^^^^^^^^^^^^^^^^^^^^^^^^^^^^^^^^^^^^^^^^^^^^^^^^^^^^^^^^^^^^^^^^^^^^^^^^^^^^^^^^^^^^^^^^^^^^^^^^^^^^^^^^^^^^^^^^^^^^^^^^^^^^^^^^^^^^^^^^^^^^^^^^^^^^^^^^^^^^^^^^^^^^^^^^^^^^^^^^^^^^^^^^^^^^^^^^^^^^^^^^^^^^^^^^^^^^^^^^^^^^^^^^^^^^^^^^^^^^^^^^^^^^^^^^^^^^^^^^^^^^^^^^^^^^^^^^^^^^^^^^^^^^^^^^^^^^^^^^^^^^^^^^^^^^^^^^^^^^^^^^^^
 [ecj-lint] Resource leak: 'stream' is never closed
 [ecj-lint] ----------
 [ecj-lint] 31. WARNING in /home/jenkins/workspace/Lucene-Solr-master-Linux/solr/solrj/src/test/org/apache/solr/client/solrj/io/stream/StreamExpressionToExplanationTest.java (at line 250)
 [ecj-lint] 	stream = new JDBCStream(StreamExpressionParser.parse("jdbc(connection=\"jdbc:hsqldb:mem:.\", sql=\"select PEOPLE.ID, PEOPLE.NAME, COUNTRIES.COUNTRY_NAME from PEOPLE inner join COUNTRIES on PEOPLE.COUNTRY_CODE = COUNTRIES.CODE order by PEOPLE.ID\", sort=\"ID asc\")"), factory);
 [ecj-lint] 	^^^^^^^^^^^^^^^^^^^^^^^^^^^^^^^^^^^^^^^^^^^^^^^^^^^^^^^^^^^^^^^^^^^^^^^^^^^^^^^^^^^^^^^^^^^^^^^^^^^^^^^^^^^^^^^^^^^^^^^^^^^^^^^^^^^^^^^^^^^^^^^^^^^^^^^^^^^^^^^^^^^^^^^^^^^^^^^^^^^^^^^^^^^^^^^^^^^^^^^^^^^^^^^^^^^^^^^^^^^^^^^^^^^^^^^^^^^^^^^^^^^^^^^^^^^^^^^^^^^^^^^^^^^^^^^^^^^^
 [ecj-lint] Resource leak: 'stream' is never closed
 [ecj-lint] ----------
 [ecj-lint] 32. WARNING in /home/jenkins/workspace/Lucene-Solr-master-Linux/solr/solrj/src/test/org/apache/solr/client/solrj/io/stream/StreamExpressionToExplanationTest.java (at line 263)
 [ecj-lint] 	stream = new IntersectStream(StreamExpressionParser.parse("intersect("
 [ecj-lint]                               + "search(collection1, q=\"id:(0 3 4)\", fl=\"id,a_s,a_i,a_f\", sort=\"a_f asc, a_s asc\"),"
 [ecj-lint]                               + "search(collection1, q=\"id:(1 2)\", fl=\"id,a_s,a_i,a_f\", sort=\"a_f asc, a_s asc\"),"
 [ecj-lint]                               + "on=\"a_f, a_s\")"), factory);
 [ecj-lint] 	^^^^^^^^^^^^^^^^^^^^^^^^^^^^^^^^^^^^^^^^^^^^^^^^^^^^^^^^^^^^^^^^^^^^^^^^^^^^^^^^^^^^^^^^^^^^^^^^^^^^^^^^^^^^^^^^^^^^^^^^^^^^^^^^^^^^^^^^^^^^^^^^^^^^^^^^^^^^^^^^^^^^^^^^^^^^^^^^^^^^^^^^^^^^^^^^^^^^^^^^^^^^^^^^^^^^^^^^^^^^^^^^^^^^^^^^^^^^^^^^^^^^^^^^^^^^^^^^^^^^^^^^^^^^^^^^^^^^^^^^^^^^^^^^^^^^^^^^^^^^^^^^^^^^^^^^^^^^^^^^^^^^^^^^^^^^^^^^^^^^^^^^^^^^^^^^^^^^^^^^^^^^^^^^^^^^^^^^
 [ecj-lint] Resource leak: 'stream' is never closed
 [ecj-lint] ----------
 [ecj-lint] 33. WARNING in /home/jenkins/workspace/Lucene-Solr-master-Linux/solr/solrj/src/test/org/apache/solr/client/solrj/io/stream/StreamExpressionToExplanationTest.java (at line 279)
 [ecj-lint] 	stream = new ComplementStream(StreamExpressionParser.parse("complement("
 [ecj-lint]                               + "search(collection1, q=\"id:(0 3 4)\", fl=\"id,a_s,a_i,a_f\", sort=\"a_f asc, a_s asc\"),"
 [ecj-lint]                               + "search(collection1, q=\"id:(1 2)\", fl=\"id,a_s,a_i,a_f\", sort=\"a_f asc, a_s asc\"),"
 [ecj-lint]                               + "on=\"a_f, a_s\")"), factory);
 [ecj-lint] 	^^^^^^^^^^^^^^^^^^^^^^^^^^^^^^^^^^^^^^^^^^^^^^^^^^^^^^^^^^^^^^^^^^^^^^^^^^^^^^^^^^^^^^^^^^^^^^^^^^^^^^^^^^^^^^^^^^^^^^^^^^^^^^^^^^^^^^^^^^^^^^^^^^^^^^^^^^^^^^^^^^^^^^^^^^^^^^^^^^^^^^^^^^^^^^^^^^^^^^^^^^^^^^^^^^^^^^^^^^^^^^^^^^^^^^^^^^^^^^^^^^^^^^^^^^^^^^^^^^^^^^^^^^^^^^^^^^^^^^^^^^^^^^^^^^^^^^^^^^^^^^^^^^^^^^^^^^^^^^^^^^^^^^^^^^^^^^^^^^^^^^^^^^^^^^^^^^^^^^^^^^^^^^^^^^^^^^^^^^
 [ecj-lint] Resource leak: 'stream' is never closed
 [ecj-lint] ----------
 [ecj-lint] ----------
 [ecj-lint] 34. WARNING in /home/jenkins/workspace/Lucene-Solr-master-Linux/solr/solrj/src/test/org/apache/solr/client/solrj/io/stream/StreamingTest.java (at line 159)
 [ecj-lint] 	CloudSolrStream stream = new CloudSolrStream("", "collection1", sParams);
 [ecj-lint] 	                ^^^^^^
 [ecj-lint] Resource leak: 'stream' is never closed
 [ecj-lint] ----------
 [ecj-lint] ----------
 [ecj-lint] 35. ERROR in /home/jenkins/workspace/Lucene-Solr-master-Linux/solr/solrj/src/test/org/apache/solr/client/solrj/request/SchemaTest.java (at line 31)
 [ecj-lint] 	import org.apache.solr.api.ApiBag;
 [ecj-lint] 	       ^^^^^^^^^^^^^^^^^^^^^^^^^^
 [ecj-lint] The import org.apache.solr.api.ApiBag is never used
 [ecj-lint] ----------
 [ecj-lint] ----------
 [ecj-lint] 36. WARNING in /home/jenkins/workspace/Lucene-Solr-master-Linux/solr/solrj/src/test/org/apache/solr/client/solrj/response/NoOpResponseParserTest.java (at line 52)
 [ecj-lint] 	return new SolrResourceLoader().openResource("solrj/sampleRangeFacetResponse.xml");
 [ecj-lint] 	       ^^^^^^^^^^^^^^^^^^^^^^^^
 [ecj-lint] Resource leak: '<unassigned Closeable value>' is never closed
 [ecj-lint] ----------
 [ecj-lint] ----------
 [ecj-lint] 37. WARNING in /home/jenkins/workspace/Lucene-Solr-master-Linux/solr/solrj/src/test/org/apache/solr/client/solrj/response/QueryResponseTest.java (at line 46)
 [ecj-lint] 	InputStream is = new SolrResourceLoader().openResource("solrj/sampleRangeFacetResponse.xml");
 [ecj-lint] 	                 ^^^^^^^^^^^^^^^^^^^^^^^^
 [ecj-lint] Resource leak: '<unassigned Closeable value>' is never closed
 [ecj-lint] ----------
 [ecj-lint] 38. WARNING in /home/jenkins/workspace/Lucene-Solr-master-Linux/solr/solrj/src/test/org/apache/solr/client/solrj/response/QueryResponseTest.java (at line 103)
 [ecj-lint] 	InputStream is = new SolrResourceLoader().openResource("solrj/sampleGroupResponse.xml");
 [ecj-lint] 	                 ^^^^^^^^^^^^^^^^^^^^^^^^
 [ecj-lint] Resource leak: '<unassigned Closeable value>' is never closed
 [ecj-lint] ----------
 [ecj-lint] 39. WARNING in /home/jenkins/workspace/Lucene-Solr-master-Linux/solr/solrj/src/test/org/apache/solr/client/solrj/response/QueryResponseTest.java (at line 205)
 [ecj-lint] 	InputStream is = new SolrResourceLoader().openResource("solrj/sampleSimpleGroupResponse.xml");
 [ecj-lint] 	                 ^^^^^^^^^^^^^^^^^^^^^^^^
 [ecj-lint] Resource leak: '<unassigned Closeable value>' is never closed
 [ecj-lint] ----------
 [ecj-lint] ----------
 [ecj-lint] 40. WARNING in /home/jenkins/workspace/Lucene-Solr-master-Linux/solr/solrj/src/test/org/apache/solr/client/solrj/response/TestClusteringResponse.java (at line 41)
 [ecj-lint] 	InputStream is = new SolrResourceLoader().openResource("solrj/sampleClusteringResponse.xml");
 [ecj-lint] 	                 ^^^^^^^^^^^^^^^^^^^^^^^^
 [ecj-lint] Resource leak: '<unassigned Closeable value>' is never closed
 [ecj-lint] ----------
 [ecj-lint] ----------
 [ecj-lint] 41. WARNING in /home/jenkins/workspace/Lucene-Solr-master-Linux/solr/solrj/src/test/org/apache/solr/common/util/ContentStreamTest.java (at line 48)
 [ecj-lint] 	InputStream is = new SolrResourceLoader().openResource( "solrj/README" );
 [ecj-lint] 	                 ^^^^^^^^^^^^^^^^^^^^^^^^
 [ecj-lint] Resource leak: '<unassigned Closeable value>' is never closed
 [ecj-lint] ----------
 [ecj-lint] 42. WARNING in /home/jenkins/workspace/Lucene-Solr-master-Linux/solr/solrj/src/test/org/apache/solr/common/util/ContentStreamTest.java (at line 77)
 [ecj-lint] 	InputStream is = new SolrResourceLoader().openResource( "solrj/README" );
 [ecj-lint] 	                 ^^^^^^^^^^^^^^^^^^^^^^^^
 [ecj-lint] Resource leak: '<unassigned Closeable value>' is never closed
 [ecj-lint] ----------
 [ecj-lint] 42 problems (1 error, 41 warnings)

BUILD FAILED
/home/jenkins/workspace/Lucene-Solr-master-Linux/build.xml:836: The following error occurred while executing this line:
/home/jenkins/workspace/Lucene-Solr-master-Linux/build.xml:101: The following error occurred while executing this line:
/home/jenkins/workspace/Lucene-Solr-master-Linux/solr/build.xml:684: The following error occurred while executing this line:
/home/jenkins/workspace/Lucene-Solr-master-Linux/lucene/common-build.xml:2111: The following error occurred while executing this line:
/home/jenkins/workspace/Lucene-Solr-master-Linux/lucene/common-build.xml:2144: Compile failed; see the compiler error output for details.

Total time: 85 minutes 8 seconds
Build step 'Invoke Ant' marked build as failure
Archiving artifacts
[WARNINGS] Skipping publisher since build result is FAILURE
Recording test results
Email was triggered for: Failure - Any
Sending email for trigger: Failure - Any

Mime
View raw message