lucene-dev mailing list archives

Site index · List index
Message view « Date » · « Thread »
Top « Date » · « Thread »
From Policeman Jenkins Server <jenk...@thetaphi.de>
Subject [JENKINS] Lucene-Solr-7.x-MacOSX (64bit/jdk1.8.0) - Build # 424 - Still Unstable!
Date Sat, 27 Jan 2018 13:49:39 GMT
Build: https://jenkins.thetaphi.de/job/Lucene-Solr-7.x-MacOSX/424/
Java: 64bit/jdk1.8.0 -XX:-UseCompressedOops -XX:+UseParallelGC

8 tests failed.
FAILED:  org.apache.solr.cloud.LeaderFailoverAfterPartitionTest.test

Error Message:
Expected 2 of 3 replicas to be active but only found 1; [core_node5:{"core":"c8n_1x3_lf_shard1_replica_n2","base_url":"http://127.0.0.1:52238/_c","node_name":"127.0.0.1:52238__c","state":"active","type":"NRT","leader":"true"}]; clusterState: DocCollection(c8n_1x3_lf//collections/c8n_1x3_lf/state.json/17)={   "pullReplicas":"0",   "replicationFactor":"1",   "shards":{"shard1":{       "range":"80000000-7fffffff",       "state":"active",       "replicas":{         "core_node4":{           "state":"down",           "base_url":"http://127.0.0.1:52268/_c",           "core":"c8n_1x3_lf_shard1_replica_n1",           "node_name":"127.0.0.1:52268__c",           "type":"NRT"},         "core_node5":{           "core":"c8n_1x3_lf_shard1_replica_n2",           "base_url":"http://127.0.0.1:52238/_c",           "node_name":"127.0.0.1:52238__c",           "state":"active",           "type":"NRT",           "leader":"true"},         "core_node6":{           "core":"c8n_1x3_lf_shard1_replica_n3",           "base_url":"http://127.0.0.1:52253/_c",           "node_name":"127.0.0.1:52253__c",           "state":"down",           "type":"NRT"}}}},   "router":{"name":"compositeId"},   "maxShardsPerNode":"1",   "autoAddReplicas":"false",   "nrtReplicas":"3",   "tlogReplicas":"0"}

Stack Trace:
java.lang.AssertionError: Expected 2 of 3 replicas to be active but only found 1; [core_node5:{"core":"c8n_1x3_lf_shard1_replica_n2","base_url":"http://127.0.0.1:52238/_c","node_name":"127.0.0.1:52238__c","state":"active","type":"NRT","leader":"true"}]; clusterState: DocCollection(c8n_1x3_lf//collections/c8n_1x3_lf/state.json/17)={
  "pullReplicas":"0",
  "replicationFactor":"1",
  "shards":{"shard1":{
      "range":"80000000-7fffffff",
      "state":"active",
      "replicas":{
        "core_node4":{
          "state":"down",
          "base_url":"http://127.0.0.1:52268/_c",
          "core":"c8n_1x3_lf_shard1_replica_n1",
          "node_name":"127.0.0.1:52268__c",
          "type":"NRT"},
        "core_node5":{
          "core":"c8n_1x3_lf_shard1_replica_n2",
          "base_url":"http://127.0.0.1:52238/_c",
          "node_name":"127.0.0.1:52238__c",
          "state":"active",
          "type":"NRT",
          "leader":"true"},
        "core_node6":{
          "core":"c8n_1x3_lf_shard1_replica_n3",
          "base_url":"http://127.0.0.1:52253/_c",
          "node_name":"127.0.0.1:52253__c",
          "state":"down",
          "type":"NRT"}}}},
  "router":{"name":"compositeId"},
  "maxShardsPerNode":"1",
  "autoAddReplicas":"false",
  "nrtReplicas":"3",
  "tlogReplicas":"0"}
	at __randomizedtesting.SeedInfo.seed([C98B0B0C27CBFDD4:41DF34D68937902C]:0)
	at org.junit.Assert.fail(Assert.java:93)
	at org.junit.Assert.assertTrue(Assert.java:43)
	at org.apache.solr.cloud.LeaderFailoverAfterPartitionTest.testRf3WithLeaderFailover(LeaderFailoverAfterPartitionTest.java:169)
	at org.apache.solr.cloud.LeaderFailoverAfterPartitionTest.test(LeaderFailoverAfterPartitionTest.java:56)
	at sun.reflect.NativeMethodAccessorImpl.invoke0(Native Method)
	at sun.reflect.NativeMethodAccessorImpl.invoke(NativeMethodAccessorImpl.java:62)
	at sun.reflect.DelegatingMethodAccessorImpl.invoke(DelegatingMethodAccessorImpl.java:43)
	at java.lang.reflect.Method.invoke(Method.java:498)
	at com.carrotsearch.randomizedtesting.RandomizedRunner.invoke(RandomizedRunner.java:1737)
	at com.carrotsearch.randomizedtesting.RandomizedRunner$8.evaluate(RandomizedRunner.java:934)
	at com.carrotsearch.randomizedtesting.RandomizedRunner$9.evaluate(RandomizedRunner.java:970)
	at com.carrotsearch.randomizedtesting.RandomizedRunner$10.evaluate(RandomizedRunner.java:984)
	at org.apache.solr.BaseDistributedSearchTestCase$ShardsRepeatRule$ShardsFixedStatement.callStatement(BaseDistributedSearchTestCase.java:993)
	at org.apache.solr.BaseDistributedSearchTestCase$ShardsRepeatRule$ShardsStatement.evaluate(BaseDistributedSearchTestCase.java:968)
	at com.carrotsearch.randomizedtesting.rules.SystemPropertiesRestoreRule$1.evaluate(SystemPropertiesRestoreRule.java:57)
	at org.apache.lucene.util.TestRuleSetupTeardownChained$1.evaluate(TestRuleSetupTeardownChained.java:49)
	at org.apache.lucene.util.AbstractBeforeAfterRule$1.evaluate(AbstractBeforeAfterRule.java:45)
	at org.apache.lucene.util.TestRuleThreadAndTestName$1.evaluate(TestRuleThreadAndTestName.java:48)
	at org.apache.lucene.util.TestRuleIgnoreAfterMaxFailures$1.evaluate(TestRuleIgnoreAfterMaxFailures.java:64)
	at org.apache.lucene.util.TestRuleMarkFailure$1.evaluate(TestRuleMarkFailure.java:47)
	at com.carrotsearch.randomizedtesting.rules.StatementAdapter.evaluate(StatementAdapter.java:36)
	at com.carrotsearch.randomizedtesting.ThreadLeakControl$StatementRunner.run(ThreadLeakControl.java:368)
	at com.carrotsearch.randomizedtesting.ThreadLeakControl.forkTimeoutingTask(ThreadLeakControl.java:817)
	at com.carrotsearch.randomizedtesting.ThreadLeakControl$3.evaluate(ThreadLeakControl.java:468)
	at com.carrotsearch.randomizedtesting.RandomizedRunner.runSingleTest(RandomizedRunner.java:943)
	at com.carrotsearch.randomizedtesting.RandomizedRunner$5.evaluate(RandomizedRunner.java:829)
	at com.carrotsearch.randomizedtesting.RandomizedRunner$6.evaluate(RandomizedRunner.java:879)
	at com.carrotsearch.randomizedtesting.RandomizedRunner$7.evaluate(RandomizedRunner.java:890)
	at com.carrotsearch.randomizedtesting.rules.StatementAdapter.evaluate(StatementAdapter.java:36)
	at com.carrotsearch.randomizedtesting.rules.SystemPropertiesRestoreRule$1.evaluate(SystemPropertiesRestoreRule.java:57)
	at org.apache.lucene.util.AbstractBeforeAfterRule$1.evaluate(AbstractBeforeAfterRule.java:45)
	at com.carrotsearch.randomizedtesting.rules.StatementAdapter.evaluate(StatementAdapter.java:36)
	at org.apache.lucene.util.TestRuleStoreClassName$1.evaluate(TestRuleStoreClassName.java:41)
	at com.carrotsearch.randomizedtesting.rules.NoShadowingOrOverridesOnMethodsRule$1.evaluate(NoShadowingOrOverridesOnMethodsRule.java:40)
	at com.carrotsearch.randomizedtesting.rules.NoShadowingOrOverridesOnMethodsRule$1.evaluate(NoShadowingOrOverridesOnMethodsRule.java:40)
	at com.carrotsearch.randomizedtesting.rules.StatementAdapter.evaluate(StatementAdapter.java:36)
	at com.carrotsearch.randomizedtesting.rules.StatementAdapter.evaluate(StatementAdapter.java:36)
	at com.carrotsearch.randomizedtesting.rules.StatementAdapter.evaluate(StatementAdapter.java:36)
	at org.apache.lucene.util.TestRuleAssertionsRequired$1.evaluate(TestRuleAssertionsRequired.java:53)
	at org.apache.lucene.util.TestRuleMarkFailure$1.evaluate(TestRuleMarkFailure.java:47)
	at org.apache.lucene.util.TestRuleIgnoreAfterMaxFailures$1.evaluate(TestRuleIgnoreAfterMaxFailures.java:64)
	at org.apache.lucene.util.TestRuleIgnoreTestSuites$1.evaluate(TestRuleIgnoreTestSuites.java:54)
	at com.carrotsearch.randomizedtesting.rules.StatementAdapter.evaluate(StatementAdapter.java:36)
	at com.carrotsearch.randomizedtesting.ThreadLeakControl$StatementRunner.run(ThreadLeakControl.java:368)
	at java.lang.Thread.run(Thread.java:748)


FAILED:  org.apache.solr.cloud.TestTlogReplica.testCreateDelete {seed=[C98B0B0C27CBFDD4:66CD46BCE5F9CEC8]}

Error Message:
Could not find collection : tlog_replica_test_create_delete

Stack Trace:
org.apache.solr.common.SolrException: Could not find collection : tlog_replica_test_create_delete
	at __randomizedtesting.SeedInfo.seed([C98B0B0C27CBFDD4:66CD46BCE5F9CEC8]:0)
	at org.apache.solr.common.cloud.ClusterState.getCollection(ClusterState.java:118)
	at org.apache.solr.cloud.SolrCloudTestCase.getCollectionState(SolrCloudTestCase.java:247)
	at org.apache.solr.cloud.TestTlogReplica.testCreateDelete(TestTlogReplica.java:188)
	at sun.reflect.NativeMethodAccessorImpl.invoke0(Native Method)
	at sun.reflect.NativeMethodAccessorImpl.invoke(NativeMethodAccessorImpl.java:62)
	at sun.reflect.DelegatingMethodAccessorImpl.invoke(DelegatingMethodAccessorImpl.java:43)
	at java.lang.reflect.Method.invoke(Method.java:498)
	at com.carrotsearch.randomizedtesting.RandomizedRunner.invoke(RandomizedRunner.java:1737)
	at com.carrotsearch.randomizedtesting.RandomizedRunner$8.evaluate(RandomizedRunner.java:934)
	at com.carrotsearch.randomizedtesting.RandomizedRunner$9.evaluate(RandomizedRunner.java:970)
	at com.carrotsearch.randomizedtesting.RandomizedRunner$10.evaluate(RandomizedRunner.java:984)
	at com.carrotsearch.randomizedtesting.rules.SystemPropertiesRestoreRule$1.evaluate(SystemPropertiesRestoreRule.java:57)
	at org.apache.lucene.util.TestRuleSetupTeardownChained$1.evaluate(TestRuleSetupTeardownChained.java:49)
	at org.apache.lucene.util.AbstractBeforeAfterRule$1.evaluate(AbstractBeforeAfterRule.java:45)
	at org.apache.lucene.util.TestRuleThreadAndTestName$1.evaluate(TestRuleThreadAndTestName.java:48)
	at org.apache.lucene.util.TestRuleIgnoreAfterMaxFailures$1.evaluate(TestRuleIgnoreAfterMaxFailures.java:64)
	at org.apache.lucene.util.TestRuleMarkFailure$1.evaluate(TestRuleMarkFailure.java:47)
	at com.carrotsearch.randomizedtesting.rules.StatementAdapter.evaluate(StatementAdapter.java:36)
	at com.carrotsearch.randomizedtesting.ThreadLeakControl$StatementRunner.run(ThreadLeakControl.java:368)
	at com.carrotsearch.randomizedtesting.ThreadLeakControl.forkTimeoutingTask(ThreadLeakControl.java:817)
	at com.carrotsearch.randomizedtesting.ThreadLeakControl$3.evaluate(ThreadLeakControl.java:468)
	at com.carrotsearch.randomizedtesting.RandomizedRunner.runSingleTest(RandomizedRunner.java:943)
	at com.carrotsearch.randomizedtesting.RandomizedRunner$5.evaluate(RandomizedRunner.java:829)
	at com.carrotsearch.randomizedtesting.RandomizedRunner$6.evaluate(RandomizedRunner.java:879)
	at com.carrotsearch.randomizedtesting.RandomizedRunner$7.evaluate(RandomizedRunner.java:890)
	at com.carrotsearch.randomizedtesting.rules.StatementAdapter.evaluate(StatementAdapter.java:36)
	at com.carrotsearch.randomizedtesting.rules.SystemPropertiesRestoreRule$1.evaluate(SystemPropertiesRestoreRule.java:57)
	at org.apache.lucene.util.AbstractBeforeAfterRule$1.evaluate(AbstractBeforeAfterRule.java:45)
	at com.carrotsearch.randomizedtesting.rules.StatementAdapter.evaluate(StatementAdapter.java:36)
	at org.apache.lucene.util.TestRuleStoreClassName$1.evaluate(TestRuleStoreClassName.java:41)
	at com.carrotsearch.randomizedtesting.rules.NoShadowingOrOverridesOnMethodsRule$1.evaluate(NoShadowingOrOverridesOnMethodsRule.java:40)
	at com.carrotsearch.randomizedtesting.rules.NoShadowingOrOverridesOnMethodsRule$1.evaluate(NoShadowingOrOverridesOnMethodsRule.java:40)
	at com.carrotsearch.randomizedtesting.rules.StatementAdapter.evaluate(StatementAdapter.java:36)
	at com.carrotsearch.randomizedtesting.rules.StatementAdapter.evaluate(StatementAdapter.java:36)
	at com.carrotsearch.randomizedtesting.rules.StatementAdapter.evaluate(StatementAdapter.java:36)
	at org.apache.lucene.util.TestRuleAssertionsRequired$1.evaluate(TestRuleAssertionsRequired.java:53)
	at org.apache.lucene.util.TestRuleMarkFailure$1.evaluate(TestRuleMarkFailure.java:47)
	at org.apache.lucene.util.TestRuleIgnoreAfterMaxFailures$1.evaluate(TestRuleIgnoreAfterMaxFailures.java:64)
	at org.apache.lucene.util.TestRuleIgnoreTestSuites$1.evaluate(TestRuleIgnoreTestSuites.java:54)
	at com.carrotsearch.randomizedtesting.rules.StatementAdapter.evaluate(StatementAdapter.java:36)
	at com.carrotsearch.randomizedtesting.ThreadLeakControl$StatementRunner.run(ThreadLeakControl.java:368)
	at java.lang.Thread.run(Thread.java:748)


FAILED:  org.apache.solr.cloud.TestTlogReplica.testOnlyLeaderIndexes

Error Message:
Expected collection to be created with 1 shards and  2 replicas null Live Nodes: [127.0.0.1:64995_solr, 127.0.0.1:64996_solr] Last available state: null

Stack Trace:
java.lang.AssertionError: Expected collection to be created with 1 shards and  2 replicas
null
Live Nodes: [127.0.0.1:64995_solr, 127.0.0.1:64996_solr]
Last available state: null
	at __randomizedtesting.SeedInfo.seed([C98B0B0C27CBFDD4:D58A7681526E8347]:0)
	at org.junit.Assert.fail(Assert.java:93)
	at org.apache.solr.cloud.SolrCloudTestCase.waitForState(SolrCloudTestCase.java:269)
	at org.apache.solr.cloud.TestTlogReplica.createAndWaitForCollection(TestTlogReplica.java:733)
	at org.apache.solr.cloud.TestTlogReplica.testOnlyLeaderIndexes(TestTlogReplica.java:456)
	at sun.reflect.NativeMethodAccessorImpl.invoke0(Native Method)
	at sun.reflect.NativeMethodAccessorImpl.invoke(NativeMethodAccessorImpl.java:62)
	at sun.reflect.DelegatingMethodAccessorImpl.invoke(DelegatingMethodAccessorImpl.java:43)
	at java.lang.reflect.Method.invoke(Method.java:498)
	at com.carrotsearch.randomizedtesting.RandomizedRunner.invoke(RandomizedRunner.java:1737)
	at com.carrotsearch.randomizedtesting.RandomizedRunner$8.evaluate(RandomizedRunner.java:934)
	at com.carrotsearch.randomizedtesting.RandomizedRunner$9.evaluate(RandomizedRunner.java:970)
	at com.carrotsearch.randomizedtesting.RandomizedRunner$10.evaluate(RandomizedRunner.java:984)
	at com.carrotsearch.randomizedtesting.rules.SystemPropertiesRestoreRule$1.evaluate(SystemPropertiesRestoreRule.java:57)
	at org.apache.lucene.util.TestRuleSetupTeardownChained$1.evaluate(TestRuleSetupTeardownChained.java:49)
	at org.apache.lucene.util.AbstractBeforeAfterRule$1.evaluate(AbstractBeforeAfterRule.java:45)
	at org.apache.lucene.util.TestRuleThreadAndTestName$1.evaluate(TestRuleThreadAndTestName.java:48)
	at org.apache.lucene.util.TestRuleIgnoreAfterMaxFailures$1.evaluate(TestRuleIgnoreAfterMaxFailures.java:64)
	at org.apache.lucene.util.TestRuleMarkFailure$1.evaluate(TestRuleMarkFailure.java:47)
	at com.carrotsearch.randomizedtesting.rules.StatementAdapter.evaluate(StatementAdapter.java:36)
	at com.carrotsearch.randomizedtesting.ThreadLeakControl$StatementRunner.run(ThreadLeakControl.java:368)
	at com.carrotsearch.randomizedtesting.ThreadLeakControl.forkTimeoutingTask(ThreadLeakControl.java:817)
	at com.carrotsearch.randomizedtesting.ThreadLeakControl$3.evaluate(ThreadLeakControl.java:468)
	at com.carrotsearch.randomizedtesting.RandomizedRunner.runSingleTest(RandomizedRunner.java:943)
	at com.carrotsearch.randomizedtesting.RandomizedRunner$5.evaluate(RandomizedRunner.java:829)
	at com.carrotsearch.randomizedtesting.RandomizedRunner$6.evaluate(RandomizedRunner.java:879)
	at com.carrotsearch.randomizedtesting.RandomizedRunner$7.evaluate(RandomizedRunner.java:890)
	at com.carrotsearch.randomizedtesting.rules.StatementAdapter.evaluate(StatementAdapter.java:36)
	at com.carrotsearch.randomizedtesting.rules.SystemPropertiesRestoreRule$1.evaluate(SystemPropertiesRestoreRule.java:57)
	at org.apache.lucene.util.AbstractBeforeAfterRule$1.evaluate(AbstractBeforeAfterRule.java:45)
	at com.carrotsearch.randomizedtesting.rules.StatementAdapter.evaluate(StatementAdapter.java:36)
	at org.apache.lucene.util.TestRuleStoreClassName$1.evaluate(TestRuleStoreClassName.java:41)
	at com.carrotsearch.randomizedtesting.rules.NoShadowingOrOverridesOnMethodsRule$1.evaluate(NoShadowingOrOverridesOnMethodsRule.java:40)
	at com.carrotsearch.randomizedtesting.rules.NoShadowingOrOverridesOnMethodsRule$1.evaluate(NoShadowingOrOverridesOnMethodsRule.java:40)
	at com.carrotsearch.randomizedtesting.rules.StatementAdapter.evaluate(StatementAdapter.java:36)
	at com.carrotsearch.randomizedtesting.rules.StatementAdapter.evaluate(StatementAdapter.java:36)
	at com.carrotsearch.randomizedtesting.rules.StatementAdapter.evaluate(StatementAdapter.java:36)
	at org.apache.lucene.util.TestRuleAssertionsRequired$1.evaluate(TestRuleAssertionsRequired.java:53)
	at org.apache.lucene.util.TestRuleMarkFailure$1.evaluate(TestRuleMarkFailure.java:47)
	at org.apache.lucene.util.TestRuleIgnoreAfterMaxFailures$1.evaluate(TestRuleIgnoreAfterMaxFailures.java:64)
	at org.apache.lucene.util.TestRuleIgnoreTestSuites$1.evaluate(TestRuleIgnoreTestSuites.java:54)
	at com.carrotsearch.randomizedtesting.rules.StatementAdapter.evaluate(StatementAdapter.java:36)
	at com.carrotsearch.randomizedtesting.ThreadLeakControl$StatementRunner.run(ThreadLeakControl.java:368)
	at java.lang.Thread.run(Thread.java:748)


FAILED:  org.apache.solr.cloud.TestTlogReplica.testBasicLeaderElection

Error Message:


Stack Trace:
java.lang.NullPointerException
	at __randomizedtesting.SeedInfo.seed([C98B0B0C27CBFDD4:5F03CD44CF51BA2E]:0)
	at org.apache.solr.cloud.TestTlogReplica.getSolrRunner(TestTlogReplica.java:898)
	at org.apache.solr.cloud.TestTlogReplica.testBasicLeaderElection(TestTlogReplica.java:645)
	at sun.reflect.NativeMethodAccessorImpl.invoke0(Native Method)
	at sun.reflect.NativeMethodAccessorImpl.invoke(NativeMethodAccessorImpl.java:62)
	at sun.reflect.DelegatingMethodAccessorImpl.invoke(DelegatingMethodAccessorImpl.java:43)
	at java.lang.reflect.Method.invoke(Method.java:498)
	at com.carrotsearch.randomizedtesting.RandomizedRunner.invoke(RandomizedRunner.java:1737)
	at com.carrotsearch.randomizedtesting.RandomizedRunner$8.evaluate(RandomizedRunner.java:934)
	at com.carrotsearch.randomizedtesting.RandomizedRunner$9.evaluate(RandomizedRunner.java:970)
	at com.carrotsearch.randomizedtesting.RandomizedRunner$10.evaluate(RandomizedRunner.java:984)
	at com.carrotsearch.randomizedtesting.rules.SystemPropertiesRestoreRule$1.evaluate(SystemPropertiesRestoreRule.java:57)
	at org.apache.lucene.util.TestRuleSetupTeardownChained$1.evaluate(TestRuleSetupTeardownChained.java:49)
	at org.apache.lucene.util.AbstractBeforeAfterRule$1.evaluate(AbstractBeforeAfterRule.java:45)
	at org.apache.lucene.util.TestRuleThreadAndTestName$1.evaluate(TestRuleThreadAndTestName.java:48)
	at org.apache.lucene.util.TestRuleIgnoreAfterMaxFailures$1.evaluate(TestRuleIgnoreAfterMaxFailures.java:64)
	at org.apache.lucene.util.TestRuleMarkFailure$1.evaluate(TestRuleMarkFailure.java:47)
	at com.carrotsearch.randomizedtesting.rules.StatementAdapter.evaluate(StatementAdapter.java:36)
	at com.carrotsearch.randomizedtesting.ThreadLeakControl$StatementRunner.run(ThreadLeakControl.java:368)
	at com.carrotsearch.randomizedtesting.ThreadLeakControl.forkTimeoutingTask(ThreadLeakControl.java:817)
	at com.carrotsearch.randomizedtesting.ThreadLeakControl$3.evaluate(ThreadLeakControl.java:468)
	at com.carrotsearch.randomizedtesting.RandomizedRunner.runSingleTest(RandomizedRunner.java:943)
	at com.carrotsearch.randomizedtesting.RandomizedRunner$5.evaluate(RandomizedRunner.java:829)
	at com.carrotsearch.randomizedtesting.RandomizedRunner$6.evaluate(RandomizedRunner.java:879)
	at com.carrotsearch.randomizedtesting.RandomizedRunner$7.evaluate(RandomizedRunner.java:890)
	at com.carrotsearch.randomizedtesting.rules.StatementAdapter.evaluate(StatementAdapter.java:36)
	at com.carrotsearch.randomizedtesting.rules.SystemPropertiesRestoreRule$1.evaluate(SystemPropertiesRestoreRule.java:57)
	at org.apache.lucene.util.AbstractBeforeAfterRule$1.evaluate(AbstractBeforeAfterRule.java:45)
	at com.carrotsearch.randomizedtesting.rules.StatementAdapter.evaluate(StatementAdapter.java:36)
	at org.apache.lucene.util.TestRuleStoreClassName$1.evaluate(TestRuleStoreClassName.java:41)
	at com.carrotsearch.randomizedtesting.rules.NoShadowingOrOverridesOnMethodsRule$1.evaluate(NoShadowingOrOverridesOnMethodsRule.java:40)
	at com.carrotsearch.randomizedtesting.rules.NoShadowingOrOverridesOnMethodsRule$1.evaluate(NoShadowingOrOverridesOnMethodsRule.java:40)
	at com.carrotsearch.randomizedtesting.rules.StatementAdapter.evaluate(StatementAdapter.java:36)
	at com.carrotsearch.randomizedtesting.rules.StatementAdapter.evaluate(StatementAdapter.java:36)
	at com.carrotsearch.randomizedtesting.rules.StatementAdapter.evaluate(StatementAdapter.java:36)
	at org.apache.lucene.util.TestRuleAssertionsRequired$1.evaluate(TestRuleAssertionsRequired.java:53)
	at org.apache.lucene.util.TestRuleMarkFailure$1.evaluate(TestRuleMarkFailure.java:47)
	at org.apache.lucene.util.TestRuleIgnoreAfterMaxFailures$1.evaluate(TestRuleIgnoreAfterMaxFailures.java:64)
	at org.apache.lucene.util.TestRuleIgnoreTestSuites$1.evaluate(TestRuleIgnoreTestSuites.java:54)
	at com.carrotsearch.randomizedtesting.rules.StatementAdapter.evaluate(StatementAdapter.java:36)
	at com.carrotsearch.randomizedtesting.ThreadLeakControl$StatementRunner.run(ThreadLeakControl.java:368)
	at java.lang.Thread.run(Thread.java:748)


FAILED:  org.apache.solr.cloud.TestTlogReplica.testRecovery

Error Message:


Stack Trace:
java.lang.NullPointerException
	at __randomizedtesting.SeedInfo.seed([C98B0B0C27CBFDD4:87B72A00A9B3773]:0)
	at org.apache.solr.cloud.TestTlogReplica.getSolrRunner(TestTlogReplica.java:898)
	at org.apache.solr.cloud.TestTlogReplica.testRecovery(TestTlogReplica.java:534)
	at sun.reflect.NativeMethodAccessorImpl.invoke0(Native Method)
	at sun.reflect.NativeMethodAccessorImpl.invoke(NativeMethodAccessorImpl.java:62)
	at sun.reflect.DelegatingMethodAccessorImpl.invoke(DelegatingMethodAccessorImpl.java:43)
	at java.lang.reflect.Method.invoke(Method.java:498)
	at com.carrotsearch.randomizedtesting.RandomizedRunner.invoke(RandomizedRunner.java:1737)
	at com.carrotsearch.randomizedtesting.RandomizedRunner$8.evaluate(RandomizedRunner.java:934)
	at com.carrotsearch.randomizedtesting.RandomizedRunner$9.evaluate(RandomizedRunner.java:970)
	at com.carrotsearch.randomizedtesting.RandomizedRunner$10.evaluate(RandomizedRunner.java:984)
	at com.carrotsearch.randomizedtesting.rules.SystemPropertiesRestoreRule$1.evaluate(SystemPropertiesRestoreRule.java:57)
	at org.apache.lucene.util.TestRuleSetupTeardownChained$1.evaluate(TestRuleSetupTeardownChained.java:49)
	at org.apache.lucene.util.AbstractBeforeAfterRule$1.evaluate(AbstractBeforeAfterRule.java:45)
	at org.apache.lucene.util.TestRuleThreadAndTestName$1.evaluate(TestRuleThreadAndTestName.java:48)
	at org.apache.lucene.util.TestRuleIgnoreAfterMaxFailures$1.evaluate(TestRuleIgnoreAfterMaxFailures.java:64)
	at org.apache.lucene.util.TestRuleMarkFailure$1.evaluate(TestRuleMarkFailure.java:47)
	at com.carrotsearch.randomizedtesting.rules.StatementAdapter.evaluate(StatementAdapter.java:36)
	at com.carrotsearch.randomizedtesting.ThreadLeakControl$StatementRunner.run(ThreadLeakControl.java:368)
	at com.carrotsearch.randomizedtesting.ThreadLeakControl.forkTimeoutingTask(ThreadLeakControl.java:817)
	at com.carrotsearch.randomizedtesting.ThreadLeakControl$3.evaluate(ThreadLeakControl.java:468)
	at com.carrotsearch.randomizedtesting.RandomizedRunner.runSingleTest(RandomizedRunner.java:943)
	at com.carrotsearch.randomizedtesting.RandomizedRunner$5.evaluate(RandomizedRunner.java:829)
	at com.carrotsearch.randomizedtesting.RandomizedRunner$6.evaluate(RandomizedRunner.java:879)
	at com.carrotsearch.randomizedtesting.RandomizedRunner$7.evaluate(RandomizedRunner.java:890)
	at com.carrotsearch.randomizedtesting.rules.StatementAdapter.evaluate(StatementAdapter.java:36)
	at com.carrotsearch.randomizedtesting.rules.SystemPropertiesRestoreRule$1.evaluate(SystemPropertiesRestoreRule.java:57)
	at org.apache.lucene.util.AbstractBeforeAfterRule$1.evaluate(AbstractBeforeAfterRule.java:45)
	at com.carrotsearch.randomizedtesting.rules.StatementAdapter.evaluate(StatementAdapter.java:36)
	at org.apache.lucene.util.TestRuleStoreClassName$1.evaluate(TestRuleStoreClassName.java:41)
	at com.carrotsearch.randomizedtesting.rules.NoShadowingOrOverridesOnMethodsRule$1.evaluate(NoShadowingOrOverridesOnMethodsRule.java:40)
	at com.carrotsearch.randomizedtesting.rules.NoShadowingOrOverridesOnMethodsRule$1.evaluate(NoShadowingOrOverridesOnMethodsRule.java:40)
	at com.carrotsearch.randomizedtesting.rules.StatementAdapter.evaluate(StatementAdapter.java:36)
	at com.carrotsearch.randomizedtesting.rules.StatementAdapter.evaluate(StatementAdapter.java:36)
	at com.carrotsearch.randomizedtesting.rules.StatementAdapter.evaluate(StatementAdapter.java:36)
	at org.apache.lucene.util.TestRuleAssertionsRequired$1.evaluate(TestRuleAssertionsRequired.java:53)
	at org.apache.lucene.util.TestRuleMarkFailure$1.evaluate(TestRuleMarkFailure.java:47)
	at org.apache.lucene.util.TestRuleIgnoreAfterMaxFailures$1.evaluate(TestRuleIgnoreAfterMaxFailures.java:64)
	at org.apache.lucene.util.TestRuleIgnoreTestSuites$1.evaluate(TestRuleIgnoreTestSuites.java:54)
	at com.carrotsearch.randomizedtesting.rules.StatementAdapter.evaluate(StatementAdapter.java:36)
	at com.carrotsearch.randomizedtesting.ThreadLeakControl$StatementRunner.run(ThreadLeakControl.java:368)
	at java.lang.Thread.run(Thread.java:748)


FAILED:  org.apache.solr.cloud.TestTlogReplica.testOutOfOrderDBQWithInPlaceUpdates

Error Message:


Stack Trace:
java.lang.NullPointerException
	at __randomizedtesting.SeedInfo.seed([C98B0B0C27CBFDD4:4F4AF3E1789A2B34]:0)
	at org.apache.solr.cloud.TestTlogReplica.getSolrCore(TestTlogReplica.java:863)
	at org.apache.solr.cloud.TestTlogReplica.testOutOfOrderDBQWithInPlaceUpdates(TestTlogReplica.java:662)
	at sun.reflect.NativeMethodAccessorImpl.invoke0(Native Method)
	at sun.reflect.NativeMethodAccessorImpl.invoke(NativeMethodAccessorImpl.java:62)
	at sun.reflect.DelegatingMethodAccessorImpl.invoke(DelegatingMethodAccessorImpl.java:43)
	at java.lang.reflect.Method.invoke(Method.java:498)
	at com.carrotsearch.randomizedtesting.RandomizedRunner.invoke(RandomizedRunner.java:1737)
	at com.carrotsearch.randomizedtesting.RandomizedRunner$8.evaluate(RandomizedRunner.java:934)
	at com.carrotsearch.randomizedtesting.RandomizedRunner$9.evaluate(RandomizedRunner.java:970)
	at com.carrotsearch.randomizedtesting.RandomizedRunner$10.evaluate(RandomizedRunner.java:984)
	at com.carrotsearch.randomizedtesting.rules.SystemPropertiesRestoreRule$1.evaluate(SystemPropertiesRestoreRule.java:57)
	at org.apache.lucene.util.TestRuleSetupTeardownChained$1.evaluate(TestRuleSetupTeardownChained.java:49)
	at org.apache.lucene.util.AbstractBeforeAfterRule$1.evaluate(AbstractBeforeAfterRule.java:45)
	at org.apache.lucene.util.TestRuleThreadAndTestName$1.evaluate(TestRuleThreadAndTestName.java:48)
	at org.apache.lucene.util.TestRuleIgnoreAfterMaxFailures$1.evaluate(TestRuleIgnoreAfterMaxFailures.java:64)
	at org.apache.lucene.util.TestRuleMarkFailure$1.evaluate(TestRuleMarkFailure.java:47)
	at com.carrotsearch.randomizedtesting.rules.StatementAdapter.evaluate(StatementAdapter.java:36)
	at com.carrotsearch.randomizedtesting.ThreadLeakControl$StatementRunner.run(ThreadLeakControl.java:368)
	at com.carrotsearch.randomizedtesting.ThreadLeakControl.forkTimeoutingTask(ThreadLeakControl.java:817)
	at com.carrotsearch.randomizedtesting.ThreadLeakControl$3.evaluate(ThreadLeakControl.java:468)
	at com.carrotsearch.randomizedtesting.RandomizedRunner.runSingleTest(RandomizedRunner.java:943)
	at com.carrotsearch.randomizedtesting.RandomizedRunner$5.evaluate(RandomizedRunner.java:829)
	at com.carrotsearch.randomizedtesting.RandomizedRunner$6.evaluate(RandomizedRunner.java:879)
	at com.carrotsearch.randomizedtesting.RandomizedRunner$7.evaluate(RandomizedRunner.java:890)
	at com.carrotsearch.randomizedtesting.rules.StatementAdapter.evaluate(StatementAdapter.java:36)
	at com.carrotsearch.randomizedtesting.rules.SystemPropertiesRestoreRule$1.evaluate(SystemPropertiesRestoreRule.java:57)
	at org.apache.lucene.util.AbstractBeforeAfterRule$1.evaluate(AbstractBeforeAfterRule.java:45)
	at com.carrotsearch.randomizedtesting.rules.StatementAdapter.evaluate(StatementAdapter.java:36)
	at org.apache.lucene.util.TestRuleStoreClassName$1.evaluate(TestRuleStoreClassName.java:41)
	at com.carrotsearch.randomizedtesting.rules.NoShadowingOrOverridesOnMethodsRule$1.evaluate(NoShadowingOrOverridesOnMethodsRule.java:40)
	at com.carrotsearch.randomizedtesting.rules.NoShadowingOrOverridesOnMethodsRule$1.evaluate(NoShadowingOrOverridesOnMethodsRule.java:40)
	at com.carrotsearch.randomizedtesting.rules.StatementAdapter.evaluate(StatementAdapter.java:36)
	at com.carrotsearch.randomizedtesting.rules.StatementAdapter.evaluate(StatementAdapter.java:36)
	at com.carrotsearch.randomizedtesting.rules.StatementAdapter.evaluate(StatementAdapter.java:36)
	at org.apache.lucene.util.TestRuleAssertionsRequired$1.evaluate(TestRuleAssertionsRequired.java:53)
	at org.apache.lucene.util.TestRuleMarkFailure$1.evaluate(TestRuleMarkFailure.java:47)
	at org.apache.lucene.util.TestRuleIgnoreAfterMaxFailures$1.evaluate(TestRuleIgnoreAfterMaxFailures.java:64)
	at org.apache.lucene.util.TestRuleIgnoreTestSuites$1.evaluate(TestRuleIgnoreTestSuites.java:54)
	at com.carrotsearch.randomizedtesting.rules.StatementAdapter.evaluate(StatementAdapter.java:36)
	at com.carrotsearch.randomizedtesting.ThreadLeakControl$StatementRunner.run(ThreadLeakControl.java:368)
	at java.lang.Thread.run(Thread.java:748)


FAILED:  org.apache.solr.cloud.autoscaling.TriggerIntegrationTest.testSetProperties

Error Message:
Expected 8 triggers but found: [x0, x1, x2, x3, x4, x5, x6] expected:<8> but was:<7>

Stack Trace:
java.lang.AssertionError: Expected 8 triggers but found: [x0, x1, x2, x3, x4, x5, x6] expected:<8> but was:<7>
	at __randomizedtesting.SeedInfo.seed([C98B0B0C27CBFDD4:A2EFDC4594E66850]:0)
	at org.junit.Assert.fail(Assert.java:93)
	at org.junit.Assert.failNotEquals(Assert.java:647)
	at org.junit.Assert.assertEquals(Assert.java:128)
	at org.junit.Assert.assertEquals(Assert.java:472)
	at org.apache.solr.cloud.autoscaling.TriggerIntegrationTest.testSetProperties(TriggerIntegrationTest.java:1322)
	at sun.reflect.NativeMethodAccessorImpl.invoke0(Native Method)
	at sun.reflect.NativeMethodAccessorImpl.invoke(NativeMethodAccessorImpl.java:62)
	at sun.reflect.DelegatingMethodAccessorImpl.invoke(DelegatingMethodAccessorImpl.java:43)
	at java.lang.reflect.Method.invoke(Method.java:498)
	at com.carrotsearch.randomizedtesting.RandomizedRunner.invoke(RandomizedRunner.java:1737)
	at com.carrotsearch.randomizedtesting.RandomizedRunner$8.evaluate(RandomizedRunner.java:934)
	at com.carrotsearch.randomizedtesting.RandomizedRunner$9.evaluate(RandomizedRunner.java:970)
	at com.carrotsearch.randomizedtesting.RandomizedRunner$10.evaluate(RandomizedRunner.java:984)
	at com.carrotsearch.randomizedtesting.rules.SystemPropertiesRestoreRule$1.evaluate(SystemPropertiesRestoreRule.java:57)
	at org.apache.lucene.util.TestRuleSetupTeardownChained$1.evaluate(TestRuleSetupTeardownChained.java:49)
	at org.apache.lucene.util.AbstractBeforeAfterRule$1.evaluate(AbstractBeforeAfterRule.java:45)
	at org.apache.lucene.util.TestRuleThreadAndTestName$1.evaluate(TestRuleThreadAndTestName.java:48)
	at org.apache.lucene.util.TestRuleIgnoreAfterMaxFailures$1.evaluate(TestRuleIgnoreAfterMaxFailures.java:64)
	at org.apache.lucene.util.TestRuleMarkFailure$1.evaluate(TestRuleMarkFailure.java:47)
	at com.carrotsearch.randomizedtesting.rules.StatementAdapter.evaluate(StatementAdapter.java:36)
	at com.carrotsearch.randomizedtesting.ThreadLeakControl$StatementRunner.run(ThreadLeakControl.java:368)
	at com.carrotsearch.randomizedtesting.ThreadLeakControl.forkTimeoutingTask(ThreadLeakControl.java:817)
	at com.carrotsearch.randomizedtesting.ThreadLeakControl$3.evaluate(ThreadLeakControl.java:468)
	at com.carrotsearch.randomizedtesting.RandomizedRunner.runSingleTest(RandomizedRunner.java:943)
	at com.carrotsearch.randomizedtesting.RandomizedRunner$5.evaluate(RandomizedRunner.java:829)
	at com.carrotsearch.randomizedtesting.RandomizedRunner$6.evaluate(RandomizedRunner.java:879)
	at com.carrotsearch.randomizedtesting.RandomizedRunner$7.evaluate(RandomizedRunner.java:890)
	at com.carrotsearch.randomizedtesting.rules.StatementAdapter.evaluate(StatementAdapter.java:36)
	at com.carrotsearch.randomizedtesting.rules.SystemPropertiesRestoreRule$1.evaluate(SystemPropertiesRestoreRule.java:57)
	at org.apache.lucene.util.AbstractBeforeAfterRule$1.evaluate(AbstractBeforeAfterRule.java:45)
	at com.carrotsearch.randomizedtesting.rules.StatementAdapter.evaluate(StatementAdapter.java:36)
	at org.apache.lucene.util.TestRuleStoreClassName$1.evaluate(TestRuleStoreClassName.java:41)
	at com.carrotsearch.randomizedtesting.rules.NoShadowingOrOverridesOnMethodsRule$1.evaluate(NoShadowingOrOverridesOnMethodsRule.java:40)
	at com.carrotsearch.randomizedtesting.rules.NoShadowingOrOverridesOnMethodsRule$1.evaluate(NoShadowingOrOverridesOnMethodsRule.java:40)
	at com.carrotsearch.randomizedtesting.rules.StatementAdapter.evaluate(StatementAdapter.java:36)
	at com.carrotsearch.randomizedtesting.rules.StatementAdapter.evaluate(StatementAdapter.java:36)
	at com.carrotsearch.randomizedtesting.rules.StatementAdapter.evaluate(StatementAdapter.java:36)
	at org.apache.lucene.util.TestRuleAssertionsRequired$1.evaluate(TestRuleAssertionsRequired.java:53)
	at org.apache.lucene.util.TestRuleMarkFailure$1.evaluate(TestRuleMarkFailure.java:47)
	at org.apache.lucene.util.TestRuleIgnoreAfterMaxFailures$1.evaluate(TestRuleIgnoreAfterMaxFailures.java:64)
	at org.apache.lucene.util.TestRuleIgnoreTestSuites$1.evaluate(TestRuleIgnoreTestSuites.java:54)
	at com.carrotsearch.randomizedtesting.rules.StatementAdapter.evaluate(StatementAdapter.java:36)
	at com.carrotsearch.randomizedtesting.ThreadLeakControl$StatementRunner.run(ThreadLeakControl.java:368)
	at java.lang.Thread.run(Thread.java:748)


FAILED:  org.apache.solr.handler.admin.AutoscalingHistoryHandlerTest.testHistory

Error Message:
expected:<5> but was:<0>

Stack Trace:
java.lang.AssertionError: expected:<5> but was:<0>
	at __randomizedtesting.SeedInfo.seed([C98B0B0C27CBFDD4:A477AFF19D8302D3]:0)
	at org.junit.Assert.fail(Assert.java:93)
	at org.junit.Assert.failNotEquals(Assert.java:647)
	at org.junit.Assert.assertEquals(Assert.java:128)
	at org.junit.Assert.assertEquals(Assert.java:472)
	at org.junit.Assert.assertEquals(Assert.java:456)
	at org.apache.solr.handler.admin.AutoscalingHistoryHandlerTest.testHistory(AutoscalingHistoryHandlerTest.java:265)
	at sun.reflect.NativeMethodAccessorImpl.invoke0(Native Method)
	at sun.reflect.NativeMethodAccessorImpl.invoke(NativeMethodAccessorImpl.java:62)
	at sun.reflect.DelegatingMethodAccessorImpl.invoke(DelegatingMethodAccessorImpl.java:43)
	at java.lang.reflect.Method.invoke(Method.java:498)
	at com.carrotsearch.randomizedtesting.RandomizedRunner.invoke(RandomizedRunner.java:1737)
	at com.carrotsearch.randomizedtesting.RandomizedRunner$8.evaluate(RandomizedRunner.java:934)
	at com.carrotsearch.randomizedtesting.RandomizedRunner$9.evaluate(RandomizedRunner.java:970)
	at com.carrotsearch.randomizedtesting.RandomizedRunner$10.evaluate(RandomizedRunner.java:984)
	at com.carrotsearch.randomizedtesting.rules.SystemPropertiesRestoreRule$1.evaluate(SystemPropertiesRestoreRule.java:57)
	at org.apache.lucene.util.TestRuleSetupTeardownChained$1.evaluate(TestRuleSetupTeardownChained.java:49)
	at org.apache.lucene.util.AbstractBeforeAfterRule$1.evaluate(AbstractBeforeAfterRule.java:45)
	at org.apache.lucene.util.TestRuleThreadAndTestName$1.evaluate(TestRuleThreadAndTestName.java:48)
	at org.apache.lucene.util.TestRuleIgnoreAfterMaxFailures$1.evaluate(TestRuleIgnoreAfterMaxFailures.java:64)
	at org.apache.lucene.util.TestRuleMarkFailure$1.evaluate(TestRuleMarkFailure.java:47)
	at com.carrotsearch.randomizedtesting.rules.StatementAdapter.evaluate(StatementAdapter.java:36)
	at com.carrotsearch.randomizedtesting.ThreadLeakControl$StatementRunner.run(ThreadLeakControl.java:368)
	at com.carrotsearch.randomizedtesting.ThreadLeakControl.forkTimeoutingTask(ThreadLeakControl.java:817)
	at com.carrotsearch.randomizedtesting.ThreadLeakControl$3.evaluate(ThreadLeakControl.java:468)
	at com.carrotsearch.randomizedtesting.RandomizedRunner.runSingleTest(RandomizedRunner.java:943)
	at com.carrotsearch.randomizedtesting.RandomizedRunner$5.evaluate(RandomizedRunner.java:829)
	at com.carrotsearch.randomizedtesting.RandomizedRunner$6.evaluate(RandomizedRunner.java:879)
	at com.carrotsearch.randomizedtesting.RandomizedRunner$7.evaluate(RandomizedRunner.java:890)
	at com.carrotsearch.randomizedtesting.rules.StatementAdapter.evaluate(StatementAdapter.java:36)
	at com.carrotsearch.randomizedtesting.rules.SystemPropertiesRestoreRule$1.evaluate(SystemPropertiesRestoreRule.java:57)
	at org.apache.lucene.util.AbstractBeforeAfterRule$1.evaluate(AbstractBeforeAfterRule.java:45)
	at com.carrotsearch.randomizedtesting.rules.StatementAdapter.evaluate(StatementAdapter.java:36)
	at org.apache.lucene.util.TestRuleStoreClassName$1.evaluate(TestRuleStoreClassName.java:41)
	at com.carrotsearch.randomizedtesting.rules.NoShadowingOrOverridesOnMethodsRule$1.evaluate(NoShadowingOrOverridesOnMethodsRule.java:40)
	at com.carrotsearch.randomizedtesting.rules.NoShadowingOrOverridesOnMethodsRule$1.evaluate(NoShadowingOrOverridesOnMethodsRule.java:40)
	at com.carrotsearch.randomizedtesting.rules.StatementAdapter.evaluate(StatementAdapter.java:36)
	at com.carrotsearch.randomizedtesting.rules.StatementAdapter.evaluate(StatementAdapter.java:36)
	at com.carrotsearch.randomizedtesting.rules.StatementAdapter.evaluate(StatementAdapter.java:36)
	at org.apache.lucene.util.TestRuleAssertionsRequired$1.evaluate(TestRuleAssertionsRequired.java:53)
	at org.apache.lucene.util.TestRuleMarkFailure$1.evaluate(TestRuleMarkFailure.java:47)
	at org.apache.lucene.util.TestRuleIgnoreAfterMaxFailures$1.evaluate(TestRuleIgnoreAfterMaxFailures.java:64)
	at org.apache.lucene.util.TestRuleIgnoreTestSuites$1.evaluate(TestRuleIgnoreTestSuites.java:54)
	at com.carrotsearch.randomizedtesting.rules.StatementAdapter.evaluate(StatementAdapter.java:36)
	at com.carrotsearch.randomizedtesting.ThreadLeakControl$StatementRunner.run(ThreadLeakControl.java:368)
	at java.lang.Thread.run(Thread.java:748)




Build Log:
[...truncated 11949 lines...]
   [junit4] Suite: org.apache.solr.cloud.autoscaling.TriggerIntegrationTest
   [junit4]   2> Creating dataDir: /Users/jenkins/workspace/Lucene-Solr-7.x-MacOSX/solr/build/solr-core/test/J1/temp/solr.cloud.autoscaling.TriggerIntegrationTest_C98B0B0C27CBFDD4-001/init-core-data-001
   [junit4]   2> 110331 WARN  (SUITE-TriggerIntegrationTest-seed#[C98B0B0C27CBFDD4]-worker) [    ] o.a.s.SolrTestCaseJ4 startTrackingSearchers: numOpens=1 numCloses=1
   [junit4]   2> 110331 INFO  (SUITE-TriggerIntegrationTest-seed#[C98B0B0C27CBFDD4]-worker) [    ] o.a.s.SolrTestCaseJ4 Using PointFields (NUMERIC_POINTS_SYSPROP=true) w/NUMERIC_DOCVALUES_SYSPROP=false
   [junit4]   2> 110335 INFO  (SUITE-TriggerIntegrationTest-seed#[C98B0B0C27CBFDD4]-worker) [    ] o.a.s.SolrTestCaseJ4 Randomized ssl (false) and clientAuth (false) via: @org.apache.solr.util.RandomizeSSL(reason=, value=NaN, ssl=NaN, clientAuth=NaN) w/ MAC_OS_X supressed clientAuth
   [junit4]   2> 110335 INFO  (SUITE-TriggerIntegrationTest-seed#[C98B0B0C27CBFDD4]-worker) [    ] o.a.s.SolrTestCaseJ4 SecureRandom sanity checks: test.solr.allowed.securerandom=null & java.security.egd=file:/dev/./urandom
   [junit4]   2> 110336 INFO  (SUITE-TriggerIntegrationTest-seed#[C98B0B0C27CBFDD4]-worker) [    ] o.a.s.c.MiniSolrCloudCluster Starting cluster of 2 servers in /Users/jenkins/workspace/Lucene-Solr-7.x-MacOSX/solr/build/solr-core/test/J1/temp/solr.cloud.autoscaling.TriggerIntegrationTest_C98B0B0C27CBFDD4-001/tempDir-001
   [junit4]   2> 110336 INFO  (SUITE-TriggerIntegrationTest-seed#[C98B0B0C27CBFDD4]-worker) [    ] o.a.s.c.ZkTestServer STARTING ZK TEST SERVER
   [junit4]   2> 110336 INFO  (Thread-159) [    ] o.a.s.c.ZkTestServer client port:0.0.0.0/0.0.0.0:0
   [junit4]   2> 110336 INFO  (Thread-159) [    ] o.a.s.c.ZkTestServer Starting server
   [junit4]   2> 110339 ERROR (Thread-159) [    ] o.a.z.s.ZooKeeperServer ZKShutdownHandler is not registered, so ZooKeeper server won't take any action on ERROR or SHUTDOWN server state changes
   [junit4]   2> 110436 INFO  (SUITE-TriggerIntegrationTest-seed#[C98B0B0C27CBFDD4]-worker) [    ] o.a.s.c.ZkTestServer start zk server on port:61324
   [junit4]   2> 110446 INFO  (zkConnectionManagerCallback-210-thread-1) [    ] o.a.s.c.c.ConnectionManager zkClient has connected
   [junit4]   2> 110450 INFO  (jetty-launcher-207-thread-1) [    ] o.e.j.s.Server jetty-9.4.8.v20171121, build timestamp: 2017-11-22T05:27:37+08:00, git hash: 82b8fb23f757335bb3329d540ce37a2a2615f0a8
   [junit4]   2> 110450 INFO  (jetty-launcher-207-thread-2) [    ] o.e.j.s.Server jetty-9.4.8.v20171121, build timestamp: 2017-11-22T05:27:37+08:00, git hash: 82b8fb23f757335bb3329d540ce37a2a2615f0a8
   [junit4]   2> 110452 INFO  (jetty-launcher-207-thread-1) [    ] o.e.j.s.session DefaultSessionIdManager workerName=node0
   [junit4]   2> 110452 INFO  (jetty-launcher-207-thread-1) [    ] o.e.j.s.session No SessionScavenger set, using defaults
   [junit4]   2> 110452 INFO  (jetty-launcher-207-thread-1) [    ] o.e.j.s.session Scavenging every 660000ms
   [junit4]   2> 110452 INFO  (jetty-launcher-207-thread-1) [    ] o.e.j.s.h.ContextHandler Started o.e.j.s.ServletContextHandler@372836b4{/solr,null,AVAILABLE}
   [junit4]   2> 110453 INFO  (jetty-launcher-207-thread-2) [    ] o.e.j.s.session DefaultSessionIdManager workerName=node0
   [junit4]   2> 110453 INFO  (jetty-launcher-207-thread-2) [    ] o.e.j.s.session No SessionScavenger set, using defaults
   [junit4]   2> 110453 INFO  (jetty-launcher-207-thread-2) [    ] o.e.j.s.session Scavenging every 600000ms
   [junit4]   2> 110453 INFO  (jetty-launcher-207-thread-2) [    ] o.e.j.s.h.ContextHandler Started o.e.j.s.ServletContextHandler@e8fabc9{/solr,null,AVAILABLE}
   [junit4]   2> 110453 INFO  (jetty-launcher-207-thread-1) [    ] o.e.j.s.AbstractConnector Started ServerConnector@6c24f39a{HTTP/1.1,[http/1.1]}{127.0.0.1:61326}
   [junit4]   2> 110453 INFO  (jetty-launcher-207-thread-1) [    ] o.e.j.s.Server Started @115079ms
   [junit4]   2> 110453 INFO  (jetty-launcher-207-thread-1) [    ] o.a.s.c.s.e.JettySolrRunner Jetty properties: {hostContext=/solr, hostPort=61326}
   [junit4]   2> 110454 INFO  (jetty-launcher-207-thread-2) [    ] o.e.j.s.AbstractConnector Started ServerConnector@24022591{HTTP/1.1,[http/1.1]}{127.0.0.1:61327}
   [junit4]   2> 110454 ERROR (jetty-launcher-207-thread-1) [    ] o.a.s.u.StartupLoggingUtils Missing Java Option solr.log.dir. Logging may be missing or incomplete.
   [junit4]   2> 110454 INFO  (jetty-launcher-207-thread-2) [    ] o.e.j.s.Server Started @115080ms
   [junit4]   2> 110454 INFO  (jetty-launcher-207-thread-1) [    ] o.a.s.s.SolrDispatchFilter  ___      _       Welcome to Apache Solr? version 7.3.0
   [junit4]   2> 110454 INFO  (jetty-launcher-207-thread-2) [    ] o.a.s.c.s.e.JettySolrRunner Jetty properties: {hostContext=/solr, hostPort=61327}
   [junit4]   2> 110454 INFO  (jetty-launcher-207-thread-1) [    ] o.a.s.s.SolrDispatchFilter / __| ___| |_ _   Starting in cloud mode on port null
   [junit4]   2> 110454 INFO  (jetty-launcher-207-thread-1) [    ] o.a.s.s.SolrDispatchFilter \__ \/ _ \ | '_|  Install dir: null
   [junit4]   2> 110454 INFO  (jetty-launcher-207-thread-1) [    ] o.a.s.s.SolrDispatchFilter |___/\___/_|_|    Start time: 2018-01-27T12:29:18.968Z
   [junit4]   2> 110454 ERROR (jetty-launcher-207-thread-2) [    ] o.a.s.u.StartupLoggingUtils Missing Java Option solr.log.dir. Logging may be missing or incomplete.
   [junit4]   2> 110455 INFO  (jetty-launcher-207-thread-2) [    ] o.a.s.s.SolrDispatchFilter  ___      _       Welcome to Apache Solr? version 7.3.0
   [junit4]   2> 110455 INFO  (jetty-launcher-207-thread-2) [    ] o.a.s.s.SolrDispatchFilter / __| ___| |_ _   Starting in cloud mode on port null
   [junit4]   2> 110455 INFO  (jetty-launcher-207-thread-2) [    ] o.a.s.s.SolrDispatchFilter \__ \/ _ \ | '_|  Install dir: null
   [junit4]   2> 110455 INFO  (jetty-launcher-207-thread-2) [    ] o.a.s.s.SolrDispatchFilter |___/\___/_|_|    Start time: 2018-01-27T12:29:18.969Z
   [junit4]   2> 110456 INFO  (zkConnectionManagerCallback-212-thread-1) [    ] o.a.s.c.c.ConnectionManager zkClient has connected
   [junit4]   2> 110456 INFO  (zkConnectionManagerCallback-214-thread-1) [    ] o.a.s.c.c.ConnectionManager zkClient has connected
   [junit4]   2> 110457 INFO  (jetty-launcher-207-thread-1) [    ] o.a.s.s.SolrDispatchFilter solr.xml found in ZooKeeper. Loading...
   [junit4]   2> 110457 INFO  (jetty-launcher-207-thread-2) [    ] o.a.s.s.SolrDispatchFilter solr.xml found in ZooKeeper. Loading...
   [junit4]   2> 110468 INFO  (jetty-launcher-207-thread-2) [    ] o.a.s.c.ZkContainer Zookeeper client=127.0.0.1:61324/solr
   [junit4]   2> 110469 INFO  (jetty-launcher-207-thread-1) [    ] o.a.s.c.ZkContainer Zookeeper client=127.0.0.1:61324/solr
   [junit4]   2> 110470 INFO  (zkConnectionManagerCallback-220-thread-1) [    ] o.a.s.c.c.ConnectionManager zkClient has connected
   [junit4]   2> 110479 INFO  (zkConnectionManagerCallback-222-thread-1) [    ] o.a.s.c.c.ConnectionManager zkClient has connected
   [junit4]   2> 110483 INFO  (zkConnectionManagerCallback-226-thread-1-processing-n:127.0.0.1:61326_solr) [n:127.0.0.1:61326_solr    ] o.a.s.c.c.ConnectionManager zkClient has connected
   [junit4]   2> 110483 INFO  (zkConnectionManagerCallback-225-thread-1-processing-n:127.0.0.1:61327_solr) [n:127.0.0.1:61327_solr    ] o.a.s.c.c.ConnectionManager zkClient has connected
   [junit4]   2> 110602 INFO  (jetty-launcher-207-thread-2) [n:127.0.0.1:61327_solr    ] o.a.s.c.Overseer Overseer (id=null) closing
   [junit4]   2> 110602 INFO  (jetty-launcher-207-thread-1) [n:127.0.0.1:61326_solr    ] o.a.s.c.Overseer Overseer (id=null) closing
   [junit4]   2> 110602 INFO  (jetty-launcher-207-thread-2) [n:127.0.0.1:61327_solr    ] o.a.s.c.OverseerElectionContext I am going to be the leader 127.0.0.1:61327_solr
   [junit4]   2> 110603 INFO  (jetty-launcher-207-thread-1) [n:127.0.0.1:61326_solr    ] o.a.s.c.ZkController Register node as live in ZooKeeper:/live_nodes/127.0.0.1:61326_solr
   [junit4]   2> 110604 INFO  (jetty-launcher-207-thread-2) [n:127.0.0.1:61327_solr    ] o.a.s.c.Overseer Overseer (id=99421792426524678-127.0.0.1:61327_solr-n_0000000000) starting
   [junit4]   2> 110605 INFO  (zkCallback-224-thread-1-processing-n:127.0.0.1:61326_solr) [n:127.0.0.1:61326_solr    ] o.a.s.c.c.ZkStateReader Updated live nodes from ZooKeeper... (0) -> (1)
   [junit4]   2> 110605 INFO  (zkCallback-223-thread-1-processing-n:127.0.0.1:61327_solr) [n:127.0.0.1:61327_solr    ] o.a.s.c.c.ZkStateReader Updated live nodes from ZooKeeper... (0) -> (1)
   [junit4]   2> 110618 DEBUG (OverseerAutoScalingTriggerThread-99421792426524678-127.0.0.1:61327_solr-n_0000000000) [n:127.0.0.1:61327_solr    ] o.a.s.c.a.OverseerTriggerThread Adding .autoAddReplicas trigger
   [junit4]   2> 110619 DEBUG (OverseerAutoScalingTriggerThread-99421792426524678-127.0.0.1:61327_solr-n_0000000000) [n:127.0.0.1:61327_solr    ] o.a.s.c.a.OverseerTriggerThread Refreshing /autoscaling.json with znode version 1
   [junit4]   2> 110620 DEBUG (OverseerAutoScalingTriggerThread-99421792426524678-127.0.0.1:61327_solr-n_0000000000) [n:127.0.0.1:61327_solr    ] o.a.s.c.a.NodeLostTrigger Initial livenodes: [127.0.0.1:61326_solr]
   [junit4]   2> 110620 DEBUG (OverseerAutoScalingTriggerThread-99421792426524678-127.0.0.1:61327_solr-n_0000000000) [n:127.0.0.1:61327_solr    ] o.a.s.c.a.OverseerTriggerThread Current znodeVersion 1, lastZnodeVersion -1
   [junit4]   2> 110620 DEBUG (OverseerAutoScalingTriggerThread-99421792426524678-127.0.0.1:61327_solr-n_0000000000) [n:127.0.0.1:61327_solr    ] o.a.s.c.a.OverseerTriggerThread Processed trigger updates upto znodeVersion 1
   [junit4]   2> 110623 INFO  (jetty-launcher-207-thread-2) [n:127.0.0.1:61327_solr    ] o.a.s.c.ZkController Register node as live in ZooKeeper:/live_nodes/127.0.0.1:61327_solr
   [junit4]   2> 110623 DEBUG (OverseerAutoScalingTriggerThread-99421792426524678-127.0.0.1:61327_solr-n_0000000000) [n:127.0.0.1:61327_solr    ] o.a.s.c.a.OverseerTriggerThread -- clean old nodeAdded markers
   [junit4]   2> 110624 DEBUG (OverseerAutoScalingTriggerThread-99421792426524678-127.0.0.1:61327_solr-n_0000000000) [n:127.0.0.1:61327_solr    ] o.a.s.c.a.OverseerTriggerThread Current znodeVersion 1, lastZnodeVersion 1
   [junit4]   2> 110624 INFO  (zkCallback-223-thread-1-processing-n:127.0.0.1:61327_solr) [n:127.0.0.1:61327_solr    ] o.a.s.c.c.ZkStateReader Updated live nodes from ZooKeeper... (1) -> (2)
   [junit4]   2> 110624 INFO  (zkCallback-224-thread-1-processing-n:127.0.0.1:61326_solr) [n:127.0.0.1:61326_solr    ] o.a.s.c.c.ZkStateReader Updated live nodes from ZooKeeper... (1) -> (2)
   [junit4]   2> 110624 DEBUG (ScheduledTrigger-347-thread-1) [n:127.0.0.1:61327_solr    ] o.a.s.c.a.NodeLostTrigger Running NodeLostTrigger: .auto_add_replicas with currently live nodes: 2
   [junit4]   2> 110707 INFO  (jetty-launcher-207-thread-1) [n:127.0.0.1:61326_solr    ] o.a.s.m.r.SolrJmxReporter JMX monitoring for 'solr_61326.solr.node' (registry 'solr.node') enabled at server: com.sun.jmx.mbeanserver.JmxMBeanServer@5d6d12ad
   [junit4]   2> 110714 INFO  (jetty-launcher-207-thread-2) [n:127.0.0.1:61327_solr    ] o.a.s.m.r.SolrJmxReporter JMX monitoring for 'solr_61327.solr.node' (registry 'solr.node') enabled at server: com.sun.jmx.mbeanserver.JmxMBeanServer@5d6d12ad
   [junit4]   2> 110720 INFO  (jetty-launcher-207-thread-1) [n:127.0.0.1:61326_solr    ] o.a.s.m.r.SolrJmxReporter JMX monitoring for 'solr_61326.solr.jvm' (registry 'solr.jvm') enabled at server: com.sun.jmx.mbeanserver.JmxMBeanServer@5d6d12ad
   [junit4]   2> 110720 INFO  (jetty-launcher-207-thread-1) [n:127.0.0.1:61326_solr    ] o.a.s.m.r.SolrJmxReporter JMX monitoring for 'solr_61326.solr.jetty' (registry 'solr.jetty') enabled at server: com.sun.jmx.mbeanserver.JmxMBeanServer@5d6d12ad
   [junit4]   2> 110721 INFO  (jetty-launcher-207-thread-2) [n:127.0.0.1:61327_solr    ] o.a.s.m.r.SolrJmxReporter JMX monitoring for 'solr_61327.solr.jvm' (registry 'solr.jvm') enabled at server: com.sun.jmx.mbeanserver.JmxMBeanServer@5d6d12ad
   [junit4]   2> 110721 INFO  (jetty-launcher-207-thread-2) [n:127.0.0.1:61327_solr    ] o.a.s.m.r.SolrJmxReporter JMX monitoring for 'solr_61327.solr.jetty' (registry 'solr.jetty') enabled at server: com.sun.jmx.mbeanserver.JmxMBeanServer@5d6d12ad
   [junit4]   2> 110722 INFO  (jetty-launcher-207-thread-1) [n:127.0.0.1:61326_solr    ] o.a.s.c.CorePropertiesLocator Found 0 core definitions underneath /Users/jenkins/workspace/Lucene-Solr-7.x-MacOSX/solr/build/solr-core/test/J1/temp/solr.cloud.autoscaling.TriggerIntegrationTest_C98B0B0C27CBFDD4-001/tempDir-001/node1/.
   [junit4]   2> 110722 INFO  (jetty-launcher-207-thread-2) [n:127.0.0.1:61327_solr    ] o.a.s.c.CorePropertiesLocator Found 0 core definitions underneath /Users/jenkins/workspace/Lucene-Solr-7.x-MacOSX/solr/build/solr-core/test/J1/temp/solr.cloud.autoscaling.TriggerIntegrationTest_C98B0B0C27CBFDD4-001/tempDir-001/node2/.
   [junit4]   2> 110776 INFO  (zkConnectionManagerCallback-232-thread-1) [    ] o.a.s.c.c.ConnectionManager zkClient has connected
   [junit4]   2> 110779 INFO  (zkConnectionManagerCallback-236-thread-1) [    ] o.a.s.c.c.ConnectionManager zkClient has connected
   [junit4]   2> 110781 INFO  (SUITE-TriggerIntegrationTest-seed#[C98B0B0C27CBFDD4]-worker) [    ] o.a.s.c.c.ZkStateReader Updated live nodes from ZooKeeper... (0) -> (2)
   [junit4]   2> 110783 INFO  (SUITE-TriggerIntegrationTest-seed#[C98B0B0C27CBFDD4]-worker) [    ] o.a.s.c.s.i.ZkClientClusterStateProvider Cluster at 127.0.0.1:61324/solr ready
   [junit4]   2> 110802 INFO  (TEST-TriggerIntegrationTest.testNodeAddedTrigger-seed#[C98B0B0C27CBFDD4]) [    ] o.a.s.SolrTestCaseJ4 ###Starting testNodeAddedTrigger
   [junit4]   2> 110803 INFO  (TEST-TriggerIntegrationTest.testNodeAddedTrigger-seed#[C98B0B0C27CBFDD4]) [    ] o.a.s.c.a.TriggerIntegrationTest /autoscaling.json reset, new znode version 2
   [junit4]   2> 110803 DEBUG (zkCallback-223-thread-1-processing-n:127.0.0.1:61327_solr) [n:127.0.0.1:61327_solr    ] o.a.s.c.a.OverseerTriggerThread Refreshing /autoscaling.json with znode version 2
   [junit4]   2> 110803 DEBUG (OverseerAutoScalingTriggerThread-99421792426524678-127.0.0.1:61327_solr-n_0000000000) [n:127.0.0.1:61327_solr    ] o.a.s.c.a.OverseerTriggerThread Processed trigger updates upto znodeVersion 2
   [junit4]   2> 110806 DEBUG (OverseerAutoScalingTriggerThread-99421792426524678-127.0.0.1:61327_solr-n_0000000000) [n:127.0.0.1:61327_solr    ] o.a.s.c.a.OverseerTriggerThread -- clean old nodeLost markers
   [junit4]   2> 110807 DEBUG (OverseerAutoScalingTriggerThread-99421792426524678-127.0.0.1:61327_solr-n_0000000000) [n:127.0.0.1:61327_solr    ] o.a.s.c.a.OverseerTriggerThread -- clean old nodeAdded markers
   [junit4]   2> 110807 DEBUG (OverseerAutoScalingTriggerThread-99421792426524678-127.0.0.1:61327_solr-n_0000000000) [n:127.0.0.1:61327_solr    ] o.a.s.c.a.OverseerTriggerThread Current znodeVersion 2, lastZnodeVersion 2
   [junit4]   2> 110826 INFO  (qtp821632975-878) [n:127.0.0.1:61326_solr    ] o.a.s.s.HttpSolrCall [admin] webapp=null path=/admin/metrics params={prefix=CONTAINER.fs.usableSpace,CORE.coreName&wt=javabin&version=2&group=solr.node,solr.core} status=0 QTime=0
   [junit4]   2> 110828 INFO  (qtp1200424120-891) [n:127.0.0.1:61327_solr    ] o.a.s.s.HttpSolrCall [admin] webapp=null path=/admin/metrics params={prefix=CONTAINER.fs.usableSpace,CORE.coreName&wt=javabin&version=2&group=solr.node,solr.core} status=0 QTime=0
   [junit4]   2> 110828 DEBUG (qtp1200424120-886) [n:127.0.0.1:61327_solr    ] o.a.s.c.a.AutoScalingHandler Verified autoscaling configuration
   [junit4]   2> 110829 INFO  (qtp1200424120-886) [n:127.0.0.1:61327_solr    ] o.a.s.s.HttpSolrCall [admin] webapp=null path=/admin/autoscaling params={wt=javabin&version=2} status=0 QTime=11
   [junit4]   2> 110829 DEBUG (zkCallback-223-thread-1-processing-n:127.0.0.1:61327_solr) [n:127.0.0.1:61327_solr    ] o.a.s.c.a.OverseerTriggerThread Refreshing /autoscaling.json with znode version 3
   [junit4]   2> 110834 DEBUG (zkCallback-223-thread-1-processing-n:127.0.0.1:61327_solr) [n:127.0.0.1:61327_solr    ] o.a.s.c.a.NodeAddedTrigger Initial livenodes: [127.0.0.1:61326_solr, 127.0.0.1:61327_solr]
   [junit4]   2> 110834 DEBUG (zkCallback-223-thread-1-processing-n:127.0.0.1:61327_solr) [n:127.0.0.1:61327_solr    ] o.a.s.c.a.NodeAddedTrigger NodeAddedTrigger node_added_trigger instantiated with properties: {event=nodeAdded, waitFor=1, actions=[{name=test, class=org.apache.solr.cloud.autoscaling.TriggerIntegrationTest$TestTriggerAction}], enabled=true}
   [junit4]   2> 110834 DEBUG (OverseerAutoScalingTriggerThread-99421792426524678-127.0.0.1:61327_solr-n_0000000000) [n:127.0.0.1:61327_solr    ] o.a.s.c.a.OverseerTriggerThread Processed trigger updates upto znodeVersion 3
   [junit4]   2> 110836 INFO  (OverseerAutoScalingTriggerThread-99421792426524678-127.0.0.1:61327_solr-n_0000000000) [n:127.0.0.1:61327_solr    ] o.a.s.c.a.TriggerIntegrationTest TestTriggerAction init
   [junit4]   2> 110838 INFO  (TEST-TriggerIntegrationTest.testNodeAddedTrigger-seed#[C98B0B0C27CBFDD4]) [    ] o.e.j.s.Server jetty-9.4.8.v20171121, build timestamp: 2017-11-22T05:27:37+08:00, git hash: 82b8fb23f757335bb3329d540ce37a2a2615f0a8
   [junit4]   2> 110838 DEBUG (OverseerAutoScalingTriggerThread-99421792426524678-127.0.0.1:61327_solr-n_0000000000) [n:127.0.0.1:61327_solr    ] o.a.s.c.a.OverseerTriggerThread -- clean old nodeLost markers
   [junit4]   2> 110839 INFO  (TEST-TriggerIntegrationTest.testNodeAddedTrigger-seed#[C98B0B0C27CBFDD4]) [    ] o.e.j.s.session DefaultSessionIdManager workerName=node0
   [junit4]   2> 110839 INFO  (TEST-TriggerIntegrationTest.testNodeAddedTrigger-seed#[C98B0B0C27CBFDD4]) [    ] o.e.j.s.session No SessionScavenger set, using defaults
   [junit4]   2> 110839 INFO  (TEST-TriggerIntegrationTest.testNodeAddedTrigger-seed#[C98B0B0C27CBFDD4]) [    ] o.e.j.s.session Scavenging every 600000ms
   [junit4]   2> 110839 INFO  (TEST-TriggerIntegrationTest.testNodeAddedTrigger-seed#[C98B0B0C27CBFDD4]) [    ] o.e.j.s.h.ContextHandler Started o.e.j.s.ServletContextHandler@ab05eff{/solr,null,AVAILABLE}
   [junit4]   2> 110839 INFO  (TEST-TriggerIntegrationTest.testNodeAddedTrigger-seed#[C98B0B0C27CBFDD4]) [    ] o.e.j.s.AbstractConnector Started ServerConnector@4885812f{HTTP/1.1,[http/1.1]}{127.0.0.1:61340}
   [junit4]   2> 110840 INFO  (TEST-TriggerIntegrationTest.testNodeAddedTrigger-seed#[C98B0B0C27CBFDD4]) [    ] o.e.j.s.Server Started @115465ms
   [junit4]   2> 110840 INFO  (TEST-TriggerIntegrationTest.testNodeAddedTrigger-seed#[C98B0B0C27CBFDD4]) [    ] o.a.s.c.s.e.JettySolrRunner Jetty properties: {hostContext=/solr, hostPort=61340}
   [junit4]   2> 110840 DEBUG (OverseerAutoScalingTriggerThread-99421792426524678-127.0.0.1:61327_solr-n_0000000000) [n:127.0.0.1:61327_solr    ] o.a.s.c.a.OverseerTriggerThread Current znodeVersion 3, lastZnodeVersion 3
   [junit4]   2> 110840 DEBUG (ScheduledTrigger-347-thread-1) [n:127.0.0.1:61327_solr    ] o.a.s.c.a.NodeAddedTrigger Running NodeAddedTrigger node_added_trigger
   [junit4]   2> 110840 DEBUG (ScheduledTrigger-347-thread-1) [n:127.0.0.1:61327_solr    ] o.a.s.c.a.NodeAddedTrigger Found livenodes: 2
   [junit4]   2> 110840 ERROR (TEST-TriggerIntegrationTest.testNodeAddedTrigger-seed#[C98B0B0C27CBFDD4]) [    ] o.a.s.u.StartupLoggingUtils Missing Java Option solr.log.dir. Logging may be missing or incomplete.
   [junit4]   2> 110841 INFO  (TEST-TriggerIntegrationTest.testNodeAddedTrigger-seed#[C98B0B0C27CBFDD4]) [    ] o.a.s.s.SolrDispatchFilter  ___      _       Welcome to Apache Solr? version 7.3.0
   [junit4]   2> 110841 INFO  (TEST-TriggerIntegrationTest.testNodeAddedTrigger-seed#[C98B0B0C27CBFDD4]) [    ] o.a.s.s.SolrDispatchFilter / __| ___| |_ _   Starting in cloud mode on port null
   [junit4]   2> 110841 INFO  (TEST-TriggerIntegrationTest.testNodeAddedTrigger-seed#[C98B0B0C27CBFDD4]) [    ] o.a.s.s.SolrDispatchFilter \__ \/ _ \ | '_|  Install dir: null
   [junit4]   2> 110841 INFO  (TEST-TriggerIntegrationTest.testNodeAddedTrigger-seed#[C98B0B0C27CBFDD4]) [    ] o.a.s.s.SolrDispatchFilter |___/\___/_|_|    Start time: 2018-01-27T12:29:19.355Z
   [junit4]   2> 110843 INFO  (zkConnectionManagerCallback-238-thread-1) [    ] o.a.s.c.c.ConnectionManager zkClient has connected
   [junit4]   2> 110843 INFO  (TEST-TriggerIntegrationTest.testNodeAddedTrigger-seed#[C98B0B0C27CBFDD4]) [    ] o.a.s.s.SolrDispatchFilter solr.xml found in ZooKeeper. Loading...
   [junit4]   2> 110853 INFO  (TEST-TriggerIntegrationTest.testNodeAddedTrigger-seed#[C98B0B0C27CBFDD4]) [    ] o.a.s.c.ZkContainer Zookeeper client=127.0.0.1:61324/solr
   [junit4]   2> 110854 INFO  (zkConnectionManagerCallback-242-thread-1) [    ] o.a.s.c.c.ConnectionManager zkClient has connected
   [junit4]   2> 110859 INFO  (zkConnectionManagerCallback-244-thread-1-processing-n:127.0.0.1:61340_solr) [n:127.0.0.1:61340_solr    ] o.a.s.c.c.ConnectionManager zkClient has connected
   [junit4]   2> 110869 INFO  (TEST-TriggerIntegrationTest.testNodeAddedTrigger-seed#[C98B0B0C27CBFDD4]) [n:127.0.0.1:61340_solr    ] o.a.s.c.c.ZkStateReader Updated live nodes from ZooKeeper... (0) -> (2)
   [junit4]   2> 110873 INFO  (TEST-TriggerIntegrationTest.testNodeAddedTrigger-seed#[C98B0B0C27CBFDD4]) [n:127.0.0.1:61340_solr    ] o.a.s.c.Overseer Overseer (id=null) closing
   [junit4]   2> 110876 INFO  (TEST-TriggerIntegrationTest.testNodeAddedTrigger-seed#[C98B0B0C27CBFDD4]) [n:127.0.0.1:61340_solr    ] o.a.s.c.ZkController Register node as live in ZooKeeper:/live_nodes/127.0.0.1:61340_solr
   [junit4]   2> 110879 INFO  (zkCallback-224-thread-1-processing-n:127.0.0.1:61326_solr) [n:127.0.0.1:61326_solr    ] o.a.s.c.c.ZkStateReader Updated live nodes from ZooKeeper... (2) -> (3)
   [junit4]   2> 110879 INFO  (zkCallback-235-thread-1) [    ] o.a.s.c.c.ZkStateReader Updated live nodes from ZooKeeper... (2) -> (3)
   [junit4]   2> 110880 INFO  (zkCallback-223-thread-1-processing-n:127.0.0.1:61327_solr) [n:127.0.0.1:61327_solr    ] o.a.s.c.c.ZkStateReader Updated live nodes from ZooKeeper... (2) -> (3)
   [junit4]   2> 110881 INFO  (zkCallback-243-thread-1-processing-n:127.0.0.1:61340_solr) [n:127.0.0.1:61340_solr    ] o.a.s.c.c.ZkStateReader Updated live nodes from ZooKeeper... (2) -> (3)
   [junit4]   2> 110966 INFO  (TEST-TriggerIntegrationTest.testNodeAddedTrigger-seed#[C98B0B0C27CBFDD4]) [n:127.0.0.1:61340_solr    ] o.a.s.m.r.SolrJmxReporter JMX monitoring for 'solr_61340.solr.node' (registry 'solr.node') enabled at server: com.sun.jmx.mbeanserver.JmxMBeanServer@5d6d12ad
   [junit4]   2> 110972 INFO  (TEST-TriggerIntegrationTest.testNodeAddedTrigger-seed#[C98B0B0C27CBFDD4]) [n:127.0.0.1:61340_solr    ] o.a.s.m.r.SolrJmxReporter JMX monitoring for 'solr_61340.solr.jvm' (registry 'solr.jvm') enabled at server: com.sun.jmx.mbeanserver.JmxMBeanServer@5d6d12ad
   [junit4]   2> 110972 INFO  (TEST-TriggerIntegrationTest.testNodeAddedTrigger-seed#[C98B0B0C27CBFDD4]) [n:127.0.0.1:61340_solr    ] o.a.s.m.r.SolrJmxReporter JMX monitoring for 'solr_61340.solr.jetty' (registry 'solr.jetty') enabled at server: com.sun.jmx.mbeanserver.JmxMBeanServer@5d6d12ad
   [junit4]   2> 110973 INFO  (TEST-TriggerIntegrationTest.testNodeAddedTrigger-seed#[C98B0B0C27CBFDD4]) [n:127.0.0.1:61340_solr    ] o.a.s.c.CorePropertiesLocator Found 0 core definitions underneath /Users/jenkins/workspace/Lucene-Solr-7.x-MacOSX/solr/build/solr-core/test/J1/temp/solr.cloud.autoscaling.TriggerIntegrationTest_C98B0B0C27CBFDD4-001/tempDir-001/node3/.
   [junit4]   2> 111852 DEBUG (ScheduledTrigger-347-thread-2) [n:127.0.0.1:61327_solr    ] o.a.s.c.a.NodeAddedTrigger Running NodeAddedTrigger node_added_trigger
   [junit4]   2> 111852 DEBUG (ScheduledTrigger-347-thread-2) [n:127.0.0.1:61327_solr    ] o.a.s.c.a.NodeAddedTrigger Found livenodes: 3
   [junit4]   2> 111853 DEBUG (ScheduledTrigger-347-thread-2) [n:127.0.0.1:61327_solr    ] o.a.s.c.a.NodeAddedTrigger Tracking new node: 127.0.0.1:61340_solr at time 756679364720229
   [junit4]   2> 112863 DEBUG (ScheduledTrigger-347-thread-2) [n:127.0.0.1:61327_solr    ] o.a.s.c.a.NodeAddedTrigger Running NodeAddedTrigger node_added_trigger
   [junit4]   2> 112863 DEBUG (ScheduledTrigger-347-thread-2) [n:127.0.0.1:61327_solr    ] o.a.s.c.a.NodeAddedTrigger Found livenodes: 3
   [junit4]   2> 112863 DEBUG (ScheduledTrigger-347-thread-2) [n:127.0.0.1:61327_solr    ] o.a.s.c.a.NodeAddedTrigger NodeAddedTrigger node_added_trigger firing registered processor for nodes: [127.0.0.1:61340_solr] added at times [756679364720229], now=756680374867404
   [junit4]   2> 112863 DEBUG (ScheduledTrigger-347-thread-2) [n:127.0.0.1:61327_solr    ] o.a.s.c.a.ScheduledTriggers ++++++++ Cooldown inactive - processing event: {
   [junit4]   2>   "id":"2b03224be3665T5gvln9ivyvbfucls5hdwrivai",
   [junit4]   2>   "source":"node_added_trigger",
   [junit4]   2>   "eventTime":756679364720229,
   [junit4]   2>   "eventType":"NODEADDED",
   [junit4]   2>   "properties":{
   [junit4]   2>     "eventTimes":[756679364720229],
   [junit4]   2>     "nodeNames":["127.0.0.1:61340_solr"]}}
   [junit4]   2> 112863 DEBUG (ScheduledTrigger-347-thread-2) [n:127.0.0.1:61327_solr    ] o.a.s.c.a.ScheduledTriggers Pausing all triggers: [node_added_trigger]
   [junit4]   2> 112864 INFO  (ScheduledTrigger-347-thread-2) [n:127.0.0.1:61327_solr    ] o.a.s.c.a.SystemLogListener Collection .system does not exist, disabling logging.
   [junit4]   2> 112865 DEBUG (AutoscalingActionExecutor-348-thread-1-processing-n:127.0.0.1:61327_solr) [n:127.0.0.1:61327_solr    ] o.a.s.c.a.ScheduledTriggers -- processing actions for {
   [junit4]   2>   "id":"2b03224be3665T5gvln9ivyvbfucls5hdwrivai",
   [junit4]   2>   "source":"node_added_trigger",
   [junit4]   2>   "eventTime":756679364720229,
   [junit4]   2>   "eventType":"NODEADDED",
   [junit4]   2>   "properties":{
   [junit4]   2>     "eventTimes":[756679364720229],
   [junit4]   2>     "_enqueue_time_":756680375454009,
   [junit4]   2>     "nodeNames":["127.0.0.1:61340_solr"]}}
   [junit4]   2> 112867 DEBUG (AutoscalingActionExecutor-348-thread-1-processing-n:127.0.0.1:61327_solr) [n:127.0.0.1:61327_solr    ] o.a.s.c.a.ScheduledTriggers Resuming trigger: node_added_trigger after 5000ms
   [junit4]   2> 112867 DEBUG (AutoscalingActionExecutor-348-thread-1-processing-n:127.0.0.1:61327_solr) [n:127.0.0.1:61327_solr    ] o.a.s.c.a.ScheduledTriggers -- processing took 2 ms for event id=2b03224be3665T5gvln9ivyvbfucls5hdwrivai
   [junit4]   2> 112879 INFO  (qtp821632975-880) [n:127.0.0.1:61326_solr    ] o.a.s.s.HttpSolrCall [admin] webapp=null path=/admin/metrics params={prefix=CONTAINER.fs.usableSpace,CORE.coreName&wt=javabin&version=2&group=solr.node,solr.core} status=0 QTime=0
   [junit4]   2> 112881 INFO  (qtp1200424120-891) [n:127.0.0.1:61327_solr    ] o.a.s.s.HttpSolrCall [admin] webapp=null path=/admin/metrics params={prefix=CONTAINER.fs.usableSpace,CORE.coreName&wt=javabin&version=2&group=solr.node,solr.core} status=0 QTime=0
   [junit4]   2> 112884 INFO  (qtp483556555-941) [n:127.0.0.1:61340_solr    ] o.a.s.s.HttpSolrCall [admin] webapp=null path=/admin/metrics params={prefix=CONTAINER.fs.usableSpace,CORE.coreName&wt=javabin&version=2&group=solr.node,solr.core} status=0 QTime=0
   [junit4]   2> 112884 DEBUG (qtp1200424120-889) [n:127.0.0.1:61327_solr    ] o.a.s.c.a.AutoScalingHandler Verified autoscaling configuration
   [junit4]   2> 112885 INFO  (qtp1200424120-889) [n:127.0.0.1:61327_solr    ] o.a.s.s.HttpSolrCall [admin] webapp=null path=/cluster/autoscaling params={wt=javabin&version=2} status=0 QTime=8
   [junit4]   2> 112886 DEBUG (zkCallback-223-thread-1-processing-n:127.0.0.1:61327_solr) [n:127.0.0.1:61327_solr    ] o.a.s.c.a.OverseerTriggerThread Refreshing /autoscaling.json with znode version 4
   [junit4]   2> 112886 DEBUG (zkCallback-223-thread-1-processing-n:127.0.0.1:61327_solr) [n:127.0.0.1:61327_solr    ] o.a.s.c.a.NodeAddedTrigger Initial livenodes: [127.0.0.1:61326_solr, 127.0.0.1:61327_solr, 127.0.0.1:61340_solr]
   [junit4]   2> 112886 DEBUG (zkCallback-223-thread-1-processing-n:127.0.0.1:61327_solr) [n:127.0.0.1:61327_solr    ] o.a.s.c.a.NodeAddedTrigger NodeAddedTrigger node_added_trigger instantiated with properties: {event=nodeAdded, waitFor=1, actions=[{name=test, class=org.apache.solr.cloud.autoscaling.TriggerIntegrationTest$TestTriggerAction}], enabled=true}
   [junit4]   2> 112887 DEBUG (OverseerAutoScalingTriggerThread-99421792426524678-127.0.0.1:61327_solr-n_0000000000) [n:127.0.0.1:61327_solr    ] o.a.s.c.a.OverseerTriggerThread Processed trigger updates upto znodeVersion 4
   [junit4]   2> 112887 DEBUG (OverseerAutoScalingTriggerThread-99421792426524678-127.0.0.1:61327_solr-n_0000000000) [n:127.0.0.1:61327_solr    ] o.a.s.c.a.OverseerTriggerThread -- clean old nodeLost markers
   [junit4]   2> 112888 DEBUG (OverseerAutoScalingTriggerThread-99421792426524678-127.0.0.1:61327_solr-n_0000000000) [n:127.0.0.1:61327_solr    ] o.a.s.c.a.OverseerTriggerThread Current znodeVersion 4, lastZnodeVersion 4
   [junit4]   2> 114896 INFO  (TEST-TriggerIntegrationTest.testNodeAddedTrigger-seed#[C98B0B0C27CBFDD4]) [    ] o.a.s.SolrTestCaseJ4 ###Ending testNodeAddedTrigger
   [junit4]   2> 114938 INFO  (TEST-TriggerIntegrationTest.testNodeAddedTriggerRestoreState-seed#[C98B0B0C27CBFDD4]) [    ] o.a.s.SolrTestCaseJ4 ###Starting testNodeAddedTriggerRestoreState
   [junit4]   2> 114939 INFO  (TEST-TriggerIntegrationTest.testNodeAddedTriggerRestoreState-seed#[C98B0B0C27CBFDD4]) [    ] o.a.s.c.a.TriggerIntegrationTest /autoscaling.json reset, new znode version 5
   [junit4]   2> 114940 DEBUG (zkCallback-223-thread-1-processing-n:127.0.0.1:61327_solr) [n:127.0.0.1:61327_solr    ] o.a.s.c.a.OverseerTriggerThread Refreshing /autoscaling.json with znode version 5
   [junit4]   2> 114940 DEBUG (OverseerAutoScalingTriggerThread-99421792426524678-127.0.0.1:61327_solr-n_0000000000) [n:127.0.0.1:61327_solr    ] o.a.s.c.a.OverseerTriggerThread Processed trigger updates upto znodeVersion 5
   [junit4]   2> 114942 DEBUG (OverseerAutoScalingTriggerThread-99421792426524678-127.0.0.1:61327_solr-n_0000000000) [n:127.0.0.1:61327_solr    ] o.a.s.c.a.OverseerTriggerThread -- clean old nodeLost markers
   [junit4]   2> 114943 DEBUG (OverseerAutoScalingTriggerThread-99421792426524678-127.0.0.1:61327_solr-n_0000000000) [n:127.0.0.1:61327_solr    ] o.a.s.c.a.OverseerTriggerThread -- clean old nodeAdded markers
   [junit4]   2> 114943 DEBUG (OverseerAutoScalingTriggerThread-99421792426524678-127.0.0.1:61327_solr-n_0000000000) [n:127.0.0.1:61327_solr    ] o.a.s.c.a.OverseerTriggerThread Current znodeVersion 5, lastZnodeVersion 5
   [junit4]   2> 114947 INFO  (qtp821632975-883) [n:127.0.0.1:61326_solr    ] o.a.s.s.HttpSolrCall [admin] webapp=null path=/admin/metrics params={prefix=CONTAINER.fs.usableSpace,CORE.coreName&wt=javabin&version=2&group=solr.node,solr.core} status=0 QTime=0
   [junit4]   2> 114949 INFO  (qtp1200424120-889) [n:127.0.0.1:61327_solr    ] o.a.s.s.HttpSolrCall [admin] webapp=null path=/admin/metrics params={prefix=CONTAINER.fs.usableSpace,CORE.coreName&wt=javabin&version=2&group=solr.node,solr.core} status=0 QTime=0
   [junit4]   2> 114951 INFO  (qtp483556555-945) [n:127.0.0.1:61340_solr    ] o.a.s.s.HttpSolrCall [admin] webapp=null path=/admin/metrics params={prefix=CONTAINER.fs.usableSpace,CORE.coreName&wt=javabin&version=2&group=solr.node,solr.core} status=0 QTime=0
   [junit4]   2> 114952 DEBUG (qtp821632975-880) [n:127.0.0.1:61326_solr    ] o.a.s.c.a.AutoScalingHandler Verified autoscaling configuration
   [junit4]   2> 114952 INFO  (qtp821632975-880) [n:127.0.0.1:61326_solr    ] o.a.s.s.HttpSolrCall [admin] webapp=null path=/admin/autoscaling params={wt=javabin&version=2} status=0 QTime=8
   [junit4]   2> 114953 DEBUG (zkCallback-223-thread-1-processing-n:127.0.0.1:61327_solr) [n:127.0.0.1:61327_solr    ] o.a.s.c.a.OverseerTriggerThread Refreshing /autoscaling.json with znode version 6
   [junit4]   2> 114953 DEBUG (zkCallback-223-thread-1-processing-n:127.0.0.1:61327_solr) [n:127.0.0.1:61327_solr    ] o.a.s.c.a.NodeAddedTrigger Initial livenodes: [127.0.0.1:61326_solr, 127.0.0.1:61327_solr, 127.0.0.1:61340_solr]
   [junit4]   2> 114953 INFO  (TEST-TriggerIntegrationTest.testNodeAddedTriggerRestoreState-seed#[C98B0B0C27CBFDD4]) [    ] o.e.j.s.Server jetty-9.4.8.v20171121, build timestamp: 2017-11-22T05:27:37+08:00, git hash: 82b8fb23f757335bb3329d540ce37a2a2615f0a8
   [junit4]   2> 114953 DEBUG (zkCallback-223-thread-1-processing-n:127.0.0.1:61327_solr) [n:127.0.0.1:61327_solr    ] o.a.s.c.a.NodeAddedTrigger NodeAddedTrigger node_added_restore_trigger instantiated with properties: {event=nodeAdded, waitFor=5, actions=[{name=test, class=org.apache.solr.cloud.autoscaling.TriggerIntegrationTest$TestTriggerAction}], enabled=true}
   [junit4]   2> 114953 DEBUG (OverseerAutoScalingTriggerThread-99421792426524678-127.0.0.1:61327_solr-n_0000000000) [n:127.0.0.1:61327_solr    ] o.a.s.c.a.OverseerTriggerThread Processed trigger updates upto znodeVersion 6
   [junit4]   2> 114954 INFO  (TEST-TriggerIntegrationTest.testNodeAddedTriggerRestoreState-seed#[C98B0B0C27CBFDD4]) [    ] o.e.j.s.session DefaultSessionIdManager workerName=node0
   [junit4]   2> 114955 INFO  (TEST-TriggerIntegrationTest.testNodeAddedTriggerRestoreState-seed#[C98B0B0C27CBFDD4]) [    ] o.e.j.s.session No SessionScavenger set, using defaults
   [junit4]   2> 114955 INFO  (TEST-TriggerIntegrationTest.testNodeAddedTriggerRestoreState-seed#[C98B0B0C27CBFDD4]) [    ] o.e.j.s.session Scavenging every 600000ms
   [junit4]   2> 114955 INFO  (TEST-TriggerIntegrationTest.testNodeAddedTriggerRestoreState-seed#[C98B0B0C27CBFDD4]) [    ] o.e.j.s.h.ContextHandler Started o.e.j.s.ServletContextHandler@5e94cad6{/solr,null,AVAILABLE}
   [junit4]   2> 114955 INFO  (TEST-TriggerIntegrationTest.testNodeAddedTriggerRestoreState-seed#[C98B0B0C27CBFDD4]) [    ] o.e.j.s.AbstractConnector Started ServerConnector@5872a092{HTTP/1.1,[http/1.1]}{127.0.0.1:61355}
   [junit4]   2> 114955 INFO  (TEST-TriggerIntegrationTest.testNodeAddedTriggerRestoreState-seed#[C98B0B0C27CBFDD4]) [    ] o.e.j.s.Server Started @119581ms
   [junit4]   2> 114955 INFO  (TEST-TriggerIntegrationTest.testNodeAddedTriggerRestoreState-seed#[C98B0B0C27CBFDD4]) [    ] o.a.s.c.s.e.JettySolrRunner Jetty properties: {hostContext=/solr, hostPort=61355}
   [junit4]   2> 114956 ERROR (TEST-TriggerIntegrationTest.testNodeAddedTriggerRestoreState-seed#[C98B0B0C27CBFDD4]) [    ] o.a.s.u.StartupLoggingUtils Missing Java Option solr.log.dir. Logging may be missing or incomplete.
   [junit4]   2> 114956 INFO  (TEST-TriggerIntegrationTest.testNodeAddedTriggerRestoreState-seed#[C98B0B0C27CBFDD4]) [    ] o.a.s.s.SolrDispatchFilter  ___      _       Welcome to Apache Solr? version 7.3.0
   [junit4]   2> 114956 INFO  (TEST-TriggerIntegrationTest.testNodeAddedTriggerRestoreState-seed#[C98B0B0C27CBFDD4]) [    ] o.a.s.s.SolrDispatchFilter / __| ___| |_ _   Starting in cloud mode on port null
   [junit4]   2> 114956 INFO  (TEST-TriggerIntegrationTest.testNodeAddedTriggerRestoreState-seed#[C98B0B0C27CBFDD4]) [    ] o.a.s.s.SolrDispatchFilter \__ \/ _ \ | '_|  Install dir: null
   [junit4]   2> 114956 INFO  (OverseerAutoScalingTriggerThread-99421792426524678-127.0.0.1:61327_solr-n_0000000000) [n:127.0.0.1:61327_solr    ] o.a.s.c.a.TriggerIntegrationTest TestTriggerAction init
   [junit4]   2> 114956 INFO  (TEST-TriggerIntegrationTest.testNodeAddedTriggerRestoreState-seed#[C98B0B0C27CBFDD4]) [    ] o.a.s.s.SolrDispatchFilter |___/\___/_|_|    Start time: 2018-01-27T12:29:23.470Z
   [junit4]   2> 114956 DEBUG (OverseerAutoScalingTriggerThread-99421792426524678-127.0.0.1:61327_solr-n_0000000000) [n:127.0.0.1:61327_solr    ] o.a.s.c.a.OverseerTriggerThread -- clean old nodeLost markers
   [junit4]   2> 114957 DEBUG (OverseerAutoScalingTriggerThread-99421792426524678-127.0.0.1:61327_solr-n_0000000000) [n:127.0.0.1:61327_solr    ] o.a.s.c.a.OverseerTriggerThread Current znodeVersion 6, lastZnodeVersion 6
   [junit4]   2> 114957 DEBUG (ScheduledTrigger-347-thread-4) [n:127.0.0.1:61327_solr    ] o.a.s.c.a.NodeAddedTrigger Running NodeAddedTrigger node_added_restore_trigger
   [junit4]   2> 114958 DEBUG (ScheduledTrigger-347-thread-4) [n:127.0.0.1:61327_solr    ] o.a.s.c.a.NodeAddedTrigger Found livenodes: 3
   [junit4]   2> 114958 INFO  (zkConnectionManagerCallback-248-thread-1) [    ] o.a.s.c.c.ConnectionManager zkClient has connected
   [junit4]   2> 114959 INFO  (TEST-TriggerIntegrationTest.testNodeAddedTriggerRestoreState-seed#[C98B0B0C27CBFDD4]) [    ] o.a.s.s.SolrDispatchFilter solr.xml found in ZooKeeper. Loading...
   [junit4]   2> 114969 INFO  (TEST-TriggerIntegrationTest.testNodeAddedTriggerRestoreState-seed#[C98B0B0C27CBFDD4]) [    ] o.a.s.c.ZkContainer Zookeeper client=127.0.0.1:61324/solr
   [junit4]   2> 114970 INFO  (zkConnectionManagerCallback-252-thread-1) [    ] o.a.s.c.c.ConnectionManager zkClient has connected
   [junit4]   2> 114974 INFO  (zkConnectionManagerCallback-254-thread-1-processing-n:127.0.0.1:61355_solr) [n:127.0.0.1:61355_solr    ] o.a.s.c.c.ConnectionManager zkClient has connected
   [junit4]   2> 114989 INFO  (TEST-TriggerIntegrationTest.testNodeAddedTriggerRestoreState-seed#[C98B0B0C27CBFDD4]) [n:127.0.0.1:61355_solr    ] o.a.s.c.c.ZkStateReader Updated live nodes from ZooKeeper... (0) -> (3)
   [junit4]   2> 114993 INFO  (TEST-TriggerIntegrationTest.testNodeAddedTriggerRestoreState-seed#[C98B0B0C27CBFDD4]) [n:127.0.0.1:61355_solr    ] o.a.s.c.Overseer Overseer (id=null) closing
   [junit4]   2> 114996 INFO  (TEST-TriggerIntegrationTest.testNodeAddedTriggerRestoreState-seed#[C98B0B0C27CBFDD4]) [n:127.0.0.1:61355_solr    ] o.a.s.c.ZkController Register node as live in ZooKeeper:/live_nodes/127.0.0.1:61355_solr
   [junit4]   2> 115000 INFO  (zkCallback-224-thread-1-processing-n:127.0.0.1:61326_solr) [n:127.0.0.1:61326_solr    ] o.a.s.c.c.ZkStateReader Updated live nodes from ZooKeeper... (3) -> (4)
   [junit4]   2> 115000 INFO  (zkCallback-235-thread-1) [    ] o.a.s.c.c.ZkStateReader Updated live nodes from ZooKeeper... (3) -> (4)
   [junit4]   2> 115001 INFO  (zkCallback-223-thread-1-processing-n:127.0.0.1:61327_solr) [n:127.0.0.1:61327_solr    ] o.a.s.c.c.ZkStateReader Updated live nodes from ZooKeeper... (3) -> (4)
   [junit4]   2> 115001 INFO  (zkCallback-243-thread-1-processing-n:127.0.0.1:61340_solr) [n:127.0.0.1:61340_solr    ] o.a.s.c.c.ZkStateReader Updated live nodes from ZooKeeper... (3) -> (4)
   [junit4]   2> 115002 INFO  (zkCallback-253-thread-1-processing-n:127.0.0.1:61355_solr) [n:127.0.0.1:61355_solr    ] o.a.s.c.c.ZkStateReader Updated live nodes from ZooKeeper... (3) -> (4)
   [junit4]   2> 115086 INFO  (TEST-TriggerIntegrationTest.testNodeAddedTriggerRestoreState-seed#[C98B0B0C27CBFDD4]) [n:127.0.0.1:61355_solr    ] o.a.s.m.r.SolrJmxReporter JMX monitoring for 'solr_61355.solr.node' (registry 'solr.node') enabled at server: com.sun.jmx.mbeanserver.JmxMBeanServer@5d6d12ad
   [junit4]   2> 115092 INFO  (TEST-TriggerIntegrationTest.testNodeAddedTriggerRestoreState-seed#[C98B0B0C27CBFDD4]) [n:127.0.0.1:61355_solr    ] o.a.s.m.r.SolrJmxReporter JMX monitoring for 'solr_61355.solr.jvm' (registry 'solr.jvm') enabled at server: com.sun.jmx.mbeanserver.JmxMBeanServer@5d6d12ad
   [junit4]   2> 115092 INFO  (TEST-TriggerIntegrationTest.testNodeAddedTriggerRestoreState-seed#[C98B0B0C27CBFDD4]) [n:127.0.0.1:61355_solr    ] o.a.s.m.r.SolrJmxReporter JMX monitoring for 'solr_61355.solr.jetty' (registry 'solr.jetty') enabled at server: com.sun.jmx.mbeanserver.JmxMBeanServer@5d6d12ad
   [junit4]   2> 115093 INFO  (TEST-TriggerIntegrationTest.testNodeAddedTriggerRestoreState-seed#[C98B0B0C27CBFDD4]) [n:127.0.0.1:61355_solr    ] o.a.s.c.CorePropertiesLocator Found 0 core definitions underneath /Users/jenkins/workspace/Lucene-Solr-7.x-MacOSX/solr/build/solr-core/test/J1/temp/solr.cloud.autoscaling.TriggerIntegrationTest_C98B0B0C27CBFDD4-001/tempDir-001/node4/.
   [junit4]   2> 115969 DEBUG (ScheduledTrigger-347-thread-4) [n:127.0.0.1:61327_solr    ] o.a.s.c.a.NodeAddedTrigger Running NodeAddedTrigger node_added_restore_trigger
   [junit4]   2> 115969 DEBUG (ScheduledTrigger-347-thread-4) [n:127.0.0.1:61327_solr    ] o.a.s.c.a.NodeAddedTrigger Found livenodes: 4
   [junit4]   2> 115969 DEBUG (ScheduledTrigger-347-thread-4) [n:127.0.0.1:61327_solr    ] o.a.s.c.a.NodeAddedTrigger Tracking new node: 127.0.0.1:61355_solr at time 756683480849775
   [junit4]   2> 116638 INFO  (qtp821632975-885) [n:127.0.0.1:61326_solr    ] o.a.s.s.HttpSolrCall [admin] webapp=null path=/admin/metrics params={prefix=CONTAINER.fs.usableSpace,CORE.coreName&wt=javabin&version=2&group=solr.node,solr.core} status=0 QTime=0
   [junit4]   2> 116640 INFO  (qtp1200424120-889) [n:127.0.0.1:61327_solr    ] o.a.s.s.HttpSolrCall [admin] webapp=null path=/admin/metrics params={prefix=CONTAINER.fs.usableSpace,CORE.coreName&wt=javabin&version=2&group=solr.node,solr.core} status=0 QTime=0
   [junit4]   2> 116641 INFO  (qtp483556555-947) [n:127.0.0.1:61340_solr    ] o.a.s.s.HttpSolrCall [admin] webapp=null path=/admin/metrics params={prefix=CONTAINER.fs.usableSpace,CORE.coreName&wt=javabin&version=2&group=solr.node,solr.core} status=0 QTime=0
   [junit4]   2> 116643 INFO  (qtp1588359092-973) [n:127.0.0.1:61355_solr    ] o.a.s.s.HttpSolrCall [admin] webapp=null path=/admin/metrics params={prefix=CONTAINER.fs.usableSpace,CORE.coreName&wt=javabin&version=2&group=solr.node,solr.core} status=0 QTime=0
   [junit4]   2> 116643 DEBUG (qtp1588359092-969) [n:127.0.0.1:61355_solr    ] o.a.s.c.a.AutoScalingHandler Verified autoscaling configuration
   [junit4]   2> 116644 INFO  (qtp1588359092-969) [n:127.0.0.1:61355_solr    ] o.a.s.s.HttpSolrCall [admin] webapp=null path=/cluster/autoscaling params={wt=javabin&version=2} status=0 QTime=8
   [junit4]   2> 116645 DEBUG (zkCallback-223-thread-1-processing-n:127.0.0.1:61327_solr) [n:127.0.0.1:61327_solr    ] o.a.s.c.a.OverseerTriggerThread Refreshing /autoscaling.json with znode version 7
   [junit4]   2> 116645 DEBUG (zkCallback-223-thread-1-processing-n:127.0.0.1:61327_solr) [n:127.0.0.1:61327_solr    ] o.a.s.c.a.NodeAddedTrigger Initial livenodes: [127.0.0.1:61355_solr, 127.0.0.1:61326_solr, 127.0.0.1:61327_solr, 127.0.0.1:61340_solr]
   [junit4]   2> 116645 DEBUG (zkCallback-223-thread-1-processing-n:127.0.0.1:61327_solr) [n:127.0.0.1:61327_solr    ] o.a.s.c.a.NodeAddedTrigger NodeAddedTrigger node_added_restore_trigger instantiated with properties: {event=nodeAdded, waitFor=0, actions=[{name=test, class=org.apache.solr.cloud.autoscaling.TriggerIntegrationTest$TestTriggerAction}], enabled=true}
   [junit4]   2> 116645 DEBUG (OverseerAutoScalingTriggerThread-99421792426524678-127.0.0.1:61327_solr-n_0000000000) [n:127.0.0.1:61327_solr    ] o.a.s.c.a.OverseerTriggerThread Processed trigger updates upto znodeVersion 7
   [junit4]   2> 116646 INFO  (OverseerAutoScalingTriggerThread-99421792426524678-127.0.0.1:61327_solr-n_0000000000) [n:127.0.0.1:61327_solr    ] o.a.s.c.a.TriggerIntegrationTest TestTriggerAction init
   [junit4]   2> 116647 DEBUG (OverseerAutoScalingTriggerThread-99421792426524678-127.0.0.1:61327_solr-n_0000000000) [n:127.0.0.1:61327_solr    ] o.a.s.c.a.NodeAddedTrigger Adding node from marker path: 127.0.0.1:61355_solr
   [junit4]   2> 116648 DEBUG (OverseerAutoScalingTriggerThread-99421792426524678-127.0.0.1:61327_solr-n_0000000000) [n:127.0.0.1:61327_solr    ] o.a.s.c.a.OverseerTriggerThread -- clean old nodeLost markers
   [junit4]   2> 116648 DEBUG (ScheduledTrigger-347-thread-2) [n:127.0.0.1:61327_solr    ] o.a.s.c.a.NodeAddedTrigger Running NodeAddedTrigger node_added_restore_trigger
   [junit4]   2> 116648 DEBUG (ScheduledTrigger-347-thread-2) [n:127.0.0.1:61327_solr    ] o.a.s.c.a.NodeAddedTrigger Found livenodes: 4
   [junit4]   2> 116648 DEBUG (ScheduledTrigger-347-thread-2) [n:127.0.0.1:61327_solr    ] o.a.s.c.a.NodeAddedTrigger NodeAddedTrigger node_added_restore_trigger firing registered processor for nodes: [127.0.0.1:61355_solr] added at times [756684158904913], now=756684159823470
   [junit4]   2> 116648 DEBUG (ScheduledTrigger-347-thread-2) [n:127.0.0.1:61327_solr    ] o.a.s.c.a.ScheduledTriggers ++++++++ Cooldown inactive - processing event: {
   [junit4]   2>   "id":"2b033427faa51T5gvln9ivyvbfucls5hdwrivak",
   [junit4]   2>   "source":"node_added_restore_trigger",
   [junit4]   2>   "eventTime":756684158904913,
   [junit4]   2>   "eventType":"NODEADDED",
   [junit4]   2>   "properties":{
   [junit4]   2>     "eventTimes":[756684158904913],
   [junit4]   2>     "nodeNames":["127.0.0.1:61355_solr"]}}
   [junit4]   2> 116648 DEBUG (ScheduledTrigger-347-thread-2) [n:127.0.0.1:61327_solr    ] o.a.s.c.a.ScheduledTriggers Pausing all triggers: [node_added_restore_trigger]
   [junit4]   2> 116648 DEBUG (OverseerAutoScalingTriggerThread-99421792426524678-127.0.0.1:61327_solr-n_0000000000) [n:127.0.0.1:61327_solr    ] o.a.s.c.a.OverseerTriggerThread Current znodeVersion 7, lastZnodeVersion 7
   [junit4]   2> 116649 INFO  (ScheduledTrigger-347-thread-2) [n:127.0.0.1:61327_solr    ] o.a.s.c.a.SystemLogListener Collection .system does not exist, disabling logging.
   [junit4]   2> 116649 DEBUG (AutoscalingActionExecutor-348-thread-1-processing-n:127.0.0.1:61327_solr) [n:127.0.0.1:61327_solr    ] o.a.s.c.a.ScheduledTriggers -- processing actions for {
   [junit4]   2>   "id":"2b033427faa51T5gvln9ivyvbfucls5hdwrivak",
   [junit4]   2>   "source":"node_added_restore_trigger",
   [junit4]   2>   "eventTime":756684158904913,
   [junit4]   2>   "eventType":"NODEADDED",
   [junit4]   2>   "properties":{
   [junit4]   2>     "eventTimes":[756684158904913],
   [junit4]   2>     "_enqueue_time_":756684159972569,
   [junit4]   2>     "nodeNames":["127.0.0.1:61355_solr"]}}
   [junit4]   2> 116649 INFO  (TEST-TriggerIntegrationTest.testNodeAddedTriggerRestoreState-seed#[C98B0B0C27CBFDD4]) [    ] o.a.s.SolrTestCaseJ4 ###Ending testNodeAddedTriggerRestoreState
   [junit4]   2> 116655 DEBUG (AutoscalingActionExecutor-348-thread-1-processing-n:127.0.0.1:61327_solr) [n:127.0.0.1:61327_solr    ] o.a.s.c.a.ScheduledTriggers Resuming trigger: node_added_restore_trigger after 5000ms
   [junit4]   2> 116656 DEBUG (AutoscalingActionExecutor-348-thread-1-processing-n:127.0.0.1:61327_solr) [n:127.0.0.1:61327_solr    ] o.a.s.c.a.ScheduledTriggers -- processing took 6 ms for event id=2b033427faa51T5gvln9ivyvbfucls5hdwrivak
   [junit4]   2> 116675 INFO  (TEST-TriggerIntegrationTest.testMetricTrigger-seed#[C98B0B0C27CBFDD4]) [    ] o.a.s.SolrTestCaseJ4 ###Starting testMetricTrigger
   [junit4]   2> 116676 INFO  (TEST-TriggerIntegrationTest.testMetricTrigger-seed#[C98B0B0C27CBFDD4]) [    ] o.a.s.c.a.TriggerIntegrationTest /autoscaling.json reset, new znode version 8
   [junit4]   2> 116677 DEBUG (zkCallback-223-thread-1-processing-n:127.0.0.1:61327_solr) [n:127.0.0.1:61327_solr    ] o.a.s.c.a.OverseerTriggerThread Refreshing /autoscaling.json with znode version 8
   [junit4]   2> 116677 DEBUG (OverseerAutoScalingTriggerThread-99421792426524678-127.0.0.1:61327_solr-n_0000000000) [n:127.0.0.1:61327_solr    ] o.a.s.c.a.OverseerTriggerThread Processed trigger updates upto znodeVersion 8
   [junit4]   2> 116679 DEBUG (OverseerAutoScalingTriggerThread-99421792426524678-127.0.0.1:61327_solr-n_0000000000) [n:127.0.0.1:61327_solr    ] o.a.s.c.a.OverseerTriggerThread -- clean old nodeLost markers
   [junit4]   2> 116679 DEBUG (OverseerAutoScalingTriggerThread-99421792426524678-127.0.0.1:61327_solr-n_0000000000) [n:127.0.0.1:61327_solr    ] o.a.s.c.a.OverseerTriggerThread -- clean old nodeAdded markers
   [junit4]   2> 116680 DEBUG (OverseerAutoScalingTriggerThread-99421792426524678-127.0.0.1:61327_solr-n_0000000000) [n:127.0.0.1:61327_solr    ] o.a.s.c.a.OverseerTriggerThread Current znodeVersion 8, lastZnodeVersion 8
   [junit4]   2> 116681 INFO  (zkConnectionManagerCallback-258-thread-1) [    ] o.a.s.c.c.ConnectionManager zkClient has connected
   [junit4]   2> 116684 INFO  (qtp821632975-882) [n:127.0.0.1:61326_solr    ] o.a.s.h.a.CollectionsHandler Invoked Collection Action :create with params replicationFactor=1&collection.configName=conf&name=testMetricTrigger&nrtReplicas=1&action=CREATE&numShards=2&wt=javabin&version=2 and sendToOCPQueue=true
   [junit4]   2> 116687 INFO  (OverseerThreadFactory-349-thread-1-processing-n:127.0.0.1:61327_solr) [n:127.0.0.1:61327_solr    ] o.a.s.c.a.c.CreateCollectionCmd Create collection testMetricTrigger
   [junit4]   2> 116813 INFO  (OverseerStateUpdate-99421792426524678-127.0.0.1:61327_solr-n_0000000000) [n:127.0.0.1:61327_solr    ] o.a.s.c.o.SliceMutator createReplica() {
   [junit4]   2>   "operation":"ADDREPLICA",
   [junit4]   2>   "collection":"testMetricTrigger",
   [junit4]   2>   "shard":"shard1",
   [junit4]   2>   "core":"testMetricTrigger_shard1_replica_n1",
   [junit4]   2>   "state":"down",
   [junit4]   2>   "base_url":"http://127.0.0.1:61340/solr",
   [junit4]   2>   "type":"NRT",
   [junit4]   2>   "waitForFinalState":"false"} 
   [junit4]   2> 116817 INFO  (OverseerStateUpdate-99421792426524678-127.0.0.1:61327_solr-n_0000000000) [n:127.0.0.1:61327_solr    ] o.a.s.c.o.SliceMutator createReplica() {
   [junit4]   2>   "operation":"ADDREPLICA",
   [junit4]   2>   "collection":"testMetricTrigger",
   [junit4]   2>   "shard":"shard2",
   [junit4]   2>   "core":"testMetricTrigger_shard2_replica_n2",
   [junit4]   2>   "state":"down",
   [junit4]   2>   "base_url":"http://127.0.0.1:61327/solr",
   [junit4]   2>   "type":"NRT",
   [junit4]   2>   "waitForFinalState":"false"} 
   [junit4]   2> 117034 INFO  (qtp1200424120-889) [n:127.0.0.1:61327_solr    ] o.a.s.h.a.CoreAdminOperation core create command qt=/admin/cores&coreNodeName=core_node4&collection.configName=conf&newCollection=true&name=testMetricTrigger_shard2_replica_n2&action=CREATE&numShards=2&collection=testMetricTrigger&shard=shard2&wt=javabin&version=2&replicaType=NRT
   [junit4]   2> 117034 INFO  (qtp483556555-947) [n:127.0.0.1:61340_solr    ] o.a.s.h.a.CoreAdminOperation core create command qt=/admin/cores&coreNodeName=core_node3&collection.configName=conf&newCollection=true&name=testMetricTrigger_shard1_replica_n1&action=CREATE&numShards=2&collection=testMetricTrigger&shard=shard1&wt=javabin&version=2&replicaType=NRT
   [junit4]   2> 117035 INFO  (qtp1200424120-889) [n:127.0.0.1:61327_solr    ] o.a.s.c.TransientSolrCoreCacheDefault Allocating transient cache for 2147483647 transient cores
   [junit4]   2> 117036 INFO  (qtp483556555-947) [n:127.0.0.1:61340_solr    ] o.a.s.c.TransientSolrCoreCacheDefault Allocating transient cache for 2147483647 transient cores
   [junit4]   2> 117157 INFO  (zkCallback-243-thread-1-processing-n:127.0.0.1:61340_solr) [n:127.0.0.1:61340_solr    ] o.a.s.c.c.ZkStateReader A cluster state change: [WatchedEvent state:SyncConnected type:NodeDataChanged path:/collections/testMetricTrigger/state.json] for collection [testMetricTrigger] has occurred - updating... (live nodes size: [4])
   [junit4]   2> 117157 INFO  (zkCallback-223-thread-1-processing-n:127.0.0.1:61327_solr) [n:127.0.0.1:61327_solr    ] o.a.s.c.c.ZkStateReader A cluster state change: [WatchedEvent state:SyncConnected type:NodeDataChanged path:/collections/testMetricTrigger/state.json] for collection [testMetricTrigger] has occurred - updating... (live nodes size: [4])
   [junit4]   2> 117158 INFO  (zkCallback-243-thread-2-processing-n:127.0.0.1:61340_solr) [n:127.0.0.1:61340_solr    ] o.a.s.c.c.ZkStateReader A cluster state change: [WatchedEvent state:SyncConnected type:NodeDataChanged path:/collections/testMetricTrigger/state.json] for collection [testMetricTrigger] has occurred - updating... (live nodes size: [4])
   [junit4]   2> 117158 INFO  (zkCallback-223-thread-2-processing-n:127.0.0.1:61327_solr) [n:127.0.0.1:61327_solr    ] o.a.s.c.c.ZkStateReader A cluster state change: [WatchedEvent state:SyncConnected type:NodeDataChanged path:/collections/testMetricTrigger/state.json] for collection [testMetricTrigger] has occurred - updating... (live nodes size: [4])
   [junit4]   2> 118089 INFO  (qtp483556555-947) [n:127.0.0.1:61340_solr c:testMetricTrigger s:shard1 r:core_node3 x:testMetricTrigger_

[...truncated too long message...]

tsearch.randomizedtesting.ThreadLeakControl checkThreadLeaks
   [junit4]   2> WARNING: Will linger awaiting termination of 1 leaked thread(s).
   [junit4]   2> NOTE: test params are: codec=Asserting(Lucene70): {action_s=PostingsFormat(name=LuceneVarGapDocFreqInterval), event.source_s=PostingsFormat(name=Memory), type=PostingsFormat(name=LuceneVarGapDocFreqInterval), before.actions_ss=PostingsFormat(name=Memory), event.property._enqueue_time__ss=PostingsFormat(name=LuceneVarGapDocFreqInterval), after.actions_ss=PostingsFormat(name=MockRandom), stage_s=PostingsFormat(name=LuceneVarGapDocFreqInterval), event.id_s=PostingsFormat(name=Asserting), event.property.eventTimes_ss=PostingsFormat(name=LuceneVarGapDocFreqInterval), source_s=PostingsFormat(name=Asserting), event.type_s=PostingsFormat(name=LuceneVarGapDocFreqInterval), responses_ts=PostingsFormat(name=MockRandom), id=PostingsFormat(name=Asserting), collections_ss=PostingsFormat(name=LuceneVarGapDocFreqInterval), operations.params_ts=PostingsFormat(name=LuceneVarGapDocFreqInterval), event.property.nodeNames_ss=PostingsFormat(name=LuceneVarGapDocFreqInterval)}, docValues:{_version_=DocValuesFormat(name=Lucene70), event.time_l=DocValuesFormat(name=Lucene70), timestamp=DocValuesFormat(name=Lucene70)}, maxPointsInLeafNode=1296, maxMBSortInHeap=5.9762019400585125, sim=RandomSimilarity(queryNorm=true): {}, locale=ar-EG, timezone=Canada/Mountain
   [junit4]   2> NOTE: Mac OS X 10.11.6 x86_64/Oracle Corporation 1.8.0_144 (64-bit)/cpus=3,threads=1,free=222189136,total=524812288
   [junit4]   2> NOTE: All tests run in this JVM: [TestZkChroot, PingRequestHandlerTest, DistributedQueryComponentOptimizationTest, TlogReplayBufferedWhileIndexingTest, HdfsBasicDistributedZk2Test, TestManagedStopFilterFactory, SpatialFilterTest, SolrIndexConfigTest, QueryResultKeyTest, CustomHighlightComponentTest, ZkCLITest, TestAuthorizationFramework, BooleanFieldTest, CloudExitableDirectoryReaderTest, CloneFieldUpdateProcessorFactoryTest, TestCloudJSONFacetJoinDomain, TestConfigOverlay, BlockJoinFacetSimpleTest, TestCollationFieldDocValues, TestXIncludeConfig, TestIBSimilarityFactory, TestSurroundQueryParser, DistribJoinFromCollectionTest, TestPhraseSuggestions, TestFieldTypeCollectionResource, TestShardHandlerFactory, PolyFieldTest, TestMergePolicyConfig, CdcrReplicationDistributedZkTest, SolrIndexSplitterTest, TestEmbeddedSolrServerSchemaAPI, TestFilteredDocIdSet, SolrShardReporterTest, TestSweetSpotSimilarityFactory, NodeAddedTriggerTest, CopyFieldTest, CollectionTooManyReplicasTest, SolrTestCaseJ4Test, AtomicUpdatesTest, SolrSlf4jReporterTest, TestCursorMarkWithoutUniqueKey, TestPartialUpdateDeduplication, TestLRUStatsCache, ConnectionReuseTest, TestSolrCloudWithSecureImpersonation, BinaryUpdateRequestHandlerTest, TestSizeLimitedDistributedMap, TestCloudPseudoReturnFields, TestAnalyzeInfixSuggestions, TestRecovery, HdfsNNFailoverTest, TestUninvertingReader, DistributedExpandComponentTest, TestHdfsCloudBackupRestore, TestLegacyTerms, TestObjectReleaseTracker, TestJoin, UninvertDocValuesMergePolicyTest, TestRealTimeGet, TestFiltering, TestCollationField, TestSchemaManager, TestSolrDeletionPolicy1, TestPullReplicaErrorHandling, TestSmileRequest, DirectSolrSpellCheckerTest, TestQueryWrapperFilter, TestComplexPhraseLeadingWildcard, AddReplicaTest, FileUtilsTest, TestBinaryField, TestUtils, TestClusterStateMutator, TestJsonFacetRefinement, TestSuggestSpellingConverter, TestRuleBasedAuthorizationPlugin, SolrCLIZkUtilsTest, TestUseDocValuesAsStored, DistributedFacetPivotSmallAdvancedTest, TestDefaultStatsCache, DateMathParserTest, TestPolicyCloud, TestInfoStreamLogging, CustomCollectionTest, SolrRequestParserTest, SolrJmxReporterCloudTest, PathHierarchyTokenizerFactoryTest, TestDeleteCollectionOnDownNodes, UtilsToolTest, SpatialHeatmapFacetsTest, RecoveryZkTest, TestSolrCoreParser, TestCorePropertiesReload, TestJmxIntegration, WordBreakSolrSpellCheckerTest, TestDocTermOrds, TestStressInPlaceUpdates, ReplicaListTransformerTest, ResourceLoaderTest, HdfsSyncSliceTest, TestFaceting, DateFieldTest, DirectSolrConnectionTest, CacheHeaderTest, TestFunctionQuery, MoveReplicaHDFSFailoverTest, AnalyticsMergeStrategyTest, SignatureUpdateProcessorFactoryTest, TestCoreContainer, DocumentBuilderTest, TestTolerantSearch, JvmMetricsTest, BigEndianAscendingWordDeserializerTest, TestFieldCacheWithThreads, TestFieldCollectionResource, SolrGangliaReporterTest, SolrInfoBeanTest, OverriddenZkACLAndCredentialsProvidersTest, PluginInfoTest, RemoteQueryErrorTest, SaslZkACLProviderTest, IndexSchemaRuntimeFieldTest, BlobRepositoryCloudTest, CreateCollectionCleanupTest, DistributedMLTComponentTest, TestNoOpRegenerator, TestSolrCloudWithHadoopAuthPlugin, TestManagedSchemaThreadSafety, HdfsWriteToMultipleCollectionsTest, AddSchemaFieldsUpdateProcessorFactoryTest, TestBlobHandler, SuggestComponentTest, TestSubQueryTransformer, DistribCursorPagingTest, TemplateUpdateProcessorTest, XmlUpdateRequestHandlerTest, ExecutePlanActionTest, TestSolrConfigHandler, SampleTest, TestConfigSetProperties, TestCharFilters, UUIDUpdateProcessorFallbackTest, TestQueryUtils, DeleteNodeTest, FacetPivotSmallTest, CachingDirectoryFactoryTest, TestGenericDistributedQueue, RuleEngineTest, OverseerStatusTest, TestDynamicLoading, RankQueryTest, NumericFieldsTest, TestSolrCLIRunExample, TestIntervalFaceting, IgnoreCommitOptimizeUpdateProcessorFactoryTest, TestFieldCacheSortRandom, OutputWriterTest, TestExportWriter, TestPostingsSolrHighlighter, MoreLikeThisHandlerTest, CurrencyRangeFacetCloudTest, TestPerFieldSimilarity, RequiredFieldsTest, PreAnalyzedUpdateProcessorTest, SolrIndexMetricsTest, TestPseudoReturnFields, DataDrivenBlockJoinTest, TestLegacyFieldReuse, TestLazyCores, TestJsonRequest, TestReplicaProperties, TestMacroExpander, TestExpandComponent, TestTrieFacet, FastVectorHighlighterTest, SubstringBytesRefFilterTest, TestLeaderInitiatedRecoveryThread, LeaderElectionTest, TestDynamicFieldCollectionResource, SOLR749Test, TestSolrQueryResponse, MetricUtilsTest, OpenCloseCoreStressTest, TestTlogReplica, ShardSplitTest, TestCloudDeleteByQuery, TestConfigSetsAPI, TestSolrConfigHandlerConcurrent, BasicDistributedZkTest, ChaosMonkeySafeLeaderTest, BasicDistributedZk2Test, UnloadDistributedZkTest, LeaderElectionIntegrationTest, ZkSolrClientTest, ShardRoutingCustomTest, TermVectorComponentDistributedTest, TestReload, SimpleFacetsTest, SolrCoreTest, StatsComponentTest, BadIndexSchemaTest, ConvertedLegacyTest, BasicFunctionalityTest, DirectUpdateHandlerTest, TestBadConfig, TestIndexSearcher, HighlighterTest, ShowFileRequestHandlerTest, DistributedQueryElevationComponentTest, TestCoreDiscovery, AnalysisAfterCoreReloadTest, TestExtendedDismaxParser, SuggesterFSTTest, TestFoldingMultitermQuery, SuggesterTSTTest, SuggesterTest, TestStressLucene, TestTrie, SuggesterWFSTTest, TestCSVLoader, SchemaVersionSpecificBehaviorTest, SolrCoreCheckLockOnStartupTest, FieldMutatingUpdateProcessorTest, TestAtomicUpdateErrorCases, TestWordDelimiterFilterFactory, QueryEqualityTest, DirectUpdateHandlerOptimizeTest, StatelessScriptUpdateProcessorFactoryTest, TestRemoteStreaming, DistanceFunctionTest, DebugComponentTest, IndexBasedSpellCheckerTest, LukeRequestHandlerTest, TestQueryTypes, TestOmitPositions, TermsComponentTest, RequestHandlersTest, TestValueSourceCache, FieldAnalysisRequestHandlerTest, LoggingHandlerTest, RegexBoostProcessorTest, SolrPluginUtilsTest, IndexSchemaTest, TestCSVResponseWriter, MBeansHandlerTest, TestAnalyzedSuggestions, UniqFieldsUpdateProcessorFactoryTest, TestPHPSerializedResponseWriter, CSVRequestHandlerTest, TestComponentsName, SearchHandlerTest, TestLFUCache, UpdateParamsTest, TestSolrIndexConfig, ResponseLogComponentTest, TestDocSet, TestElisionMultitermQuery, TestLuceneMatchVersion, SynonymTokenizerTest, EchoParamsTest, TestDFRSimilarityFactory, TestLMDirichletSimilarityFactory, TestLMJelinekMercerSimilarityFactory, TestBM25SimilarityFactory, TestFastOutputStream, OpenExchangeRatesOrgProviderTest, PreAnalyzedFieldTest, RAMDirectoryFactoryTest, TestLRUCache, UUIDFieldTest, CursorPagingTest, TestCrossCoreJoin, TestDistributedMissingSort, TestSimpleTrackingShardHandler, AssignBackwardCompatibilityTest, CleanupOldIndexTest, CollectionStateFormat2Test, CollectionsAPISolrJTest, ConfigSetsAPITest, ConnectionManagerTest, CreateRoutedAliasTest, DeleteShardTest, DistributedVersionInfoTest, LeaderElectionContextKeyTest, LeaderFailureAfterFreshStartTest, LeaderInitiatedRecoveryOnCommitTest, LeaderInitiatedRecoveryOnShardRestartTest, LegacyCloudClusterPropTest, MigrateRouteKeyTest, NodeMutatorTest, OutOfBoxZkACLAndCredentialsProvidersTest, OverseerCollectionConfigSetProcessorTest, OverseerModifyCollectionTest, RecoveryAfterSoftCommitTest, ReplaceNodeTest, ReplicationFactorTest, RestartWhileUpdatingTest, RollingRestartTest, TestClusterProperties, TestConfigSetsAPIExclusivity, TestConfigSetsAPIZkFailure, TestCryptoKeys, TestDownShardTolerantSearch, TestExclusionRuleCollectionAccess, TestLeaderElectionWithEmptyReplica, TestPrepRecovery, TestRandomRequestDistribution, TestRequestForwarding, TestSSLRandomization, TestSegmentSorting, TestSolrCloudWithDelegationTokens, TestStressLiveNodes, TestTolerantUpdateProcessorRandomCloud, VMParamsZkACLAndCredentialsProvidersTest, AssignTest, TestCollectionAPI, AutoAddReplicasIntegrationTest, TestComputePlanAction, TestDistribStateManager, TestLargeCluster, CdcrReplicationHandlerTest, CdcrRequestHandlerTest, CdcrVersionReplicationTest, HdfsChaosMonkeyNothingIsSafeTest, HdfsChaosMonkeySafeLeaderTest, HdfsRecoveryZkTest, HdfsRestartWhileUpdatingTest, HdfsThreadLeakTest, HdfsTlogReplayBufferedWhileIndexingTest, HdfsUnloadDistributedZkTest, ZkStateReaderTest, ImplicitSnitchTest, RulesTest, TestSolrCoreSnapshots, RequestLoggingTest, TestReplicationHandlerBackup, TestSQLHandlerNonCloud, AutoscalingHistoryHandlerTest]
   [junit4] Completed [651/769 (4!)] on J0 in 38.91s, 1 test, 1 failure <<< FAILURES!

[...truncated 48650 lines...]

Mime
View raw message