lucene-dev mailing list archives

Site index · List index
Message view « Date » · « Thread »
Top « Date » · « Thread »
From Apache Jenkins Server <jenk...@builds.apache.org>
Subject [JENKINS] Lucene-Solr-Tests-7.x - Build # 336 - Failure
Date Sat, 27 Jan 2018 21:20:46 GMT
Build: https://builds.apache.org/job/Lucene-Solr-Tests-7.x/336/

9 tests failed.
FAILED:  org.apache.solr.cloud.ConcurrentCreateRoutedAliasTest.testConcurrentCreateRoutedAliasMinimal

Error Message:
concurrent alias creation failed java.lang.IllegalStateException: Connection pool shut down

Stack Trace:
java.lang.AssertionError: concurrent alias creation failed java.lang.IllegalStateException: Connection pool shut down
	at __randomizedtesting.SeedInfo.seed([5C443574D8348035:98DF3926752B370F]:0)
	at org.junit.Assert.fail(Assert.java:93)
	at org.junit.Assert.assertTrue(Assert.java:43)
	at org.junit.Assert.assertNull(Assert.java:551)
	at org.apache.solr.cloud.ConcurrentCreateRoutedAliasTest.testConcurrentCreateRoutedAliasMinimal(ConcurrentCreateRoutedAliasTest.java:108)
	at sun.reflect.NativeMethodAccessorImpl.invoke0(Native Method)
	at sun.reflect.NativeMethodAccessorImpl.invoke(NativeMethodAccessorImpl.java:62)
	at sun.reflect.DelegatingMethodAccessorImpl.invoke(DelegatingMethodAccessorImpl.java:43)
	at java.lang.reflect.Method.invoke(Method.java:498)
	at com.carrotsearch.randomizedtesting.RandomizedRunner.invoke(RandomizedRunner.java:1737)
	at com.carrotsearch.randomizedtesting.RandomizedRunner$8.evaluate(RandomizedRunner.java:934)
	at com.carrotsearch.randomizedtesting.RandomizedRunner$9.evaluate(RandomizedRunner.java:970)
	at com.carrotsearch.randomizedtesting.RandomizedRunner$10.evaluate(RandomizedRunner.java:984)
	at com.carrotsearch.randomizedtesting.rules.SystemPropertiesRestoreRule$1.evaluate(SystemPropertiesRestoreRule.java:57)
	at org.apache.lucene.util.TestRuleSetupTeardownChained$1.evaluate(TestRuleSetupTeardownChained.java:49)
	at org.apache.lucene.util.AbstractBeforeAfterRule$1.evaluate(AbstractBeforeAfterRule.java:45)
	at org.apache.lucene.util.TestRuleThreadAndTestName$1.evaluate(TestRuleThreadAndTestName.java:48)
	at org.apache.lucene.util.TestRuleIgnoreAfterMaxFailures$1.evaluate(TestRuleIgnoreAfterMaxFailures.java:64)
	at org.apache.lucene.util.TestRuleMarkFailure$1.evaluate(TestRuleMarkFailure.java:47)
	at com.carrotsearch.randomizedtesting.rules.StatementAdapter.evaluate(StatementAdapter.java:36)
	at com.carrotsearch.randomizedtesting.ThreadLeakControl$StatementRunner.run(ThreadLeakControl.java:368)
	at com.carrotsearch.randomizedtesting.ThreadLeakControl.forkTimeoutingTask(ThreadLeakControl.java:817)
	at com.carrotsearch.randomizedtesting.ThreadLeakControl$3.evaluate(ThreadLeakControl.java:468)
	at com.carrotsearch.randomizedtesting.RandomizedRunner.runSingleTest(RandomizedRunner.java:943)
	at com.carrotsearch.randomizedtesting.RandomizedRunner$5.evaluate(RandomizedRunner.java:829)
	at com.carrotsearch.randomizedtesting.RandomizedRunner$6.evaluate(RandomizedRunner.java:879)
	at com.carrotsearch.randomizedtesting.RandomizedRunner$7.evaluate(RandomizedRunner.java:890)
	at com.carrotsearch.randomizedtesting.rules.StatementAdapter.evaluate(StatementAdapter.java:36)
	at com.carrotsearch.randomizedtesting.rules.SystemPropertiesRestoreRule$1.evaluate(SystemPropertiesRestoreRule.java:57)
	at org.apache.lucene.util.AbstractBeforeAfterRule$1.evaluate(AbstractBeforeAfterRule.java:45)
	at com.carrotsearch.randomizedtesting.rules.StatementAdapter.evaluate(StatementAdapter.java:36)
	at org.apache.lucene.util.TestRuleStoreClassName$1.evaluate(TestRuleStoreClassName.java:41)
	at com.carrotsearch.randomizedtesting.rules.NoShadowingOrOverridesOnMethodsRule$1.evaluate(NoShadowingOrOverridesOnMethodsRule.java:40)
	at com.carrotsearch.randomizedtesting.rules.NoShadowingOrOverridesOnMethodsRule$1.evaluate(NoShadowingOrOverridesOnMethodsRule.java:40)
	at com.carrotsearch.randomizedtesting.rules.StatementAdapter.evaluate(StatementAdapter.java:36)
	at com.carrotsearch.randomizedtesting.rules.StatementAdapter.evaluate(StatementAdapter.java:36)
	at com.carrotsearch.randomizedtesting.rules.StatementAdapter.evaluate(StatementAdapter.java:36)
	at org.apache.lucene.util.TestRuleAssertionsRequired$1.evaluate(TestRuleAssertionsRequired.java:53)
	at org.apache.lucene.util.TestRuleMarkFailure$1.evaluate(TestRuleMarkFailure.java:47)
	at org.apache.lucene.util.TestRuleIgnoreAfterMaxFailures$1.evaluate(TestRuleIgnoreAfterMaxFailures.java:64)
	at org.apache.lucene.util.TestRuleIgnoreTestSuites$1.evaluate(TestRuleIgnoreTestSuites.java:54)
	at com.carrotsearch.randomizedtesting.rules.StatementAdapter.evaluate(StatementAdapter.java:36)
	at com.carrotsearch.randomizedtesting.ThreadLeakControl$StatementRunner.run(ThreadLeakControl.java:368)
	at java.lang.Thread.run(Thread.java:748)


FAILED:  org.apache.solr.cloud.LeaderFailoverAfterPartitionTest.test

Error Message:
Expected 2 of 3 replicas to be active but only found 1; [core_node5:{"core":"c8n_1x3_lf_shard1_replica_t1","base_url":"http://127.0.0.1:36184/w/h","node_name":"127.0.0.1:36184_w%2Fh","state":"active","type":"TLOG","leader":"true"}]; clusterState: DocCollection(c8n_1x3_lf//collections/c8n_1x3_lf/state.json/17)={   "pullReplicas":"0",   "replicationFactor":"1",   "shards":{"shard1":{       "range":"80000000-7fffffff",       "state":"active",       "replicas":{         "core_node4":{           "core":"c8n_1x3_lf_shard1_replica_t2",           "base_url":"http://127.0.0.1:34913/w/h",           "node_name":"127.0.0.1:34913_w%2Fh",           "state":"down",           "type":"TLOG"},         "core_node5":{           "core":"c8n_1x3_lf_shard1_replica_t1",           "base_url":"http://127.0.0.1:36184/w/h",           "node_name":"127.0.0.1:36184_w%2Fh",           "state":"active",           "type":"TLOG",           "leader":"true"},         "core_node6":{           "state":"down",           "base_url":"http://127.0.0.1:58802/w/h",           "core":"c8n_1x3_lf_shard1_replica_t3",           "node_name":"127.0.0.1:58802_w%2Fh",           "type":"TLOG"}}}},   "router":{"name":"compositeId"},   "maxShardsPerNode":"1",   "autoAddReplicas":"false",   "nrtReplicas":"0",   "tlogReplicas":"3"}

Stack Trace:
java.lang.AssertionError: Expected 2 of 3 replicas to be active but only found 1; [core_node5:{"core":"c8n_1x3_lf_shard1_replica_t1","base_url":"http://127.0.0.1:36184/w/h","node_name":"127.0.0.1:36184_w%2Fh","state":"active","type":"TLOG","leader":"true"}]; clusterState: DocCollection(c8n_1x3_lf//collections/c8n_1x3_lf/state.json/17)={
  "pullReplicas":"0",
  "replicationFactor":"1",
  "shards":{"shard1":{
      "range":"80000000-7fffffff",
      "state":"active",
      "replicas":{
        "core_node4":{
          "core":"c8n_1x3_lf_shard1_replica_t2",
          "base_url":"http://127.0.0.1:34913/w/h",
          "node_name":"127.0.0.1:34913_w%2Fh",
          "state":"down",
          "type":"TLOG"},
        "core_node5":{
          "core":"c8n_1x3_lf_shard1_replica_t1",
          "base_url":"http://127.0.0.1:36184/w/h",
          "node_name":"127.0.0.1:36184_w%2Fh",
          "state":"active",
          "type":"TLOG",
          "leader":"true"},
        "core_node6":{
          "state":"down",
          "base_url":"http://127.0.0.1:58802/w/h",
          "core":"c8n_1x3_lf_shard1_replica_t3",
          "node_name":"127.0.0.1:58802_w%2Fh",
          "type":"TLOG"}}}},
  "router":{"name":"compositeId"},
  "maxShardsPerNode":"1",
  "autoAddReplicas":"false",
  "nrtReplicas":"0",
  "tlogReplicas":"3"}
	at __randomizedtesting.SeedInfo.seed([5C443574D8348035:D4100AAE76C8EDCD]:0)
	at org.junit.Assert.fail(Assert.java:93)
	at org.junit.Assert.assertTrue(Assert.java:43)
	at org.apache.solr.cloud.LeaderFailoverAfterPartitionTest.testRf3WithLeaderFailover(LeaderFailoverAfterPartitionTest.java:169)
	at org.apache.solr.cloud.LeaderFailoverAfterPartitionTest.test(LeaderFailoverAfterPartitionTest.java:56)
	at sun.reflect.NativeMethodAccessorImpl.invoke0(Native Method)
	at sun.reflect.NativeMethodAccessorImpl.invoke(NativeMethodAccessorImpl.java:62)
	at sun.reflect.DelegatingMethodAccessorImpl.invoke(DelegatingMethodAccessorImpl.java:43)
	at java.lang.reflect.Method.invoke(Method.java:498)
	at com.carrotsearch.randomizedtesting.RandomizedRunner.invoke(RandomizedRunner.java:1737)
	at com.carrotsearch.randomizedtesting.RandomizedRunner$8.evaluate(RandomizedRunner.java:934)
	at com.carrotsearch.randomizedtesting.RandomizedRunner$9.evaluate(RandomizedRunner.java:970)
	at com.carrotsearch.randomizedtesting.RandomizedRunner$10.evaluate(RandomizedRunner.java:984)
	at org.apache.solr.BaseDistributedSearchTestCase$ShardsRepeatRule$ShardsFixedStatement.callStatement(BaseDistributedSearchTestCase.java:993)
	at org.apache.solr.BaseDistributedSearchTestCase$ShardsRepeatRule$ShardsStatement.evaluate(BaseDistributedSearchTestCase.java:968)
	at com.carrotsearch.randomizedtesting.rules.SystemPropertiesRestoreRule$1.evaluate(SystemPropertiesRestoreRule.java:57)
	at org.apache.lucene.util.TestRuleSetupTeardownChained$1.evaluate(TestRuleSetupTeardownChained.java:49)
	at org.apache.lucene.util.AbstractBeforeAfterRule$1.evaluate(AbstractBeforeAfterRule.java:45)
	at org.apache.lucene.util.TestRuleThreadAndTestName$1.evaluate(TestRuleThreadAndTestName.java:48)
	at org.apache.lucene.util.TestRuleIgnoreAfterMaxFailures$1.evaluate(TestRuleIgnoreAfterMaxFailures.java:64)
	at org.apache.lucene.util.TestRuleMarkFailure$1.evaluate(TestRuleMarkFailure.java:47)
	at com.carrotsearch.randomizedtesting.rules.StatementAdapter.evaluate(StatementAdapter.java:36)
	at com.carrotsearch.randomizedtesting.ThreadLeakControl$StatementRunner.run(ThreadLeakControl.java:368)
	at com.carrotsearch.randomizedtesting.ThreadLeakControl.forkTimeoutingTask(ThreadLeakControl.java:817)
	at com.carrotsearch.randomizedtesting.ThreadLeakControl$3.evaluate(ThreadLeakControl.java:468)
	at com.carrotsearch.randomizedtesting.RandomizedRunner.runSingleTest(RandomizedRunner.java:943)
	at com.carrotsearch.randomizedtesting.RandomizedRunner$5.evaluate(RandomizedRunner.java:829)
	at com.carrotsearch.randomizedtesting.RandomizedRunner$6.evaluate(RandomizedRunner.java:879)
	at com.carrotsearch.randomizedtesting.RandomizedRunner$7.evaluate(RandomizedRunner.java:890)
	at com.carrotsearch.randomizedtesting.rules.StatementAdapter.evaluate(StatementAdapter.java:36)
	at com.carrotsearch.randomizedtesting.rules.SystemPropertiesRestoreRule$1.evaluate(SystemPropertiesRestoreRule.java:57)
	at org.apache.lucene.util.AbstractBeforeAfterRule$1.evaluate(AbstractBeforeAfterRule.java:45)
	at com.carrotsearch.randomizedtesting.rules.StatementAdapter.evaluate(StatementAdapter.java:36)
	at org.apache.lucene.util.TestRuleStoreClassName$1.evaluate(TestRuleStoreClassName.java:41)
	at com.carrotsearch.randomizedtesting.rules.NoShadowingOrOverridesOnMethodsRule$1.evaluate(NoShadowingOrOverridesOnMethodsRule.java:40)
	at com.carrotsearch.randomizedtesting.rules.NoShadowingOrOverridesOnMethodsRule$1.evaluate(NoShadowingOrOverridesOnMethodsRule.java:40)
	at com.carrotsearch.randomizedtesting.rules.StatementAdapter.evaluate(StatementAdapter.java:36)
	at com.carrotsearch.randomizedtesting.rules.StatementAdapter.evaluate(StatementAdapter.java:36)
	at com.carrotsearch.randomizedtesting.rules.StatementAdapter.evaluate(StatementAdapter.java:36)
	at org.apache.lucene.util.TestRuleAssertionsRequired$1.evaluate(TestRuleAssertionsRequired.java:53)
	at org.apache.lucene.util.TestRuleMarkFailure$1.evaluate(TestRuleMarkFailure.java:47)
	at org.apache.lucene.util.TestRuleIgnoreAfterMaxFailures$1.evaluate(TestRuleIgnoreAfterMaxFailures.java:64)
	at org.apache.lucene.util.TestRuleIgnoreTestSuites$1.evaluate(TestRuleIgnoreTestSuites.java:54)
	at com.carrotsearch.randomizedtesting.rules.StatementAdapter.evaluate(StatementAdapter.java:36)
	at com.carrotsearch.randomizedtesting.ThreadLeakControl$StatementRunner.run(ThreadLeakControl.java:368)
	at java.lang.Thread.run(Thread.java:748)


FAILED:  org.apache.solr.cloud.autoscaling.TriggerIntegrationTest.testEventFromRestoredState

Error Message:


Stack Trace:
java.lang.AssertionError
	at __randomizedtesting.SeedInfo.seed([5C443574D8348035:5C7281B4F139245F]:0)
	at org.junit.Assert.fail(Assert.java:92)
	at org.junit.Assert.assertTrue(Assert.java:43)
	at org.junit.Assert.assertTrue(Assert.java:54)
	at org.apache.solr.cloud.autoscaling.TriggerIntegrationTest.testEventFromRestoredState(TriggerIntegrationTest.java:760)
	at sun.reflect.NativeMethodAccessorImpl.invoke0(Native Method)
	at sun.reflect.NativeMethodAccessorImpl.invoke(NativeMethodAccessorImpl.java:62)
	at sun.reflect.DelegatingMethodAccessorImpl.invoke(DelegatingMethodAccessorImpl.java:43)
	at java.lang.reflect.Method.invoke(Method.java:498)
	at com.carrotsearch.randomizedtesting.RandomizedRunner.invoke(RandomizedRunner.java:1737)
	at com.carrotsearch.randomizedtesting.RandomizedRunner$8.evaluate(RandomizedRunner.java:934)
	at com.carrotsearch.randomizedtesting.RandomizedRunner$9.evaluate(RandomizedRunner.java:970)
	at com.carrotsearch.randomizedtesting.RandomizedRunner$10.evaluate(RandomizedRunner.java:984)
	at com.carrotsearch.randomizedtesting.rules.SystemPropertiesRestoreRule$1.evaluate(SystemPropertiesRestoreRule.java:57)
	at org.apache.lucene.util.TestRuleSetupTeardownChained$1.evaluate(TestRuleSetupTeardownChained.java:49)
	at org.apache.lucene.util.AbstractBeforeAfterRule$1.evaluate(AbstractBeforeAfterRule.java:45)
	at org.apache.lucene.util.TestRuleThreadAndTestName$1.evaluate(TestRuleThreadAndTestName.java:48)
	at org.apache.lucene.util.TestRuleIgnoreAfterMaxFailures$1.evaluate(TestRuleIgnoreAfterMaxFailures.java:64)
	at org.apache.lucene.util.TestRuleMarkFailure$1.evaluate(TestRuleMarkFailure.java:47)
	at com.carrotsearch.randomizedtesting.rules.StatementAdapter.evaluate(StatementAdapter.java:36)
	at com.carrotsearch.randomizedtesting.ThreadLeakControl$StatementRunner.run(ThreadLeakControl.java:368)
	at com.carrotsearch.randomizedtesting.ThreadLeakControl.forkTimeoutingTask(ThreadLeakControl.java:817)
	at com.carrotsearch.randomizedtesting.ThreadLeakControl$3.evaluate(ThreadLeakControl.java:468)
	at com.carrotsearch.randomizedtesting.RandomizedRunner.runSingleTest(RandomizedRunner.java:943)
	at com.carrotsearch.randomizedtesting.RandomizedRunner$5.evaluate(RandomizedRunner.java:829)
	at com.carrotsearch.randomizedtesting.RandomizedRunner$6.evaluate(RandomizedRunner.java:879)
	at com.carrotsearch.randomizedtesting.RandomizedRunner$7.evaluate(RandomizedRunner.java:890)
	at com.carrotsearch.randomizedtesting.rules.StatementAdapter.evaluate(StatementAdapter.java:36)
	at com.carrotsearch.randomizedtesting.rules.SystemPropertiesRestoreRule$1.evaluate(SystemPropertiesRestoreRule.java:57)
	at org.apache.lucene.util.AbstractBeforeAfterRule$1.evaluate(AbstractBeforeAfterRule.java:45)
	at com.carrotsearch.randomizedtesting.rules.StatementAdapter.evaluate(StatementAdapter.java:36)
	at org.apache.lucene.util.TestRuleStoreClassName$1.evaluate(TestRuleStoreClassName.java:41)
	at com.carrotsearch.randomizedtesting.rules.NoShadowingOrOverridesOnMethodsRule$1.evaluate(NoShadowingOrOverridesOnMethodsRule.java:40)
	at com.carrotsearch.randomizedtesting.rules.NoShadowingOrOverridesOnMethodsRule$1.evaluate(NoShadowingOrOverridesOnMethodsRule.java:40)
	at com.carrotsearch.randomizedtesting.rules.StatementAdapter.evaluate(StatementAdapter.java:36)
	at com.carrotsearch.randomizedtesting.rules.StatementAdapter.evaluate(StatementAdapter.java:36)
	at com.carrotsearch.randomizedtesting.rules.StatementAdapter.evaluate(StatementAdapter.java:36)
	at org.apache.lucene.util.TestRuleAssertionsRequired$1.evaluate(TestRuleAssertionsRequired.java:53)
	at org.apache.lucene.util.TestRuleMarkFailure$1.evaluate(TestRuleMarkFailure.java:47)
	at org.apache.lucene.util.TestRuleIgnoreAfterMaxFailures$1.evaluate(TestRuleIgnoreAfterMaxFailures.java:64)
	at org.apache.lucene.util.TestRuleIgnoreTestSuites$1.evaluate(TestRuleIgnoreTestSuites.java:54)
	at com.carrotsearch.randomizedtesting.rules.StatementAdapter.evaluate(StatementAdapter.java:36)
	at com.carrotsearch.randomizedtesting.ThreadLeakControl$StatementRunner.run(ThreadLeakControl.java:368)
	at java.lang.Thread.run(Thread.java:748)


FAILED:  org.apache.solr.cloud.autoscaling.sim.TestGenericDistributedQueue.testDistributedQueue

Error Message:
Test abandoned because suite timeout was reached.

Stack Trace:
java.lang.Exception: Test abandoned because suite timeout was reached.
	at __randomizedtesting.SeedInfo.seed([5C443574D8348035]:0)


FAILED:  junit.framework.TestSuite.org.apache.solr.cloud.autoscaling.sim.TestGenericDistributedQueue

Error Message:
Suite timeout exceeded (>= 7200000 msec).

Stack Trace:
java.lang.Exception: Suite timeout exceeded (>= 7200000 msec).
	at __randomizedtesting.SeedInfo.seed([5C443574D8348035]:0)


FAILED:  org.apache.solr.cloud.autoscaling.sim.TestLargeCluster.testSearchRate

Error Message:
The trigger did not fire at all

Stack Trace:
java.lang.AssertionError: The trigger did not fire at all
	at __randomizedtesting.SeedInfo.seed([5C443574D8348035:10C2BFD17F2267A]:0)
	at org.junit.Assert.fail(Assert.java:93)
	at org.junit.Assert.assertTrue(Assert.java:43)
	at org.apache.solr.cloud.autoscaling.sim.TestLargeCluster.testSearchRate(TestLargeCluster.java:547)
	at sun.reflect.NativeMethodAccessorImpl.invoke0(Native Method)
	at sun.reflect.NativeMethodAccessorImpl.invoke(NativeMethodAccessorImpl.java:62)
	at sun.reflect.DelegatingMethodAccessorImpl.invoke(DelegatingMethodAccessorImpl.java:43)
	at java.lang.reflect.Method.invoke(Method.java:498)
	at com.carrotsearch.randomizedtesting.RandomizedRunner.invoke(RandomizedRunner.java:1737)
	at com.carrotsearch.randomizedtesting.RandomizedRunner$8.evaluate(RandomizedRunner.java:934)
	at com.carrotsearch.randomizedtesting.RandomizedRunner$9.evaluate(RandomizedRunner.java:970)
	at com.carrotsearch.randomizedtesting.RandomizedRunner$10.evaluate(RandomizedRunner.java:984)
	at com.carrotsearch.randomizedtesting.rules.SystemPropertiesRestoreRule$1.evaluate(SystemPropertiesRestoreRule.java:57)
	at org.apache.lucene.util.TestRuleSetupTeardownChained$1.evaluate(TestRuleSetupTeardownChained.java:49)
	at org.apache.lucene.util.AbstractBeforeAfterRule$1.evaluate(AbstractBeforeAfterRule.java:45)
	at org.apache.lucene.util.TestRuleThreadAndTestName$1.evaluate(TestRuleThreadAndTestName.java:48)
	at org.apache.lucene.util.TestRuleIgnoreAfterMaxFailures$1.evaluate(TestRuleIgnoreAfterMaxFailures.java:64)
	at org.apache.lucene.util.TestRuleMarkFailure$1.evaluate(TestRuleMarkFailure.java:47)
	at com.carrotsearch.randomizedtesting.rules.StatementAdapter.evaluate(StatementAdapter.java:36)
	at com.carrotsearch.randomizedtesting.ThreadLeakControl$StatementRunner.run(ThreadLeakControl.java:368)
	at com.carrotsearch.randomizedtesting.ThreadLeakControl.forkTimeoutingTask(ThreadLeakControl.java:817)
	at com.carrotsearch.randomizedtesting.ThreadLeakControl$3.evaluate(ThreadLeakControl.java:468)
	at com.carrotsearch.randomizedtesting.RandomizedRunner.runSingleTest(RandomizedRunner.java:943)
	at com.carrotsearch.randomizedtesting.RandomizedRunner$5.evaluate(RandomizedRunner.java:829)
	at com.carrotsearch.randomizedtesting.RandomizedRunner$6.evaluate(RandomizedRunner.java:879)
	at com.carrotsearch.randomizedtesting.RandomizedRunner$7.evaluate(RandomizedRunner.java:890)
	at com.carrotsearch.randomizedtesting.rules.StatementAdapter.evaluate(StatementAdapter.java:36)
	at com.carrotsearch.randomizedtesting.rules.SystemPropertiesRestoreRule$1.evaluate(SystemPropertiesRestoreRule.java:57)
	at org.apache.lucene.util.AbstractBeforeAfterRule$1.evaluate(AbstractBeforeAfterRule.java:45)
	at com.carrotsearch.randomizedtesting.rules.StatementAdapter.evaluate(StatementAdapter.java:36)
	at org.apache.lucene.util.TestRuleStoreClassName$1.evaluate(TestRuleStoreClassName.java:41)
	at com.carrotsearch.randomizedtesting.rules.NoShadowingOrOverridesOnMethodsRule$1.evaluate(NoShadowingOrOverridesOnMethodsRule.java:40)
	at com.carrotsearch.randomizedtesting.rules.NoShadowingOrOverridesOnMethodsRule$1.evaluate(NoShadowingOrOverridesOnMethodsRule.java:40)
	at com.carrotsearch.randomizedtesting.rules.StatementAdapter.evaluate(StatementAdapter.java:36)
	at com.carrotsearch.randomizedtesting.rules.StatementAdapter.evaluate(StatementAdapter.java:36)
	at com.carrotsearch.randomizedtesting.rules.StatementAdapter.evaluate(StatementAdapter.java:36)
	at org.apache.lucene.util.TestRuleAssertionsRequired$1.evaluate(TestRuleAssertionsRequired.java:53)
	at org.apache.lucene.util.TestRuleMarkFailure$1.evaluate(TestRuleMarkFailure.java:47)
	at org.apache.lucene.util.TestRuleIgnoreAfterMaxFailures$1.evaluate(TestRuleIgnoreAfterMaxFailures.java:64)
	at org.apache.lucene.util.TestRuleIgnoreTestSuites$1.evaluate(TestRuleIgnoreTestSuites.java:54)
	at com.carrotsearch.randomizedtesting.rules.StatementAdapter.evaluate(StatementAdapter.java:36)
	at com.carrotsearch.randomizedtesting.ThreadLeakControl$StatementRunner.run(ThreadLeakControl.java:368)
	at java.lang.Thread.run(Thread.java:748)


FAILED:  org.apache.solr.cloud.autoscaling.sim.TestTriggerIntegration.testEventQueue

Error Message:
action wasn't interrupted

Stack Trace:
java.lang.AssertionError: action wasn't interrupted
	at __randomizedtesting.SeedInfo.seed([5C443574D8348035:95F177DAD15346C0]:0)
	at org.junit.Assert.fail(Assert.java:93)
	at org.junit.Assert.assertTrue(Assert.java:43)
	at org.apache.solr.cloud.autoscaling.sim.TestTriggerIntegration.testEventQueue(TestTriggerIntegration.java:640)
	at sun.reflect.NativeMethodAccessorImpl.invoke0(Native Method)
	at sun.reflect.NativeMethodAccessorImpl.invoke(NativeMethodAccessorImpl.java:62)
	at sun.reflect.DelegatingMethodAccessorImpl.invoke(DelegatingMethodAccessorImpl.java:43)
	at java.lang.reflect.Method.invoke(Method.java:498)
	at com.carrotsearch.randomizedtesting.RandomizedRunner.invoke(RandomizedRunner.java:1737)
	at com.carrotsearch.randomizedtesting.RandomizedRunner$8.evaluate(RandomizedRunner.java:934)
	at com.carrotsearch.randomizedtesting.RandomizedRunner$9.evaluate(RandomizedRunner.java:970)
	at com.carrotsearch.randomizedtesting.RandomizedRunner$10.evaluate(RandomizedRunner.java:984)
	at com.carrotsearch.randomizedtesting.rules.SystemPropertiesRestoreRule$1.evaluate(SystemPropertiesRestoreRule.java:57)
	at org.apache.lucene.util.TestRuleSetupTeardownChained$1.evaluate(TestRuleSetupTeardownChained.java:49)
	at org.apache.lucene.util.AbstractBeforeAfterRule$1.evaluate(AbstractBeforeAfterRule.java:45)
	at org.apache.lucene.util.TestRuleThreadAndTestName$1.evaluate(TestRuleThreadAndTestName.java:48)
	at org.apache.lucene.util.TestRuleIgnoreAfterMaxFailures$1.evaluate(TestRuleIgnoreAfterMaxFailures.java:64)
	at org.apache.lucene.util.TestRuleMarkFailure$1.evaluate(TestRuleMarkFailure.java:47)
	at com.carrotsearch.randomizedtesting.rules.StatementAdapter.evaluate(StatementAdapter.java:36)
	at com.carrotsearch.randomizedtesting.ThreadLeakControl$StatementRunner.run(ThreadLeakControl.java:368)
	at com.carrotsearch.randomizedtesting.ThreadLeakControl.forkTimeoutingTask(ThreadLeakControl.java:817)
	at com.carrotsearch.randomizedtesting.ThreadLeakControl$3.evaluate(ThreadLeakControl.java:468)
	at com.carrotsearch.randomizedtesting.RandomizedRunner.runSingleTest(RandomizedRunner.java:943)
	at com.carrotsearch.randomizedtesting.RandomizedRunner$5.evaluate(RandomizedRunner.java:829)
	at com.carrotsearch.randomizedtesting.RandomizedRunner$6.evaluate(RandomizedRunner.java:879)
	at com.carrotsearch.randomizedtesting.RandomizedRunner$7.evaluate(RandomizedRunner.java:890)
	at com.carrotsearch.randomizedtesting.rules.StatementAdapter.evaluate(StatementAdapter.java:36)
	at com.carrotsearch.randomizedtesting.rules.SystemPropertiesRestoreRule$1.evaluate(SystemPropertiesRestoreRule.java:57)
	at org.apache.lucene.util.AbstractBeforeAfterRule$1.evaluate(AbstractBeforeAfterRule.java:45)
	at com.carrotsearch.randomizedtesting.rules.StatementAdapter.evaluate(StatementAdapter.java:36)
	at org.apache.lucene.util.TestRuleStoreClassName$1.evaluate(TestRuleStoreClassName.java:41)
	at com.carrotsearch.randomizedtesting.rules.NoShadowingOrOverridesOnMethodsRule$1.evaluate(NoShadowingOrOverridesOnMethodsRule.java:40)
	at com.carrotsearch.randomizedtesting.rules.NoShadowingOrOverridesOnMethodsRule$1.evaluate(NoShadowingOrOverridesOnMethodsRule.java:40)
	at com.carrotsearch.randomizedtesting.rules.StatementAdapter.evaluate(StatementAdapter.java:36)
	at com.carrotsearch.randomizedtesting.rules.StatementAdapter.evaluate(StatementAdapter.java:36)
	at com.carrotsearch.randomizedtesting.rules.StatementAdapter.evaluate(StatementAdapter.java:36)
	at org.apache.lucene.util.TestRuleAssertionsRequired$1.evaluate(TestRuleAssertionsRequired.java:53)
	at org.apache.lucene.util.TestRuleMarkFailure$1.evaluate(TestRuleMarkFailure.java:47)
	at org.apache.lucene.util.TestRuleIgnoreAfterMaxFailures$1.evaluate(TestRuleIgnoreAfterMaxFailures.java:64)
	at org.apache.lucene.util.TestRuleIgnoreTestSuites$1.evaluate(TestRuleIgnoreTestSuites.java:54)
	at com.carrotsearch.randomizedtesting.rules.StatementAdapter.evaluate(StatementAdapter.java:36)
	at com.carrotsearch.randomizedtesting.ThreadLeakControl$StatementRunner.run(ThreadLeakControl.java:368)
	at java.lang.Thread.run(Thread.java:748)


FAILED:  org.apache.solr.cloud.autoscaling.sim.TestTriggerIntegration.testSearchRate

Error Message:
The trigger did not fire at all

Stack Trace:
java.lang.AssertionError: The trigger did not fire at all
	at __randomizedtesting.SeedInfo.seed([5C443574D8348035:10C2BFD17F2267A]:0)
	at org.junit.Assert.fail(Assert.java:93)
	at org.junit.Assert.assertTrue(Assert.java:43)
	at org.apache.solr.cloud.autoscaling.sim.TestTriggerIntegration.testSearchRate(TestTriggerIntegration.java:1178)
	at sun.reflect.NativeMethodAccessorImpl.invoke0(Native Method)
	at sun.reflect.NativeMethodAccessorImpl.invoke(NativeMethodAccessorImpl.java:62)
	at sun.reflect.DelegatingMethodAccessorImpl.invoke(DelegatingMethodAccessorImpl.java:43)
	at java.lang.reflect.Method.invoke(Method.java:498)
	at com.carrotsearch.randomizedtesting.RandomizedRunner.invoke(RandomizedRunner.java:1737)
	at com.carrotsearch.randomizedtesting.RandomizedRunner$8.evaluate(RandomizedRunner.java:934)
	at com.carrotsearch.randomizedtesting.RandomizedRunner$9.evaluate(RandomizedRunner.java:970)
	at com.carrotsearch.randomizedtesting.RandomizedRunner$10.evaluate(RandomizedRunner.java:984)
	at com.carrotsearch.randomizedtesting.rules.SystemPropertiesRestoreRule$1.evaluate(SystemPropertiesRestoreRule.java:57)
	at org.apache.lucene.util.TestRuleSetupTeardownChained$1.evaluate(TestRuleSetupTeardownChained.java:49)
	at org.apache.lucene.util.AbstractBeforeAfterRule$1.evaluate(AbstractBeforeAfterRule.java:45)
	at org.apache.lucene.util.TestRuleThreadAndTestName$1.evaluate(TestRuleThreadAndTestName.java:48)
	at org.apache.lucene.util.TestRuleIgnoreAfterMaxFailures$1.evaluate(TestRuleIgnoreAfterMaxFailures.java:64)
	at org.apache.lucene.util.TestRuleMarkFailure$1.evaluate(TestRuleMarkFailure.java:47)
	at com.carrotsearch.randomizedtesting.rules.StatementAdapter.evaluate(StatementAdapter.java:36)
	at com.carrotsearch.randomizedtesting.ThreadLeakControl$StatementRunner.run(ThreadLeakControl.java:368)
	at com.carrotsearch.randomizedtesting.ThreadLeakControl.forkTimeoutingTask(ThreadLeakControl.java:817)
	at com.carrotsearch.randomizedtesting.ThreadLeakControl$3.evaluate(ThreadLeakControl.java:468)
	at com.carrotsearch.randomizedtesting.RandomizedRunner.runSingleTest(RandomizedRunner.java:943)
	at com.carrotsearch.randomizedtesting.RandomizedRunner$5.evaluate(RandomizedRunner.java:829)
	at com.carrotsearch.randomizedtesting.RandomizedRunner$6.evaluate(RandomizedRunner.java:879)
	at com.carrotsearch.randomizedtesting.RandomizedRunner$7.evaluate(RandomizedRunner.java:890)
	at com.carrotsearch.randomizedtesting.rules.StatementAdapter.evaluate(StatementAdapter.java:36)
	at com.carrotsearch.randomizedtesting.rules.SystemPropertiesRestoreRule$1.evaluate(SystemPropertiesRestoreRule.java:57)
	at org.apache.lucene.util.AbstractBeforeAfterRule$1.evaluate(AbstractBeforeAfterRule.java:45)
	at com.carrotsearch.randomizedtesting.rules.StatementAdapter.evaluate(StatementAdapter.java:36)
	at org.apache.lucene.util.TestRuleStoreClassName$1.evaluate(TestRuleStoreClassName.java:41)
	at com.carrotsearch.randomizedtesting.rules.NoShadowingOrOverridesOnMethodsRule$1.evaluate(NoShadowingOrOverridesOnMethodsRule.java:40)
	at com.carrotsearch.randomizedtesting.rules.NoShadowingOrOverridesOnMethodsRule$1.evaluate(NoShadowingOrOverridesOnMethodsRule.java:40)
	at com.carrotsearch.randomizedtesting.rules.StatementAdapter.evaluate(StatementAdapter.java:36)
	at com.carrotsearch.randomizedtesting.rules.StatementAdapter.evaluate(StatementAdapter.java:36)
	at com.carrotsearch.randomizedtesting.rules.StatementAdapter.evaluate(StatementAdapter.java:36)
	at org.apache.lucene.util.TestRuleAssertionsRequired$1.evaluate(TestRuleAssertionsRequired.java:53)
	at org.apache.lucene.util.TestRuleMarkFailure$1.evaluate(TestRuleMarkFailure.java:47)
	at org.apache.lucene.util.TestRuleIgnoreAfterMaxFailures$1.evaluate(TestRuleIgnoreAfterMaxFailures.java:64)
	at org.apache.lucene.util.TestRuleIgnoreTestSuites$1.evaluate(TestRuleIgnoreTestSuites.java:54)
	at com.carrotsearch.randomizedtesting.rules.StatementAdapter.evaluate(StatementAdapter.java:36)
	at com.carrotsearch.randomizedtesting.ThreadLeakControl$StatementRunner.run(ThreadLeakControl.java:368)
	at java.lang.Thread.run(Thread.java:748)


FAILED:  org.apache.solr.cloud.autoscaling.sim.TestTriggerIntegration.testNodeMarkersRegistration

Error Message:
Path /autoscaling/nodeAdded/127.0.0.1:10175_solr should have been deleted

Stack Trace:
java.lang.AssertionError: Path /autoscaling/nodeAdded/127.0.0.1:10175_solr should have been deleted
	at __randomizedtesting.SeedInfo.seed([5C443574D8348035:44FEBD78D6014DDA]:0)
	at org.junit.Assert.fail(Assert.java:93)
	at org.junit.Assert.assertTrue(Assert.java:43)
	at org.junit.Assert.assertFalse(Assert.java:68)
	at org.apache.solr.cloud.autoscaling.sim.TestTriggerIntegration.testNodeMarkersRegistration(TestTriggerIntegration.java:844)
	at sun.reflect.NativeMethodAccessorImpl.invoke0(Native Method)
	at sun.reflect.NativeMethodAccessorImpl.invoke(NativeMethodAccessorImpl.java:62)
	at sun.reflect.DelegatingMethodAccessorImpl.invoke(DelegatingMethodAccessorImpl.java:43)
	at java.lang.reflect.Method.invoke(Method.java:498)
	at com.carrotsearch.randomizedtesting.RandomizedRunner.invoke(RandomizedRunner.java:1737)
	at com.carrotsearch.randomizedtesting.RandomizedRunner$8.evaluate(RandomizedRunner.java:934)
	at com.carrotsearch.randomizedtesting.RandomizedRunner$9.evaluate(RandomizedRunner.java:970)
	at com.carrotsearch.randomizedtesting.RandomizedRunner$10.evaluate(RandomizedRunner.java:984)
	at com.carrotsearch.randomizedtesting.rules.SystemPropertiesRestoreRule$1.evaluate(SystemPropertiesRestoreRule.java:57)
	at org.apache.lucene.util.TestRuleSetupTeardownChained$1.evaluate(TestRuleSetupTeardownChained.java:49)
	at org.apache.lucene.util.AbstractBeforeAfterRule$1.evaluate(AbstractBeforeAfterRule.java:45)
	at org.apache.lucene.util.TestRuleThreadAndTestName$1.evaluate(TestRuleThreadAndTestName.java:48)
	at org.apache.lucene.util.TestRuleIgnoreAfterMaxFailures$1.evaluate(TestRuleIgnoreAfterMaxFailures.java:64)
	at org.apache.lucene.util.TestRuleMarkFailure$1.evaluate(TestRuleMarkFailure.java:47)
	at com.carrotsearch.randomizedtesting.rules.StatementAdapter.evaluate(StatementAdapter.java:36)
	at com.carrotsearch.randomizedtesting.ThreadLeakControl$StatementRunner.run(ThreadLeakControl.java:368)
	at com.carrotsearch.randomizedtesting.ThreadLeakControl.forkTimeoutingTask(ThreadLeakControl.java:817)
	at com.carrotsearch.randomizedtesting.ThreadLeakControl$3.evaluate(ThreadLeakControl.java:468)
	at com.carrotsearch.randomizedtesting.RandomizedRunner.runSingleTest(RandomizedRunner.java:943)
	at com.carrotsearch.randomizedtesting.RandomizedRunner$5.evaluate(RandomizedRunner.java:829)
	at com.carrotsearch.randomizedtesting.RandomizedRunner$6.evaluate(RandomizedRunner.java:879)
	at com.carrotsearch.randomizedtesting.RandomizedRunner$7.evaluate(RandomizedRunner.java:890)
	at com.carrotsearch.randomizedtesting.rules.StatementAdapter.evaluate(StatementAdapter.java:36)
	at com.carrotsearch.randomizedtesting.rules.SystemPropertiesRestoreRule$1.evaluate(SystemPropertiesRestoreRule.java:57)
	at org.apache.lucene.util.AbstractBeforeAfterRule$1.evaluate(AbstractBeforeAfterRule.java:45)
	at com.carrotsearch.randomizedtesting.rules.StatementAdapter.evaluate(StatementAdapter.java:36)
	at org.apache.lucene.util.TestRuleStoreClassName$1.evaluate(TestRuleStoreClassName.java:41)
	at com.carrotsearch.randomizedtesting.rules.NoShadowingOrOverridesOnMethodsRule$1.evaluate(NoShadowingOrOverridesOnMethodsRule.java:40)
	at com.carrotsearch.randomizedtesting.rules.NoShadowingOrOverridesOnMethodsRule$1.evaluate(NoShadowingOrOverridesOnMethodsRule.java:40)
	at com.carrotsearch.randomizedtesting.rules.StatementAdapter.evaluate(StatementAdapter.java:36)
	at com.carrotsearch.randomizedtesting.rules.StatementAdapter.evaluate(StatementAdapter.java:36)
	at com.carrotsearch.randomizedtesting.rules.StatementAdapter.evaluate(StatementAdapter.java:36)
	at org.apache.lucene.util.TestRuleAssertionsRequired$1.evaluate(TestRuleAssertionsRequired.java:53)
	at org.apache.lucene.util.TestRuleMarkFailure$1.evaluate(TestRuleMarkFailure.java:47)
	at org.apache.lucene.util.TestRuleIgnoreAfterMaxFailures$1.evaluate(TestRuleIgnoreAfterMaxFailures.java:64)
	at org.apache.lucene.util.TestRuleIgnoreTestSuites$1.evaluate(TestRuleIgnoreTestSuites.java:54)
	at com.carrotsearch.randomizedtesting.rules.StatementAdapter.evaluate(StatementAdapter.java:36)
	at com.carrotsearch.randomizedtesting.ThreadLeakControl$StatementRunner.run(ThreadLeakControl.java:368)
	at java.lang.Thread.run(Thread.java:748)




Build Log:
[...truncated 11979 lines...]
   [junit4] Suite: org.apache.solr.cloud.ConcurrentCreateRoutedAliasTest
   [junit4]   2> 744650 INFO  (SUITE-ConcurrentCreateRoutedAliasTest-seed#[5C443574D8348035]-worker) [    ] o.a.s.SolrTestCaseJ4 SecureRandom sanity checks: test.solr.allowed.securerandom=null & java.security.egd=file:/dev/./urandom
   [junit4]   2> Creating dataDir: /x1/jenkins/jenkins-slave/workspace/Lucene-Solr-Tests-7.x/solr/build/solr-core/test/J0/temp/solr.cloud.ConcurrentCreateRoutedAliasTest_5C443574D8348035-001/init-core-data-001
   [junit4]   2> 744651 WARN  (SUITE-ConcurrentCreateRoutedAliasTest-seed#[5C443574D8348035]-worker) [    ] o.a.s.SolrTestCaseJ4 startTrackingSearchers: numOpens=2 numCloses=2
   [junit4]   2> 744651 INFO  (SUITE-ConcurrentCreateRoutedAliasTest-seed#[5C443574D8348035]-worker) [    ] o.a.s.SolrTestCaseJ4 Using PointFields (NUMERIC_POINTS_SYSPROP=true) w/NUMERIC_DOCVALUES_SYSPROP=true
   [junit4]   2> 744661 INFO  (SUITE-ConcurrentCreateRoutedAliasTest-seed#[5C443574D8348035]-worker) [    ] o.a.s.SolrTestCaseJ4 Randomized ssl (true) and clientAuth (true) via: @org.apache.solr.util.RandomizeSSL(reason=, ssl=NaN, value=NaN, clientAuth=NaN)
   [junit4]   2> 744677 INFO  (TEST-ConcurrentCreateRoutedAliasTest.testConcurrentCreateRoutedAliasMinimal-seed#[5C443574D8348035]) [    ] o.a.s.SolrTestCaseJ4 ###Starting testConcurrentCreateRoutedAliasMinimal
   [junit4]   2> 744677 INFO  (TEST-ConcurrentCreateRoutedAliasTest.testConcurrentCreateRoutedAliasMinimal-seed#[5C443574D8348035]) [    ] o.a.s.c.MiniSolrCloudCluster Starting cluster of 4 servers in /x1/jenkins/jenkins-slave/workspace/Lucene-Solr-Tests-7.x/solr/build/solr-core/test/J0/temp/solr.cloud.ConcurrentCreateRoutedAliasTest_5C443574D8348035-001/tempDir-001
   [junit4]   2> 744678 INFO  (TEST-ConcurrentCreateRoutedAliasTest.testConcurrentCreateRoutedAliasMinimal-seed#[5C443574D8348035]) [    ] o.a.s.c.ZkTestServer STARTING ZK TEST SERVER
   [junit4]   2> 744713 INFO  (Thread-245) [    ] o.a.s.c.ZkTestServer client port:0.0.0.0/0.0.0.0:0
   [junit4]   2> 744713 INFO  (Thread-245) [    ] o.a.s.c.ZkTestServer Starting server
   [junit4]   2> 744813 INFO  (TEST-ConcurrentCreateRoutedAliasTest.testConcurrentCreateRoutedAliasMinimal-seed#[5C443574D8348035]) [    ] o.a.s.c.ZkTestServer start zk server on port:34749
   [junit4]   2> 744815 ERROR (Thread-245) [    ] o.a.z.s.ZooKeeperServer ZKShutdownHandler is not registered, so ZooKeeper server won't take any action on ERROR or SHUTDOWN server state changes
   [junit4]   2> 744833 INFO  (zkConnectionManagerCallback-299-thread-1) [    ] o.a.s.c.c.ConnectionManager zkClient has connected
   [junit4]   2> 744847 INFO  (jetty-launcher-296-thread-1) [    ] o.e.j.s.Server jetty-9.4.8.v20171121, build timestamp: 2017-11-21T16:27:37-05:00, git hash: 82b8fb23f757335bb3329d540ce37a2a2615f0a8
   [junit4]   2> 744868 INFO  (jetty-launcher-296-thread-3) [    ] o.e.j.s.Server jetty-9.4.8.v20171121, build timestamp: 2017-11-21T16:27:37-05:00, git hash: 82b8fb23f757335bb3329d540ce37a2a2615f0a8
   [junit4]   2> 744877 INFO  (jetty-launcher-296-thread-2) [    ] o.e.j.s.Server jetty-9.4.8.v20171121, build timestamp: 2017-11-21T16:27:37-05:00, git hash: 82b8fb23f757335bb3329d540ce37a2a2615f0a8
   [junit4]   2> 745163 INFO  (jetty-launcher-296-thread-4) [    ] o.e.j.s.Server jetty-9.4.8.v20171121, build timestamp: 2017-11-21T16:27:37-05:00, git hash: 82b8fb23f757335bb3329d540ce37a2a2615f0a8
   [junit4]   2> 745163 INFO  (jetty-launcher-296-thread-3) [    ] o.e.j.s.session DefaultSessionIdManager workerName=node0
   [junit4]   2> 745163 INFO  (jetty-launcher-296-thread-3) [    ] o.e.j.s.session No SessionScavenger set, using defaults
   [junit4]   2> 745163 INFO  (jetty-launcher-296-thread-3) [    ] o.e.j.s.session Scavenging every 600000ms
   [junit4]   2> 745185 INFO  (jetty-launcher-296-thread-1) [    ] o.e.j.s.session DefaultSessionIdManager workerName=node0
   [junit4]   2> 745185 INFO  (jetty-launcher-296-thread-1) [    ] o.e.j.s.session No SessionScavenger set, using defaults
   [junit4]   2> 745185 INFO  (jetty-launcher-296-thread-1) [    ] o.e.j.s.session Scavenging every 600000ms
   [junit4]   2> 745226 INFO  (jetty-launcher-296-thread-2) [    ] o.e.j.s.session DefaultSessionIdManager workerName=node0
   [junit4]   2> 745226 INFO  (jetty-launcher-296-thread-2) [    ] o.e.j.s.session No SessionScavenger set, using defaults
   [junit4]   2> 745226 INFO  (jetty-launcher-296-thread-2) [    ] o.e.j.s.session Scavenging every 660000ms
   [junit4]   2> 745250 INFO  (jetty-launcher-296-thread-2) [    ] o.e.j.s.h.ContextHandler Started o.e.j.s.ServletContextHandler@45bb31e3{/solr,null,AVAILABLE}
   [junit4]   2> 745277 INFO  (jetty-launcher-296-thread-2) [    ] o.e.j.s.AbstractConnector Started ServerConnector@38f7dd56{SSL,[ssl, http/1.1]}{127.0.0.1:49517}
   [junit4]   2> 745277 INFO  (jetty-launcher-296-thread-2) [    ] o.e.j.s.Server Started @767236ms
   [junit4]   2> 745277 INFO  (jetty-launcher-296-thread-2) [    ] o.a.s.c.s.e.JettySolrRunner Jetty properties: {hostContext=/solr, hostPort=49517}
   [junit4]   2> 745277 ERROR (jetty-launcher-296-thread-2) [    ] o.a.s.u.StartupLoggingUtils Missing Java Option solr.log.dir. Logging may be missing or incomplete.
   [junit4]   2> 745278 INFO  (jetty-launcher-296-thread-2) [    ] o.a.s.s.SolrDispatchFilter  ___      _       Welcome to Apache Solr? version 7.3.0
   [junit4]   2> 745278 INFO  (jetty-launcher-296-thread-2) [    ] o.a.s.s.SolrDispatchFilter / __| ___| |_ _   Starting in cloud mode on port null
   [junit4]   2> 745278 INFO  (jetty-launcher-296-thread-2) [    ] o.a.s.s.SolrDispatchFilter \__ \/ _ \ | '_|  Install dir: null
   [junit4]   2> 745278 INFO  (jetty-launcher-296-thread-2) [    ] o.a.s.s.SolrDispatchFilter |___/\___/_|_|    Start time: 2018-01-27T15:39:03.476Z
   [junit4]   2> 745377 INFO  (jetty-launcher-296-thread-1) [    ] o.e.j.s.h.ContextHandler Started o.e.j.s.ServletContextHandler@7571c670{/solr,null,AVAILABLE}
   [junit4]   2> 745378 INFO  (jetty-launcher-296-thread-1) [    ] o.e.j.s.AbstractConnector Started ServerConnector@70da1530{SSL,[ssl, http/1.1]}{127.0.0.1:51692}
   [junit4]   2> 745378 INFO  (jetty-launcher-296-thread-1) [    ] o.e.j.s.Server Started @767337ms
   [junit4]   2> 745378 INFO  (jetty-launcher-296-thread-1) [    ] o.a.s.c.s.e.JettySolrRunner Jetty properties: {hostContext=/solr, hostPort=51692}
   [junit4]   2> 745378 ERROR (jetty-launcher-296-thread-1) [    ] o.a.s.u.StartupLoggingUtils Missing Java Option solr.log.dir. Logging may be missing or incomplete.
   [junit4]   2> 745378 INFO  (jetty-launcher-296-thread-1) [    ] o.a.s.s.SolrDispatchFilter  ___      _       Welcome to Apache Solr? version 7.3.0
   [junit4]   2> 745378 INFO  (jetty-launcher-296-thread-1) [    ] o.a.s.s.SolrDispatchFilter / __| ___| |_ _   Starting in cloud mode on port null
   [junit4]   2> 745378 INFO  (jetty-launcher-296-thread-1) [    ] o.a.s.s.SolrDispatchFilter \__ \/ _ \ | '_|  Install dir: null
   [junit4]   2> 745379 INFO  (jetty-launcher-296-thread-1) [    ] o.a.s.s.SolrDispatchFilter |___/\___/_|_|    Start time: 2018-01-27T15:39:03.577Z
   [junit4]   2> 745581 INFO  (jetty-launcher-296-thread-3) [    ] o.e.j.s.h.ContextHandler Started o.e.j.s.ServletContextHandler@70a2ed1f{/solr,null,AVAILABLE}
   [junit4]   2> 745582 INFO  (jetty-launcher-296-thread-3) [    ] o.e.j.s.AbstractConnector Started ServerConnector@4fc2e6f{SSL,[ssl, http/1.1]}{127.0.0.1:57844}
   [junit4]   2> 745582 INFO  (jetty-launcher-296-thread-3) [    ] o.e.j.s.Server Started @767541ms
   [junit4]   2> 745582 INFO  (jetty-launcher-296-thread-3) [    ] o.a.s.c.s.e.JettySolrRunner Jetty properties: {hostContext=/solr, hostPort=57844}
   [junit4]   2> 745582 ERROR (jetty-launcher-296-thread-3) [    ] o.a.s.u.StartupLoggingUtils Missing Java Option solr.log.dir. Logging may be missing or incomplete.
   [junit4]   2> 745582 INFO  (jetty-launcher-296-thread-3) [    ] o.a.s.s.SolrDispatchFilter  ___      _       Welcome to Apache Solr? version 7.3.0
   [junit4]   2> 745582 INFO  (jetty-launcher-296-thread-3) [    ] o.a.s.s.SolrDispatchFilter / __| ___| |_ _   Starting in cloud mode on port null
   [junit4]   2> 745582 INFO  (jetty-launcher-296-thread-3) [    ] o.a.s.s.SolrDispatchFilter \__ \/ _ \ | '_|  Install dir: null
   [junit4]   2> 745583 INFO  (jetty-launcher-296-thread-3) [    ] o.a.s.s.SolrDispatchFilter |___/\___/_|_|    Start time: 2018-01-27T15:39:03.780Z
   [junit4]   2> 745661 INFO  (jetty-launcher-296-thread-4) [    ] o.e.j.s.session DefaultSessionIdManager workerName=node0
   [junit4]   2> 745661 INFO  (jetty-launcher-296-thread-4) [    ] o.e.j.s.session No SessionScavenger set, using defaults
   [junit4]   2> 745661 INFO  (jetty-launcher-296-thread-4) [    ] o.e.j.s.session Scavenging every 600000ms
   [junit4]   2> 745693 INFO  (jetty-launcher-296-thread-4) [    ] o.e.j.s.h.ContextHandler Started o.e.j.s.ServletContextHandler@5efa29f3{/solr,null,AVAILABLE}
   [junit4]   2> 745694 INFO  (jetty-launcher-296-thread-4) [    ] o.e.j.s.AbstractConnector Started ServerConnector@189f556d{SSL,[ssl, http/1.1]}{127.0.0.1:49747}
   [junit4]   2> 745694 INFO  (jetty-launcher-296-thread-4) [    ] o.e.j.s.Server Started @767653ms
   [junit4]   2> 745694 INFO  (jetty-launcher-296-thread-4) [    ] o.a.s.c.s.e.JettySolrRunner Jetty properties: {hostContext=/solr, hostPort=49747}
   [junit4]   2> 745694 ERROR (jetty-launcher-296-thread-4) [    ] o.a.s.u.StartupLoggingUtils Missing Java Option solr.log.dir. Logging may be missing or incomplete.
   [junit4]   2> 745694 INFO  (jetty-launcher-296-thread-4) [    ] o.a.s.s.SolrDispatchFilter  ___      _       Welcome to Apache Solr? version 7.3.0
   [junit4]   2> 745694 INFO  (jetty-launcher-296-thread-4) [    ] o.a.s.s.SolrDispatchFilter / __| ___| |_ _   Starting in cloud mode on port null
   [junit4]   2> 745694 INFO  (jetty-launcher-296-thread-4) [    ] o.a.s.s.SolrDispatchFilter \__ \/ _ \ | '_|  Install dir: null
   [junit4]   2> 745694 INFO  (jetty-launcher-296-thread-4) [    ] o.a.s.s.SolrDispatchFilter |___/\___/_|_|    Start time: 2018-01-27T15:39:03.892Z
   [junit4]   2> 745707 INFO  (zkConnectionManagerCallback-303-thread-1) [    ] o.a.s.c.c.ConnectionManager zkClient has connected
   [junit4]   2> 745765 INFO  (jetty-launcher-296-thread-1) [    ] o.a.s.s.SolrDispatchFilter solr.xml found in ZooKeeper. Loading...
   [junit4]   2> 745813 INFO  (zkConnectionManagerCallback-305-thread-1) [    ] o.a.s.c.c.ConnectionManager zkClient has connected
   [junit4]   2> 745814 INFO  (jetty-launcher-296-thread-1) [    ] o.a.s.c.ZkContainer Zookeeper client=127.0.0.1:34749/solr
   [junit4]   2> 745815 INFO  (zkConnectionManagerCallback-301-thread-1) [    ] o.a.s.c.c.ConnectionManager zkClient has connected
   [junit4]   2> 745827 INFO  (jetty-launcher-296-thread-3) [    ] o.a.s.s.SolrDispatchFilter solr.xml found in ZooKeeper. Loading...
   [junit4]   2> 745838 INFO  (jetty-launcher-296-thread-2) [    ] o.a.s.s.SolrDispatchFilter solr.xml found in ZooKeeper. Loading...
   [junit4]   2> 745855 INFO  (jetty-launcher-296-thread-2) [    ] o.a.s.c.ZkContainer Zookeeper client=127.0.0.1:34749/solr
   [junit4]   2> 745857 INFO  (zkConnectionManagerCallback-307-thread-1) [    ] o.a.s.c.c.ConnectionManager zkClient has connected
   [junit4]   2> 745857 INFO  (zkConnectionManagerCallback-311-thread-1) [    ] o.a.s.c.c.ConnectionManager zkClient has connected
   [junit4]   2> 745866 INFO  (jetty-launcher-296-thread-4) [    ] o.a.s.s.SolrDispatchFilter solr.xml found in ZooKeeper. Loading...
   [junit4]   2> 745893 INFO  (jetty-launcher-296-thread-4) [    ] o.a.s.c.ZkContainer Zookeeper client=127.0.0.1:34749/solr
   [junit4]   2> 745894 INFO  (zkConnectionManagerCallback-315-thread-1) [    ] o.a.s.c.c.ConnectionManager zkClient has connected
   [junit4]   2> 745907 INFO  (jetty-launcher-296-thread-3) [    ] o.a.s.c.ZkContainer Zookeeper client=127.0.0.1:34749/solr
   [junit4]   2> 745934 INFO  (zkConnectionManagerCallback-317-thread-1-processing-n:127.0.0.1:51692_solr) [n:127.0.0.1:51692_solr    ] o.a.s.c.c.ConnectionManager zkClient has connected
   [junit4]   2> 745966 INFO  (zkConnectionManagerCallback-321-thread-1) [    ] o.a.s.c.c.ConnectionManager zkClient has connected
   [junit4]   2> 746129 INFO  (zkConnectionManagerCallback-325-thread-1) [    ] o.a.s.c.c.ConnectionManager zkClient has connected
   [junit4]   2> 746225 INFO  (zkConnectionManagerCallback-327-thread-1-processing-n:127.0.0.1:49517_solr) [n:127.0.0.1:49517_solr    ] o.a.s.c.c.ConnectionManager zkClient has connected
   [junit4]   2> 746226 INFO  (zkConnectionManagerCallback-330-thread-1-processing-n:127.0.0.1:49747_solr) [n:127.0.0.1:49747_solr    ] o.a.s.c.c.ConnectionManager zkClient has connected
   [junit4]   2> 746226 INFO  (zkConnectionManagerCallback-332-thread-1-processing-n:127.0.0.1:57844_solr) [n:127.0.0.1:57844_solr    ] o.a.s.c.c.ConnectionManager zkClient has connected
   [junit4]   2> 746345 INFO  (jetty-launcher-296-thread-1) [n:127.0.0.1:51692_solr    ] o.a.s.c.Overseer Overseer (id=null) closing
   [junit4]   2> 746346 INFO  (jetty-launcher-296-thread-1) [n:127.0.0.1:51692_solr    ] o.a.s.c.OverseerElectionContext I am going to be the leader 127.0.0.1:51692_solr
   [junit4]   2> 746346 INFO  (jetty-launcher-296-thread-1) [n:127.0.0.1:51692_solr    ] o.a.s.c.Overseer Overseer (id=99422538493001735-127.0.0.1:51692_solr-n_0000000000) starting
   [junit4]   2> 746349 INFO  (jetty-launcher-296-thread-2) [n:127.0.0.1:49517_solr    ] o.a.s.c.Overseer Overseer (id=null) closing
   [junit4]   2> 746373 INFO  (jetty-launcher-296-thread-3) [n:127.0.0.1:57844_solr    ] o.a.s.c.Overseer Overseer (id=null) closing
   [junit4]   2> 746453 INFO  (jetty-launcher-296-thread-2) [n:127.0.0.1:49517_solr    ] o.a.s.c.ZkController Register node as live in ZooKeeper:/live_nodes/127.0.0.1:49517_solr
   [junit4]   2> 746473 INFO  (jetty-launcher-296-thread-3) [n:127.0.0.1:57844_solr    ] o.a.s.c.ZkController Register node as live in ZooKeeper:/live_nodes/127.0.0.1:57844_solr
   [junit4]   2> 746698 INFO  (jetty-launcher-296-thread-4) [n:127.0.0.1:49747_solr    ] o.a.s.c.c.ZkStateReader Updated live nodes from ZooKeeper... (0) -> (1)
   [junit4]   2> 746708 INFO  (jetty-launcher-296-thread-4) [n:127.0.0.1:49747_solr    ] o.a.s.c.Overseer Overseer (id=null) closing
   [junit4]   2> 746742 INFO  (jetty-launcher-296-thread-4) [n:127.0.0.1:49747_solr    ] o.a.s.c.ZkController Register node as live in ZooKeeper:/live_nodes/127.0.0.1:49747_solr
   [junit4]   2> 747702 INFO  (jetty-launcher-296-thread-1) [n:127.0.0.1:51692_solr    ] o.a.s.c.ZkController Register node as live in ZooKeeper:/live_nodes/127.0.0.1:51692_solr
   [junit4]   2> 748258 INFO  (zkCallback-329-thread-1-processing-n:127.0.0.1:49747_solr) [n:127.0.0.1:49747_solr    ] o.a.s.c.c.ZkStateReader Updated live nodes from ZooKeeper... (1) -> (4)
   [junit4]   2> 748258 INFO  (zkCallback-331-thread-1-processing-n:127.0.0.1:57844_solr) [n:127.0.0.1:57844_solr    ] o.a.s.c.c.ZkStateReader Updated live nodes from ZooKeeper... (0) -> (4)
   [junit4]   2> 748258 INFO  (zkCallback-326-thread-1-processing-n:127.0.0.1:49517_solr) [n:127.0.0.1:49517_solr    ] o.a.s.c.c.ZkStateReader Updated live nodes from ZooKeeper... (0) -> (4)
   [junit4]   2> 748298 INFO  (OverseerStateUpdate-99422538493001735-127.0.0.1:51692_solr-n_0000000000) [n:127.0.0.1:51692_solr    ] o.a.s.c.c.ZkStateReader Updated live nodes from ZooKeeper... (0) -> (4)
   [junit4]   2> 748624 INFO  (jetty-launcher-296-thread-2) [n:127.0.0.1:49517_solr    ] o.a.s.m.r.SolrJmxReporter JMX monitoring for 'solr_49517.solr.node' (registry 'solr.node') enabled at server: com.sun.jmx.mbeanserver.JmxMBeanServer@773fdfc5
   [junit4]   2> 748803 INFO  (jetty-launcher-296-thread-1) [n:127.0.0.1:51692_solr    ] o.a.s.m.r.SolrJmxReporter JMX monitoring for 'solr_51692.solr.node' (registry 'solr.node') enabled at server: com.sun.jmx.mbeanserver.JmxMBeanServer@773fdfc5
   [junit4]   2> 748810 INFO  (jetty-launcher-296-thread-1) [n:127.0.0.1:51692_solr    ] o.a.s.m.r.SolrJmxReporter JMX monitoring for 'solr_51692.solr.jvm' (registry 'solr.jvm') enabled at server: com.sun.jmx.mbeanserver.JmxMBeanServer@773fdfc5
   [junit4]   2> 748810 INFO  (jetty-launcher-296-thread-1) [n:127.0.0.1:51692_solr    ] o.a.s.m.r.SolrJmxReporter JMX monitoring for 'solr_51692.solr.jetty' (registry 'solr.jetty') enabled at server: com.sun.jmx.mbeanserver.JmxMBeanServer@773fdfc5
   [junit4]   2> 748813 INFO  (jetty-launcher-296-thread-2) [n:127.0.0.1:49517_solr    ] o.a.s.m.r.SolrJmxReporter JMX monitoring for 'solr_49517.solr.jvm' (registry 'solr.jvm') enabled at server: com.sun.jmx.mbeanserver.JmxMBeanServer@773fdfc5
   [junit4]   2> 748822 INFO  (jetty-launcher-296-thread-2) [n:127.0.0.1:49517_solr    ] o.a.s.m.r.SolrJmxReporter JMX monitoring for 'solr_49517.solr.jetty' (registry 'solr.jetty') enabled at server: com.sun.jmx.mbeanserver.JmxMBeanServer@773fdfc5
   [junit4]   2> 748825 INFO  (jetty-launcher-296-thread-2) [n:127.0.0.1:49517_solr    ] o.a.s.c.CorePropertiesLocator Found 0 core definitions underneath /x1/jenkins/jenkins-slave/workspace/Lucene-Solr-Tests-7.x/solr/build/solr-core/test/J0/temp/solr.cloud.ConcurrentCreateRoutedAliasTest_5C443574D8348035-001/tempDir-001/node2/.
   [junit4]   2> 748826 INFO  (jetty-launcher-296-thread-1) [n:127.0.0.1:51692_solr    ] o.a.s.c.CorePropertiesLocator Found 0 core definitions underneath /x1/jenkins/jenkins-slave/workspace/Lucene-Solr-Tests-7.x/solr/build/solr-core/test/J0/temp/solr.cloud.ConcurrentCreateRoutedAliasTest_5C443574D8348035-001/tempDir-001/node1/.
   [junit4]   2> 762306 WARN  (jetty-launcher-296-thread-2-SendThread(127.0.0.1:34749)) [n:127.0.0.1:49517_solr    ] o.a.z.ClientCnxn Client session timed out, have not heard from server in 13393ms for sessionid 0x1613845a18b000a
   [junit4]   2> 762317 WARN  (NIOServerCxn.Factory:0.0.0.0/0.0.0.0:0) [    ] o.a.z.s.NIOServerCnxn caught end of stream exception
   [junit4]   2> EndOfStreamException: Unable to read additional data from client sessionid 0x1613845a18b000a, likely client has closed socket
   [junit4]   2> 	at org.apache.zookeeper.server.NIOServerCnxn.doIO(NIOServerCnxn.java:239)
   [junit4]   2> 	at org.apache.zookeeper.server.NIOServerCnxnFactory.run(NIOServerCnxnFactory.java:203)
   [junit4]   2> 	at java.lang.Thread.run(Thread.java:748)
   [junit4]   2> 762306 WARN  (jetty-launcher-296-thread-3-SendThread(127.0.0.1:34749)) [n:127.0.0.1:57844_solr    ] o.a.z.ClientCnxn Client session timed out, have not heard from server in 14380ms for sessionid 0x1613845a18b000b
   [junit4]   2> 762306 WARN  (jetty-launcher-296-thread-4-SendThread(127.0.0.1:34749)) [n:127.0.0.1:49747_solr    ] o.a.z.ClientCnxn Client session timed out, have not heard from server in 14525ms for sessionid 0x1613845a18b000c
   [junit4]   2> 762824 WARN  (NIOServerCxn.Factory:0.0.0.0/0.0.0.0:0) [    ] o.a.z.s.NIOServerCnxn caught end of stream exception
   [junit4]   2> EndOfStreamException: Unable to read additional data from client sessionid 0x1613845a18b000b, likely client has closed socket
   [junit4]   2> 	at org.apache.zookeeper.server.NIOServerCnxn.doIO(NIOServerCnxn.java:239)
   [junit4]   2> 	at org.apache.zookeeper.server.NIOServerCnxnFactory.run(NIOServerCnxnFactory.java:203)
   [junit4]   2> 	at java.lang.Thread.run(Thread.java:748)
   [junit4]   2> 762824 WARN  (NIOServerCxn.Factory:0.0.0.0/0.0.0.0:0) [    ] o.a.z.s.NIOServerCnxn caught end of stream exception
   [junit4]   2> EndOfStreamException: Unable to read additional data from client sessionid 0x1613845a18b000c, likely client has closed socket
   [junit4]   2> 	at org.apache.zookeeper.server.NIOServerCnxn.doIO(NIOServerCnxn.java:239)
   [junit4]   2> 	at org.apache.zookeeper.server.NIOServerCnxnFactory.run(NIOServerCnxnFactory.java:203)
   [junit4]   2> 	at java.lang.Thread.run(Thread.java:748)
   [junit4]   2> 762407 WARN  (zkConnectionManagerCallback-327-thread-1-processing-n:127.0.0.1:49517_solr) [n:127.0.0.1:49517_solr    ] o.a.s.c.c.ConnectionManager Watcher org.apache.solr.common.cloud.ConnectionManager@55385a6f name: ZooKeeperConnection Watcher:127.0.0.1:34749/solr got event WatchedEvent state:Disconnected type:None path:null path: null type: None
   [junit4]   2> 762850 WARN  (zkConnectionManagerCallback-327-thread-1-processing-n:127.0.0.1:49517_solr) [n:127.0.0.1:49517_solr    ] o.a.s.c.c.ConnectionManager zkClient has disconnected
   [junit4]   2> 762977 WARN  (zkConnectionManagerCallback-332-thread-1-processing-n:127.0.0.1:57844_solr) [n:127.0.0.1:57844_solr    ] o.a.s.c.c.ConnectionManager Watcher org.apache.solr.common.cloud.ConnectionManager@7cd76c41 name: ZooKeeperConnection Watcher:127.0.0.1:34749/solr got event WatchedEvent state:Disconnected type:None path:null path: null type: None
   [junit4]   2> 762977 WARN  (zkConnectionManagerCallback-332-thread-1-processing-n:127.0.0.1:57844_solr) [n:127.0.0.1:57844_solr    ] o.a.s.c.c.ConnectionManager zkClient has disconnected
   [junit4]   2> 763188 INFO  (jetty-launcher-296-thread-4) [n:127.0.0.1:49747_solr    ] o.a.s.m.r.SolrJmxReporter JMX monitoring for 'solr_49747.solr.node' (registry 'solr.node') enabled at server: com.sun.jmx.mbeanserver.JmxMBeanServer@773fdfc5
   [junit4]   2> 763221 WARN  (zkConnectionManagerCallback-330-thread-1-processing-n:127.0.0.1:49747_solr) [n:127.0.0.1:49747_solr    ] o.a.s.c.c.ConnectionManager Watcher org.apache.solr.common.cloud.ConnectionManager@782aeb3e name: ZooKeeperConnection Watcher:127.0.0.1:34749/solr got event WatchedEvent state:Disconnected type:None path:null path: null type: None
   [junit4]   2> 763221 WARN  (zkConnectionManagerCallback-330-thread-1-processing-n:127.0.0.1:49747_solr) [n:127.0.0.1:49747_solr    ] o.a.s.c.c.ConnectionManager zkClient has disconnected
   [junit4]   2> 763271 INFO  (jetty-launcher-296-thread-4) [n:127.0.0.1:49747_solr    ] o.a.s.m.r.SolrJmxReporter JMX monitoring for 'solr_49747.solr.jvm' (registry 'solr.jvm') enabled at server: com.sun.jmx.mbeanserver.JmxMBeanServer@773fdfc5
   [junit4]   2> 763271 INFO  (jetty-launcher-296-thread-4) [n:127.0.0.1:49747_solr    ] o.a.s.m.r.SolrJmxReporter JMX monitoring for 'solr_49747.solr.jetty' (registry 'solr.jetty') enabled at server: com.sun.jmx.mbeanserver.JmxMBeanServer@773fdfc5
   [junit4]   2> 763333 INFO  (jetty-launcher-296-thread-4) [n:127.0.0.1:49747_solr    ] o.a.s.c.CorePropertiesLocator Found 0 core definitions underneath /x1/jenkins/jenkins-slave/workspace/Lucene-Solr-Tests-7.x/solr/build/solr-core/test/J0/temp/solr.cloud.ConcurrentCreateRoutedAliasTest_5C443574D8348035-001/tempDir-001/node4/.
   [junit4]   2> 763627 INFO  (jetty-launcher-296-thread-3) [n:127.0.0.1:57844_solr    ] o.a.s.m.r.SolrJmxReporter JMX monitoring for 'solr_57844.solr.node' (registry 'solr.node') enabled at server: com.sun.jmx.mbeanserver.JmxMBeanServer@773fdfc5
   [junit4]   2> 763681 INFO  (zkConnectionManagerCallback-327-thread-1-processing-n:127.0.0.1:49517_solr) [n:127.0.0.1:49517_solr    ] o.a.s.c.c.ConnectionManager zkClient has connected
   [junit4]   2> 763700 INFO  (jetty-launcher-296-thread-3) [n:127.0.0.1:57844_solr    ] o.a.s.m.r.SolrJmxReporter JMX monitoring for 'solr_57844.solr.jvm' (registry 'solr.jvm') enabled at server: com.sun.jmx.mbeanserver.JmxMBeanServer@773fdfc5
   [junit4]   2> 763700 INFO  (jetty-launcher-296-thread-3) [n:127.0.0.1:57844_solr    ] o.a.s.m.r.SolrJmxReporter JMX monitoring for 'solr_57844.solr.jetty' (registry 'solr.jetty') enabled at server: com.sun.jmx.mbeanserver.JmxMBeanServer@773fdfc5
   [junit4]   2> 763711 INFO  (jetty-launcher-296-thread-3) [n:127.0.0.1:57844_solr    ] o.a.s.c.CorePropertiesLocator Found 0 core definitions underneath /x1/jenkins/jenkins-slave/workspace/Lucene-Solr-Tests-7.x/solr/build/solr-core/test/J0/temp/solr.cloud.ConcurrentCreateRoutedAliasTest_5C443574D8348035-001/tempDir-001/node3/.
   [junit4]   2> 764106 INFO  (zkConnectionManagerCallback-330-thread-1-processing-n:127.0.0.1:49747_solr) [n:127.0.0.1:49747_solr    ] o.a.s.c.c.ConnectionManager zkClient has connected
   [junit4]   2> 764701 INFO  (zkConnectionManagerCallback-332-thread-1-processing-n:127.0.0.1:57844_solr) [n:127.0.0.1:57844_solr    ] o.a.s.c.c.ConnectionManager zkClient has connected
   [junit4]   2> 765145 INFO  (zkConnectionManagerCallback-341-thread-1) [    ] o.a.s.c.c.ConnectionManager zkClient has connected
   [junit4]   2> 768245 INFO  (qtp194051025-1303) [n:127.0.0.1:51692_solr    ] o.a.s.h.a.CollectionsHandler Invoked Collection Action :createroutedalias with params router.interval=%2B12HOUR&router.start=NOW/HOUR&create-collection.collection.configName=_default&router.field=routedFoo_dt&name=testAlias5&router.name=time&create-collection.numShards=1&create-collection.nrtReplicas=1&action=CREATEROUTEDALIAS&wt=javabin&version=2&create-collection.replicationFactor=1 and sendToOCPQueue=true
   [junit4]   2> 768764 INFO  (qtp194051025-1532) [n:127.0.0.1:51692_solr    ] o.a.s.h.a.CollectionsHandler Invoked Collection Action :createroutedalias with params router.interval=%2B12HOUR&router.start=NOW/HOUR&create-collection.collection.configName=_default&router.field=routedFoo_dt&name=testAlias32&router.name=time&create-collection.numShards=1&create-collection.nrtReplicas=1&action=CREATEROUTEDALIAS&wt=javabin&version=2&create-collection.replicationFactor=1 and sendToOCPQueue=true
   [junit4]   2> 769297 INFO  (qtp194051025-1302) [n:127.0.0.1:51692_solr    ] o.a.s.h.a.CollectionsHandler Invoked Collection Action :createroutedalias with params router.interval=%2B12HOUR&router.start=NOW/HOUR&create-collection.collection.configName=_default&router.field=routedFoo_dt&name=testAlias27&router.name=time&create-collection.numShards=1&create-collection.nrtReplicas=1&action=CREATEROUTEDALIAS&wt=javabin&version=2&create-collection.replicationFactor=1 and sendToOCPQueue=true
   [junit4]   2> 769365 INFO  (qtp194051025-1516) [n:127.0.0.1:51692_solr    ] o.a.s.h.a.CollectionsHandler Invoked Collection Action :createroutedalias with params router.interval=%2B12HOUR&router.start=NOW/HOUR&create-collection.collection.configName=_default&router.field=routedFoo_dt&name=testAlias38&router.name=time&create-collection.numShards=1&create-collection.nrtReplicas=1&action=CREATEROUTEDALIAS&wt=javabin&version=2&create-collection.replicationFactor=1 and sendToOCPQueue=true
   [junit4]   2> 769367 INFO  (qtp194051025-1526) [n:127.0.0.1:51692_solr    ] o.a.s.h.a.CollectionsHandler Invoked Collection Action :createroutedalias with params router.interval=%2B12HOUR&router.start=NOW/HOUR&create-collection.collection.configName=_default&router.field=routedFoo_dt&name=testAlias1&router.name=time&create-collection.numShards=1&create-collection.nrtReplicas=1&action=CREATEROUTEDALIAS&wt=javabin&version=2&create-collection.replicationFactor=1 and sendToOCPQueue=true
   [junit4]   2> 769391 INFO  (OverseerThreadFactory-607-thread-1-processing-n:127.0.0.1:51692_solr) [n:127.0.0.1:51692_solr    ] o.a.s.c.a.c.CreateCollectionCmd Create collection testAlias5_2018-01-27_15
   [junit4]   2> 769405 INFO  (OverseerThreadFactory-607-thread-5-processing-n:127.0.0.1:51692_solr) [n:127.0.0.1:51692_solr    ] o.a.s.c.a.c.CreateCollectionCmd Create collection testAlias38_2018-01-27_15
   [junit4]   2> 769406 INFO  (OverseerThreadFactory-607-thread-4-processing-n:127.0.0.1:51692_solr) [n:127.0.0.1:51692_solr    ] o.a.s.c.a.c.CreateCollectionCmd Create collection testAlias1_2018-01-27_15
   [junit4]   2> 769407 INFO  (OverseerThreadFactory-607-thread-2-processing-n:127.0.0.1:51692_solr) [n:127.0.0.1:51692_solr    ] o.a.s.c.a.c.CreateCollectionCmd Create collection testAlias32_2018-01-27_15
   [junit4]   2> 769407 INFO  (OverseerThreadFactory-607-thread-3-processing-n:127.0.0.1:51692_solr) [n:127.0.0.1:51692_solr    ] o.a.s.c.a.c.CreateCollectionCmd Create collection testAlias27_2018-01-27_15
   [junit4]   2> 769447 INFO  (qtp194051025-1545) [n:127.0.0.1:51692_solr    ] o.a.s.h.a.CollectionsHandler Invoked Collection Action :createroutedalias with params router.interval=%2B12HOUR&router.start=NOW/HOUR&create-collection.collection.configName=_default&router.field=routedFoo_dt&name=testAlias47&router.name=time&create-collection.numShards=1&create-collection.nrtReplicas=1&action=CREATEROUTEDALIAS&wt=javabin&version=2&create-collection.replicationFactor=1 and sendToOCPQueue=true
   [junit4]   2> 769789 INFO  (qtp194051025-1547) [n:127.0.0.1:51692_solr    ] o.a.s.h.a.CollectionsHandler Invoked Collection Action :createroutedalias with params router.interval=%2B12HOUR&router.start=NOW/HOUR&create-collection.collection.configName=_default&router.field=routedFoo_dt&name=testAlias4&router.name=time&create-collection.numShards=1&create-collection.nrtReplicas=1&action=CREATEROUTEDALIAS&wt=javabin&version=2&create-collection.replicationFactor=1 and sendToOCPQueue=true
   [junit4]   2> 769791 INFO  (OverseerThreadFactory-607-thread-6-processing-n:127.0.0.1:51692_solr) [n:127.0.0.1:51692_solr    ] o.a.s.c.a.c.CreateCollectionCmd Create collection testAlias47_2018-01-27_15
   [junit4]   2> 769798 INFO  (qtp194051025-1549) [n:127.0.0.1:51692_solr    ] o.a.s.h.a.CollectionsHandler Invoked Collection Action :createroutedalias with params router.interval=%2B12HOUR&router.start=NOW/HOUR&create-collection.collection.configName=_default&router.field=routedFoo_dt&name=testAlias42&router.name=time&create-collection.numShards=1&create-collection.nrtReplicas=1&action=CREATEROUTEDALIAS&wt=javabin&version=2&create-collection.replicationFactor=1 and sendToOCPQueue=true
   [junit4]   2> 769798 INFO  (qtp194051025-1530) [n:127.0.0.1:51692_solr    ] o.a.s.h.a.CollectionsHandler Invoked Collection Action :createroutedalias with params router.interval=%2B12HOUR&router.start=NOW/HOUR&create-collection.collection.configName=_default&router.field=routedFoo_dt&name=testAlias8&router.name=time&create-collection.numShards=1&create-collection.nrtReplicas=1&action=CREATEROUTEDALIAS&wt=javabin&version=2&create-collection.replicationFactor=1 and sendToOCPQueue=true
   [junit4]   2> 769799 INFO  (qtp194051025-1517) [n:127.0.0.1:51692_solr    ] o.a.s.h.a.CollectionsHandler Invoked Collection Action :createroutedalias with params router.interval=%2B12HOUR&router.start=NOW/HOUR&create-collection.collection.configName=_default&router.field=routedFoo_dt&name=testAlias24&router.name=time&create-collection.numShards=1&create-collection.nrtReplicas=1&action=CREATEROUTEDALIAS&wt=javabin&version=2&create-collection.replicationFactor=1 and sendToOCPQueue=true
   [junit4]   2> 769497 INFO  (OverseerStateUpdate-99422538493001735-127.0.0.1:51692_solr-n_0000000000) [n:127.0.0.1:51692_solr    ] o.a.s.c.o.SliceMutator createReplica() {
   [junit4]   2>   "operation":"ADDREPLICA",
   [junit4]   2>   "collection":"testAlias5_2018-01-27_15",
   [junit4]   2>   "shard":"shard1",
   [junit4]   2>   "core":"testAlias5_2018-01-27_15_shard1_replica_n1",
   [junit4]   2>   "state":"down",
   [junit4]   2>   "base_url":"https://127.0.0.1:49517/solr",
   [junit4]   2>   "type":"NRT",
   [junit4]   2>   "waitForFinalState":"false"} 
   [junit4]   2> 769894 INFO  (qtp194051025-1541) [n:127.0.0.1:51692_solr    ] o.a.s.h.a.CollectionsHandler Invoked Collection Action :createroutedalias with params router.interval=%2B12HOUR&router.start=NOW/HOUR&create-collection.collection.configName=_default&router.field=routedFoo_dt&name=testAlias20&router.name=time&create-collection.numShards=1&create-collection.nrtReplicas=1&action=CREATEROUTEDALIAS&wt=javabin&version=2&create-collection.replicationFactor=1 and sendToOCPQueue=true
   [junit4]   2> 769989 INFO  (qtp194051025-1555) [n:127.0.0.1:51692_solr    ] o.a.s.h.a.CollectionsHandler Invoked Collection Action :createroutedalias with params router.interval=%2B12HOUR&router.start=NOW/HOUR&create-collection.collection.configName=_default&router.field=routedFoo_dt&name=testAlias30&router.name=time&create-collection.numShards=1&create-collection.nrtReplicas=1&action=CREATEROUTEDALIAS&wt=javabin&version=2&create-collection.replicationFactor=1 and sendToOCPQueue=true
   [junit4]   2> 770134 INFO  (qtp194051025-1550) [n:127.0.0.1:51692_solr    ] o.a.s.h.a.CollectionsHandler Invoked Collection Action :createroutedalias with params router.interval=%2B12HOUR&router.start=NOW/HOUR&create-collection.collection.configName=_default&router.field=routedFoo_dt&name=testAlias12&router.name=time&create-collection.numShards=1&create-collection.nrtReplicas=1&action=CREATEROUTEDALIAS&wt=javabin&version=2&create-collection.replicationFactor=1 and sendToOCPQueue=true
   [junit4]   2> 770134 INFO  (qtp194051025-1527) [n:127.0.0.1:51692_solr    ] o.a.s.h.a.CollectionsHandler Invoked Collection Action :createroutedalias with params router.interval=%2B12HOUR&router.start=NOW/HOUR&create-collection.collection.configName=_default&router.field=routedFoo_dt&name=testAlias49&router.name=time&create-collection.numShards=1&create-collection.nrtReplicas=1&action=CREATEROUTEDALIAS&wt=javabin&version=2&create-collection.replicationFactor=1 and sendToOCPQueue=true
   [junit4]   2> 770135 INFO  (qtp194051025-1299) [n:127.0.0.1:51692_solr    ] o.a.s.h.a.CollectionsHandler Invoked Collection Action :createroutedalias with params router.interval=%2B12HOUR&router.start=NOW/HOUR&create-collection.collection.configName=_default&router.field=routedFoo_dt&name=testAlias13&router.name=time&create-collection.numShards=1&create-collection.nrtReplicas=1&action=CREATEROUTEDALIAS&wt=javabin&version=2&create-collection.replicationFactor=1 and sendToOCPQueue=true
   [junit4]   2> 770135 INFO  (qtp194051025-1528) [n:127.0.0.1:51692_solr    ] o.a.s.h.a.CollectionsHandler Invoked Collection Action :createroutedalias with params router.interval=%2B12HOUR&router.start=NOW/HOUR&create-collection.collection.configName=_default&router.field=routedFoo_dt&name=testAlias31&router.name=time&create-collection.numShards=1&create-collection.nrtReplicas=1&action=CREATEROUTEDALIAS&wt=javabin&version=2&create-collection.replicationFactor=1 and sendToOCPQueue=true
   [junit4]   2> 770478 INFO  (OverseerThreadFactory-607-thread-7-processing-n:127.0.0.1:51692_solr) [n:127.0.0.1:51692_solr    ] o.a.s.c.a.c.CreateCollectionCmd Create collection testAlias4_2018-01-27_15
   [junit4]   2> 770522 INFO  (qtp194051025-1519) [n:127.0.0.1:51692_solr    ] o.a.s.h.a.CollectionsHandler Invoked Collection Action :createroutedalias with params router.interval=%2B12HOUR&router.start=NOW/HOUR&create-collection.collection.configName=_default&router.field=routedFoo_dt&name=testAlias48&router.name=time&create-collection.numShards=1&create-collection.nrtReplicas=1&action=CREATEROUTEDALIAS&wt=javabin&version=2&create-collection.replicationFactor=1 and sendToOCPQueue=true
   [junit4]   2> 770523 INFO  (qtp194051025-1531) [n:127.0.0.1:51692_solr    ] o.a.s.h.a.CollectionsHandler Invoked Collection Action :createroutedalias with params router.interval=%2B12HOUR&router.start=NOW/HOUR&create-collection.collection.configName=_default&router.field=routedFoo_dt&name=testAlias6&router.name=time&create-collection.numShards=1&create-collection.nrtReplicas=1&action=CREATEROUTEDALIAS&wt=javabin&version=2&create-collection.replicationFactor=1 and sendToOCPQueue=true
   [junit4]   2> 770529 INFO  (qtp194051025-1551) [n:127.0.0.1:51692_solr    ] o.a.s.h.a.CollectionsHandler Invoked Collection Action :createroutedalias with params router.interval=%2B12HOUR&router.start=NOW/HOUR&create-collection.collection.configName=_default&router.field=routedFoo_dt&name=testAlias18&router.name=time&create-collection.numShards=1&create-collection.nrtReplicas=1&action=CREATEROUTEDALIAS&wt=javabin&version=2&create-collection.replicationFactor=1 and sendToOCPQueue=true
   [junit4]   2> 770636 INFO  (OverseerThreadFactory-607-thread-8-processing-n:127.0.0.1:51692_solr) [n:127.0.0.1:51692_solr    ] o.a.s.c.a.c.CreateCollectionCmd Create collection testAlias24_2018-01-27_15
   [junit4]   2> 770640 INFO  (qtp194051025-1556) [n:127.0.0.1:51692_solr    ] o.a.s.h.a.CollectionsHandler Invoked Collection Action :createroutedalias with params router.interval=%2B12HOUR&router.start=NOW/HOUR&create-collection.collection.configName=_default&router.field=routedFoo_dt&name=testAlias35&router.name=time&create-collection.numShards=1&create-collection.nrtReplicas=1&action=CREATEROUTEDALIAS&wt=javabin&version=2&create-collection.replicationFactor=1 and sendToOCPQueue=true
   [junit4]   2> 770957 INFO  (qtp194051025-1518) [n:127.0.0.1:51692_solr    ] o.a.s.h.a.CollectionsHandler Invoked Collection Action :createroutedalias with params router.interval=%2B12HOUR&router.start=NOW/HOUR&create-collection.collection.configName=_default&router.field=routedFoo_dt&name=testAlias10&router.name=time&create-collection.numShards=1&create-collection.nrtReplicas=1&action=CREATEROUTEDALIAS&wt=javabin&version=2&create-collection.replicationFactor=1 and sendToOCPQueue=true
   [junit4]   2> 770962 INFO  (qtp194051025-1525) [n:127.0.0.1:51692_solr    ] o.a.s.h.a.CollectionsHandler Invoked Collection Action :createroutedalias with params router.interval=%2B12HOUR&router.start=NOW/HOUR&create-collection.collection.configName=_default&router.field=routedFoo_dt&name=testAlias9&router.name=time&create-collection.numShards=1&create-collection.nrtReplicas=1&action=CREATEROUTEDALIAS&wt=javabin&version=2&create-collection.replicationFactor=1 and sendToOCPQueue=true
   [junit4]   2> 770962 INFO  (qtp194051025-1538) [n:127.0.0.1:51692_solr    ] o.a.s.h.a.CollectionsHandler Invoked Collection Action :createroutedalias with params router.interval=%2B12HOUR&router.start=NOW/HOUR&create-collection.collection.configName=_default&router.field=routedFoo_dt&name=testAlias7&router.name=time&create-collection.numShards=1&create-collection.nrtReplicas=1&action=CREATEROUTEDALIAS&wt=javabin&version=2&create-collection.replicationFactor=1 and sendToOCPQueue=true
   [junit4]   2> 770962 INFO  (qtp194051025-1297) [n:127.0.0.1:51692_solr    ] o.a.s.h.a.CollectionsHandler Invoked Collection Action :createroutedalias with params router.interval=%2B12HOUR&router.start=NOW/HOUR&create-collection.collection.configName=_default&router.field=routedFoo_dt&name=testAlias37&router.name=time&create-collection.numShards=1&create-collection.nrtReplicas=1&action=CREATEROUTEDALIAS&wt=javabin&version=2&create-collection.replicationFactor=1 and sendToOCPQueue=true
   [junit4]   2> 771336 INFO  (qtp194051025-1569) [n:127.0.0.1:51692_solr    ] o.a.s.h.a.CollectionsHandler Invoked Collection Action :createroutedalias with params router.interval=%2B12HOUR&router.start=NOW/HOUR&create-collection.collection.configName=_default&router.field=routedFoo_dt&name=testAlias29&router.name=time&create-collection.numShards=1&create-collection.nrtReplicas=1&action=CREATEROUTEDALIAS&wt=javabin&version=2&create-collection.replicationFactor=1 and sendToOCPQueue=true
   [junit4]   2> 771347 INFO  (OverseerStateUpdate-99422538493001735-127.0.0.1:51692_solr-n_0000000000) [n:127.0.0.1:51692_solr    ] o.a.s.c.o.SliceMutator createReplica() {
   [junit4]   2>   "operation":"ADDREPLICA",
   [junit4]   2>   "collection":"testAlias27_2018-01-27_15",
   [junit4]   2>   "shard":"shard1",
   [junit4]   2>   "core":"testAlias27_2018-01-27_15_shard1_replica_n1",
   [junit4]   2>   "state":"down",
   [junit4]   2>   "base_url":"https://127.0.0.1:51692/solr",
   [junit4]   2>   "type":"NRT",
   [junit4]   2>   "waitForFinalState":"false"} 
   [junit4]   2> 771348 INFO  (OverseerStateUpdate-99422538493001735-127.0.0.1:51692_solr-n_0000000000) [n:127.0.0.1:51692_solr    ] o.a.s.c.o.SliceMutator createReplica() {
   [junit4]   2>   "operation":"ADDREPLICA",
   [junit4]   2>   "collection":"testAlias1_2018-01-27_15",
   [junit4]   2>   "shard":"shard1",
   [junit4]   2>   "core":"testAlias1_2018-01-27_15_shard1_replica_n1",
   [junit4]   2>   "state":"down",
   [junit4]   2>   "base_url":"https://127.0.0.1:49747/solr",
   [junit4]   2>   "type":"NRT",
   [junit4]   2>   "waitForFinalState":"false"} 
   [junit4]   2> 771349 INFO  (OverseerStateUpdate-99422538493001735-127.0.0.1:51692_solr-n_0000000000) [n:127.0.0.1:51692_solr    ] o.a.s.c.o.SliceMutator createReplica() {
   [junit4]   2>   "operation":"ADDREPLICA",
   [junit4]   2>   "collection":"testAlias38_2018-01-27_15",
   [junit4]   2>   "shard":"shard1",
   [junit4]   2>   "core":"testAlias38_2018-01-27_15_shard1_replica_n1",
   [junit4]   2>   "state":"down",
   [junit4]   2>   "base_url":"https://127.0.0.1:49747/solr",
   [junit4]   2>   "type":"NRT",
   [junit4]   2>   "waitForFinalState":"false"} 
   [junit4]   2> 771349 INFO  (OverseerStateUpdate-99422538493001735-127.0.0.1:51692_solr-n_0000000000) [n:127.0.0.1:51692_solr    ] o.a.s.c.o.SliceMutator createReplica() {
   [junit4]   2>   "operation":"ADDREPLICA",
   [junit4]   2>   "collection":"testAlias32_2018-01-27_15",
   [junit4]   2>   "shard":"shard1",
   [junit4]   2>   "core":"testAlias32_2018-01-27_15_shard1_replica_n1",
   [junit4]   2>   "state":"down",
   [junit4]   2>   "base_url":"https://127.0.0.1:57844/solr",
   [junit4]   2>   "type":"NRT",
   [junit4]   2>   "waitForFinalState":"false"} 
   [junit4]   2> 771351 INFO  (qtp194051025-1563) [n:127.0.0.1:51692_solr    ] o.a.s.h.a.CollectionsHandler Invoked Collection Action :createroutedalias with params router.interval=%2B12HOUR&router.start=NOW/HOUR&create-collection.collection.configName=_default&router.field=routedFoo_dt&name=testAlias23&router.name=time&create-collection.numShards=1&create-collection.nrtReplicas=1&action=CREATEROUTEDALIAS&wt=javabin&version=2&create-collection.replicationFactor=1 and sendToOCPQueue=true
   [junit4]   2> 771360 INFO  (OverseerThreadFactory-607-thread-9-processing-n:127.0.0.1:51692_solr) [n:127.0.0.1:51692_solr    ] o.a.s.c.a.c.CreateCollectionCmd Create collection testAlias42_2018-01-27_15
   [junit4]   2> 771366 INFO  (qtp194051025-1554) [n:127.0.0.1:51692_solr    ] o.a.s.h.a.CollectionsHandler Invoked Collection Action :createroutedalias with params router.interval=%2B12HOUR&router.start=NOW/HOUR&create-collection.collection.configName=_default&router.field=routedFoo_dt&name=testAlias14&router.name=time&create-collection.numShards=1&create-collection.nrtReplicas=1&action=CREATEROUTEDALIAS&wt=javabin&version=2&create-collection.replicationFactor=1 and sendToOCPQueue=true
   [junit4]   2> 771366 INFO  (qtp194051025-1553) [n:127.0.0.1:51692_solr    ] o.a.s.h.a.CollectionsHandler Invoked Collection Action :createroutedalias with params router.interval=%2B12HOUR&router.start=NOW/HOUR&create-collection.collection.configName=_default&router.field=routedFoo_dt&name=testAlias0&router.name=time&create-collection.numShards=1&create-collection.nrtReplicas=1&action=CREATEROUTEDALIAS&wt=javabin&version=2&create-collection.replicationFactor=1 and sendToOCPQueue=true
   [junit4]   2> 771366 INFO  (qtp194051025-1521) [n:127.0.0.1:51692_solr    ] o.a.s.h.a.CollectionsHandler Invoked Collection Action :createroutedalias with params router.interval=%2B12HOUR&router.start=NOW/HOUR&create-collection.collection.configName=_default&router.field=routedFoo_dt&name=testAlias19&router.name=time&create-collection.numShards=1&create-collection.nrtReplicas=1&action=CREATEROUTEDALIAS&wt=javabin&version=2&create-collection.replicationFactor=1 and sendToOCPQueue=true
   [junit4]   2> 771377 INFO  (qtp194051025-1537) [n:127.0.0.1:51692_solr    ] o.a.s.h.a.CollectionsHandler Invoked Collection Action :createroutedalias with params router.interval=%2B12HOUR&router.start=NOW/HOUR&create-collection.collection.configName=_default&router.field=routedFoo_dt&name=testAlias2&router.name=time&create-collection.numShards=1&create-collection.nrtReplicas=1&action=CREATEROUTEDALIAS&wt=javabin&version=2&create-collection.replicationFactor=1 and sendToOCPQueue=true
   [junit4]   2> 771377 INFO  (qtp194051025-1529) [n:127.0.0.1:51692_solr    ] o.a.s.h.a.CollectionsHandler Invoked Collection Action :createroutedalias with params router.interval=%2B12HOUR&router.start=NOW/HOUR&create-collection.collection.configName=_default&router.field=routedFoo_dt&name=testAlias44&router.name=time&create-collection.numShards=1&create-collection.nrtReplicas=1&action=CREATEROUTEDALIAS&wt=javabin&version=2&create-collection.replicationFactor=1 and sendToOCPQueue=true
   [junit4]   2> 771378 INFO  (qtp194051025-1559) [n:127.0.0.1:51692_solr    ] o.a.s.h.a.CollectionsHandler Invoked Collection Action :createroutedalias with params router.interval=%2B12HOUR&router.start=NOW/HOUR&create-collection.collection.configName=_default&router.field=routedFoo_dt&name=testAlias41&router.name=time&create-collection.numShards=1&create-collection.nrtReplicas=1&action=CREATEROUTEDALIAS&wt=javabin&version=2&create-collection.replicationFactor=1 and sendToOCPQueue=true
   [junit4]   2> 771378 INFO  (qtp194051025-1300) [n:127.0.0.1:51692_solr    ] o.a.s.h.a.CollectionsHandler Invoked Collection Action :createroutedalias with params router.interval=%2B12HOUR&router.start=NOW/HOUR&create-collection.collection.configName=_default&router.field=routedFoo_dt&name=testAlias34&router.name=time&create-collection.numShards=1&create-collection.nrtReplicas=1&action=CREATEROUTEDALIAS&wt=javabin&version=2&create-collection.replicationFactor=1 and sendToOCPQueue=true
   [junit4]   2> 771378 INFO  (qtp194051025-1301) [n:127.0.0.1:51692_solr    ] o.a.s.h.a.CollectionsHandler Invoked Collection Action :createroutedalias with params router.interval=%2B12HOUR&router.start=NOW/HOUR&create-collection.collection.configName=_default&router.field=routedFoo_dt&name=testAlias45&router.name=time&create-collection.numShards=1&create-collection.nrtReplicas=1&action=CREATEROUTEDALIAS&wt=javabin&version=2&create-collection.replicationFactor=1 and sendToOCPQueue=true
   [junit4]   2> 771379 INFO  (qtp194051025-1536) [n:127.0.0.1:51692_solr    ] o.a.s.h.a.CollectionsHandler Invoked Collection Action :createroutedalias with params router.interval=%2B12HOUR&router.start=NOW/HOUR&create-collection.collection.configName=_default&router.field=routedFoo_dt&name=testAlias40&router.name=time&create-collection.numShards=1&create-collection.nrtReplicas=1&action=CREATEROUTEDALIAS&wt=javabin&version=2&create-collection.replicationFactor=1 and sendToOCPQueue=true
   [junit4]   2> 771379 INFO  (qtp194051025-1296) [n:127.0.0.1:51692_solr    ] o.a.s.h.a.CollectionsHandler Invoked Collection Action :createroutedalias with params router.interval=%2B12HOUR&router.start=NOW/HOUR&create-collection.collection.configName=_default&router.field=routedFoo_dt&name=testAlias16&router.name=time&create-collection.numShards=1&create-collection.nrtReplicas=1&action=CREATEROUTEDALIAS&wt=javabin&version=2&create-collection.replicationFactor=1 and sendToOCPQueue=true
   [junit4]   2> 771380 INFO  (OverseerThreadFactory-607-thread-10-processing-n:127.0.0.1:51692_solr) [n:127.0.0.1:51692_solr    ] o.a.s.c.a.c.CreateCollectionCmd Create collection testAlias8_2018-01-27_15
   [junit4]   2> 771380 INFO  (qtp194051025-1522) [n:127.0.0.1:51692_solr    ] o.a.s.h.a.CollectionsHandler Invoked Collection Action :createroutedalias with params router.interval=%2B12HOUR&router.start=NOW/HOUR&create-collection.collection.configName=_default&router.field=routedFoo_dt&name=testAlias15&router.name=time&create-collection.numShards=1&create-collection.nrtReplicas=1&action=CREATEROUTEDALIAS&wt=javabin&version=2&create-collection.replicationFactor=1 and sendToOCPQueue=true
   [junit4]   2> 771380 INFO  (qtp194051025-1562) [n:127.0.0.1:51692_solr    ] o.a.s.h.a.CollectionsHandler Invoked Collection Action :createroutedalias with params router.interval=%2B12HOUR&router.start=NOW/HOUR&create-collection.collection.configName=_default&router.field=routedFoo_dt&name=testAlias25&router.name=time&create-collection.numShards=1&create-collection.nrtReplicas=1&action=CREATEROUTEDALIAS&wt=javabin&version=2&create-collection.replicationFactor=1 and sendToOCPQueue=true
   [junit4]   2> 771380 INFO  (qtp194051025-1535) [n:127.0.0.1:51692_solr    ] o.a.s.h.a.CollectionsHandler Invoked Collection Action :createroutedalias with params router.interval=%2B12HOUR&router.start=NOW/HOUR&create-collection.collection.configName=_default&router.field=routedFoo_dt&name=testAlias22&router.name=time&create-collection.numShards=1&create-collection.nrtReplicas=1&action=CREATEROUTEDALIAS&wt=javabin&version=2&create-collection.replicationFactor=1 and sendToOCPQueue=true
   [junit4]   2> 771381 INFO  (qtp194051025-1534) [n:127.0.0.1:51692_solr    ] o.a.s.h.a.CollectionsHandler Invoked Collection Action :createroutedalias with params router.interval=%2B12HOUR&router.start=NOW/HOUR&create-collection.collection.configName=_default&router.field=routedFoo_dt&name=testAlias43&router.name=time&create-collection.numShards=1&create-collection.nrtReplicas=1&action=CREATEROUTEDALIAS&wt=javabin&version=2&create-collection.replicationFactor=1 and sendToOCPQueue=true
   [junit4]   2> 771381 INFO  (qtp194051025-1561) [n:127.0.0.1:51692_solr    ] o.a.s.h.a.CollectionsHandler Invoked Collection Action :createroutedalias with params router.interval=%2B12HOUR&router.start=NOW/HOUR&create-collection.collection.configName=_default&router.field=routedFoo_dt&name=testAlias17&router.name=time&create-collection.numShards=1&create-collection.nrtReplicas=1&action=CREATEROUTEDALIAS&wt=javabin&version=2&create-collection.replicationFactor=1 and sendToOCPQueue=true
   [junit4]   2> 771393 INFO  (qtp194051025-1564) [n:127.0.0.1:51692_solr    ] o.a.s.h.a.CollectionsHandler Invoked Collection Action :createroutedalias with params router.interval=%2B12HOUR&router.start=NOW/HOUR&create-collection.collection.configName=_default&router.field=routedFoo_dt&name=testAlias3&router.name=time&create-collection.numShards=1&create-collection.nrtReplicas=1&action=CREATEROUTEDALIAS&wt=javabin&version=2&create-collection.replicationFactor=1 and sendToOCPQueue=true
   [junit4]   2> 771466 INFO  (qtp194051025-1520) [n:127.0.0.1:51692_solr    ] o.a.s.h.a.CollectionsHandler Invoked Collection Action :createroutedalias with params router.interval=%2B12HOUR&router.start=NOW/HOUR&create-collection.collection.configName=_default&router.field=routedFoo_dt&name=testAlias26&router.name=time&create-collection.numShards=1&create-collection.nrtReplicas=1&action=CREATEROUTEDALIAS&wt=javabin&version=2&create-collection.replicationFactor=1 and sendToOCPQueue=true
   [junit4]   2> 771489 INFO  (qtp194051025-1565) [n:127.0.0.1:51692_solr    ] o.a.s.h.a.CollectionsHandler Invoked Collection Action :createroutedalias with params router.interval=%2B12HOUR&router.start=NOW/HOUR&create-collection.collection.configName=_default&router.field=routedFoo_dt&name=testAlias46&router.name=time&create-collection.numShards=1&create-collection.nrtReplicas=1&action=CREATEROUTEDALIAS&wt=javabin&version=2&create-collection.replicationFactor=1 and sendToOCPQueue=true
   [junit4]   2> 771490 INFO  (qtp194051025-1566) [n:127.0.0.1:51692_solr    ] o.a.s.h.a.CollectionsHandler Invoked Collection Action :createroutedalias with params router.interval=%2B12HOUR&router.start=NOW/HOUR&create-collection.collection.configName=_default&router.field=routedFoo_dt&name=testAlias21&router.name=time&create-collection.numShards=1&create-collection.nrtReplicas=1&action=CREATEROUTEDALIAS&wt=javabin&version=2&create-collection.replicationFactor=1 and sendToOCPQueue=true
   [junit4]   2> 771490 INFO  (qtp194051025-1567) [n:127.0.0.1:51692_solr    ] o.a.s.h.a.CollectionsHandler Invoked Collection Action :createroutedalias with params router.interval=%2B12HOUR&router.start=NOW/HOUR&create-collection.collection.configName=_default&router.field=routedFoo_dt&name=testAlias11&router.name=time&create-collection.numShards=1&create-collection.nrtReplicas=1&action=CREATEROUTEDALIAS&wt=javabin&version=2&create-collection.replicationFactor=1 and sendToOCPQueue=true
   [junit4]   2> 771491 INFO  (qtp194051025-1568) [n:127.0.0.1:51692_solr    ] o.a.s.h.a.CollectionsHandler Invoked Collection Action :createroutedalias with params router.interval=%2B12HOUR&router.start=NOW/HOUR&create-collection.collection.configName=_default&router.field=routedFoo_dt&name=testAlias39&router.name=time&create-collection.numShards=1&create-collection.nrtReplicas=1&action=CREATEROUTEDALIAS&wt=javabin&version=2&create-collection.replicationFactor=1 and sendToOCPQueue=true
   [junit4]   2> 771685 INFO  (OverseerStateUpdate-99422538493001735-127.0.0.1:51692_solr-n_0000000000) [n:127.0.0.1:51692_solr    ] o.a.s.c.o.SliceMutator createReplica() {
   [junit4]   2>   "operation":"ADDREPLICA",
   [junit4]   2>   "collection":"testAlias42_2018-01-27_15",
   [junit4]   2>   "shard":"shard1",
   [junit4]   2>   "core":"testAlias42_2018-01-27_15_shard1_replica_n1",
   [junit4]   2>   "state":"down",
   [junit4]   2>   "base_url":"https://127.0.0.1:49517/solr",
   [junit4]   2>   "type":"NRT",
   [junit4]   2>   "waitForFinalState":"false"} 
   [junit4]   2> 771686 INFO  (OverseerStateUpdate-99422538493001735-127.0.0.1:51692_solr-n_0000000000) [n:127.0.0.1:51692_solr    ] o.a.s.c.o.SliceMutator createReplica() {
   [junit4]   2>   "operation":"ADDREPLICA",
   [junit4]   2>   "collection":"testAlias24_2018-01-27_15",
   [junit4]   2>   "shard":"shard1",
   [junit4]   2>   "core":"testAlias24_2018-01-27_15_shard1_replica_n1",
   [junit4]   2>   "state":"down",
   [junit4]   2>   "base_url":"https://127.0.0.1:49747/solr",
   [junit4]   2>   "type":"NRT",
   [junit4]   2>   "waitForFinalState":"false"} 
   [junit4]   2> 771687 INFO  (OverseerStateUpdate-99422538493001735-127.0.0.1:51692_solr-n_0000000000) [n:127.0.0.1:51692_solr    ] o.a.s.c.o.SliceMutator createReplica() {
   [junit4]   2>   "operation":"ADDREPLICA",
   [junit4]   2>   "collection":"testAlias8_2018-01-27_15",
   [junit4]   2>   "shard":"shard1",
   [junit4]   2>   "core":"testAlias8_2018-01-27_15_shard1_replica_n1",
   [junit4]   2>   "state":"down",
   [junit4]   2>   "base_url":"https://127.0.0.1:49747/solr",
   [junit4]   2>   "type":"NRT",
   [junit4]   2>   "waitForFinalState":"false"} 
   [junit4]   2> 771687 INFO  (OverseerStateUpdate-99422538493001735-127.0.0.1:51692_solr-n_0000000000) [n:127.0.0.1:51692_solr    ] o.a.s.c.o.SliceMutator createReplica() {
   [junit4]   2>   "operation":"ADDREPLICA",
   [junit4]   2>   "collection":"testAlias47_2018-01-27_15",
   [junit4]   2>   "shard":"shard1",
   [junit4]   2>   "core":"testAlias47_2018-01-27_15_shard1_replica_n1",
   [junit4]   2>   "state":"down",
   [junit4]   2>   "base_url":"https://127.0.0.1:49747/solr",
   [junit4]   2>   "type":"NRT",
   [junit4]   2>   "waitForFinalState":"false"} 
   [junit4]   2> 771699 INFO  (OverseerThreadFactory-607-thread-11-processing-n:127.0.0.1:51692_solr) [n:127.0.0.1:51692_solr    ] o.a.s.c.a.c.CreateCollectionCmd Create collection testAlias20_2018-01-27_15
   [junit4]   2> 771743 INFO  (OverseerThreadFactory-607-thread-13-processing-n:127.0.0.1:51692_solr) [n:127.0.0.1:51692_solr    ] o.a.s.c.a.c.CreateCollectionCmd Create collection testAlias12_2018-01-27_15
   [junit4]   2> 771745 INFO  (OverseerThreadFactory-607-thread-12-processing-n:127.0.0.1:51692_solr) [n:127.0.0.1:51692_solr    ] o.a.s.c.a.c.CreateCollectionCmd Create collection testAlias30_2018-01-27_15
   [junit4]   2> 771761 INFO  (OverseerThreadFactory-607-thread-14-processing-n:127.0.0.1:51692_solr) [n:127.0.0.1:51692_solr    ] o.a.s.c.a.c.CreateCollectionCmd Create collection testAlias13_2018-01-27_15
   [junit4]   2> 771784 INFO  (OverseerThreadFactory-607-thread-15-processing-n:127.0.0.1:51692_solr) [n:127.0.0.1:51692_solr    ] o.a.s.c.a.c.CreateCollectionCmd Create collection testAlias31_2018-01-27_15
   [junit4]   2> 771807 INFO  (OverseerThreadFactory-607-thread-16-processing-n:127.0.0.1:51692_solr) [n:127.0.0.1:51692_solr    ] o.a.s.c.a.c.CreateCollectionCmd Create collection testAlias49_2018-01-27_15
   [junit4]   2> 771816 INFO  (OverseerThreadFactory-607-thread-17-processing-n:127.0.0.1:51692_solr) [n:127.0.0.1:51692_solr    ] o.a.s.c.a.c.CreateCollectionCmd Create collection testAlias48_2018-01-27_15
   [junit4]   2> 771847 INFO  (OverseerThreadFactory-607-thread-18-processing-n:127.0.0.1:51692_solr

[...truncated too long message...]

ve/workspace/Lucene-Solr-Tests-7.x/solr/core/test-lib/apacheds-interceptor-kerberos-2.0.0-M15.jar:/x1/jenkins/jenkins-slave/workspace/Lucene-Solr-Tests-7.x/solr/core/test-lib/apacheds-interceptors-admin-2.0.0-M15.jar:/x1/jenkins/jenkins-slave/workspace/Lucene-Solr-Tests-7.x/solr/core/test-lib/apacheds-interceptors-authn-2.0.0-M15.jar:/x1/jenkins/jenkins-slave/workspace/Lucene-Solr-Tests-7.x/solr/core/test-lib/apacheds-interceptors-authz-2.0.0-M15.jar:/x1/jenkins/jenkins-slave/workspace/Lucene-Solr-Tests-7.x/solr/core/test-lib/apacheds-interceptors-changelog-2.0.0-M15.jar:/x1/jenkins/jenkins-slave/workspace/Lucene-Solr-Tests-7.x/solr/core/test-lib/apacheds-interceptors-collective-2.0.0-M15.jar:/x1/jenkins/jenkins-slave/workspace/Lucene-Solr-Tests-7.x/solr/core/test-lib/apacheds-interceptors-event-2.0.0-M15.jar:/x1/jenkins/jenkins-slave/workspace/Lucene-Solr-Tests-7.x/solr/core/test-lib/apacheds-interceptors-exception-2.0.0-M15.jar:/x1/jenkins/jenkins-slave/workspace/Lucene-Solr-Tests-7.x/solr/core/test-lib/apacheds-interceptors-journal-2.0.0-M15.jar:/x1/jenkins/jenkins-slave/workspace/Lucene-Solr-Tests-7.x/solr/core/test-lib/apacheds-interceptors-normalization-2.0.0-M15.jar:/x1/jenkins/jenkins-slave/workspace/Lucene-Solr-Tests-7.x/solr/core/test-lib/apacheds-interceptors-operational-2.0.0-M15.jar:/x1/jenkins/jenkins-slave/workspace/Lucene-Solr-Tests-7.x/solr/core/test-lib/apacheds-interceptors-referral-2.0.0-M15.jar:/x1/jenkins/jenkins-slave/workspace/Lucene-Solr-Tests-7.x/solr/core/test-lib/apacheds-interceptors-schema-2.0.0-M15.jar:/x1/jenkins/jenkins-slave/workspace/Lucene-Solr-Tests-7.x/solr/core/test-lib/apacheds-interceptors-subtree-2.0.0-M15.jar:/x1/jenkins/jenkins-slave/workspace/Lucene-Solr-Tests-7.x/solr/core/test-lib/apacheds-interceptors-trigger-2.0.0-M15.jar:/x1/jenkins/jenkins-slave/workspace/Lucene-Solr-Tests-7.x/solr/core/test-lib/apacheds-jdbm-partition-2.0.0-M15.jar:/x1/jenkins/jenkins-slave/workspace/Lucene-Solr-Tests-7.x/solr/core/test-lib/apacheds-jdbm1-2.0.0-M2.jar:/x1/jenkins/jenkins-slave/workspace/Lucene-Solr-Tests-7.x/solr/core/test-lib/apacheds-kerberos-codec-2.0.0-M15.jar:/x1/jenkins/jenkins-slave/workspace/Lucene-Solr-Tests-7.x/solr/core/test-lib/apacheds-ldif-partition-2.0.0-M15.jar:/x1/jenkins/jenkins-slave/workspace/Lucene-Solr-Tests-7.x/solr/core/test-lib/apacheds-mavibot-partition-2.0.0-M15.jar:/x1/jenkins/jenkins-slave/workspace/Lucene-Solr-Tests-7.x/solr/core/test-lib/apacheds-protocol-kerberos-2.0.0-M15.jar:/x1/jenkins/jenkins-slave/workspace/Lucene-Solr-Tests-7.x/solr/core/test-lib/apacheds-protocol-ldap-2.0.0-M15.jar:/x1/jenkins/jenkins-slave/workspace/Lucene-Solr-Tests-7.x/solr/core/test-lib/apacheds-protocol-shared-2.0.0-M15.jar:/x1/jenkins/jenkins-slave/workspace/Lucene-Solr-Tests-7.x/solr/core/test-lib/apacheds-xdbm-partition-2.0.0-M15.jar:/x1/jenkins/jenkins-slave/workspace/Lucene-Solr-Tests-7.x/solr/core/test-lib/api-all-1.0.0-M20.jar:/x1/jenkins/jenkins-slave/workspace/Lucene-Solr-Tests-7.x/solr/core/test-lib/bcprov-jdk15on-1.54.jar:/x1/jenkins/jenkins-slave/workspace/Lucene-Solr-Tests-7.x/solr/core/test-lib/byte-buddy-1.6.2.jar:/x1/jenkins/jenkins-slave/workspace/Lucene-Solr-Tests-7.x/solr/core/test-lib/commons-collections-3.2.2.jar:/x1/jenkins/jenkins-slave/workspace/Lucene-Solr-Tests-7.x/solr/core/test-lib/commons-math3-3.6.1.jar:/x1/jenkins/jenkins-slave/workspace/Lucene-Solr-Tests-7.x/solr/core/test-lib/ehcache-core-2.4.4.jar:/x1/jenkins/jenkins-slave/workspace/Lucene-Solr-Tests-7.x/solr/core/test-lib/hadoop-common-2.7.4-tests.jar:/x1/jenkins/jenkins-slave/workspace/Lucene-Solr-Tests-7.x/solr/core/test-lib/hadoop-hdfs-2.7.4-tests.jar:/x1/jenkins/jenkins-slave/workspace/Lucene-Solr-Tests-7.x/solr/core/test-lib/hadoop-minikdc-2.7.4.jar:/x1/jenkins/jenkins-slave/workspace/Lucene-Solr-Tests-7.x/solr/core/test-lib/htrace-core-3.2.0-incubating.jar:/x1/jenkins/jenkins-slave/workspace/Lucene-Solr-Tests-7.x/solr/core/test-lib/jersey-core-1.9.jar:/x1/jenkins/jenkins-slave/workspace/Lucene-Solr-Tests-7.x/solr/core/test-lib/jersey-server-1.9.jar:/x1/jenkins/jenkins-slave/workspace/Lucene-Solr-Tests-7.x/solr/core/test-lib/jetty-6.1.26.jar:/x1/jenkins/jenkins-slave/workspace/Lucene-Solr-Tests-7.x/solr/core/test-lib/jetty-sslengine-6.1.26.jar:/x1/jenkins/jenkins-slave/workspace/Lucene-Solr-Tests-7.x/solr/core/test-lib/jetty-util-6.1.26.jar:/x1/jenkins/jenkins-slave/workspace/Lucene-Solr-Tests-7.x/solr/core/test-lib/mina-core-2.0.0-M5.jar:/x1/jenkins/jenkins-slave/workspace/Lucene-Solr-Tests-7.x/solr/core/test-lib/mockito-core-2.6.2.jar:/x1/jenkins/jenkins-slave/workspace/Lucene-Solr-Tests-7.x/solr/core/test-lib/netty-all-4.0.36.Final.jar:/x1/jenkins/jenkins-slave/workspace/Lucene-Solr-Tests-7.x/solr/core/test-lib/objenesis-2.5.jar:/x1/jenkins/jenkins-slave/workspace/Lucene-Solr-Tests-7.x/lucene/build/analysis/icu/lucene-analyzers-icu-7.3.0-SNAPSHOT.jar:/x1/jenkins/jenkins-slave/workspace/Lucene-Solr-Tests-7.x/solr/build/contrib/solr-analysis-extras/classes/java:/x1/jenkins/jenkins-slave/workspace/Lucene-Solr-Tests-7.x/lucene/build/queryparser/classes/test:/x1/jenkins/jenkins-slave/workspace/Lucene-Solr-Tests-7.x/lucene/build/backward-codecs/classes/test:/x1/jenkins/jenkins-slave/workspace/Lucene-Solr-Tests-7.x/solr/contrib/analysis-extras/lib/icu4j-60.2.jar:/home/jenkins/tools/ant/apache-ant-1.8.4/lib/ant-launcher.jar:/x1/jenkins/.ant/lib/ivy-2.4.0.jar:/home/jenkins/tools/ant/apache-ant-1.8.4/lib/ant-junit.jar:/home/jenkins/tools/ant/apache-ant-1.8.4/lib/ant-apache-log4j.jar:/home/jenkins/tools/ant/apache-ant-1.8.4/lib/ant-junit4.jar:/home/jenkins/tools/ant/apache-ant-1.8.4/lib/ant-jai.jar:/home/jenkins/tools/ant/apache-ant-1.8.4/lib/ant-javamail.jar:/home/jenkins/tools/ant/apache-ant-1.8.4/lib/ant-apache-bsf.jar:/home/jenkins/tools/ant/apache-ant-1.8.4/lib/ant-commons-net.jar:/home/jenkins/tools/ant/apache-ant-1.8.4/lib/ant-antlr.jar:/home/jenkins/tools/ant/apache-ant-1.8.4/lib/ant-jsch.jar:/home/jenkins/tools/ant/apache-ant-1.8.4/lib/ant-apache-oro.jar:/home/jenkins/tools/ant/apache-ant-1.8.4/lib/ant-commons-logging.jar:/home/jenkins/tools/ant/apache-ant-1.8.4/lib/ant.jar:/home/jenkins/tools/ant/apache-ant-1.8.4/lib/ant-netrexx.jar:/home/jenkins/tools/ant/apache-ant-1.8.4/lib/ant-testutil.jar:/home/jenkins/tools/ant/apache-ant-1.8.4/lib/ant-jdepend.jar:/home/jenkins/tools/ant/apache-ant-1.8.4/lib/ant-apache-bcel.jar:/home/jenkins/tools/ant/apache-ant-1.8.4/lib/ant-apache-xalan2.jar:/home/jenkins/tools/ant/apache-ant-1.8.4/lib/ant-apache-resolver.jar:/home/jenkins/tools/ant/apache-ant-1.8.4/lib/ant-jmf.jar:/home/jenkins/tools/ant/apache-ant-1.8.4/lib/ant-apache-regexp.jar:/home/jenkins/tools/ant/apache-ant-1.8.4/lib/ant-swing.jar:/usr/local/asfpackages/java/jdk1.8.0_144/lib/tools.jar:/x1/jenkins/.ivy2/cache/com.carrotsearch.randomizedtesting/junit4-ant/jars/junit4-ant-2.5.3.jar com.carrotsearch.ant.tasks.junit4.slave.SlaveMainSafe -eventsfile /x1/jenkins/jenkins-slave/workspace/Lucene-Solr-Tests-7.x/solr/build/solr-core/test/temp/junit4-J1-20180127_152615_9113758609875533046473.events @/x1/jenkins/jenkins-slave/workspace/Lucene-Solr-Tests-7.x/solr/build/solr-core/test/temp/junit4-J1-20180127_152615_9114747300054153322530.suites -stdin
   [junit4] ERROR: JVM J1 ended with an exception: Forked process returned with error code: 1. Very likely a JVM crash.  See process stdout at: /x1/jenkins/jenkins-slave/workspace/Lucene-Solr-Tests-7.x/solr/build/solr-core/test/temp/junit4-J1-20180127_152615_9113654611955155589331.sysout See process stderr at: /x1/jenkins/jenkins-slave/workspace/Lucene-Solr-Tests-7.x/solr/build/solr-core/test/temp/junit4-J1-20180127_152615_911628447201174378206.syserr
   [junit4] 	at com.carrotsearch.ant.tasks.junit4.JUnit4.executeSlave(JUnit4.java:1519)
   [junit4] 	at com.carrotsearch.ant.tasks.junit4.JUnit4.access$000(JUnit4.java:126)
   [junit4] 	at com.carrotsearch.ant.tasks.junit4.JUnit4$2.call(JUnit4.java:982)
   [junit4] 	at com.carrotsearch.ant.tasks.junit4.JUnit4$2.call(JUnit4.java:979)
   [junit4] 	at java.util.concurrent.FutureTask.run(FutureTask.java:266)
   [junit4] 	at java.util.concurrent.ThreadPoolExecutor.runWorker(ThreadPoolExecutor.java:1149)
   [junit4] 	at java.util.concurrent.ThreadPoolExecutor$Worker.run(ThreadPoolExecutor.java:624)
   [junit4] 	at java.lang.Thread.run(Thread.java:748)

BUILD FAILED
/x1/jenkins/jenkins-slave/workspace/Lucene-Solr-Tests-7.x/build.xml:836: The following error occurred while executing this line:
/x1/jenkins/jenkins-slave/workspace/Lucene-Solr-Tests-7.x/build.xml:780: The following error occurred while executing this line:
/x1/jenkins/jenkins-slave/workspace/Lucene-Solr-Tests-7.x/build.xml:59: The following error occurred while executing this line:
/x1/jenkins/jenkins-slave/workspace/Lucene-Solr-Tests-7.x/solr/build.xml:262: The following error occurred while executing this line:
/x1/jenkins/jenkins-slave/workspace/Lucene-Solr-Tests-7.x/solr/common-build.xml:556: The following error occurred while executing this line:
/x1/jenkins/jenkins-slave/workspace/Lucene-Solr-Tests-7.x/lucene/common-build.xml:1513: The following error occurred while executing this line:
/x1/jenkins/jenkins-slave/workspace/Lucene-Solr-Tests-7.x/lucene/common-build.xml:1038: At least one slave process threw an exception, first: Forked process returned with error code: 1. Very likely a JVM crash.  See process stdout at: /x1/jenkins/jenkins-slave/workspace/Lucene-Solr-Tests-7.x/solr/build/solr-core/test/temp/junit4-J0-20180127_152615_9036502585241868026825.sysout See process stderr at: /x1/jenkins/jenkins-slave/workspace/Lucene-Solr-Tests-7.x/solr/build/solr-core/test/temp/junit4-J0-20180127_152615_9035344044204316037534.syserr

Total time: 501 minutes 11 seconds
Build step 'Invoke Ant' marked build as failure
Archiving artifacts
[Fast Archiver] No artifacts from Lucene-Solr-Tests-7.x #335 to compare, so performing full copy of artifacts
Recording test results
Email was triggered for: Failure - Any
Sending email for trigger: Failure - Any

Mime
View raw message