lucene-dev mailing list archives

Site index · List index
Message view « Date » · « Thread »
Top « Date » · « Thread »
From Policeman Jenkins Server <jenk...@thetaphi.de>
Subject [JENKINS] Lucene-Solr-7.2-Windows (64bit/jdk-9.0.1) - Build # 43 - Still Unstable!
Date Tue, 16 Jan 2018 00:08:24 GMT
Build: https://jenkins.thetaphi.de/job/Lucene-Solr-7.2-Windows/43/
Java: 64bit/jdk-9.0.1 -XX:+UseCompressedOops -XX:+UseParallelGC

3 tests failed.
FAILED:  junit.framework.TestSuite.org.apache.lucene.analysis.miscellaneous.TestWordDelimiterFilter

Error Message:
Could not remove the following files (in the order of attempts):    C:\Users\jenkins\workspace\Lucene-Solr-7.2-Windows\lucene\build\analysis\common\test\J1\temp\lucene.analysis.miscellaneous.TestWordDelimiterFilter_10BAB1866208E05-001\bttc-001: java.nio.file.DirectoryNotEmptyException: C:\Users\jenkins\workspace\Lucene-Solr-7.2-Windows\lucene\build\analysis\common\test\J1\temp\lucene.analysis.miscellaneous.TestWordDelimiterFilter_10BAB1866208E05-001\bttc-001    C:\Users\jenkins\workspace\Lucene-Solr-7.2-Windows\lucene\build\analysis\common\test\J1\temp\lucene.analysis.miscellaneous.TestWordDelimiterFilter_10BAB1866208E05-001\bttc-001\segments_2: java.nio.file.AccessDeniedException: C:\Users\jenkins\workspace\Lucene-Solr-7.2-Windows\lucene\build\analysis\common\test\J1\temp\lucene.analysis.miscellaneous.TestWordDelimiterFilter_10BAB1866208E05-001\bttc-001\segments_2    C:\Users\jenkins\workspace\Lucene-Solr-7.2-Windows\lucene\build\analysis\common\test\J1\temp\lucene.analysis.miscellaneous.TestWordDelimiterFilter_10BAB1866208E05-001: java.nio.file.DirectoryNotEmptyException: C:\Users\jenkins\workspace\Lucene-Solr-7.2-Windows\lucene\build\analysis\common\test\J1\temp\lucene.analysis.miscellaneous.TestWordDelimiterFilter_10BAB1866208E05-001 

Stack Trace:
java.io.IOException: Could not remove the following files (in the order of attempts):
   C:\Users\jenkins\workspace\Lucene-Solr-7.2-Windows\lucene\build\analysis\common\test\J1\temp\lucene.analysis.miscellaneous.TestWordDelimiterFilter_10BAB1866208E05-001\bttc-001: java.nio.file.DirectoryNotEmptyException: C:\Users\jenkins\workspace\Lucene-Solr-7.2-Windows\lucene\build\analysis\common\test\J1\temp\lucene.analysis.miscellaneous.TestWordDelimiterFilter_10BAB1866208E05-001\bttc-001
   C:\Users\jenkins\workspace\Lucene-Solr-7.2-Windows\lucene\build\analysis\common\test\J1\temp\lucene.analysis.miscellaneous.TestWordDelimiterFilter_10BAB1866208E05-001\bttc-001\segments_2: java.nio.file.AccessDeniedException: C:\Users\jenkins\workspace\Lucene-Solr-7.2-Windows\lucene\build\analysis\common\test\J1\temp\lucene.analysis.miscellaneous.TestWordDelimiterFilter_10BAB1866208E05-001\bttc-001\segments_2
   C:\Users\jenkins\workspace\Lucene-Solr-7.2-Windows\lucene\build\analysis\common\test\J1\temp\lucene.analysis.miscellaneous.TestWordDelimiterFilter_10BAB1866208E05-001: java.nio.file.DirectoryNotEmptyException: C:\Users\jenkins\workspace\Lucene-Solr-7.2-Windows\lucene\build\analysis\common\test\J1\temp\lucene.analysis.miscellaneous.TestWordDelimiterFilter_10BAB1866208E05-001

	at __randomizedtesting.SeedInfo.seed([10BAB1866208E05]:0)
	at org.apache.lucene.util.IOUtils.rm(IOUtils.java:329)
	at org.apache.lucene.util.TestRuleTemporaryFilesCleanup.afterAlways(TestRuleTemporaryFilesCleanup.java:216)
	at com.carrotsearch.randomizedtesting.rules.TestRuleAdapter$1.afterAlways(TestRuleAdapter.java:31)
	at com.carrotsearch.randomizedtesting.rules.StatementAdapter.evaluate(StatementAdapter.java:43)
	at com.carrotsearch.randomizedtesting.rules.StatementAdapter.evaluate(StatementAdapter.java:36)
	at org.apache.lucene.util.TestRuleAssertionsRequired$1.evaluate(TestRuleAssertionsRequired.java:53)
	at org.apache.lucene.util.TestRuleMarkFailure$1.evaluate(TestRuleMarkFailure.java:47)
	at org.apache.lucene.util.TestRuleIgnoreAfterMaxFailures$1.evaluate(TestRuleIgnoreAfterMaxFailures.java:64)
	at org.apache.lucene.util.TestRuleIgnoreTestSuites$1.evaluate(TestRuleIgnoreTestSuites.java:54)
	at com.carrotsearch.randomizedtesting.rules.StatementAdapter.evaluate(StatementAdapter.java:36)
	at com.carrotsearch.randomizedtesting.ThreadLeakControl$StatementRunner.run(ThreadLeakControl.java:368)
	at java.base/java.lang.Thread.run(Thread.java:844)


FAILED:  junit.framework.TestSuite.org.apache.solr.cloud.TestCloudRecovery

Error Message:
Could not remove the following files (in the order of attempts):    C:\Users\jenkins\workspace\Lucene-Solr-7.2-Windows\solr\build\solr-core\test\J1\temp\solr.cloud.TestCloudRecovery_EDF96C3EC2B0470F-001\tempDir-001\node2\collection1_shard1_replica_n2\data\tlog\tlog.0000000000000000001: java.nio.file.FileSystemException: C:\Users\jenkins\workspace\Lucene-Solr-7.2-Windows\solr\build\solr-core\test\J1\temp\solr.cloud.TestCloudRecovery_EDF96C3EC2B0470F-001\tempDir-001\node2\collection1_shard1_replica_n2\data\tlog\tlog.0000000000000000001: The process cannot access the file because it is being used by another process.     C:\Users\jenkins\workspace\Lucene-Solr-7.2-Windows\solr\build\solr-core\test\J1\temp\solr.cloud.TestCloudRecovery_EDF96C3EC2B0470F-001\tempDir-001\node2\collection1_shard1_replica_n2\data\tlog: java.nio.file.DirectoryNotEmptyException: C:\Users\jenkins\workspace\Lucene-Solr-7.2-Windows\solr\build\solr-core\test\J1\temp\solr.cloud.TestCloudRecovery_EDF96C3EC2B0470F-001\tempDir-001\node2\collection1_shard1_replica_n2\data\tlog    C:\Users\jenkins\workspace\Lucene-Solr-7.2-Windows\solr\build\solr-core\test\J1\temp\solr.cloud.TestCloudRecovery_EDF96C3EC2B0470F-001\tempDir-001\node2\collection1_shard1_replica_n2\data: java.nio.file.DirectoryNotEmptyException: C:\Users\jenkins\workspace\Lucene-Solr-7.2-Windows\solr\build\solr-core\test\J1\temp\solr.cloud.TestCloudRecovery_EDF96C3EC2B0470F-001\tempDir-001\node2\collection1_shard1_replica_n2\data    C:\Users\jenkins\workspace\Lucene-Solr-7.2-Windows\solr\build\solr-core\test\J1\temp\solr.cloud.TestCloudRecovery_EDF96C3EC2B0470F-001\tempDir-001\node2\collection1_shard1_replica_n2: java.nio.file.DirectoryNotEmptyException: C:\Users\jenkins\workspace\Lucene-Solr-7.2-Windows\solr\build\solr-core\test\J1\temp\solr.cloud.TestCloudRecovery_EDF96C3EC2B0470F-001\tempDir-001\node2\collection1_shard1_replica_n2    C:\Users\jenkins\workspace\Lucene-Solr-7.2-Windows\solr\build\solr-core\test\J1\temp\solr.cloud.TestCloudRecovery_EDF96C3EC2B0470F-001\tempDir-001\node2\collection1_shard2_replica_n6\data\tlog\tlog.0000000000000000001: java.nio.file.FileSystemException: C:\Users\jenkins\workspace\Lucene-Solr-7.2-Windows\solr\build\solr-core\test\J1\temp\solr.cloud.TestCloudRecovery_EDF96C3EC2B0470F-001\tempDir-001\node2\collection1_shard2_replica_n6\data\tlog\tlog.0000000000000000001: The process cannot access the file because it is being used by another process.     C:\Users\jenkins\workspace\Lucene-Solr-7.2-Windows\solr\build\solr-core\test\J1\temp\solr.cloud.TestCloudRecovery_EDF96C3EC2B0470F-001\tempDir-001\node2\collection1_shard2_replica_n6\data\tlog: java.nio.file.DirectoryNotEmptyException: C:\Users\jenkins\workspace\Lucene-Solr-7.2-Windows\solr\build\solr-core\test\J1\temp\solr.cloud.TestCloudRecovery_EDF96C3EC2B0470F-001\tempDir-001\node2\collection1_shard2_replica_n6\data\tlog    C:\Users\jenkins\workspace\Lucene-Solr-7.2-Windows\solr\build\solr-core\test\J1\temp\solr.cloud.TestCloudRecovery_EDF96C3EC2B0470F-001\tempDir-001\node2\collection1_shard2_replica_n6\data: java.nio.file.DirectoryNotEmptyException: C:\Users\jenkins\workspace\Lucene-Solr-7.2-Windows\solr\build\solr-core\test\J1\temp\solr.cloud.TestCloudRecovery_EDF96C3EC2B0470F-001\tempDir-001\node2\collection1_shard2_replica_n6\data    C:\Users\jenkins\workspace\Lucene-Solr-7.2-Windows\solr\build\solr-core\test\J1\temp\solr.cloud.TestCloudRecovery_EDF96C3EC2B0470F-001\tempDir-001\node2\collection1_shard2_replica_n6: java.nio.file.DirectoryNotEmptyException: C:\Users\jenkins\workspace\Lucene-Solr-7.2-Windows\solr\build\solr-core\test\J1\temp\solr.cloud.TestCloudRecovery_EDF96C3EC2B0470F-001\tempDir-001\node2\collection1_shard2_replica_n6    C:\Users\jenkins\workspace\Lucene-Solr-7.2-Windows\solr\build\solr-core\test\J1\temp\solr.cloud.TestCloudRecovery_EDF96C3EC2B0470F-001\tempDir-001\node2: java.nio.file.DirectoryNotEmptyException: C:\Users\jenkins\workspace\Lucene-Solr-7.2-Windows\solr\build\solr-core\test\J1\temp\solr.cloud.TestCloudRecovery_EDF96C3EC2B0470F-001\tempDir-001\node2    C:\Users\jenkins\workspace\Lucene-Solr-7.2-Windows\solr\build\solr-core\test\J1\temp\solr.cloud.TestCloudRecovery_EDF96C3EC2B0470F-001\tempDir-001\node1\collection1_shard1_replica_n1\data\tlog\tlog.0000000000000000001: java.nio.file.FileSystemException: C:\Users\jenkins\workspace\Lucene-Solr-7.2-Windows\solr\build\solr-core\test\J1\temp\solr.cloud.TestCloudRecovery_EDF96C3EC2B0470F-001\tempDir-001\node1\collection1_shard1_replica_n1\data\tlog\tlog.0000000000000000001: The process cannot access the file because it is being used by another process.     C:\Users\jenkins\workspace\Lucene-Solr-7.2-Windows\solr\build\solr-core\test\J1\temp\solr.cloud.TestCloudRecovery_EDF96C3EC2B0470F-001\tempDir-001\node1\collection1_shard1_replica_n1\data\tlog: java.nio.file.DirectoryNotEmptyException: C:\Users\jenkins\workspace\Lucene-Solr-7.2-Windows\solr\build\solr-core\test\J1\temp\solr.cloud.TestCloudRecovery_EDF96C3EC2B0470F-001\tempDir-001\node1\collection1_shard1_replica_n1\data\tlog    C:\Users\jenkins\workspace\Lucene-Solr-7.2-Windows\solr\build\solr-core\test\J1\temp\solr.cloud.TestCloudRecovery_EDF96C3EC2B0470F-001\tempDir-001\node1\collection1_shard1_replica_n1\data: java.nio.file.DirectoryNotEmptyException: C:\Users\jenkins\workspace\Lucene-Solr-7.2-Windows\solr\build\solr-core\test\J1\temp\solr.cloud.TestCloudRecovery_EDF96C3EC2B0470F-001\tempDir-001\node1\collection1_shard1_replica_n1\data    C:\Users\jenkins\workspace\Lucene-Solr-7.2-Windows\solr\build\solr-core\test\J1\temp\solr.cloud.TestCloudRecovery_EDF96C3EC2B0470F-001\tempDir-001\node1\collection1_shard1_replica_n1: java.nio.file.DirectoryNotEmptyException: C:\Users\jenkins\workspace\Lucene-Solr-7.2-Windows\solr\build\solr-core\test\J1\temp\solr.cloud.TestCloudRecovery_EDF96C3EC2B0470F-001\tempDir-001\node1\collection1_shard1_replica_n1    C:\Users\jenkins\workspace\Lucene-Solr-7.2-Windows\solr\build\solr-core\test\J1\temp\solr.cloud.TestCloudRecovery_EDF96C3EC2B0470F-001\tempDir-001\node1\collection1_shard2_replica_n4\data\tlog\tlog.0000000000000000001: java.nio.file.FileSystemException: C:\Users\jenkins\workspace\Lucene-Solr-7.2-Windows\solr\build\solr-core\test\J1\temp\solr.cloud.TestCloudRecovery_EDF96C3EC2B0470F-001\tempDir-001\node1\collection1_shard2_replica_n4\data\tlog\tlog.0000000000000000001: The process cannot access the file because it is being used by another process.     C:\Users\jenkins\workspace\Lucene-Solr-7.2-Windows\solr\build\solr-core\test\J1\temp\solr.cloud.TestCloudRecovery_EDF96C3EC2B0470F-001\tempDir-001\node1\collection1_shard2_replica_n4\data\tlog: java.nio.file.DirectoryNotEmptyException: C:\Users\jenkins\workspace\Lucene-Solr-7.2-Windows\solr\build\solr-core\test\J1\temp\solr.cloud.TestCloudRecovery_EDF96C3EC2B0470F-001\tempDir-001\node1\collection1_shard2_replica_n4\data\tlog    C:\Users\jenkins\workspace\Lucene-Solr-7.2-Windows\solr\build\solr-core\test\J1\temp\solr.cloud.TestCloudRecovery_EDF96C3EC2B0470F-001\tempDir-001\node1\collection1_shard2_replica_n4\data: java.nio.file.DirectoryNotEmptyException: C:\Users\jenkins\workspace\Lucene-Solr-7.2-Windows\solr\build\solr-core\test\J1\temp\solr.cloud.TestCloudRecovery_EDF96C3EC2B0470F-001\tempDir-001\node1\collection1_shard2_replica_n4\data    C:\Users\jenkins\workspace\Lucene-Solr-7.2-Windows\solr\build\solr-core\test\J1\temp\solr.cloud.TestCloudRecovery_EDF96C3EC2B0470F-001\tempDir-001\node1\collection1_shard2_replica_n4: java.nio.file.DirectoryNotEmptyException: C:\Users\jenkins\workspace\Lucene-Solr-7.2-Windows\solr\build\solr-core\test\J1\temp\solr.cloud.TestCloudRecovery_EDF96C3EC2B0470F-001\tempDir-001\node1\collection1_shard2_replica_n4    C:\Users\jenkins\workspace\Lucene-Solr-7.2-Windows\solr\build\solr-core\test\J1\temp\solr.cloud.TestCloudRecovery_EDF96C3EC2B0470F-001\tempDir-001\node1: java.nio.file.DirectoryNotEmptyException: C:\Users\jenkins\workspace\Lucene-Solr-7.2-Windows\solr\build\solr-core\test\J1\temp\solr.cloud.TestCloudRecovery_EDF96C3EC2B0470F-001\tempDir-001\node1    C:\Users\jenkins\workspace\Lucene-Solr-7.2-Windows\solr\build\solr-core\test\J1\temp\solr.cloud.TestCloudRecovery_EDF96C3EC2B0470F-001\tempDir-001: java.nio.file.DirectoryNotEmptyException: C:\Users\jenkins\workspace\Lucene-Solr-7.2-Windows\solr\build\solr-core\test\J1\temp\solr.cloud.TestCloudRecovery_EDF96C3EC2B0470F-001\tempDir-001    C:\Users\jenkins\workspace\Lucene-Solr-7.2-Windows\solr\build\solr-core\test\J1\temp\solr.cloud.TestCloudRecovery_EDF96C3EC2B0470F-001: java.nio.file.DirectoryNotEmptyException: C:\Users\jenkins\workspace\Lucene-Solr-7.2-Windows\solr\build\solr-core\test\J1\temp\solr.cloud.TestCloudRecovery_EDF96C3EC2B0470F-001 

Stack Trace:
java.io.IOException: Could not remove the following files (in the order of attempts):
   C:\Users\jenkins\workspace\Lucene-Solr-7.2-Windows\solr\build\solr-core\test\J1\temp\solr.cloud.TestCloudRecovery_EDF96C3EC2B0470F-001\tempDir-001\node2\collection1_shard1_replica_n2\data\tlog\tlog.0000000000000000001: java.nio.file.FileSystemException: C:\Users\jenkins\workspace\Lucene-Solr-7.2-Windows\solr\build\solr-core\test\J1\temp\solr.cloud.TestCloudRecovery_EDF96C3EC2B0470F-001\tempDir-001\node2\collection1_shard1_replica_n2\data\tlog\tlog.0000000000000000001: The process cannot access the file because it is being used by another process.

   C:\Users\jenkins\workspace\Lucene-Solr-7.2-Windows\solr\build\solr-core\test\J1\temp\solr.cloud.TestCloudRecovery_EDF96C3EC2B0470F-001\tempDir-001\node2\collection1_shard1_replica_n2\data\tlog: java.nio.file.DirectoryNotEmptyException: C:\Users\jenkins\workspace\Lucene-Solr-7.2-Windows\solr\build\solr-core\test\J1\temp\solr.cloud.TestCloudRecovery_EDF96C3EC2B0470F-001\tempDir-001\node2\collection1_shard1_replica_n2\data\tlog
   C:\Users\jenkins\workspace\Lucene-Solr-7.2-Windows\solr\build\solr-core\test\J1\temp\solr.cloud.TestCloudRecovery_EDF96C3EC2B0470F-001\tempDir-001\node2\collection1_shard1_replica_n2\data: java.nio.file.DirectoryNotEmptyException: C:\Users\jenkins\workspace\Lucene-Solr-7.2-Windows\solr\build\solr-core\test\J1\temp\solr.cloud.TestCloudRecovery_EDF96C3EC2B0470F-001\tempDir-001\node2\collection1_shard1_replica_n2\data
   C:\Users\jenkins\workspace\Lucene-Solr-7.2-Windows\solr\build\solr-core\test\J1\temp\solr.cloud.TestCloudRecovery_EDF96C3EC2B0470F-001\tempDir-001\node2\collection1_shard1_replica_n2: java.nio.file.DirectoryNotEmptyException: C:\Users\jenkins\workspace\Lucene-Solr-7.2-Windows\solr\build\solr-core\test\J1\temp\solr.cloud.TestCloudRecovery_EDF96C3EC2B0470F-001\tempDir-001\node2\collection1_shard1_replica_n2
   C:\Users\jenkins\workspace\Lucene-Solr-7.2-Windows\solr\build\solr-core\test\J1\temp\solr.cloud.TestCloudRecovery_EDF96C3EC2B0470F-001\tempDir-001\node2\collection1_shard2_replica_n6\data\tlog\tlog.0000000000000000001: java.nio.file.FileSystemException: C:\Users\jenkins\workspace\Lucene-Solr-7.2-Windows\solr\build\solr-core\test\J1\temp\solr.cloud.TestCloudRecovery_EDF96C3EC2B0470F-001\tempDir-001\node2\collection1_shard2_replica_n6\data\tlog\tlog.0000000000000000001: The process cannot access the file because it is being used by another process.

   C:\Users\jenkins\workspace\Lucene-Solr-7.2-Windows\solr\build\solr-core\test\J1\temp\solr.cloud.TestCloudRecovery_EDF96C3EC2B0470F-001\tempDir-001\node2\collection1_shard2_replica_n6\data\tlog: java.nio.file.DirectoryNotEmptyException: C:\Users\jenkins\workspace\Lucene-Solr-7.2-Windows\solr\build\solr-core\test\J1\temp\solr.cloud.TestCloudRecovery_EDF96C3EC2B0470F-001\tempDir-001\node2\collection1_shard2_replica_n6\data\tlog
   C:\Users\jenkins\workspace\Lucene-Solr-7.2-Windows\solr\build\solr-core\test\J1\temp\solr.cloud.TestCloudRecovery_EDF96C3EC2B0470F-001\tempDir-001\node2\collection1_shard2_replica_n6\data: java.nio.file.DirectoryNotEmptyException: C:\Users\jenkins\workspace\Lucene-Solr-7.2-Windows\solr\build\solr-core\test\J1\temp\solr.cloud.TestCloudRecovery_EDF96C3EC2B0470F-001\tempDir-001\node2\collection1_shard2_replica_n6\data
   C:\Users\jenkins\workspace\Lucene-Solr-7.2-Windows\solr\build\solr-core\test\J1\temp\solr.cloud.TestCloudRecovery_EDF96C3EC2B0470F-001\tempDir-001\node2\collection1_shard2_replica_n6: java.nio.file.DirectoryNotEmptyException: C:\Users\jenkins\workspace\Lucene-Solr-7.2-Windows\solr\build\solr-core\test\J1\temp\solr.cloud.TestCloudRecovery_EDF96C3EC2B0470F-001\tempDir-001\node2\collection1_shard2_replica_n6
   C:\Users\jenkins\workspace\Lucene-Solr-7.2-Windows\solr\build\solr-core\test\J1\temp\solr.cloud.TestCloudRecovery_EDF96C3EC2B0470F-001\tempDir-001\node2: java.nio.file.DirectoryNotEmptyException: C:\Users\jenkins\workspace\Lucene-Solr-7.2-Windows\solr\build\solr-core\test\J1\temp\solr.cloud.TestCloudRecovery_EDF96C3EC2B0470F-001\tempDir-001\node2
   C:\Users\jenkins\workspace\Lucene-Solr-7.2-Windows\solr\build\solr-core\test\J1\temp\solr.cloud.TestCloudRecovery_EDF96C3EC2B0470F-001\tempDir-001\node1\collection1_shard1_replica_n1\data\tlog\tlog.0000000000000000001: java.nio.file.FileSystemException: C:\Users\jenkins\workspace\Lucene-Solr-7.2-Windows\solr\build\solr-core\test\J1\temp\solr.cloud.TestCloudRecovery_EDF96C3EC2B0470F-001\tempDir-001\node1\collection1_shard1_replica_n1\data\tlog\tlog.0000000000000000001: The process cannot access the file because it is being used by another process.

   C:\Users\jenkins\workspace\Lucene-Solr-7.2-Windows\solr\build\solr-core\test\J1\temp\solr.cloud.TestCloudRecovery_EDF96C3EC2B0470F-001\tempDir-001\node1\collection1_shard1_replica_n1\data\tlog: java.nio.file.DirectoryNotEmptyException: C:\Users\jenkins\workspace\Lucene-Solr-7.2-Windows\solr\build\solr-core\test\J1\temp\solr.cloud.TestCloudRecovery_EDF96C3EC2B0470F-001\tempDir-001\node1\collection1_shard1_replica_n1\data\tlog
   C:\Users\jenkins\workspace\Lucene-Solr-7.2-Windows\solr\build\solr-core\test\J1\temp\solr.cloud.TestCloudRecovery_EDF96C3EC2B0470F-001\tempDir-001\node1\collection1_shard1_replica_n1\data: java.nio.file.DirectoryNotEmptyException: C:\Users\jenkins\workspace\Lucene-Solr-7.2-Windows\solr\build\solr-core\test\J1\temp\solr.cloud.TestCloudRecovery_EDF96C3EC2B0470F-001\tempDir-001\node1\collection1_shard1_replica_n1\data
   C:\Users\jenkins\workspace\Lucene-Solr-7.2-Windows\solr\build\solr-core\test\J1\temp\solr.cloud.TestCloudRecovery_EDF96C3EC2B0470F-001\tempDir-001\node1\collection1_shard1_replica_n1: java.nio.file.DirectoryNotEmptyException: C:\Users\jenkins\workspace\Lucene-Solr-7.2-Windows\solr\build\solr-core\test\J1\temp\solr.cloud.TestCloudRecovery_EDF96C3EC2B0470F-001\tempDir-001\node1\collection1_shard1_replica_n1
   C:\Users\jenkins\workspace\Lucene-Solr-7.2-Windows\solr\build\solr-core\test\J1\temp\solr.cloud.TestCloudRecovery_EDF96C3EC2B0470F-001\tempDir-001\node1\collection1_shard2_replica_n4\data\tlog\tlog.0000000000000000001: java.nio.file.FileSystemException: C:\Users\jenkins\workspace\Lucene-Solr-7.2-Windows\solr\build\solr-core\test\J1\temp\solr.cloud.TestCloudRecovery_EDF96C3EC2B0470F-001\tempDir-001\node1\collection1_shard2_replica_n4\data\tlog\tlog.0000000000000000001: The process cannot access the file because it is being used by another process.

   C:\Users\jenkins\workspace\Lucene-Solr-7.2-Windows\solr\build\solr-core\test\J1\temp\solr.cloud.TestCloudRecovery_EDF96C3EC2B0470F-001\tempDir-001\node1\collection1_shard2_replica_n4\data\tlog: java.nio.file.DirectoryNotEmptyException: C:\Users\jenkins\workspace\Lucene-Solr-7.2-Windows\solr\build\solr-core\test\J1\temp\solr.cloud.TestCloudRecovery_EDF96C3EC2B0470F-001\tempDir-001\node1\collection1_shard2_replica_n4\data\tlog
   C:\Users\jenkins\workspace\Lucene-Solr-7.2-Windows\solr\build\solr-core\test\J1\temp\solr.cloud.TestCloudRecovery_EDF96C3EC2B0470F-001\tempDir-001\node1\collection1_shard2_replica_n4\data: java.nio.file.DirectoryNotEmptyException: C:\Users\jenkins\workspace\Lucene-Solr-7.2-Windows\solr\build\solr-core\test\J1\temp\solr.cloud.TestCloudRecovery_EDF96C3EC2B0470F-001\tempDir-001\node1\collection1_shard2_replica_n4\data
   C:\Users\jenkins\workspace\Lucene-Solr-7.2-Windows\solr\build\solr-core\test\J1\temp\solr.cloud.TestCloudRecovery_EDF96C3EC2B0470F-001\tempDir-001\node1\collection1_shard2_replica_n4: java.nio.file.DirectoryNotEmptyException: C:\Users\jenkins\workspace\Lucene-Solr-7.2-Windows\solr\build\solr-core\test\J1\temp\solr.cloud.TestCloudRecovery_EDF96C3EC2B0470F-001\tempDir-001\node1\collection1_shard2_replica_n4
   C:\Users\jenkins\workspace\Lucene-Solr-7.2-Windows\solr\build\solr-core\test\J1\temp\solr.cloud.TestCloudRecovery_EDF96C3EC2B0470F-001\tempDir-001\node1: java.nio.file.DirectoryNotEmptyException: C:\Users\jenkins\workspace\Lucene-Solr-7.2-Windows\solr\build\solr-core\test\J1\temp\solr.cloud.TestCloudRecovery_EDF96C3EC2B0470F-001\tempDir-001\node1
   C:\Users\jenkins\workspace\Lucene-Solr-7.2-Windows\solr\build\solr-core\test\J1\temp\solr.cloud.TestCloudRecovery_EDF96C3EC2B0470F-001\tempDir-001: java.nio.file.DirectoryNotEmptyException: C:\Users\jenkins\workspace\Lucene-Solr-7.2-Windows\solr\build\solr-core\test\J1\temp\solr.cloud.TestCloudRecovery_EDF96C3EC2B0470F-001\tempDir-001
   C:\Users\jenkins\workspace\Lucene-Solr-7.2-Windows\solr\build\solr-core\test\J1\temp\solr.cloud.TestCloudRecovery_EDF96C3EC2B0470F-001: java.nio.file.DirectoryNotEmptyException: C:\Users\jenkins\workspace\Lucene-Solr-7.2-Windows\solr\build\solr-core\test\J1\temp\solr.cloud.TestCloudRecovery_EDF96C3EC2B0470F-001

	at __randomizedtesting.SeedInfo.seed([EDF96C3EC2B0470F]:0)
	at org.apache.lucene.util.IOUtils.rm(IOUtils.java:329)
	at org.apache.lucene.util.TestRuleTemporaryFilesCleanup.afterAlways(TestRuleTemporaryFilesCleanup.java:216)
	at com.carrotsearch.randomizedtesting.rules.TestRuleAdapter$1.afterAlways(TestRuleAdapter.java:31)
	at com.carrotsearch.randomizedtesting.rules.StatementAdapter.evaluate(StatementAdapter.java:43)
	at com.carrotsearch.randomizedtesting.rules.StatementAdapter.evaluate(StatementAdapter.java:36)
	at org.apache.lucene.util.TestRuleAssertionsRequired$1.evaluate(TestRuleAssertionsRequired.java:53)
	at org.apache.lucene.util.TestRuleMarkFailure$1.evaluate(TestRuleMarkFailure.java:47)
	at org.apache.lucene.util.TestRuleIgnoreAfterMaxFailures$1.evaluate(TestRuleIgnoreAfterMaxFailures.java:64)
	at org.apache.lucene.util.TestRuleIgnoreTestSuites$1.evaluate(TestRuleIgnoreTestSuites.java:54)
	at com.carrotsearch.randomizedtesting.rules.StatementAdapter.evaluate(StatementAdapter.java:36)
	at com.carrotsearch.randomizedtesting.ThreadLeakControl$StatementRunner.run(ThreadLeakControl.java:368)
	at java.base/java.lang.Thread.run(Thread.java:844)


FAILED:  junit.framework.TestSuite.org.apache.solr.cloud.ZkCLITest

Error Message:
Could not remove the following files (in the order of attempts):    C:\Users\jenkins\workspace\Lucene-Solr-7.2-Windows\solr\build\solr-core\test\J1\temp\solr.cloud.ZkCLITest_EDF96C3EC2B0470F-001\tempDir-012\collection1: java.nio.file.DirectoryNotEmptyException: C:\Users\jenkins\workspace\Lucene-Solr-7.2-Windows\solr\build\solr-core\test\J1\temp\solr.cloud.ZkCLITest_EDF96C3EC2B0470F-001\tempDir-012\collection1    C:\Users\jenkins\workspace\Lucene-Solr-7.2-Windows\solr\build\solr-core\test\J1\temp\solr.cloud.ZkCLITest_EDF96C3EC2B0470F-001\tempDir-012: java.nio.file.DirectoryNotEmptyException: C:\Users\jenkins\workspace\Lucene-Solr-7.2-Windows\solr\build\solr-core\test\J1\temp\solr.cloud.ZkCLITest_EDF96C3EC2B0470F-001\tempDir-012 

Stack Trace:
java.io.IOException: Could not remove the following files (in the order of attempts):
   C:\Users\jenkins\workspace\Lucene-Solr-7.2-Windows\solr\build\solr-core\test\J1\temp\solr.cloud.ZkCLITest_EDF96C3EC2B0470F-001\tempDir-012\collection1: java.nio.file.DirectoryNotEmptyException: C:\Users\jenkins\workspace\Lucene-Solr-7.2-Windows\solr\build\solr-core\test\J1\temp\solr.cloud.ZkCLITest_EDF96C3EC2B0470F-001\tempDir-012\collection1
   C:\Users\jenkins\workspace\Lucene-Solr-7.2-Windows\solr\build\solr-core\test\J1\temp\solr.cloud.ZkCLITest_EDF96C3EC2B0470F-001\tempDir-012: java.nio.file.DirectoryNotEmptyException: C:\Users\jenkins\workspace\Lucene-Solr-7.2-Windows\solr\build\solr-core\test\J1\temp\solr.cloud.ZkCLITest_EDF96C3EC2B0470F-001\tempDir-012

	at __randomizedtesting.SeedInfo.seed([EDF96C3EC2B0470F]:0)
	at org.apache.lucene.util.IOUtils.rm(IOUtils.java:329)
	at org.apache.lucene.util.TestRuleTemporaryFilesCleanup.afterAlways(TestRuleTemporaryFilesCleanup.java:216)
	at com.carrotsearch.randomizedtesting.rules.TestRuleAdapter$1.afterAlways(TestRuleAdapter.java:31)
	at com.carrotsearch.randomizedtesting.rules.StatementAdapter.evaluate(StatementAdapter.java:43)
	at com.carrotsearch.randomizedtesting.rules.StatementAdapter.evaluate(StatementAdapter.java:36)
	at org.apache.lucene.util.TestRuleAssertionsRequired$1.evaluate(TestRuleAssertionsRequired.java:53)
	at org.apache.lucene.util.TestRuleMarkFailure$1.evaluate(TestRuleMarkFailure.java:47)
	at org.apache.lucene.util.TestRuleIgnoreAfterMaxFailures$1.evaluate(TestRuleIgnoreAfterMaxFailures.java:64)
	at org.apache.lucene.util.TestRuleIgnoreTestSuites$1.evaluate(TestRuleIgnoreTestSuites.java:54)
	at com.carrotsearch.randomizedtesting.rules.StatementAdapter.evaluate(StatementAdapter.java:36)
	at com.carrotsearch.randomizedtesting.ThreadLeakControl$StatementRunner.run(ThreadLeakControl.java:368)
	at java.base/java.lang.Thread.run(Thread.java:844)




Build Log:
[...truncated 2296 lines...]
   [junit4] Suite: org.apache.lucene.analysis.miscellaneous.TestWordDelimiterFilter
   [junit4]   2> NOTE: test params are: codec=Asserting(Lucene70): {dummy=FSTOrd50}, docValues:{}, maxPointsInLeafNode=336, maxMBSortInHeap=7.71990203446254, sim=RandomSimilarity(queryNorm=true): {dummy=DFR GLZ(0.3)}, locale=vo-001, timezone=Atlantic/Reykjavik
   [junit4]   2> NOTE: Windows 10 10.0 amd64/Oracle Corporation 9.0.1 (64-bit)/cpus=3,threads=1,free=174211232,total=225443840
   [junit4]   2> NOTE: All tests run in this JVM: [TestSnowballPorterFilterFactory, TestGreekLowerCaseFilterFactory, TestGalicianMinimalStemFilter, TestWordDelimiterFilter]
   [junit4]   2> NOTE: reproduce with: ant test  -Dtestcase=TestWordDelimiterFilter -Dtests.seed=10BAB1866208E05 -Dtests.slow=true -Dtests.locale=vo-001 -Dtests.timezone=Atlantic/Reykjavik -Dtests.asserts=true -Dtests.file.encoding=ISO-8859-1
   [junit4] ERROR   0.00s J1 | TestWordDelimiterFilter (suite) <<<
   [junit4]    > Throwable #1: java.io.IOException: Could not remove the following files (in the order of attempts):
   [junit4]    >    C:\Users\jenkins\workspace\Lucene-Solr-7.2-Windows\lucene\build\analysis\common\test\J1\temp\lucene.analysis.miscellaneous.TestWordDelimiterFilter_10BAB1866208E05-001\bttc-001: java.nio.file.DirectoryNotEmptyException: C:\Users\jenkins\workspace\Lucene-Solr-7.2-Windows\lucene\build\analysis\common\test\J1\temp\lucene.analysis.miscellaneous.TestWordDelimiterFilter_10BAB1866208E05-001\bttc-001
   [junit4]    >    C:\Users\jenkins\workspace\Lucene-Solr-7.2-Windows\lucene\build\analysis\common\test\J1\temp\lucene.analysis.miscellaneous.TestWordDelimiterFilter_10BAB1866208E05-001\bttc-001\segments_2: java.nio.file.AccessDeniedException: C:\Users\jenkins\workspace\Lucene-Solr-7.2-Windows\lucene\build\analysis\common\test\J1\temp\lucene.analysis.miscellaneous.TestWordDelimiterFilter_10BAB1866208E05-001\bttc-001\segments_2
   [junit4]    >    C:\Users\jenkins\workspace\Lucene-Solr-7.2-Windows\lucene\build\analysis\common\test\J1\temp\lucene.analysis.miscellaneous.TestWordDelimiterFilter_10BAB1866208E05-001: java.nio.file.DirectoryNotEmptyException: C:\Users\jenkins\workspace\Lucene-Solr-7.2-Windows\lucene\build\analysis\common\test\J1\temp\lucene.analysis.miscellaneous.TestWordDelimiterFilter_10BAB1866208E05-001
   [junit4]    > 	at __randomizedtesting.SeedInfo.seed([10BAB1866208E05]:0)
   [junit4]    > 	at org.apache.lucene.util.IOUtils.rm(IOUtils.java:329)
   [junit4]    > 	at java.base/java.lang.Thread.run(Thread.java:844)
   [junit4] Completed [8/284 (1!)] on J1 in 3.93s, 15 tests, 1 error <<< FAILURES!

[...truncated 10557 lines...]
   [junit4] Suite: org.apache.solr.cloud.ZkCLITest
   [junit4]   2> Creating dataDir: C:\Users\jenkins\workspace\Lucene-Solr-7.2-Windows\solr\build\solr-core\test\J1\temp\solr.cloud.ZkCLITest_EDF96C3EC2B0470F-001\init-core-data-001
   [junit4]   2> 1747307 WARN  (SUITE-ZkCLITest-seed#[EDF96C3EC2B0470F]-worker) [    ] o.a.s.SolrTestCaseJ4 startTrackingSearchers: numOpens=529 numCloses=529
   [junit4]   2> 1747307 INFO  (SUITE-ZkCLITest-seed#[EDF96C3EC2B0470F]-worker) [    ] o.a.s.SolrTestCaseJ4 Using PointFields (NUMERIC_POINTS_SYSPROP=true) w/NUMERIC_DOCVALUES_SYSPROP=true
   [junit4]   2> 1747309 INFO  (SUITE-ZkCLITest-seed#[EDF96C3EC2B0470F]-worker) [    ] o.a.s.SolrTestCaseJ4 Randomized ssl (false) and clientAuth (false) via: @org.apache.solr.util.RandomizeSSL(reason="", value=0.0/0.0, ssl=0.0/0.0, clientAuth=0.0/0.0)
   [junit4]   2> 1747309 INFO  (SUITE-ZkCLITest-seed#[EDF96C3EC2B0470F]-worker) [    ] o.a.s.SolrTestCaseJ4 SecureRandom sanity checks: test.solr.allowed.securerandom=null & java.security.egd=file:/dev/./urandom
   [junit4]   2> 1747311 INFO  (TEST-ZkCLITest.testGet-seed#[EDF96C3EC2B0470F]) [    ] o.a.s.SolrTestCaseJ4 ###Starting testGet
   [junit4]   2> 1747311 INFO  (TEST-ZkCLITest.testGet-seed#[EDF96C3EC2B0470F]) [    ] o.a.s.c.ZkCLITest ####SETUP_START testGet
   [junit4]   2> 1747423 INFO  (TEST-ZkCLITest.testGet-seed#[EDF96C3EC2B0470F]) [    ] o.a.s.c.ZkCLITest ZooKeeper dataDir:C:\Users\jenkins\workspace\Lucene-Solr-7.2-Windows\solr\build\solr-core\test\J1\temp\solr.cloud.ZkCLITest_EDF96C3EC2B0470F-001\tempDir-002\zookeeper/server1/data
   [junit4]   2> 1747423 INFO  (TEST-ZkCLITest.testGet-seed#[EDF96C3EC2B0470F]) [    ] o.a.s.c.ZkTestServer STARTING ZK TEST SERVER
   [junit4]   2> 1747424 INFO  (Thread-3394) [    ] o.a.s.c.ZkTestServer client port:0.0.0.0/0.0.0.0:0
   [junit4]   2> 1747424 INFO  (Thread-3394) [    ] o.a.s.c.ZkTestServer Starting server
   [junit4]   2> 1747431 ERROR (Thread-3394) [    ] o.a.z.s.ZooKeeperServer ZKShutdownHandler is not registered, so ZooKeeper server won't take any action on ERROR or SHUTDOWN server state changes
   [junit4]   2> 1747524 INFO  (TEST-ZkCLITest.testGet-seed#[EDF96C3EC2B0470F]) [    ] o.a.s.c.ZkTestServer start zk server on port:51050
   [junit4]   2> 1747531 INFO  (zkConnectionManagerCallback-3602-thread-1) [    ] o.a.s.c.c.ConnectionManager zkClient has connected
   [junit4]   2> 1747536 INFO  (zkConnectionManagerCallback-3604-thread-1) [    ] o.a.s.c.c.ConnectionManager zkClient has connected
   [junit4]   2> 1747536 INFO  (TEST-ZkCLITest.testGet-seed#[EDF96C3EC2B0470F]) [    ] o.a.s.c.ZkCLITest ####SETUP_END testGet
   [junit4]   2> 1747546 INFO  (zkConnectionManagerCallback-3606-thread-1) [    ] o.a.s.c.c.ConnectionManager zkClient has connected
   [junit4]   1> getNode-data
   [junit4]   2> 1747550 WARN  (NIOServerCxn.Factory:0.0.0.0/0.0.0.0:0) [    ] o.a.z.s.NIOServerCnxn caught end of stream exception
   [junit4]   2> EndOfStreamException: Unable to read additional data from client sessionid 0x160fc267d930002, likely client has closed socket
   [junit4]   2> 	at org.apache.zookeeper.server.NIOServerCnxn.doIO(NIOServerCnxn.java:239)
   [junit4]   2> 	at org.apache.zookeeper.server.NIOServerCnxnFactory.run(NIOServerCnxnFactory.java:203)
   [junit4]   2> 	at java.base/java.lang.Thread.run(Thread.java:844)
   [junit4]   2> 1747550 ERROR (TEST-ZkCLITest.testGet-seed#[EDF96C3EC2B0470F]) [    ] o.a.z.s.ZooKeeperServer ZKShutdownHandler is not registered, so ZooKeeper server won't take any action on ERROR or SHUTDOWN server state changes
   [junit4]   2> 1747551 INFO  (TEST-ZkCLITest.testGet-seed#[EDF96C3EC2B0470F]) [    ] o.a.s.c.ZkTestServer connecting to 127.0.0.1:51050 51050
   [junit4]   2> 1747552 INFO  (Thread-3394) [    ] o.a.s.c.ZkTestServer connecting to 127.0.0.1:51050 51050
   [junit4]   2> 1747554 INFO  (TEST-ZkCLITest.testGet-seed#[EDF96C3EC2B0470F]) [    ] o.a.s.SolrTestCaseJ4 ###Ending testGet
   [junit4]   2> 1747557 INFO  (TEST-ZkCLITest.testPut-seed#[EDF96C3EC2B0470F]) [    ] o.a.s.SolrTestCaseJ4 ###Starting testPut
   [junit4]   2> 1747557 INFO  (TEST-ZkCLITest.testPut-seed#[EDF96C3EC2B0470F]) [    ] o.a.s.c.ZkCLITest ####SETUP_START testPut
   [junit4]   2> 1747658 INFO  (TEST-ZkCLITest.testPut-seed#[EDF96C3EC2B0470F]) [    ] o.a.s.c.ZkCLITest ZooKeeper dataDir:C:\Users\jenkins\workspace\Lucene-Solr-7.2-Windows\solr\build\solr-core\test\J1\temp\solr.cloud.ZkCLITest_EDF96C3EC2B0470F-001\tempDir-004\zookeeper/server1/data
   [junit4]   2> 1747658 INFO  (TEST-ZkCLITest.testPut-seed#[EDF96C3EC2B0470F]) [    ] o.a.s.c.ZkTestServer STARTING ZK TEST SERVER
   [junit4]   2> 1747658 INFO  (Thread-3395) [    ] o.a.s.c.ZkTestServer client port:0.0.0.0/0.0.0.0:0
   [junit4]   2> 1747659 INFO  (Thread-3395) [    ] o.a.s.c.ZkTestServer Starting server
   [junit4]   2> 1747664 ERROR (Thread-3395) [    ] o.a.z.s.ZooKeeperServer ZKShutdownHandler is not registered, so ZooKeeper server won't take any action on ERROR or SHUTDOWN server state changes
   [junit4]   2> 1747759 INFO  (TEST-ZkCLITest.testPut-seed#[EDF96C3EC2B0470F]) [    ] o.a.s.c.ZkTestServer start zk server on port:51062
   [junit4]   2> 1747768 INFO  (zkConnectionManagerCallback-3608-thread-1) [    ] o.a.s.c.c.ConnectionManager zkClient has connected
   [junit4]   2> 1747771 WARN  (NIOServerCxn.Factory:0.0.0.0/0.0.0.0:0) [    ] o.a.z.s.NIOServerCnxn caught end of stream exception
   [junit4]   2> EndOfStreamException: Unable to read additional data from client sessionid 0x160fc267e7e0000, likely client has closed socket
   [junit4]   2> 	at org.apache.zookeeper.server.NIOServerCnxn.doIO(NIOServerCnxn.java:239)
   [junit4]   2> 	at org.apache.zookeeper.server.NIOServerCnxnFactory.run(NIOServerCnxnFactory.java:203)
   [junit4]   2> 	at java.base/java.lang.Thread.run(Thread.java:844)
   [junit4]   2> 1747778 INFO  (zkConnectionManagerCallback-3610-thread-1) [    ] o.a.s.c.c.ConnectionManager zkClient has connected
   [junit4]   2> 1747779 INFO  (TEST-ZkCLITest.testPut-seed#[EDF96C3EC2B0470F]) [    ] o.a.s.c.ZkCLITest ####SETUP_END testPut
   [junit4]   2> 1747787 INFO  (zkConnectionManagerCallback-3612-thread-1) [    ] o.a.s.c.c.ConnectionManager zkClient has connected
   [junit4]   2> 1747944 INFO  (zkConnectionManagerCallback-3614-thread-1) [    ] o.a.s.c.c.ConnectionManager zkClient has connected
   [junit4]   2> 1747946 WARN  (NIOServerCxn.Factory:0.0.0.0/0.0.0.0:0) [    ] o.a.z.s.NIOServerCnxn caught end of stream exception
   [junit4]   2> EndOfStreamException: Unable to read additional data from client sessionid 0x160fc267e7e0003, likely client has closed socket
   [junit4]   2> 	at org.apache.zookeeper.server.NIOServerCnxn.doIO(NIOServerCnxn.java:239)
   [junit4]   2> 	at org.apache.zookeeper.server.NIOServerCnxnFactory.run(NIOServerCnxnFactory.java:203)
   [junit4]   2> 	at java.base/java.lang.Thread.run(Thread.java:844)
   [junit4]   2> 1747947 ERROR (TEST-ZkCLITest.testPut-seed#[EDF96C3EC2B0470F]) [    ] o.a.z.s.ZooKeeperServer ZKShutdownHandler is not registered, so ZooKeeper server won't take any action on ERROR or SHUTDOWN server state changes
   [junit4]   2> 1747948 INFO  (TEST-ZkCLITest.testPut-seed#[EDF96C3EC2B0470F]) [    ] o.a.s.c.ZkTestServer connecting to 127.0.0.1:51062 51062
   [junit4]   2> 1747949 INFO  (Thread-3395) [    ] o.a.s.c.ZkTestServer connecting to 127.0.0.1:51062 51062
   [junit4]   2> 1747950 INFO  (TEST-ZkCLITest.testPut-seed#[EDF96C3EC2B0470F]) [    ] o.a.s.SolrTestCaseJ4 ###Ending testPut
   [junit4]   2> 1747954 INFO  (TEST-ZkCLITest.testUpConfigLinkConfigClearZk-seed#[EDF96C3EC2B0470F]) [    ] o.a.s.SolrTestCaseJ4 ###Starting testUpConfigLinkConfigClearZk
   [junit4]   2> 1747954 INFO  (TEST-ZkCLITest.testUpConfigLinkConfigClearZk-seed#[EDF96C3EC2B0470F]) [    ] o.a.s.c.ZkCLITest ####SETUP_START testUpConfigLinkConfigClearZk
   [junit4]   2> 1748078 INFO  (TEST-ZkCLITest.testUpConfigLinkConfigClearZk-seed#[EDF96C3EC2B0470F]) [    ] o.a.s.c.ZkCLITest ZooKeeper dataDir:C:\Users\jenkins\workspace\Lucene-Solr-7.2-Windows\solr\build\solr-core\test\J1\temp\solr.cloud.ZkCLITest_EDF96C3EC2B0470F-001\tempDir-006\zookeeper/server1/data
   [junit4]   2> 1748079 INFO  (TEST-ZkCLITest.testUpConfigLinkConfigClearZk-seed#[EDF96C3EC2B0470F]) [    ] o.a.s.c.ZkTestServer STARTING ZK TEST SERVER
   [junit4]   2> 1748079 INFO  (Thread-3396) [    ] o.a.s.c.ZkTestServer client port:0.0.0.0/0.0.0.0:0
   [junit4]   2> 1748079 INFO  (Thread-3396) [    ] o.a.s.c.ZkTestServer Starting server
   [junit4]   2> 1748084 ERROR (Thread-3396) [    ] o.a.z.s.ZooKeeperServer ZKShutdownHandler is not registered, so ZooKeeper server won't take any action on ERROR or SHUTDOWN server state changes
   [junit4]   2> 1748179 INFO  (TEST-ZkCLITest.testUpConfigLinkConfigClearZk-seed#[EDF96C3EC2B0470F]) [    ] o.a.s.c.ZkTestServer start zk server on port:51078
   [junit4]   2> 1748213 INFO  (zkConnectionManagerCallback-3616-thread-1) [    ] o.a.s.c.c.ConnectionManager zkClient has connected
   [junit4]   2> 1748234 INFO  (zkConnectionManagerCallback-3618-thread-1) [    ] o.a.s.c.c.ConnectionManager zkClient has connected
   [junit4]   2> 1748234 INFO  (TEST-ZkCLITest.testUpConfigLinkConfigClearZk-seed#[EDF96C3EC2B0470F]) [    ] o.a.s.c.ZkCLITest ####SETUP_END testUpConfigLinkConfigClearZk
   [junit4]   2> 1748239 INFO  (zkConnectionManagerCallback-3620-thread-1) [    ] o.a.s.c.c.ConnectionManager zkClient has connected
   [junit4]   2> 1748243 INFO  (zkConnectionManagerCallback-3622-thread-1) [    ] o.a.s.c.c.ConnectionManager zkClient has connected
   [junit4]   2> 1748666 INFO  (zkConnectionManagerCallback-3624-thread-1) [    ] o.a.s.c.c.ConnectionManager zkClient has connected
   [junit4]   2> 1748679 INFO  (zkConnectionManagerCallback-3626-thread-1) [    ] o.a.s.c.c.ConnectionManager zkClient has connected
   [junit4]   2> 1748682 INFO  (TEST-ZkCLITest.testUpConfigLinkConfigClearZk-seed#[EDF96C3EC2B0470F]) [    ] o.a.s.c.c.ZkMaintenanceUtils Writing file C:\Users\jenkins\workspace\Lucene-Solr-7.2-Windows\solr\build\solr-core\test\J1\temp\solr.cloud.ZkCLITest_EDF96C3EC2B0470F-001\tempDir-007\solrtest-confdropspot-org.apache.solr.cloud.ZkCLITest-263832141952609\currency.xml
   [junit4]   2> 1748717 INFO  (TEST-ZkCLITest.testUpConfigLinkConfigClearZk-seed#[EDF96C3EC2B0470F]) [    ] o.a.s.c.c.ZkMaintenanceUtils Writing file C:\Users\jenkins\workspace\Lucene-Solr-7.2-Windows\solr\build\solr-core\test\J1\temp\solr.cloud.ZkCLITest_EDF96C3EC2B0470F-001\tempDir-007\solrtest-confdropspot-org.apache.solr.cloud.ZkCLITest-263832141952609\mapping-FoldToASCII.txt
   [junit4]   2> 1748719 INFO  (TEST-ZkCLITest.testUpConfigLinkConfigClearZk-seed#[EDF96C3EC2B0470F]) [    ] o.a.s.c.c.ZkMaintenanceUtils Writing file C:\Users\jenkins\workspace\Lucene-Solr-7.2-Windows\solr\build\solr-core\test\J1\temp\solr.cloud.ZkCLITest_EDF96C3EC2B0470F-001\tempDir-007\solrtest-confdropspot-org.apache.solr.cloud.ZkCLITest-263832141952609\managed-schema
   [junit4]   2> 1748721 INFO  (TEST-ZkCLITest.testUpConfigLinkConfigClearZk-seed#[EDF96C3EC2B0470F]) [    ] o.a.s.c.c.ZkMaintenanceUtils Writing file C:\Users\jenkins\workspace\Lucene-Solr-7.2-Windows\solr\build\solr-core\test\J1\temp\solr.cloud.ZkCLITest_EDF96C3EC2B0470F-001\tempDir-007\solrtest-confdropspot-org.apache.solr.cloud.ZkCLITest-263832141952609\protwords.txt
   [junit4]   2> 1748722 INFO  (TEST-ZkCLITest.testUpConfigLinkConfigClearZk-seed#[EDF96C3EC2B0470F]) [    ] o.a.s.c.c.ZkMaintenanceUtils Writing file C:\Users\jenkins\workspace\Lucene-Solr-7.2-Windows\solr\build\solr-core\test\J1\temp\solr.cloud.ZkCLITest_EDF96C3EC2B0470F-001\tempDir-007\solrtest-confdropspot-org.apache.solr.cloud.ZkCLITest-263832141952609\synonyms.txt
   [junit4]   2> 1748723 INFO  (TEST-ZkCLITest.testUpConfigLinkConfigClearZk-seed#[EDF96C3EC2B0470F]) [    ] o.a.s.c.c.ZkMaintenanceUtils Writing file C:\Users\jenkins\workspace\Lucene-Solr-7.2-Windows\solr\build\solr-core\test\J1\temp\solr.cloud.ZkCLITest_EDF96C3EC2B0470F-001\tempDir-007\solrtest-confdropspot-org.apache.solr.cloud.ZkCLITest-263832141952609\stopwords.txt
   [junit4]   2> 1748727 INFO  (TEST-ZkCLITest.testUpConfigLinkConfigClearZk-seed#[EDF96C3EC2B0470F]) [    ] o.a.s.c.c.ZkMaintenanceUtils Writing file C:\Users\jenkins\workspace\Lucene-Solr-7.2-Windows\solr\build\solr-core\test\J1\temp\solr.cloud.ZkCLITest_EDF96C3EC2B0470F-001\tempDir-007\solrtest-confdropspot-org.apache.solr.cloud.ZkCLITest-263832141952609\velocity\hit_grouped.vm
   [junit4]   2> 1748729 INFO  (TEST-ZkCLITest.testUpConfigLinkConfigClearZk-seed#[EDF96C3EC2B0470F]) [    ] o.a.s.c.c.ZkMaintenanceUtils Writing file C:\Users\jenkins\workspace\Lucene-Solr-7.2-Windows\solr\build\solr-core\test\J1\temp\solr.cloud.ZkCLITest_EDF96C3EC2B0470F-001\tempDir-007\solrtest-confdropspot-org.apache.solr.cloud.ZkCLITest-263832141952609\velocity\mime_type_lists.vm
   [junit4]   2> 1748732 INFO  (TEST-ZkCLITest.testUpConfigLinkConfigClearZk-seed#[EDF96C3EC2B0470F]) [    ] o.a.s.c.c.ZkMaintenanceUtils Writing file C:\Users\jenkins\workspace\Lucene-Solr-7.2-Windows\solr\build\solr-core\test\J1\temp\solr.cloud.ZkCLITest_EDF96C3EC2B0470F-001\tempDir-007\solrtest-confdropspot-org.apache.solr.cloud.ZkCLITest-263832141952609\velocity\suggest.vm
   [junit4]   2> 1748733 INFO  (TEST-ZkCLITest.testUpConfigLinkConfigClearZk-seed#[EDF96C3EC2B0470F]) [    ] o.a.s.c.c.ZkMaintenanceUtils Writing file C:\Users\jenkins\workspace\Lucene-Solr-7.2-Windows\solr\build\solr-core\test\J1\temp\solr.cloud.ZkCLITest_EDF96C3EC2B0470F-001\tempDir-007\solrtest-confdropspot-org.apache.solr.cloud.ZkCLITest-263832141952609\velocity\hit.vm
   [junit4]   2> 1748736 INFO  (TEST-ZkCLITest.testUpConfigLinkConfigClearZk-seed#[EDF96C3EC2B0470F]) [    ] o.a.s.c.c.ZkMaintenanceUtils Writing file C:\Users\jenkins\workspace\Lucene-Solr-7.2-Windows\solr\build\solr-core\test\J1\temp\solr.cloud.ZkCLITest_EDF96C3EC2B0470F-001\tempDir-007\solrtest-confdropspot-org.apache.solr.cloud.ZkCLITest-263832141952609\velocity\pagination_bottom.vm
   [junit4]   2> 1748741 INFO  (TEST-ZkCLITest.testUpConfigLinkConfigClearZk-seed#[EDF96C3EC2B0470F]) [    ] o.a.s.c.c.ZkMaintenanceUtils Writing file C:\Users\jenkins\workspace\Lucene-Solr-7.2-Windows\solr\build\solr-core\test\J1\temp\solr.cloud.ZkCLITest_EDF96C3EC2B0470F-001\tempDir-007\solrtest-confdropspot-org.apache.solr.cloud.ZkCLITest-263832141952609\velocity\jquery.autocomplete.css
   [junit4]   2> 1748743 INFO  (TEST-ZkCLITest.testUpConfigLinkConfigClearZk-seed#[EDF96C3EC2B0470F]) [    ] o.a.s.c.c.ZkMaintenanceUtils Writing file C:\Users\jenkins\workspace\Lucene-Solr-7.2-Windows\solr\build\solr-core\test\J1\temp\solr.cloud.ZkCLITest_EDF96C3EC2B0470F-001\tempDir-007\solrtest-confdropspot-org.apache.solr.cloud.ZkCLITest-263832141952609\velocity\hit_plain.vm
   [junit4]   2> 1748744 INFO  (TEST-ZkCLITest.testUpConfigLinkConfigClearZk-seed#[EDF96C3EC2B0470F]) [    ] o.a.s.c.c.ZkMaintenanceUtils Writing file C:\Users\jenkins\workspace\Lucene-Solr-7.2-Windows\solr\build\solr-core\test\J1\temp\solr.cloud.ZkCLITest_EDF96C3EC2B0470F-001\tempDir-007\solrtest-confdropspot-org.apache.solr.cloud.ZkCLITest-263832141952609\velocity\product_doc.vm
   [junit4]   2> 1748747 INFO  (TEST-ZkCLITest.testUpConfigLinkConfigClearZk-seed#[EDF96C3EC2B0470F]) [    ] o.a.s.c.c.ZkMaintenanceUtils Writing file C:\Users\jenkins\workspace\Lucene-Solr-7.2-Windows\solr\build\solr-core\test\J1\temp\solr.cloud.ZkCLITest_EDF96C3EC2B0470F-001\tempDir-007\solrtest-confdropspot-org.apache.solr.cloud.ZkCLITest-263832141952609\velocity\query_form.vm
   [junit4]   2> 1748748 INFO  (TEST-ZkCLITest.testUpConfigLinkConfigClearZk-seed#[EDF96C3EC2B0470F]) [    ] o.a.s.c.c.ZkMaintenanceUtils Writing file C:\Users\jenkins\workspace\Lucene-Solr-7.2-Windows\solr\build\solr-core\test\J1\temp\solr.cloud.ZkCLITest_EDF96C3EC2B0470F-001\tempDir-007\solrtest-confdropspot-org.apache.solr.cloud.ZkCLITest-263832141952609\velocity\facet_queries.vm
   [junit4]   2> 1748749 INFO  (TEST-ZkCLITest.testUpConfigLinkConfigClearZk-seed#[EDF96C3EC2B0470F]) [    ] o.a.s.c.c.ZkMaintenanceUtils Writing file C:\Users\jenkins\workspace\Lucene-Solr-7.2-Windows\solr\build\solr-core\test\J1\temp\solr.cloud.ZkCLITest_EDF96C3EC2B0470F-001\tempDir-007\solrtest-confdropspot-org.apache.solr.cloud.ZkCLITest-263832141952609\velocity\debug.vm
   [junit4]   2> 1748752 INFO  (TEST-ZkCLITest.testUpConfigLinkConfigClearZk-seed#[EDF96C3EC2B0470F]) [    ] o.a.s.c.c.ZkMaintenanceUtils Writing file C:\Users\jenkins\workspace\Lucene-Solr-7.2-Windows\solr\build\solr-core\test\J1\temp\solr.cloud.ZkCLITest_EDF96C3EC2B0470F-001\tempDir-007\solrtest-confdropspot-org.apache.solr.cloud.ZkCLITest-263832141952609\velocity\facet_fields.vm
   [junit4]   2> 1748754 INFO  (TEST-ZkCLITest.testUpConfigLinkConfigClearZk-seed#[EDF96C3EC2B0470F]) [    ] o.a.s.c.c.ZkMaintenanceUtils Writing file C:\Users\jenkins\workspace\Lucene-Solr-7.2-Windows\solr\build\solr-core\test\J1\temp\solr.cloud.ZkCLITest_EDF96C3EC2B0470F-001\tempDir-007\solrtest-confdropspot-org.apache.solr.cloud.ZkCLITest-263832141952609\velocity\jquery.autocomplete.js
   [junit4]   2> 1748758 INFO  (TEST-ZkCLITest.testUpConfigLinkConfigClearZk-seed#[EDF96C3EC2B0470F]) [    ] o.a.s.c.c.ZkMaintenanceUtils Writing file C:\Users\jenkins\workspace\Lucene-Solr-7.2-Windows\solr\build\solr-core\test\J1\temp\solr.cloud.ZkCLITest_EDF96C3EC2B0470F-001\tempDir-007\solrtest-confdropspot-org.apache.solr.cloud.ZkCLITest-263832141952609\velocity\results_list.vm
   [junit4]   2> 1748761 INFO  (TEST-ZkCLITest.testUpConfigLinkConfigClearZk-seed#[EDF96C3EC2B0470F]) [    ] o.a.s.c.c.ZkMaintenanceUtils Writing file C:\Users\jenkins\workspace\Lucene-Solr-7.2-Windows\solr\build\solr-core\test\J1\temp\solr.cloud.ZkCLITest_EDF96C3EC2B0470F-001\tempDir-007\solrtest-confdropspot-org.apache.solr.cloud.ZkCLITest-263832141952609\velocity\tabs.vm
   [junit4]   2> 1748763 INFO  (TEST-ZkCLITest.testUpConfigLinkConfigClearZk-seed#[EDF96C3EC2B0470F]) [    ] o.a.s.c.c.ZkMaintenanceUtils Writing file C:\Users\jenkins\workspace\Lucene-Solr-7.2-Windows\solr\build\solr-core\test\J1\temp\solr.cloud.ZkCLITest_EDF96C3EC2B0470F-001\tempDir-007\solrtest-confdropspot-org.apache.solr.cloud.ZkCLITest-263832141952609\velocity\facet_pivot.vm
   [junit4]   2> 1748765 INFO  (TEST-ZkCLITest.testUpConfigLinkConfigClearZk-seed#[EDF96C3EC2B0470F]) [    ] o.a.s.c.c.ZkMaintenanceUtils Writing file C:\Users\jenkins\workspace\Lucene-Solr-7.2-Windows\solr\build\solr-core\test\J1\temp\solr.cloud.ZkCLITest_EDF96C3EC2B0470F-001\tempDir-007\solrtest-confdropspot-org.apache.solr.cloud.ZkCLITest-263832141952609\velocity\did_you_mean.vm
   [junit4]   2> 1748766 INFO  (TEST-ZkCLITest.testUpConfigLinkConfigClearZk-seed#[EDF96C3EC2B0470F]) [    ] o.a.s.c.c.ZkMaintenanceUtils Writing file C:\Users\jenkins\workspace\Lucene-Solr-7.2-Windows\solr\build\solr-core\test\J1\temp\solr.cloud.ZkCLITest_EDF96C3EC2B0470F-001\tempDir-007\solrtest-confdropspot-org.apache.solr.cloud.ZkCLITest-263832141952609\velocity\facets.vm
   [junit4]   2> 1748769 INFO  (TEST-ZkCLITest.testUpConfigLinkConfigClearZk-seed#[EDF96C3EC2B0470F]) [    ] o.a.s.c.c.ZkMaintenanceUtils Writing file C:\Users\jenkins\workspace\Lucene-Solr-7.2-Windows\solr\build\solr-core\test\J1\temp\solr.cloud.ZkCLITest_EDF96C3EC2B0470F-001\tempDir-007\solrtest-confdropspot-org.apache.solr.cloud.ZkCLITest-263832141952609\velocity\join_doc.vm
   [junit4]   2> 1748771 INFO  (TEST-ZkCLITest.testUpConfigLinkConfigClearZk-seed#[EDF96C3EC2B0470F]) [    ] o.a.s.c.c.ZkMaintenanceUtils Writing file C:\Users\jenkins\workspace\Lucene-Solr-7.2-Windows\solr\build\solr-core\test\J1\temp\solr.cloud.ZkCLITest_EDF96C3EC2B0470F-001\tempDir-007\solrtest-confdropspot-org.apache.solr.cloud.ZkCLITest-263832141952609\velocity\footer.vm
   [junit4]   2> 1748773 INFO  (TEST-ZkCLITest.testUpConfigLinkConfigClearZk-seed#[EDF96C3EC2B0470F]) [    ] o.a.s.c.c.ZkMaintenanceUtils Writing file C:\Users\jenkins\workspace\Lucene-Solr-7.2-Windows\solr\build\solr-core\test\J1\temp\solr.cloud.ZkCLITest_EDF96C3EC2B0470F-001\tempDir-007\solrtest-confdropspot-org.apache.solr.cloud.ZkCLITest-263832141952609\velocity\query_spatial.vm
   [junit4]   2> 1748775 INFO  (TEST-ZkCLITest.testUpConfigLinkConfigClearZk-seed#[EDF96C3EC2B0470F]) [    ] o.a.s.c.c.ZkMaintenanceUtils Writing file C:\Users\jenkins\workspace\Lucene-Solr-7.2-Windows\solr\build\solr-core\test\J1\temp\solr.cloud.ZkCLITest_EDF96C3EC2B0470F-001\tempDir-007\solrtest-confdropspot-org.apache.solr.cloud.ZkCLITest-263832141952609\velocity\facet_ranges.vm
   [junit4]   2> 1748776 INFO  (TEST-ZkCLITest.testUpConfigLinkConfigClearZk-seed#[EDF96C3EC2B0470F]) [    ] o.a.s.c.c.ZkMaintenanceUtils Writing file C:\Users\jenkins\workspace\Lucene-Solr-7.2-Windows\solr\build\solr-core\test\J1\temp\solr.cloud.ZkCLITest_EDF96C3EC2B0470F-001\tempDir-007\solrtest-confdropspot-org.apache.solr.cloud.ZkCLITest-263832141952609\velocity\query_group.vm
   [junit4]   2> 1748778 INFO  (TEST-ZkCLITest.testUpConfigLinkConfigClearZk-seed#[EDF96C3EC2B0470F]) [    ] o.a.s.c.c.ZkMaintenanceUtils Writing file C:\Users\jenkins\workspace\Lucene-Solr-7.2-Windows\solr\build\solr-core\test\J1\temp\solr.cloud.ZkCLITest_EDF96C3EC2B0470F-001\tempDir-007\solrtest-confdropspot-org.apache.solr.cloud.ZkCLITest-263832141952609\velocity\head.vm
   [junit4]   2> 1748779 INFO  (TEST-ZkCLITest.testUpConfigLinkConfigClearZk-seed#[EDF96C3EC2B0470F]) [    ] o.a.s.c.c.ZkMaintenanceUtils Writing file C:\Users\jenkins\workspace\Lucene-Solr-7.2-Windows\solr\build\solr-core\test\J1\temp\solr.cloud.ZkCLITest_EDF96C3EC2B0470F-001\tempDir-007\solrtest-confdropspot-org.apache.solr.cloud.ZkCLITest-263832141952609\velocity\main.css
   [junit4]   2> 1748780 INFO  (TEST-ZkCLITest.testUpConfigLinkConfigClearZk-seed#[EDF96C3EC2B0470F]) [    ] o.a.s.c.c.ZkMaintenanceUtils Writing file C:\Users\jenkins\workspace\Lucene-Solr-7.2-Windows\solr\build\solr-core\test\J1\temp\solr.cloud.ZkCLITest_EDF96C3EC2B0470F-001\tempDir-007\solrtest-confdropspot-org.apache.solr.cloud.ZkCLITest-263832141952609\velocity\pagination_top.vm
   [junit4]   2> 1748781 INFO  (TEST-ZkCLITest.testUpConfigLinkConfigClearZk-seed#[EDF96C3EC2B0470F]) [    ] o.a.s.c.c.ZkMaintenanceUtils Writing file C:\Users\jenkins\workspace\Lucene-Solr-7.2-Windows\solr\build\solr-core\test\J1\temp\solr.cloud.ZkCLITest_EDF96C3EC2B0470F-001\tempDir-007\solrtest-confdropspot-org.apache.solr.cloud.ZkCLITest-263832141952609\velocity\README.txt
   [junit4]   2> 1748783 INFO  (TEST-ZkCLITest.testUpConfigLinkConfigClearZk-seed#[EDF96C3EC2B0470F]) [    ] o.a.s.c.c.ZkMaintenanceUtils Writing file C:\Users\jenkins\workspace\Lucene-Solr-7.2-Windows\solr\build\solr-core\test\J1\temp\solr.cloud.ZkCLITest_EDF96C3EC2B0470F-001\tempDir-007\solrtest-confdropspot-org.apache.solr.cloud.ZkCLITest-263832141952609\velocity\cluster_results.vm
   [junit4]   2> 1748784 INFO  (TEST-ZkCLITest.testUpConfigLinkConfigClearZk-seed#[EDF96C3EC2B0470F]) [    ] o.a.s.c.c.ZkMaintenanceUtils Writing file C:\Users\jenkins\workspace\Lucene-Solr-7.2-Windows\solr\build\solr-core\test\J1\temp\solr.cloud.ZkCLITest_EDF96C3EC2B0470F-001\tempDir-007\solrtest-confdropspot-org.apache.solr.cloud.ZkCLITest-263832141952609\velocity\query.vm
   [junit4]   2> 1748786 INFO  (TEST-ZkCLITest.testUpConfigLinkConfigClearZk-seed#[EDF96C3EC2B0470F]) [    ] o.a.s.c.c.ZkMaintenanceUtils Writing file C:\Users\jenkins\workspace\Lucene-Solr-7.2-Windows\solr\build\solr-core\test\J1\temp\solr.cloud.ZkCLITest_EDF96C3EC2B0470F-001\tempDir-007\solrtest-confdropspot-org.apache.solr.cloud.ZkCLITest-263832141952609\velocity\layout.vm
   [junit4]   2> 1748787 INFO  (TEST-ZkCLITest.testUpConfigLinkConfigClearZk-seed#[EDF96C3EC2B0470F]) [    ] o.a.s.c.c.ZkMaintenanceUtils Writing file C:\Users\jenkins\workspace\Lucene-Solr-7.2-Windows\solr\build\solr-core\test\J1\temp\solr.cloud.ZkCLITest_EDF96C3EC2B0470F-001\tempDir-007\solrtest-confdropspot-org.apache.solr.cloud.ZkCLITest-263832141952609\velocity\error.vm
   [junit4]   2> 1748790 INFO  (TEST-ZkCLITest.testUpConfigLinkConfigClearZk-seed#[EDF96C3EC2B0470F]) [    ] o.a.s.c.c.ZkMaintenanceUtils Writing file C:\Users\jenkins\workspace\Lucene-Solr-7.2-Windows\solr\build\solr-core\test\J1\temp\solr.cloud.ZkCLITest_EDF96C3EC2B0470F-001\tempDir-007\solrtest-confdropspot-org.apache.solr.cloud.ZkCLITest-263832141952609\velocity\header.vm
   [junit4]   2> 1748791 INFO  (TEST-ZkCLITest.testUpConfigLinkConfigClearZk-seed#[EDF96C3EC2B0470F]) [    ] o.a.s.c.c.ZkMaintenanceUtils Writing file C:\Users\jenkins\workspace\Lucene-Solr-7.2-Windows\solr\build\solr-core\test\J1\temp\solr.cloud.ZkCLITest_EDF96C3EC2B0470F-001\tempDir-007\solrtest-confdropspot-org.apache.solr.cloud.ZkCLITest-263832141952609\velocity\VM_global_library.vm
   [junit4]   2> 1748792 INFO  (TEST-ZkCLITest.testUpConfigLinkConfigClearZk-seed#[EDF96C3EC2B0470F]) [    ] o.a.s.c.c.ZkMaintenanceUtils Writing file C:\Users\jenkins\workspace\Lucene-Solr-7.2-Windows\solr\build\solr-core\test\J1\temp\solr.cloud.ZkCLITest_EDF96C3EC2B0470F-001\tempDir-007\solrtest-confdropspot-org.apache.solr.cloud.ZkCLITest-263832141952609\velocity\cluster.vm
   [junit4]   2> 1748794 INFO  (TEST-ZkCLITest.testUpConfigLinkConfigClearZk-seed#[EDF96C3EC2B0470F]) [    ] o.a.s.c.c.ZkMaintenanceUtils Writing file C:\Users\jenkins\workspace\Lucene-Solr-7.2-Windows\solr\build\solr-core\test\J1\temp\solr.cloud.ZkCLITest_EDF96C3EC2B0470F-001\tempDir-007\solrtest-confdropspot-org.apache.solr.cloud.ZkCLITest-263832141952609\velocity\richtext_doc.vm
   [junit4]   2> 1748795 INFO  (TEST-ZkCLITest.testUpConfigLinkConfigClearZk-seed#[EDF96C3EC2B0470F]) [    ] o.a.s.c.c.ZkMaintenanceUtils Writing file C:\Users\jenkins\workspace\Lucene-Solr-7.2-Windows\solr\build\solr-core\test\J1\temp\solr.cloud.ZkCLITest_EDF96C3EC2B0470F-001\tempDir-007\solrtest-confdropspot-org.apache.solr.cloud.ZkCLITest-263832141952609\velocity\browse.vm
   [junit4]   2> 1748796 INFO  (TEST-ZkCLITest.testUpConfigLinkConfigClearZk-seed#[EDF96C3EC2B0470F]) [    ] o.a.s.c.c.ZkMaintenanceUtils Writing file C:\Users\jenkins\workspace\Lucene-Solr-7.2-Windows\solr\build\solr-core\test\J1\temp\solr.cloud.ZkCLITest_EDF96C3EC2B0470F-001\tempDir-007\solrtest-confdropspot-org.apache.solr.cloud.ZkCLITest-263832141952609\_schema_analysis_synonyms_english.json
   [junit4]   2> 1748797 INFO  (TEST-ZkCLITest.testUpConfigLinkConfigClearZk-seed#[EDF96C3EC2B0470F]) [    ] o.a.s.c.c.ZkMaintenanceUtils Writing file C:\Users\jenkins\workspace\Lucene-Solr-7.2-Windows\solr\build\solr-core\test\J1\temp\solr.cloud.ZkCLITest_EDF96C3EC2B0470F-001\tempDir-007\solrtest-confdropspot-org.apache.solr.cloud.ZkCLITest-263832141952609\admin-extra.html
   [junit4]   2> 1748798 INFO  (TEST-ZkCLITest.testUpConfigLinkConfigClearZk-seed#[EDF96C3EC2B0470F]) [    ] o.a.s.c.c.ZkMaintenanceUtils Writing file C:\Users\jenkins\workspace\Lucene-Solr-7.2-Windows\solr\build\solr-core\test\J1\temp\solr.cloud.ZkCLITest_EDF96C3EC2B0470F-001\tempDir-007\solrtest-confdropspot-org.apache.solr.cloud.ZkCLITest-263832141952609\update-script.js
   [junit4]   2> 1748799 INFO  (TEST-ZkCLITest.testUpConfigLinkConfigClearZk-seed#[EDF96C3EC2B0470F]) [    ] o.a.s.c.c.ZkMaintenanceUtils Writing file C:\Users\jenkins\workspace\Lucene-Solr-7.2-Windows\solr\build\solr-core\test\J1\temp\solr.cloud.ZkCLITest_EDF96C3EC2B0470F-001\tempDir-007\solrtest-confdropspot-org.apache.solr.cloud.ZkCLITest-263832141952609\_schema_analysis_stopwords_english.json
   [junit4]   2> 1748802 INFO  (TEST-ZkCLITest.testUpConfigLinkConfigClearZk-seed#[EDF96C3EC2B0470F]) [    ] o.a.s.c.c.ZkMaintenanceUtils Writing file C:\Users\jenkins\workspace\Lucene-Solr-7.2-Windows\solr\build\solr-core\test\J1\temp\solr.cloud.ZkCLITest_EDF96C3EC2B0470F-001\tempDir-007\solrtest-confdropspot-org.apache.solr.cloud.ZkCLITest-263832141952609\solrconfig.xml
   [junit4]   2> 1748803 INFO  (TEST-ZkCLITest.testUpConfigLinkConfigClearZk-seed#[EDF96C3EC2B0470F]) [    ] o.a.s.c.c.ZkMaintenanceUtils Writing file C:\Users\jenkins\workspace\Lucene-Solr-7.2-Windows\solr\build\solr-core\test\J1\temp\solr.cloud.ZkCLITest_EDF96C3EC2B0470F-001\tempDir-007\solrtest-confdropspot-org.apache.solr.cloud.ZkCLITest-263832141952609\admin-extra.menu-top.html
   [junit4]   2> 1748804 INFO  (TEST-ZkCLITest.testUpConfigLinkConfigClearZk-seed#[EDF96C3EC2B0470F]) [    ] o.a.s.c.c.ZkMaintenanceUtils Writing file C:\Users\jenkins\workspace\Lucene-Solr-7.2-Windows\solr\build\solr-core\test\J1\temp\solr.cloud.ZkCLITest_EDF96C3EC2B0470F-001\tempDir-007\solrtest-confdropspot-org.apache.solr.cloud.ZkCLITest-263832141952609\elevate.xml
   [junit4]   2> 1748809 INFO  (TEST-ZkCLITest.testUpConfigLinkConfigClearZk-seed#[EDF96C3EC2B0470F]) [    ] o.a.s.c.c.ZkMaintenanceUtils Writing file C:\Users\jenkins\workspace\Lucene-Solr-7.2-Windows\solr\build\solr-core\test\J1\temp\solr.cloud.ZkCLITest_EDF96C3EC2B0470F-001\tempDir-007\solrtest-confdropspot-org.apache.solr.cloud.ZkCLITest-263832141952609\clustering\carrot2\README.txt
   [junit4]   2> 1748810 INFO  (TEST-ZkCLITest.testUpConfigLinkConfigClearZk-seed#[EDF96C3EC2B0470F]) [    ] o.a.s.c.c.ZkMaintenanceUtils Writing file C:\Users\jenkins\workspace\Lucene-Solr-7.2-Windows\solr\build\solr-core\test\J1\temp\solr.cloud.ZkCLITest_EDF96C3EC2B0470F-001\tempDir-007\solrtest-confdropspot-org.apache.solr.cloud.ZkCLITest-263832141952609\clustering\carrot2\lingo-attributes.xml
   [junit4]   2> 1748812 INFO  (TEST-ZkCLITest.testUpConfigLinkConfigClearZk-seed#[EDF96C3EC2B0470F]) [    ] o.a.s.c.c.ZkMaintenanceUtils Writing file C:\Users\jenkins\workspace\Lucene-Solr-7.2-Windows\solr\build\solr-core\test\J1\temp\solr.cloud.ZkCLITest_EDF96C3EC2B0470F-001\tempDir-007\solrtest-confdropspot-org.apache.solr.cloud.ZkCLITest-263832141952609\clustering\carrot2\stc-attributes.xml
   [junit4]   2> 1748814 INFO  (TEST-ZkCLITest.testUpConfigLinkConfigClearZk-seed#[EDF96C3EC2B0470F]) [    ] o.a.s.c.c.ZkMaintenanceUtils Writing file C:\Users\jenkins\workspace\Lucene-Solr-7.2-Windows\solr\build\solr-core\test\J1\temp\solr.cloud.ZkCLITest_EDF96C3EC2B0470F-001\tempDir-007\solrtest-confdropspot-org.apache.solr.cloud.ZkCLITest-263832141952609\clustering\carrot2\kmeans-attributes.xml
   [junit4]   2> 1748817 INFO  (TEST-ZkCLITest.testUpConfigLinkConfigClearZk-seed#[EDF96C3EC2B0470F]) [    ] o.a.s.c.c.ZkMaintenanceUtils Writing file C:\Users\jenkins\workspace\Lucene-Solr-7.2-Windows\solr\build\solr-core\test\J1\temp\solr.cloud.ZkCLITest_EDF96C3EC2B0470F-001\tempDir-007\solrtest-confdropspot-org.apache.solr.cloud.ZkCLITest-263832141952609\mapping-ISOLatin1Accent.txt
   [junit4]   2> 1748820 INFO  (TEST-ZkCLITest.testUpConfigLinkConfigClearZk-seed#[EDF96C3EC2B0470F]) [    ] o.a.s.c.c.ZkMaintenanceUtils Writing file C:\Users\jenkins\workspace\Lucene-Solr-7.2-Windows\solr\build\solr-core\test\J1\temp\solr.cloud.ZkCLITest_EDF96C3EC2B0470F-001\tempDir-007\solrtest-confdropspot-org.apache.solr.cloud.ZkCLITest-263832141952609\spellings.txt
   [junit4]   2> 1748824 INFO  (TEST-ZkCLITest.testUpConfigLinkConfigClearZk-seed#[EDF96C3EC2B0470F]) [    ] o.a.s.c.c.ZkMaintenanceUtils Writing file C:\Users\jenkins\workspace\Lucene-Solr-7.2-Windows\solr\build\solr-core\test\J1\temp\solr.cloud.ZkCLITest_EDF96C3EC2B0470F-001\tempDir-007\solrtest-confdropspot-org.apache.solr.cloud.ZkCLITest-263832141952609\xslt\example_atom.xsl
   [junit4]   2> 1748827 INFO  (TEST-ZkCLITest.testUpConfigLinkConfigClearZk-seed#[EDF96C3EC2B0470F]) [    ] o.a.s.c.c.ZkMaintenanceUtils Writing file C:\Users\jenkins\workspace\Lucene-Solr-7.2-Windows\solr\build\solr-core\test\J1\temp\solr.cloud.ZkCLITest_EDF96C3EC2B0470F-001\tempDir-007\solrtest-confdropspot-org.apache.solr.cloud.ZkCLITest-263832141952609\xslt\example_rss.xsl
   [junit4]   2> 1748828 INFO  (TEST-ZkCLITest.testUpConfigLinkConfigClearZk-seed#[EDF96C3EC2B0470F]) [    ] o.a.s.c.c.ZkMaintenanceUtils Writing file C:\Users\jenkins\workspace\Lucene-Solr-7.2-Windows\solr\build\solr-core\test\J1\temp\solr.cloud.ZkCLITest_EDF96C3EC2B0470F-001\tempDir-007\solrtest-confdropspot-org.apache.solr.cloud.ZkCLITest-263832141952609\xslt\luke.xsl
   [junit4]   2> 1748829 INFO  (TEST-ZkCLITest.testUpConfigLinkConfigClearZk-seed#[EDF96C3EC2B0470F]) [    ] o.a.s.c.c.ZkMaintenanceUtils Writing file C:\Users\jenkins\workspace\Lucene-Solr-7.2-Windows\solr\build\solr-core\test\J1\temp\solr.cloud.ZkCLITest_EDF96C3EC2B0470F-001\tempDir-007\solrtest-confdropspot-org.apache.solr.cloud.ZkCLITest-263832141952609\xslt\updateXml.xsl
   [junit4]   2> 1748849 INFO  (TEST-ZkCLITest.testUpConfigLinkConfigClearZk-seed#[EDF96C3EC2B0470F]) [    ] o.a.s.c.c.ZkMaintenanceUtils Writing file C:\Users\jenkins\workspace\Lucene-Solr-7.2-Windows\solr\build\solr-core\test\J1\temp\solr.cloud.ZkCLITest_EDF96C3EC2B0470F-001\tempDir-007\solrtest-confdropspot-org.apache.solr.cloud.ZkCLITest-263832141952609\xslt\example.xsl
   [junit4]   2> 1748850 INFO  (TEST-ZkCLITest.testUpConfigLinkConfigClearZk-seed#[EDF96C3EC2B0470F]) [    ] o.a.s.c.c.ZkMaintenanceUtils Writing file C:\Users\jenkins\workspace\Lucene-Solr-7.2-Windows\solr\build\solr-core\test\J1\temp\solr.cloud.ZkCLITest_EDF96C3EC2B0470F-001\tempDir-007\solrtest-confdropspot-org.apache.solr.cloud.ZkCLITest-263832141952609\_rest_managed.json
   [junit4]   2> 1748852 INFO  (TEST-ZkCLITest.testUpConfigLinkConfigClearZk-seed#[EDF96C3EC2B0470F]) [    ] o.a.s.c.c.ZkMaintenanceUtils Writing file C:\Users\jenkins\workspace\Lucene-Solr-7.2-Windows\solr\build\solr-core\test\J1\temp\solr.cloud.ZkCLITest_EDF96C3EC2B0470F-001\tempDir-007\solrtest-confdropspot-org.apache.solr.cloud.ZkCLITest-263832141952609\lang\contractions_it.txt
   [junit4]   2> 1748853 INFO  (TEST-ZkCLITest.testUpConfigLinkConfigClearZk-seed#[EDF96C3EC2B0470F]) [    ] o.a.s.c.c.ZkMaintenanceUtils Writing file C:\Users\jenkins\workspace\Lucene-Solr-7.2-Windows\solr\build\solr-core\test\J1\temp\solr.cloud.ZkCLITest_EDF96C3EC2B0470F-001\tempDir-007\solrtest-confdropspot-org.apache.solr.cloud.ZkCLITest-263832141952609\lang\contractions_ca.txt
   [junit4]   2> 1748854 INFO  (TEST-ZkCLITest.testUpConfigLinkConfigClearZk-seed#[EDF96C3EC2B0470F]) [    ] o.a.s.c.c.ZkMaintenanceUtils Writing file C:\Users\jenkins\workspace\Lucene-Solr-7.2-Windows\solr\build\solr-core\test\J1\temp\solr.cloud.ZkCLITest_EDF96C3EC2B0470F-001\tempDir-007\solrtest-confdropspot-org.apache.solr.cloud.ZkCLITest-263832141952609\lang\stemdict_nl.txt
   [junit4]   2> 1748855 INFO  (TEST-ZkCLITest.testUpConfigLinkConfigClearZk-seed#[EDF96C3EC2B0470F]) [    ] o.a.s.c.c.ZkMaintenanceUtils Writing file C:\Users\jenkins\workspace\Lucene-Solr-7.2-Windows\solr\build\solr-core\test\J1\temp\solr.cloud.ZkCLITest_EDF96C3EC2B0470F-001\tempDir-007\solrtest-confdropspot-org.apache.solr.cloud.ZkCLITest-263832141952609\lang\stopwords_hy.txt
   [junit4]   2> 1748858 INFO  (TEST-ZkCLITest.testUpConfigLinkConfigClearZk-seed#[EDF96C3EC2B0470F]) [    ] o.a.s.c.c.ZkMaintenanceUtils Writing file C:\Users\jenkins\workspace\Lucene-Solr-7.2-Windows\solr\build\solr-core\test\J1\temp\solr.cloud.ZkCLITest_EDF96C3EC2B0470F-001\tempDir-007\solrtest-confdropspot-org.apache.solr.cloud.ZkCLITest-263832141952609\lang\stopwords_no.txt
   [junit4]   2> 1748861 INFO  (TEST-ZkCLITest.testUpConfigLinkConfigClearZk-seed#[EDF96C3EC2B0470F]) [    ] o.a.s.c.c.ZkMaintenanceUtils Writing file C:\Users\jenkins\workspace\Lucene-Solr-7.2-Windows\solr\build\solr-core\test\J1\temp\solr.cloud.ZkCLITest_EDF96C3EC2B0470F-001\tempDir-007\solrtest-confdropspot-org.apache.solr.cloud.ZkCLITest-263832141952609\lang\stopwords_id.txt
   [junit4]   2> 1748863 INFO  (TEST-ZkCLITest.testUpConfigLinkConfigClearZk-seed#[EDF96C3EC2B0470F]) [    ] o.a.s.c.c.ZkMaintenanceUtils Writing file C:\Users\jenkins\workspace\Lucene-Solr-7.2-Windows\solr\build\solr-core\test\J1\temp\solr.cloud.ZkCLITest_EDF96C3EC2B0470F-001\tempDir-007\solrtest-confdropspot-org.apache.solr.cloud.ZkCLITest-263832141952609\lang\stopwords_da.txt
   [junit4]   2> 1748865 INFO  (TEST-ZkCLITest.testUpConfigLinkConfigClearZk-seed#[EDF96C3EC2B0470F]) [    ] o.a.s.c.c.ZkMaintenanceUtils Writing file C:\Users\jenkins\workspace\Lucene-Solr-7.2-Windows\solr\build\solr-core\test\J1\temp\solr.cloud.ZkCLITest_EDF96C3EC2B0470F-001\tempDir-007\solrtest-confdropspot-org.apache.solr.cloud.ZkCLITest-263832141952609\lang\stopwords_ga.txt
   [junit4]   2> 1748866 INFO  (TEST-ZkCLITest.testUpConfigLinkConfigClearZk-seed#[EDF96C3EC2B0470F]) [    ] o.a.s.c.c.ZkMaintenanceUtils Writing file C:\Users\jenkins\workspace\Lucene-Solr-7.2-Windows\solr\build\solr-core\test\J1\temp\solr.cloud.ZkCLITest_EDF96C3EC2B0470F-001\tempDir-007\solrtest-confdropspot-org.apache.solr.cloud.ZkCLITest-263832141952609\lang\stopwords_hi.txt
   [junit4]   2> 1748868 INFO  (TEST-ZkCLITest.testUpConfigLinkConfigClearZk-seed#[EDF96C3EC2B0470F]) [    ] o.a.s.c.c.ZkMaintenanceUtils Writing file C:\Users\jenkins\workspace\Lucene-Solr-7.2-Windows\solr\build\solr-core\test\J1\temp\solr.cloud.ZkCLITest_EDF96C3EC2B0470F-001\tempDir-007\solrtest-confdropspot-org.apache.solr.cloud.ZkCLITest-263832141952609\lang\stopwords_ja.txt
   [junit4]   2> 1748869 INFO  (TEST-ZkCLITest.testUpConfigLinkConfigClearZk-seed#[EDF96C3EC2B0470F]) [    ] o.a.s.c.c.ZkMaintenanceUtils Writing file C:\Users\jenkins\workspace\Lucene-Solr-7.2-Windows\solr\build\solr-core\test\J1\temp\solr.cloud.ZkCLITest_EDF96C3EC2B0470F-001\tempDir-007\solrtest-confdropspot-org.apache.solr.cloud.ZkCLITest-263832141952609\lang\stopwords_pt.txt
   [junit4]   2> 1748871 INFO  (TEST-ZkCLITest.testUpConfigLinkConfigClearZk-seed#[EDF96C3EC2B0470F]) [    ] o.a.s.c.c.ZkMaintenanceUtils Writing file C:\Users\jenkins\workspace\Lucene-Solr-7.2-Windows\solr\build\solr-core\test\J1\temp\solr.cloud.ZkCLITest_EDF96C3EC2B0470F-001\tempDir-007\solrtest-confdropspot-org.apache.solr.cloud.ZkCLITest-263832141952609\lang\stopwords_hu.txt
   [junit4]   2> 1748873 INFO  (TEST-ZkCLITest.testUpConfigLinkConfigClearZk-seed#[EDF96C3EC2B0470F]) [    ] o.a.s.c.c.ZkMaintenanceUtils Writing file C:\Users\jenkins\workspace\Lucene-Solr-7.2-Windows\solr\build\solr-core\test\J1\temp\solr.cloud.ZkCLITest_EDF96C3EC2B0470F-001\tempDir-007\solrtest-confdropspot-org.apache.solr.cloud.ZkCLITest-263832141952609\lang\stopwords_ckb.txt
   [junit4]   2> 1748874 INFO  (TEST-ZkCLITest.testUpConfigLinkConfigClearZk-seed#[EDF96C3EC2B0470F]) [    ] o.a.s.c.c.ZkMaintenanceUtils Writing file C:\Users\jenkins\workspace\Lucene-Solr-7.2-Windows\solr\build\solr-core\test\J1\temp\solr.cloud.ZkCLITest_EDF96C3EC2B0470F-001\tempDir-007\solrtest-confdropspot-org.apache.solr.cloud.ZkCLITest-263832141952609\lang\stopwords_el.txt
   [junit4]   2> 1748875 INFO  (TEST-ZkCLITest.testUpConfigLinkConfigClearZk-seed#[EDF96C3EC2B0470F]) [    ] o.a.s.c.c.ZkMaintenanceUtils Writing file C:\Users\jenkins\workspace\Lucene-Solr-7.2-Windows\solr\build\solr-core\test\J1\temp\solr.cloud.ZkCLITest_EDF96C3EC2B0470F-001\tempDir-007\solrtest-confdropspot-org.apache.solr.cloud.ZkCLITest-263832141952609\lang\stopwords_ru.txt
   [junit4]   2> 1748887 INFO  (TEST-ZkCLITest.testUpConfigLinkConfigClearZk-seed#[EDF96C3EC2B0470F]) [    ] o.a.s.c.c.ZkMaintenanceUtils Writing file C:\Users\jenkins\workspace\Lucene-Solr-7.2-Windows\solr\build\solr-core\test\J1\temp\solr.cloud.ZkCLITest_EDF96C3EC2B0470F-001\tempDir-007\solrtest-confdropspot-org.apache.solr.cloud.ZkCLITest-263832141952609\lang\stopwords_tr.txt
   [junit4]   2> 1748887 INFO  (TEST-ZkCLITest.testUpConfigLinkConfigClearZk-seed#[EDF96C3EC2B0470F]) [    ] o.a.s.c.c.ZkMaintenanceUtils Writing file C:\Users\jenkins\workspace\Lucene-Solr-7.2-Windows\solr\build\solr-core\test\J1\temp\solr.cloud.ZkCLITest_EDF96C3EC2B0470F-001\tempDir-007\solrtest-confdropspot-org.apache.solr.cloud.ZkCLITest-263832141952609\lang\stopwords_ar.txt
   [junit4]   2> 1748890 INFO  (TEST-ZkCLITest.testUpConfigLinkConfigClearZk-seed#[EDF96C3EC2B0470F]) [    ] o.a.s.c.c.ZkMaintenanceUtils Writing file C:\Users\jenkins\workspace\Lucene-Solr-7.2-Windows\solr\build\solr-core\test\J1\temp\solr.cloud.ZkCLITest_EDF96C3EC2B0470F-001\tempDir-007\solrtest-confdropspot-org.apache.solr.cloud.ZkCLITest-263832141952609\lang\userdict_ja.txt
   [junit4]   2> 1748896 INFO  (TEST-ZkCLITest.testUpConfigLinkConfigClearZk-seed#[EDF96C3EC2B0470F]) [    ] o.a.s.c.c.ZkMaintenanceUtils Writing file C:\Users\jenkins\workspace\Lucene-Solr-7.2-Windows\solr\build\solr-core\test\J1\temp\solr.cloud.ZkCLITest_EDF96C3EC2B0470F-001\tempDir-007\solrtest-confdropspot-org.apache.solr.cloud.ZkCLITest-263832141952609\lang\stopwords_eu.txt
   [junit4]   2> 1748904 INFO  (TEST-ZkCLITest.testUpConfigLinkConfigClearZk-seed#[EDF96C3EC2B0470F]) [    ] o.a.s.c.c.ZkMaintenanceUtils Writing file C:\Users\jenkins\workspace\Lucene-Solr-7.2-Windows\solr\build\solr-core\test\J1\temp\solr.cloud.ZkCLITest_EDF96C3EC2B0470F-001\tempDir-007\solrtest-confdropspot-org.apache.solr.cloud.ZkCLITest-263832141952609\lang\stopwords_it.txt
   [junit4]   2> 1748908 INFO  (TEST-ZkCLITest.testUpConfigLinkConfigClearZk-seed#[EDF96C3EC2B0470F]) [    ] o.a.s.c.c.ZkMaintenanceUtils Writing file C:\Users\jenkins\workspace\Lucene-Solr-7.2-Windows\solr\build\solr-core\test\J1\temp\solr.cloud.ZkCLITest_EDF96C3EC2B0470F-001\tempDir-007\solrtest-confdropspot-org.apache.solr.cloud.ZkCLITest-263832141952609\lang\stopwords_cz.txt
   [junit4]   2> 1748910 INFO  (TEST-ZkCLITest.testUpConfigLinkConfigClearZk-seed#[EDF96C3EC2B0470F]) [    ] o.a.s.c.c.ZkMaintenanceUtils Writing file C:\Users\jenkins\workspace\Lucene-Solr-7.2-Windows\solr\build\solr-core\test\J1\temp\solr.cloud.ZkCLITest_EDF96C3EC2B0470F-001\tempDir-007\solrtest-confdropspot-org.apache.solr.cloud.ZkCLITest-263832141952609\lang\stoptags_ja.txt
   [junit4]   2> 1748912 INFO  (TEST-ZkCLITest.testUpConfigLinkConfigClearZk-seed#[EDF96C3EC2B0470F]) [    ] o.a.s.c.c.ZkMaintenanceUtils Writing file C:\Users\jenkins\workspace\Lucene-Solr-7.2-Windows\solr\build\solr-core\test\J1\temp\solr.cloud.ZkCLITest_EDF96C3EC2B0470F-001\tempDir-007\solrtest-confdropspot-org.apache.solr.cloud.ZkCLITest-263832141952609\lang\contractions_fr.txt
   [junit4]   2> 1748913 INFO  (TEST-ZkCLITest.testUpConfigLinkConfigClearZk-seed#[EDF96C3EC2B0470F]) [    ] o.a.s.c.c.ZkMaintenanceUtils Writing file C:\Users\jenkins\workspace\Lucene-Solr-7.2-Windows\solr\build\solr-core\test\J1\temp\solr.cloud.ZkCLITest_EDF96C3EC2B0470F-001\tempDir-007\solrtest-confdropspot-org.apache.solr.cloud.ZkCLITest-263832141952609\lang\stopwords_de.txt
   [junit4]   2> 1748915 INFO  (TEST-ZkCLITest.testUpConfigLinkConfigClearZk-seed#[EDF96C3EC2B0470F]) [    ] o.a.s.c.c.ZkMaintenanceUtils Writing file C:\Users\jenkins\workspace\Lucene-Solr-7.2-Windows\solr\build\solr-core\test\J1\temp\solr.cloud.ZkCLITest_EDF96C3EC2B0470F-001\tempDir-007\solrtest-confdropspot-org.apache.solr.cloud.ZkCLITest-263832141952609\lang\stopwords_fa.txt
   [junit4]   2> 1748918 INFO  (TEST-ZkCLITest.testUpConfigLinkConfigClearZk-seed#[EDF96C3EC2B0470F]) [    ] o.a.s.c.c.ZkMaintenanceUtils Writing file C:\Users\jenkins\workspace\Lucene-Solr-7.2-Windows\solr\build\solr-core\test\J1\temp\solr.cloud.ZkCLITest_EDF96C3EC2B0470F-001\tempDir-007\solrtest-confdropspot-org.apache.solr.cloud.ZkCLITest-263832141952609\lang\contractions_ga.txt
   [junit4]   2> 1748920 INFO  (TEST-ZkCLITest.testUpConfigLinkConfigClearZk-seed#[EDF96C3EC2B0470F]) [    ] o.a.s.c.c.ZkMaintenanceUtils Writing file C:\Users\jenkins\workspace\Lucene-Solr-7.2-Windows\solr\build\solr-core\test\J1\temp\solr.cloud.ZkCLITest_EDF96C3EC2B0470F-001\tempDir-007\solrtest-confdropspot-org.apache.solr.cloud.ZkCLITest-263832141952609\lang\stopwords_ca.txt
   [junit4]   2> 1748921 INFO  (TEST-ZkCLITest.testUpConfigLinkConfigClearZk-seed#[EDF96C3EC2B0470F]) [    ] o.a.s.c.c.ZkMaintenanceUtils Writing file C:\Users\jenkins\workspace\Lucene-Solr-7.2-Windows\solr\build\solr-core\test\J1\temp\solr.cloud.ZkCLITest_EDF96C3EC2B0470F-001\tempDir-007\solrtest-confdropspot-org.apache.solr.cloud.ZkCLITest-263832141952609\lang\stopwords_nl.txt
   [junit4]   2> 1748924 INFO  (TEST-ZkCLITest.testUpConfigLinkConfigClearZk-seed#[EDF96C3EC2B0470F]) [    ] o.a.s.c.c.ZkMaintenanceUtils Writing file C:\Users\jenkins\workspace\Lucene-Solr-7.2-Windows\solr\build\solr-core\test\J1\temp\solr.cloud.ZkCLITest_EDF96C3EC2B0470F-001\tempDir-007\solrtest-confdropspot-org.apache.solr.cloud.ZkCLITest-263832141952609\lang\stopwords_bg.txt
   [junit4]   2> 1748927 INFO  (TEST-ZkCLITest.testUpConfigLinkConfigClearZk-seed#[EDF96C3EC2B0470F]) [    ] o.a.s.c.c.ZkMaintenanceUtils Writing file C:\Users\jenkins\workspace\Lucene-Solr-7.2-Windows\solr\build\solr-core\test\J1\temp\solr.cloud.ZkCLITest_EDF96C3EC2B0470F-001\tempDir-007\solrtest-confdropspot-org.apache.solr.cloud.ZkCLITest-263832141952609\lang\stopwords_en.txt
   [junit4]   2> 1748936 INFO  (TEST-ZkCLITest.testUpConfigLinkConfigClearZk-seed#[EDF96C3EC2B0470F]) [    ] o.a.s.c.c.ZkMaintenanceUtils Writing file C:\Users\jenkins\workspace\Lucene-Solr-7.2-Windows\solr\build\solr-core\test\J1\temp\solr.cloud.ZkCLITest_EDF96C3EC2B0470F-001\tempDir-007\solrtest-confdropspot-org.apache.solr.cloud.ZkCLITest-263832141952609\lang\stopwords_es.txt
   [junit4]   2> 1748937 INFO  (TEST-ZkCLITest.testUpConfigLinkConfigClearZk-seed#[EDF96C3EC2B0470F]) [    ] o.a.s.c.c.ZkMaintenanceUtils Writing file C:\Users\jenkins\workspace\Lucene-Solr-7.2-Windows\solr\build\solr-core\test\J1\temp\solr.cloud.ZkCLITest_EDF96C3EC2B0470F-001\tempDir-007\solrtest-confdropspot-org.apache.solr.cloud.ZkCLITest-263832141952609\lang\stopwords_lv.txt
   [junit4]   2> 1748978 INFO  (TEST-ZkCLITest.testUpConfigLinkConfigClearZk-seed#[EDF96C3EC2B0470F]) [    ] o.a.s.c.c.ZkMaintenanceUtils Writing file C:\Users\jenkins\workspace\Lucene-Solr-7.2-Windows\solr\build\solr-core\test\J1\temp\solr.cloud.ZkCLITest_EDF96C3EC2B0470F-001\tempDir-007\solrtest-confdropspot-org.apache.solr.cloud.ZkCLITest-263832141952609\lang\stopwords_ro.txt
   [junit4]   2> 1748981 INFO  (TEST-ZkCLITest.testUpConfigLinkConfigClearZk-seed#[EDF96C3EC2B0470F]) [    ] o.a.s.c.c.ZkMaintenanceUtils Writing file C:\Users\jenkins\workspace\Lucene-Solr-7.2-Windows\solr\build\solr-core\test\J1\temp\solr.cloud.ZkCLITest_EDF96C3EC2B0470F-001\tempDir-007\solrtest-confdropspot-org.apache.solr.cloud.ZkCLITest-263832141952609\lang\stopwords_th.txt
   [junit4]   2> 1748983 INFO  (TEST-ZkCLITest.testUpConfigLinkConfigClearZk-seed#[EDF96C3EC2B0470F]) [    ] o.a.s.c.c.ZkMaintenanceUtils Writing file C:\Users\jenkins\workspace\Lucene-Solr-7.2-Windows\solr\build\solr-core\test\J1\temp\solr.cloud.ZkCLITest_EDF96C3EC2B0470F-001\tempDir-007\solrtest-confdropspot-org.apache.solr.cloud.ZkCLITest-263832141952609\lang\stopwords_fr.txt
   [junit4]   2> 1748986 INFO  (TEST-ZkCLITest.testUpConfigLinkConfigClearZk-seed#[EDF96C3EC2B0470F]) [    ] o.a.s.c.c.ZkMaintenanceUtils Writing file C:\Users\jenkins\workspace\Lucene-Solr-7.2-Windows\solr\build\solr-core\test\J1\temp\solr.cloud.ZkCLITest_EDF96C3EC2B0470F-001\tempDir-007\solrtest-confdropspot-org.apache.solr.cloud.ZkCLITest-263832141952609\lang\stopwords_sv.txt
   [junit4]   2> 1748988 INFO  (TEST-ZkCLITest.testUpConfigLinkConfigClearZk-seed#[EDF96C3EC2B0470F]) [    ] o.a.s.c.c.ZkMaintenanceUtils Writing file C:\Users\jenkins\workspace\Lucene-Solr-7.2-Windows\solr\build\solr-core\test\J1\temp\solr.cloud.ZkCLITest_EDF96C3EC2B0470F-001\tempDir-007\solrtest-confdropspot-org.apache.solr.cloud.ZkCLITest-263832141952609\lang\stopwords_fi.txt
   [junit4]   2> 1748989 INFO  (TEST-ZkCLITest.testUpConfigLinkConfigClearZk-seed#[EDF96C3EC2B0470F]) [    ] o.a.s.c.c.ZkMaintenanceUtils Writing file C:\Users\jenkins\workspace\Lucene-Solr-7.2-Windows\solr\build\solr-core\test\J1\temp\solr.cloud.ZkCLITest_EDF96C3EC2B0470F-001\tempDir-007\solrtest-confdropspot-org.apache.solr.cloud.ZkCLITest-263832141952609\lang\hyphenations_ga.txt
   [junit4]   2> 1748990 INFO  (TEST-ZkCLITest.testUpConfigLinkConfigClearZk-seed#[EDF96C3EC2B0470F]) [    ] o.a.s.c.c.ZkMaintenanceUtils Writing file C:\Users\jenkins\workspace\Lucene-Solr-7.2-Windows\solr\build\solr-core\test\J1\temp\solr.cloud.ZkCLITest_EDF96C3EC2B0470F-001\tempDir-007\solrtest-confdropspot-org.apache.solr.cloud.ZkCLITest-263832141952609\lang\stopwords_gl.txt
   [junit4]   2> 1748992 INFO  (TEST-ZkCLITest.testUpConfigLinkConfigClearZk-seed#[EDF96C3EC2B0470F]) [    ] o.a.s.c.c.ZkMaintenanceUtils Writing file C:\Users\jenkins\workspace\Lucene-Solr-7.2-Windows\solr\build\solr-core\test\J1\temp\solr.cloud.ZkCLITest_EDF96C3EC2B0470F-001\tempDir-007\solrtest-confdropspot-org.apache.solr.cloud.ZkCLITest-263832141952609\params.json
   [junit4]   2> 1748995 INFO  (TEST-ZkCLITest.testUpConfigLinkConfigClearZk-seed#[EDF96C3EC2B0470F]) [    ] o.a.s.c.c.ZkMaintenanceUtils Writing file C:\Users\jenkins\workspace\Lucene-Solr-7.2-Windows\solr\build\solr-core\test\J1\temp\solr.cloud.ZkCLITest_EDF96C3EC2B0470F-001\tempDir-007\solrtest-confdropspot-org.apache.solr.cloud.ZkCLITest-263832141952609\admin-extra.menu-bottom.html
   [junit4]   2> 1749193 INFO  (zkConnectionManagerCallback-3628-thread-1) [    ] o.a.s.c.c.ConnectionManager zkClient has connected
   [junit4]   2> 1749298 ERROR (TEST-ZkCLITest.testUpConfigLinkConfigClearZk-seed#[EDF96C3EC2B0470F]) [    ] o.a.z.s.ZooKeeperServer ZKShutdownHandler is not registered, so ZooKeeper server won't take any action on ERROR or SHUTDOWN server state changes
   [junit4]   2> 1749298 INFO  (TEST-ZkCLITest.testUpConfigLinkConfigClearZk-seed#[EDF96C3EC2B0470F]) [    ] o.a.s.c.ZkTestServer connecting to 127.0.0.1:51078 51078
   [junit4]   2> 1749298 INFO  (Thread-3396) [    ] o.a.s.c.ZkTestServer connecting to 127.0.0.1:51078 51078
   [junit4]   2> 1749301 INFO  (TEST-ZkCLITest.testUpConfigLinkConfigClearZk-seed#[EDF96C3EC2B0470F]) [    ] o.a.s.SolrTestCaseJ4 ###Ending testUpConfigLinkConfigClearZk
   [junit4]   2> 1749304 INFO  (TEST-ZkCLITest.testList-seed#[EDF96C3EC2B0470F]) [    ] o.a.s.SolrTestCaseJ4 ###Starting testList
   [junit4]   2> 1749304 INFO  (TEST-ZkCLITest.testList-seed#[EDF96C3EC2B0470F]) [    ] o.a.s.c.ZkCLITest ####SETUP_START testList
   [junit4]   2> 1749404 INFO  (TEST-ZkCLITest.testList-seed#[EDF96C3EC2B0470F]) [    ] o.a.s.c.ZkCLITest ZooKeeper dataDir:C:\Users\jenkins\workspace\Lucene-Solr-7.2-Windows\solr\build\solr-core\test\J1\temp\solr.cloud.ZkCLITest_EDF96C3EC2B0470F-001\tempDir-009\zookeeper/server1/data
   [junit4]   2> 1749404 INFO  (TEST-ZkCLITest.testList-seed#[EDF96C3EC2B0470F]) [    ] o.a.s.c.ZkTestServer STARTING ZK TEST SERVER
   [junit4]   2> 1749404 INFO  (Thread-3397) [    ] o.a.s.c.ZkTestServer client port:0.0.0.0/0.0.0.0:0
   [junit4]   2> 1749404 INFO  (Thread-3397) [    ] o.a.s.c.ZkTestServer Starting server
   [junit4]   2> 1749408 ERROR (Thread-3397) [    ] o.a.z.s.ZooKeeperServer ZKShutdownHandler is not registered, so ZooKeeper server won't take any action on ERROR or SHUTDOWN server state changes
   [junit4]   2> 1749566 INFO  (TEST-ZkCLITest.testList-seed#[EDF96C3EC2B0470F]) [    ] o.a.s.c.ZkTestServer start zk server on port:51102
   [junit4]   2> 1749571 INFO  (zkConnectionManagerCallback-3630-thread-1) [    ] o.a.s.c.c.ConnectionManager zkClient has connected
   [junit4]   2> 1749581 WARN  (NIOServerCxn.Factory:0.0.0.0/0.0.0.0:0) [    ] o.a.z.s.NIOServerCnxn caught end of stream exception
   [junit4]   2> EndOfStreamException: Unable to read additional data from client sessionid 0x160fc26854e0000, likely client has closed socket
   [junit4]   2> 	at org.apache.zookeeper.server.NIOServerCnxn.doIO(NIOServerCnxn.java:239)
   [junit4]   2> 	at org.apache.zookeeper.server.NIOServerCnxnFactory.run(NIOServerCnxnFactory.java:203)
   [junit4]   2> 	at java.base/java.lang.Thread.run(Thread.java:844)
   [junit4]   2> 1749585 INFO  (zkConnectionManagerCallback-3632-thread-1) [    ] o.a.s.c.c.ConnectionManager zkClient has connected
   [junit4]   2> 1749585 INFO  (TEST-ZkCLITest.testList-seed#[EDF96C3EC2B0470F]) [    ] o.a.s.c.ZkCLITest ####SETUP_END testList
   [junit4]   2> 1749758 INFO  (zkConnectionManagerCallback-3634-thread-1) [    ] o.a.s.c.c.ConnectionManager zkClient has connected
   [junit4]   2> 1749762 WARN  (NIOServerCxn.Factory:0.0.0.0/0.0.0.0:0) [    ] o.a.z.s.NIOServerCnxn caught end of stream exception
   [junit4]   2> EndOfStreamException: Unable to read additional data from client sessionid 0x160fc26854e0002, likely client has closed socket
   [junit4]   2> 	at org.apache.zookeeper.server.NIOServerCnxn.doIO(NIOServerCnxn.java:239)
   [junit4]   2> 	at org.apache.zookeeper.server.NIOServerCnxnFactory.run(NIOServerCnxnFactory.java:203)
   [junit4]   2> 	at java.base/java.lang.Thread.run(Thread.java:844)
   [junit4]   2> 1749763 WARN  (NIOServerCxn.Factory:0.0.0.0/0.0.0.0:0) [    ] o.a.z.s.NIOServerCnxn caught end of stream exception
   [junit4]   2> EndOfStreamException: Unable to read additional data from client sessionid 0x160fc26854e0001, likely client has closed socket
   [junit4]   2> 	at org.apache.zookeeper.server.NIOServerCnxn.doIO(NIOServerCnxn.java:239)
   [junit4]   2> 	at org.apache.zookeeper.server.NIOServerCnxnFactory.run(NIOServerCnxnFactory.java:203)
   [junit4]   2> 	at java.base/java.lang.Thread.run(Thread.java:844)
   [junit4]   2> 1749763 ERROR (TEST-ZkCLITest.testList-seed#[EDF96C3EC2B0470F]) [    ] o.a.z.s.ZooKeeperServer ZKShutdownHandler is not registered, so ZooKeeper server won't take any action on ERROR or SHUTDOWN server state changes
   [junit4]   2> 1749764 INFO  (TEST-ZkCLITest.testList-seed#[EDF96C3EC2B0470F]) [    ] o.a.s.c.ZkTestServer connecting to 127.0.0.1:51102 51102
   [junit4]   2> 1749765 INFO  (Thread-3397) [    ] o.a.s.c.ZkTestServer connecting to 127.0.0.1:51102 51102
   [junit4]   2> 1749766 INFO  (TEST-ZkCLITest.testList-seed#[EDF96C3EC2B0470F]) [    ] o.a.s.SolrTestCaseJ4 ###Ending testList
   [junit4]   2> 1749768 INFO  (TEST-ZkCLITest.testUpdateAcls-seed#[EDF96C3EC2B0470F]) [    ] o.a.s.SolrTestCaseJ4 ###Starting testUpdateAcls
   [junit4]   2> 1749768 INFO  (TEST-ZkCLITest.testUpdateAcls-seed#[EDF96C3EC2B0470F]) [    ] o.a.s.c.ZkCLITest ####SETUP_START testUpdateAcls
   [junit4]   2> 1749885 INFO  (TEST-ZkCLITest.testUpdateAcls-seed#[EDF96C3EC2B0470F]) [    ] o.a.s.c.ZkCLITest ZooKeeper dataDir:C:\Users\jenkins\workspace\Lucene-Solr-7.2-Windows\solr\build\solr-core\test\J1\temp\solr.cloud.ZkCLITest_EDF96C3EC2B0470F-001\tempDir-011\zookeeper/server1/data
   [junit4]   2> 1749885 INFO  (TEST-ZkCLITest.testUpdateAcls-seed#[EDF96C3EC2B0470F]) [    ] o.a.s.c.ZkTestServer STARTING ZK TEST SERVER
   [junit4]   2> 1749889 INFO  (Thread-3398) [    ] o.a.s.c.ZkTestServer client port:0.0.0.0/0.0.0.0:0
   [junit4]   2> 1749890 INFO  (Thread-3398) [    ] o.a.s.c.ZkTestServer Starting server
   [junit4]   2> 1749894 ERROR (Thread-3398) [    ] o.a.z.s.ZooKeeperServer ZKShutdownHandler is not registered, so ZooKeeper server won't take any action on ERROR or SHUTDOWN server state changes
   [junit4]   2> 1749996 INFO  (TEST-ZkCLITest.testUpdateAcls-seed#[EDF96C3EC2B0470F]) [    ] o.a.s.c.ZkTestServer start zk server on port:51114
   [junit4]   2> 1750047 INFO  (zkConnectionManagerCallback-3636-thread-1) [    ] o.a.s.c.c.ConnectionManager zkClient has connected
   [junit4]   2> 1750057 INFO  (zkConnectionManagerCallback-3638-thread-1) [    ] o.a.s.c.c.ConnectionManager zkClient has connected
   [junit4]   2> 1750057 INFO  (TEST-ZkCLITest.testUpdateAcls-seed#[EDF96C3EC2B0470F]) [    ] o.a.s.c.ZkCLITest ####SETUP_END testUpdateAcls
   [junit4]   2> 1750076 INFO  (zkConnectionManagerCallback-3640-thread-1) [    ] o.a.s.c.c.ConnectionManager zkClient has connected
   [junit4]   2> 1750077 INFO  (TEST-ZkCLITest.testUpdateAcls-seed#[EDF96C3EC2B0470F]) [    ] o.a.s.c.c.SolrZkClient Using ZkACLProvider: org.apache.solr.common.cloud.VMParamsAllAndReadonlyDigestZkACLProvider
   [junit4]   2> 1750094 WARN  (NIOServerCxn.Factory:0.0.0.0/0.0.0.0:0) [    ] o.a.z.s.NIOServerCnxn caught end of stream exception
   [junit4]   2> EndOfStreamException: Unable to read additional data from client sessionid 0x160fc2687340002, likely client has closed socket
   [junit4]   2> 	at org.apache.zookeeper.server.NIOServerCnxn.doIO(NIOServerCnxn.java:239)
   [junit4]   2> 	at org.apache.zookeeper.server.NIOServerCnxnFactory.run(NIOServerCnxnFactory.java:203)
   [junit4]   2> 	at java.base/java.lang.Thread.run(Thread.java:844)
   [junit4]   2> 1750098 INFO  (zkConnectionManagerCallback-3642-thread-1) [    ] o.a.s.c.c.ConnectionManager zkClient has connected
   [junit4]   2> 1750101 ERROR (TEST-ZkCLITest.testUpdateAcls-seed#[EDF96C3EC2B0470F]) [    ] o.a.z.s.ZooKeeperServer ZKShutdownHandler is not registered, so ZooKeeper server won't take any action on ERROR or SHUTDOWN server state changes
   [junit4]   2> 1750102 INFO  (TEST-ZkCLITest.testUpdateAcls-seed#[EDF96C3EC2B0470F]) [    ] o.a.s.c.ZkTestServer connecting to 127.0.0.1:51114 51114
   [junit4]   2> 1750104 INFO  (Thread-3398) [    ] o.a.s.c.ZkTestServer connecting to 127.0.0.1:51114 51114
   [junit4]   2> 1750105 INFO  (TEST-ZkCLITest.testUpdateAcls-seed#[EDF96C3EC2B0470F]) [    ] o.a.s.SolrTestCaseJ4 ###Ending testUpdateAcls
   [junit4]   2> 1750108 INFO  (TEST-ZkCLITest.testSetClusterProperty-seed#[EDF96C3EC2B0470F]) [    ] o.a.s.SolrTestCaseJ4 ###Starting testSetClusterProperty
   [junit4]   2> 1750108 INFO  (TEST-ZkCLITest.testSetClusterProperty-seed#[EDF96C3EC2B0470F]) [    ] o.a.s.c.ZkCLITest ####SETUP_START testSetClusterProperty
   [junit4]   2> 1750222 INFO  (TEST-ZkCLITest.testSetClusterProperty-seed#[EDF96C3EC2B0470F]) [    ] o.a.s.c.ZkCLITest ZooKeeper dataDir:C:\Users\jenkins\workspace\Lucene-Solr-7.2-Windows\solr\build\solr-core\test\J1\temp\solr.cloud.ZkCLITest_EDF96C3EC2B0470F-001\tempDir-013\zookeeper/server1/data
   [junit4]   2> 1750222 INFO  (TEST-ZkCLITest.testSetClusterProperty-seed#[EDF96C3EC2B0470F]) [    ] o.a.s.c.ZkTestServer STARTING ZK TEST SERVER
   [junit4]   2> 1750223 INFO  (Thread-3399) [    ] o.a.s.c.ZkTestServer client port:0.0.0.0/0.0.0.0:0
   [junit4]   2> 1750223 INFO  (Thread-3399) [    ] o.a.s.c.ZkTestServer Starting server
   [junit4]   2> 1750231 ERROR (Thread-3399) [    ] o.a.z.s.ZooKeeperServer ZKShutdownHandler is not registered, so ZooKeeper server won't take any action on ERROR or SHUTDOWN server state changes
   [junit4]   2> 1750323 INFO  (TEST-ZkCLITest.testSetClusterProperty-seed#[EDF96C3EC2B0470F]) [    ] o.a.s.c.ZkTestServer start zk server on port:51129
   [junit4]   2> 1750340 INFO  (zkConnectionManagerCallback-3644-thread-1) [    ] o.a.s.c.c.ConnectionManager zkClient has connected
   [junit4]   2> 1750351 INFO  (zkConnectionManagerCallback-3646-thread-1) [    ] o.a.s.c.c.ConnectionManager zkClient has connected
   [junit4]   2> 1750351 INFO  (TEST-ZkCLITest.testSetClusterProperty-seed#[EDF96C3EC2B0470F]) [    ] o.a.s.c.ZkCLITest ####SETUP_END testSetClusterProperty
   [junit4]   2> 1750357 INFO  (zkConnectionManagerCallback-3648-thread-1) [    ] o.a.s.c.c.ConnectionManager zkClient has connected
   [junit4]   2> 1750374 INFO  (zkConnectionManagerCallback-3650-thread-1) [    ] o.a.s.c.c.ConnectionManager zkClient has connected
   [junit4]   2> 1750381 WARN  (NIOServerCxn.Factory:0.0.0.0/0.0.0.0:0) [    ] o.a.z.s.NIOServerCnxn caught end of stream exception
   [junit4]   2> EndOfStreamException: Unable to read additional data from client sessionid 0x160fc2688830001, likely client has closed socket
   [junit4]   2> 	at org.apache.zookeeper.server.NIOServerCnxn.doIO(NIOServerCnxn.java:239)
   [junit4]   2> 	at org.apache.zookeeper.server.NIOServerCnxnFactory.run(NIOServerCnxnFactory.java:203)
   [junit4]   2> 	at java.base/java.lang.Thread.run(Thread.java:844)
   [junit4]   2> 1750381 ERROR (TEST-ZkCLITest.testSetClusterProperty-seed#[EDF96C3EC2B0470F]) [    ] o.a.z.s.ZooKeeperServer ZKShutdownHandler is not registered, so ZooKeeper server won't take any action on ERROR or SHUTDOWN server state changes
   [junit4]   2> 1750383 INFO  (TEST-ZkCLITest.testSetClusterProperty-seed#[EDF96C3EC2B0470F]) [    ] o.a.s.c.ZkTestServer connecting to 127.0.0.1:51129 51129
   [junit4]   2> 1750384 INFO  (Thread-3399) [    ] o.a.s.c.ZkTestServer connecting to 127.0.0.1:51129 51129
   [junit4]   2> 1750385 INFO  (TEST-ZkCLITest.testSetClusterProperty-seed#[EDF96C3EC2B0470F]) [    ] o.a.s.SolrTestCaseJ4 ###Ending testSetClusterProperty
   [junit4]   2> 1750389 INFO  (TEST-ZkCLITest.testInvalidZKAddress-seed#[EDF96C3EC2B0470F]) [    ] o.a.s.SolrTestCaseJ4 ###Starting testInvalidZKAddress
   [junit4]   2> 1750389 INFO  (TEST-ZkCLITest.testInvalidZKAddress-seed#[EDF96C3EC2B0470F]) [    ] o.a.s.c.ZkCLITest ####SETUP_START testInvalidZKAddress
   [junit4]   2> 1750577 INFO  (TEST-ZkCLITest.testInvalidZKAddress-seed#[EDF96C3EC2B0470F]) [    ] o.a.s.c.ZkCLITest ZooKeeper dataDir:C:\Users\jenkins\workspace\Lucene-Solr-7.2-Windows\solr\build\solr-core\test\J1\temp\solr.cloud.ZkCLITest_EDF96C3EC2B0470F-001\tempDir-015\zookeeper/server1/data
   [junit4]   2> 1750577 INFO  (TEST-ZkCLITest.testInvalidZKAddress-seed#[EDF96C3EC2B0470F]) [    ] o.a.s.c.ZkTestServer STARTING ZK TEST SERVER
   [junit4]   2> 1750581 INFO  (Thread-3400) [    ] o.a.s.c.ZkTestServer client port:0.0.0.0/0.0.0.0:0
   [junit4]   2> 1750581 INFO  (Thread-3400) [    ] o.a.s.c.ZkTestServer Starting server
   [junit4]   2> 1750590 ERROR (Thread-3400) [    ] o.a.z.s.ZooKeeperServer ZKShutdownHandler is not registered, so ZooKeeper server won't take any action on ERROR or SHUTDOWN server state changes
   [junit4]   2> 1750680 INFO  (TEST-ZkCLITest.testInvalidZKAddress-seed#[EDF96C3EC2B0470F]) [    ] o.a.s.c.ZkTestServer start zk server on port:51144
   [junit4]   2> 1750689 INFO  (zkConnectionManagerCallback-3652-thread-1) [    ] o.

[...truncated too long message...]

 DistribCursorPagingTest, LeaderInitiatedRecoveryOnCommitTest, MultiThreadedOCPTest, RemoteQueryErrorTest, ReplaceNodeTest, SSLMigrationTest, SimpleCollectionCreateDeleteTest, SolrCloudExampleTest, TestCloudPseudoReturnFields, TestCloudRecovery]
   [junit4]   2> NOTE: reproduce with: ant test  -Dtestcase=TestCloudRecovery -Dtests.seed=EDF96C3EC2B0470F -Dtests.slow=true -Dtests.locale=ur-PK -Dtests.timezone=Etc/GMT-4 -Dtests.asserts=true -Dtests.file.encoding=US-ASCII
   [junit4] ERROR   0.00s J1 | TestCloudRecovery (suite) <<<
   [junit4]    > Throwable #1: java.io.IOException: Could not remove the following files (in the order of attempts):
   [junit4]    >    C:\Users\jenkins\workspace\Lucene-Solr-7.2-Windows\solr\build\solr-core\test\J1\temp\solr.cloud.TestCloudRecovery_EDF96C3EC2B0470F-001\tempDir-001\node2\collection1_shard1_replica_n2\data\tlog\tlog.0000000000000000001: java.nio.file.FileSystemException: C:\Users\jenkins\workspace\Lucene-Solr-7.2-Windows\solr\build\solr-core\test\J1\temp\solr.cloud.TestCloudRecovery_EDF96C3EC2B0470F-001\tempDir-001\node2\collection1_shard1_replica_n2\data\tlog\tlog.0000000000000000001: The process cannot access the file because it is being used by another process.
   [junit4]    >    C:\Users\jenkins\workspace\Lucene-Solr-7.2-Windows\solr\build\solr-core\test\J1\temp\solr.cloud.TestCloudRecovery_EDF96C3EC2B0470F-001\tempDir-001\node2\collection1_shard1_replica_n2\data\tlog: java.nio.file.DirectoryNotEmptyException: C:\Users\jenkins\workspace\Lucene-Solr-7.2-Windows\solr\build\solr-core\test\J1\temp\solr.cloud.TestCloudRecovery_EDF96C3EC2B0470F-001\tempDir-001\node2\collection1_shard1_replica_n2\data\tlog
   [junit4]    >    C:\Users\jenkins\workspace\Lucene-Solr-7.2-Windows\solr\build\solr-core\test\J1\temp\solr.cloud.TestCloudRecovery_EDF96C3EC2B0470F-001\tempDir-001\node2\collection1_shard1_replica_n2\data: java.nio.file.DirectoryNotEmptyException: C:\Users\jenkins\workspace\Lucene-Solr-7.2-Windows\solr\build\solr-core\test\J1\temp\solr.cloud.TestCloudRecovery_EDF96C3EC2B0470F-001\tempDir-001\node2\collection1_shard1_replica_n2\data
   [junit4]    >    C:\Users\jenkins\workspace\Lucene-Solr-7.2-Windows\solr\build\solr-core\test\J1\temp\solr.cloud.TestCloudRecovery_EDF96C3EC2B0470F-001\tempDir-001\node2\collection1_shard1_replica_n2: java.nio.file.DirectoryNotEmptyException: C:\Users\jenkins\workspace\Lucene-Solr-7.2-Windows\solr\build\solr-core\test\J1\temp\solr.cloud.TestCloudRecovery_EDF96C3EC2B0470F-001\tempDir-001\node2\collection1_shard1_replica_n2
   [junit4]    >    C:\Users\jenkins\workspace\Lucene-Solr-7.2-Windows\solr\build\solr-core\test\J1\temp\solr.cloud.TestCloudRecovery_EDF96C3EC2B0470F-001\tempDir-001\node2\collection1_shard2_replica_n6\data\tlog\tlog.0000000000000000001: java.nio.file.FileSystemException: C:\Users\jenkins\workspace\Lucene-Solr-7.2-Windows\solr\build\solr-core\test\J1\temp\solr.cloud.TestCloudRecovery_EDF96C3EC2B0470F-001\tempDir-001\node2\collection1_shard2_replica_n6\data\tlog\tlog.0000000000000000001: The process cannot access the file because it is being used by another process.
   [junit4]    >    C:\Users\jenkins\workspace\Lucene-Solr-7.2-Windows\solr\build\solr-core\test\J1\temp\solr.cloud.TestCloudRecovery_EDF96C3EC2B0470F-001\tempDir-001\node2\collection1_shard2_replica_n6\data\tlog: java.nio.file.DirectoryNotEmptyException: C:\Users\jenkins\workspace\Lucene-Solr-7.2-Windows\solr\build\solr-core\test\J1\temp\solr.cloud.TestCloudRecovery_EDF96C3EC2B0470F-001\tempDir-001\node2\collection1_shard2_replica_n6\data\tlog
   [junit4]    >    C:\Users\jenkins\workspace\Lucene-Solr-7.2-Windows\solr\build\solr-core\test\J1\temp\solr.cloud.TestCloudRecovery_EDF96C3EC2B0470F-001\tempDir-001\node2\collection1_shard2_replica_n6\data: java.nio.file.DirectoryNotEmptyException: C:\Users\jenkins\workspace\Lucene-Solr-7.2-Windows\solr\build\solr-core\test\J1\temp\solr.cloud.TestCloudRecovery_EDF96C3EC2B0470F-001\tempDir-001\node2\collection1_shard2_replica_n6\data
   [junit4]    >    C:\Users\jenkins\workspace\Lucene-Solr-7.2-Windows\solr\build\solr-core\test\J1\temp\solr.cloud.TestCloudRecovery_EDF96C3EC2B0470F-001\tempDir-001\node2\collection1_shard2_replica_n6: java.nio.file.DirectoryNotEmptyException: C:\Users\jenkins\workspace\Lucene-Solr-7.2-Windows\solr\build\solr-core\test\J1\temp\solr.cloud.TestCloudRecovery_EDF96C3EC2B0470F-001\tempDir-001\node2\collection1_shard2_replica_n6
   [junit4]    >    C:\Users\jenkins\workspace\Lucene-Solr-7.2-Windows\solr\build\solr-core\test\J1\temp\solr.cloud.TestCloudRecovery_EDF96C3EC2B0470F-001\tempDir-001\node2: java.nio.file.DirectoryNotEmptyException: C:\Users\jenkins\workspace\Lucene-Solr-7.2-Windows\solr\build\solr-core\test\J1\temp\solr.cloud.TestCloudRecovery_EDF96C3EC2B0470F-001\tempDir-001\node2
   [junit4]    >    C:\Users\jenkins\workspace\Lucene-Solr-7.2-Windows\solr\build\solr-core\test\J1\temp\solr.cloud.TestCloudRecovery_EDF96C3EC2B0470F-001\tempDir-001\node1\collection1_shard1_replica_n1\data\tlog\tlog.0000000000000000001: java.nio.file.FileSystemException: C:\Users\jenkins\workspace\Lucene-Solr-7.2-Windows\solr\build\solr-core\test\J1\temp\solr.cloud.TestCloudRecovery_EDF96C3EC2B0470F-001\tempDir-001\node1\collection1_shard1_replica_n1\data\tlog\tlog.0000000000000000001: The process cannot access the file because it is being used by another process.
   [junit4]    >    C:\Users\jenkins\workspace\Lucene-Solr-7.2-Windows\solr\build\solr-core\test\J1\temp\solr.cloud.TestCloudRecovery_EDF96C3EC2B0470F-001\tempDir-001\node1\collection1_shard1_replica_n1\data\tlog: java.nio.file.DirectoryNotEmptyException: C:\Users\jenkins\workspace\Lucene-Solr-7.2-Windows\solr\build\solr-core\test\J1\temp\solr.cloud.TestCloudRecovery_EDF96C3EC2B0470F-001\tempDir-001\node1\collection1_shard1_replica_n1\data\tlog
   [junit4]    >    C:\Users\jenkins\workspace\Lucene-Solr-7.2-Windows\solr\build\solr-core\test\J1\temp\solr.cloud.TestCloudRecovery_EDF96C3EC2B0470F-001\tempDir-001\node1\collection1_shard1_replica_n1\data: java.nio.file.DirectoryNotEmptyException: C:\Users\jenkins\workspace\Lucene-Solr-7.2-Windows\solr\build\solr-core\test\J1\temp\solr.cloud.TestCloudRecovery_EDF96C3EC2B0470F-001\tempDir-001\node1\collection1_shard1_replica_n1\data
   [junit4]    >    C:\Users\jenkins\workspace\Lucene-Solr-7.2-Windows\solr\build\solr-core\test\J1\temp\solr.cloud.TestCloudRecovery_EDF96C3EC2B0470F-001\tempDir-001\node1\collection1_shard1_replica_n1: java.nio.file.DirectoryNotEmptyException: C:\Users\jenkins\workspace\Lucene-Solr-7.2-Windows\solr\build\solr-core\test\J1\temp\solr.cloud.TestCloudRecovery_EDF96C3EC2B0470F-001\tempDir-001\node1\collection1_shard1_replica_n1
   [junit4]    >    C:\Users\jenkins\workspace\Lucene-Solr-7.2-Windows\solr\build\solr-core\test\J1\temp\solr.cloud.TestCloudRecovery_EDF96C3EC2B0470F-001\tempDir-001\node1\collection1_shard2_replica_n4\data\tlog\tlog.0000000000000000001: java.nio.file.FileSystemException: C:\Users\jenkins\workspace\Lucene-Solr-7.2-Windows\solr\build\solr-core\test\J1\temp\solr.cloud.TestCloudRecovery_EDF96C3EC2B0470F-001\tempDir-001\node1\collection1_shard2_replica_n4\data\tlog\tlog.0000000000000000001: The process cannot access the file because it is being used by another process.
   [junit4]    >    C:\Users\jenkins\workspace\Lucene-Solr-7.2-Windows\solr\build\solr-core\test\J1\temp\solr.cloud.TestCloudRecovery_EDF96C3EC2B0470F-001\tempDir-001\node1\collection1_shard2_replica_n4\data\tlog: java.nio.file.DirectoryNotEmptyException: C:\Users\jenkins\workspace\Lucene-Solr-7.2-Windows\solr\build\solr-core\test\J1\temp\solr.cloud.TestCloudRecovery_EDF96C3EC2B0470F-001\tempDir-001\node1\collection1_shard2_replica_n4\data\tlog
   [junit4]    >    C:\Users\jenkins\workspace\Lucene-Solr-7.2-Windows\solr\build\solr-core\test\J1\temp\solr.cloud.TestCloudRecovery_EDF96C3EC2B0470F-001\tempDir-001\node1\collection1_shard2_replica_n4\data: java.nio.file.DirectoryNotEmptyException: C:\Users\jenkins\workspace\Lucene-Solr-7.2-Windows\solr\build\solr-core\test\J1\temp\solr.cloud.TestCloudRecovery_EDF96C3EC2B0470F-001\tempDir-001\node1\collection1_shard2_replica_n4\data
   [junit4]    >    C:\Users\jenkins\workspace\Lucene-Solr-7.2-Windows\solr\build\solr-core\test\J1\temp\solr.cloud.TestCloudRecovery_EDF96C3EC2B0470F-001\tempDir-001\node1\collection1_shard2_replica_n4: java.nio.file.DirectoryNotEmptyException: C:\Users\jenkins\workspace\Lucene-Solr-7.2-Windows\solr\build\solr-core\test\J1\temp\solr.cloud.TestCloudRecovery_EDF96C3EC2B0470F-001\tempDir-001\node1\collection1_shard2_replica_n4
   [junit4]    >    C:\Users\jenkins\workspace\Lucene-Solr-7.2-Windows\solr\build\solr-core\test\J1\temp\solr.cloud.TestCloudRecovery_EDF96C3EC2B0470F-001\tempDir-001\node1: java.nio.file.DirectoryNotEmptyException: C:\Users\jenkins\workspace\Lucene-Solr-7.2-Windows\solr\build\solr-core\test\J1\temp\solr.cloud.TestCloudRecovery_EDF96C3EC2B0470F-001\tempDir-001\node1
   [junit4]    >    C:\Users\jenkins\workspace\Lucene-Solr-7.2-Windows\solr\build\solr-core\test\J1\temp\solr.cloud.TestCloudRecovery_EDF96C3EC2B0470F-001\tempDir-001: java.nio.file.DirectoryNotEmptyException: C:\Users\jenkins\workspace\Lucene-Solr-7.2-Windows\solr\build\solr-core\test\J1\temp\solr.cloud.TestCloudRecovery_EDF96C3EC2B0470F-001\tempDir-001
   [junit4]    >    C:\Users\jenkins\workspace\Lucene-Solr-7.2-Windows\solr\build\solr-core\test\J1\temp\solr.cloud.TestCloudRecovery_EDF96C3EC2B0470F-001: java.nio.file.DirectoryNotEmptyException: C:\Users\jenkins\workspace\Lucene-Solr-7.2-Windows\solr\build\solr-core\test\J1\temp\solr.cloud.TestCloudRecovery_EDF96C3EC2B0470F-001
   [junit4]    > 	at __randomizedtesting.SeedInfo.seed([EDF96C3EC2B0470F]:0)
   [junit4]    > 	at org.apache.lucene.util.IOUtils.rm(IOUtils.java:329)
   [junit4]    > 	at java.base/java.lang.Thread.run(Thread.java:844)
   [junit4] Completed [536/751 (2!)] on J1 in 18.91s, 2 tests, 1 error <<< FAILURES!

[...truncated 40930 lines...]

Mime
View raw message