lucene-dev mailing list archives

Site index · List index
Message view « Date » · « Thread »
Top « Date » · « Thread »
From Policeman Jenkins Server <jenk...@thetaphi.de>
Subject [JENKINS] Lucene-Solr-master-Linux (32bit/jdk1.8.0_144) - Build # 21361 - Still Unstable!
Date Sun, 28 Jan 2018 04:07:12 GMT
Build: https://jenkins.thetaphi.de/job/Lucene-Solr-master-Linux/21361/
Java: 32bit/jdk1.8.0_144 -server -XX:+UseConcMarkSweepGC

4 tests failed.
FAILED:  org.apache.solr.cloud.TestUtilizeNode.test

Error Message:
no replica should be present in  127.0.0.1:39217_solr

Stack Trace:
java.lang.AssertionError: no replica should be present in  127.0.0.1:39217_solr
	at __randomizedtesting.SeedInfo.seed([9F4FE8CCAF6AF3:88CB70326253070B]:0)
	at org.junit.Assert.fail(Assert.java:93)
	at org.junit.Assert.assertTrue(Assert.java:43)
	at org.apache.solr.cloud.TestUtilizeNode.test(TestUtilizeNode.java:99)
	at sun.reflect.NativeMethodAccessorImpl.invoke0(Native Method)
	at sun.reflect.NativeMethodAccessorImpl.invoke(NativeMethodAccessorImpl.java:62)
	at sun.reflect.DelegatingMethodAccessorImpl.invoke(DelegatingMethodAccessorImpl.java:43)
	at java.lang.reflect.Method.invoke(Method.java:498)
	at com.carrotsearch.randomizedtesting.RandomizedRunner.invoke(RandomizedRunner.java:1737)
	at com.carrotsearch.randomizedtesting.RandomizedRunner$8.evaluate(RandomizedRunner.java:934)
	at com.carrotsearch.randomizedtesting.RandomizedRunner$9.evaluate(RandomizedRunner.java:970)
	at com.carrotsearch.randomizedtesting.RandomizedRunner$10.evaluate(RandomizedRunner.java:984)
	at com.carrotsearch.randomizedtesting.rules.SystemPropertiesRestoreRule$1.evaluate(SystemPropertiesRestoreRule.java:57)
	at org.apache.lucene.util.TestRuleSetupTeardownChained$1.evaluate(TestRuleSetupTeardownChained.java:49)
	at org.apache.lucene.util.AbstractBeforeAfterRule$1.evaluate(AbstractBeforeAfterRule.java:45)
	at org.apache.lucene.util.TestRuleThreadAndTestName$1.evaluate(TestRuleThreadAndTestName.java:48)
	at org.apache.lucene.util.TestRuleIgnoreAfterMaxFailures$1.evaluate(TestRuleIgnoreAfterMaxFailures.java:64)
	at org.apache.lucene.util.TestRuleMarkFailure$1.evaluate(TestRuleMarkFailure.java:47)
	at com.carrotsearch.randomizedtesting.rules.StatementAdapter.evaluate(StatementAdapter.java:36)
	at com.carrotsearch.randomizedtesting.ThreadLeakControl$StatementRunner.run(ThreadLeakControl.java:368)
	at com.carrotsearch.randomizedtesting.ThreadLeakControl.forkTimeoutingTask(ThreadLeakControl.java:817)
	at com.carrotsearch.randomizedtesting.ThreadLeakControl$3.evaluate(ThreadLeakControl.java:468)
	at com.carrotsearch.randomizedtesting.RandomizedRunner.runSingleTest(RandomizedRunner.java:943)
	at com.carrotsearch.randomizedtesting.RandomizedRunner$5.evaluate(RandomizedRunner.java:829)
	at com.carrotsearch.randomizedtesting.RandomizedRunner$6.evaluate(RandomizedRunner.java:879)
	at com.carrotsearch.randomizedtesting.RandomizedRunner$7.evaluate(RandomizedRunner.java:890)
	at com.carrotsearch.randomizedtesting.rules.StatementAdapter.evaluate(StatementAdapter.java:36)
	at com.carrotsearch.randomizedtesting.rules.SystemPropertiesRestoreRule$1.evaluate(SystemPropertiesRestoreRule.java:57)
	at org.apache.lucene.util.AbstractBeforeAfterRule$1.evaluate(AbstractBeforeAfterRule.java:45)
	at com.carrotsearch.randomizedtesting.rules.StatementAdapter.evaluate(StatementAdapter.java:36)
	at org.apache.lucene.util.TestRuleStoreClassName$1.evaluate(TestRuleStoreClassName.java:41)
	at com.carrotsearch.randomizedtesting.rules.NoShadowingOrOverridesOnMethodsRule$1.evaluate(NoShadowingOrOverridesOnMethodsRule.java:40)
	at com.carrotsearch.randomizedtesting.rules.NoShadowingOrOverridesOnMethodsRule$1.evaluate(NoShadowingOrOverridesOnMethodsRule.java:40)
	at com.carrotsearch.randomizedtesting.rules.StatementAdapter.evaluate(StatementAdapter.java:36)
	at com.carrotsearch.randomizedtesting.rules.StatementAdapter.evaluate(StatementAdapter.java:36)
	at com.carrotsearch.randomizedtesting.rules.StatementAdapter.evaluate(StatementAdapter.java:36)
	at org.apache.lucene.util.TestRuleAssertionsRequired$1.evaluate(TestRuleAssertionsRequired.java:53)
	at org.apache.lucene.util.TestRuleMarkFailure$1.evaluate(TestRuleMarkFailure.java:47)
	at org.apache.lucene.util.TestRuleIgnoreAfterMaxFailures$1.evaluate(TestRuleIgnoreAfterMaxFailures.java:64)
	at org.apache.lucene.util.TestRuleIgnoreTestSuites$1.evaluate(TestRuleIgnoreTestSuites.java:54)
	at com.carrotsearch.randomizedtesting.rules.StatementAdapter.evaluate(StatementAdapter.java:36)
	at com.carrotsearch.randomizedtesting.ThreadLeakControl$StatementRunner.run(ThreadLeakControl.java:368)
	at java.lang.Thread.run(Thread.java:748)


FAILED:  org.apache.solr.cloud.autoscaling.HdfsAutoAddReplicasIntegrationTest.testSimple

Error Message:
Waiting for collection testSimple1 null Live Nodes: [127.0.0.1:34381_solr, 127.0.0.1:36127_solr] Last available state: DocCollection(testSimple1//collections/testSimple1/state.json/15)={   "pullReplicas":"0",   "replicationFactor":"2",   "shards":{     "shard1":{       "range":"80000000-ffffffff",       "state":"active",       "replicas":{         "core_node3":{           "dataDir":"hdfs://localhost.localdomain:34079/data/testSimple1/core_node3/data/",           "base_url":"https://127.0.0.1:34381/solr",           "node_name":"127.0.0.1:34381_solr",           "type":"NRT",           "ulogDir":"hdfs://localhost.localdomain:34079/data/testSimple1/core_node3/data/tlog",           "core":"testSimple1_shard1_replica_n1",           "shared_storage":"true",           "state":"active"},         "core_node5":{           "dataDir":"hdfs://localhost.localdomain:34079/data/testSimple1/core_node5/data/",           "base_url":"https://127.0.0.1:34381/solr",           "node_name":"127.0.0.1:34381_solr",           "type":"NRT",           "ulogDir":"hdfs://localhost.localdomain:34079/data/testSimple1/core_node5/data/tlog",           "core":"testSimple1_shard1_replica_n2",           "shared_storage":"true",           "state":"active",           "leader":"true"}}},     "shard2":{       "range":"0-7fffffff",       "state":"active",       "replicas":{         "core_node6":{           "dataDir":"hdfs://localhost.localdomain:34079/data/testSimple1/core_node6/data/",           "base_url":"https://127.0.0.1:37043/solr",           "node_name":"127.0.0.1:37043_solr",           "type":"NRT",           "ulogDir":"hdfs://localhost.localdomain:34079/data/testSimple1/core_node6/data/tlog",           "core":"testSimple1_shard2_replica_n4",           "shared_storage":"true",           "state":"down"},         "core_node8":{           "dataDir":"hdfs://localhost.localdomain:34079/data/testSimple1/core_node8/data/",           "base_url":"https://127.0.0.1:34381/solr",           "node_name":"127.0.0.1:34381_solr",           "type":"NRT",           "ulogDir":"hdfs://localhost.localdomain:34079/data/testSimple1/core_node8/data/tlog",           "core":"testSimple1_shard2_replica_n7",           "shared_storage":"true",           "state":"active",           "leader":"true"}}}},   "router":{"name":"compositeId"},   "maxShardsPerNode":"2",   "autoAddReplicas":"true",   "nrtReplicas":"2",   "tlogReplicas":"0"}

Stack Trace:
java.lang.AssertionError: Waiting for collection testSimple1
null
Live Nodes: [127.0.0.1:34381_solr, 127.0.0.1:36127_solr]
Last available state: DocCollection(testSimple1//collections/testSimple1/state.json/15)={
  "pullReplicas":"0",
  "replicationFactor":"2",
  "shards":{
    "shard1":{
      "range":"80000000-ffffffff",
      "state":"active",
      "replicas":{
        "core_node3":{
          "dataDir":"hdfs://localhost.localdomain:34079/data/testSimple1/core_node3/data/",
          "base_url":"https://127.0.0.1:34381/solr",
          "node_name":"127.0.0.1:34381_solr",
          "type":"NRT",
          "ulogDir":"hdfs://localhost.localdomain:34079/data/testSimple1/core_node3/data/tlog",
          "core":"testSimple1_shard1_replica_n1",
          "shared_storage":"true",
          "state":"active"},
        "core_node5":{
          "dataDir":"hdfs://localhost.localdomain:34079/data/testSimple1/core_node5/data/",
          "base_url":"https://127.0.0.1:34381/solr",
          "node_name":"127.0.0.1:34381_solr",
          "type":"NRT",
          "ulogDir":"hdfs://localhost.localdomain:34079/data/testSimple1/core_node5/data/tlog",
          "core":"testSimple1_shard1_replica_n2",
          "shared_storage":"true",
          "state":"active",
          "leader":"true"}}},
    "shard2":{
      "range":"0-7fffffff",
      "state":"active",
      "replicas":{
        "core_node6":{
          "dataDir":"hdfs://localhost.localdomain:34079/data/testSimple1/core_node6/data/",
          "base_url":"https://127.0.0.1:37043/solr",
          "node_name":"127.0.0.1:37043_solr",
          "type":"NRT",
          "ulogDir":"hdfs://localhost.localdomain:34079/data/testSimple1/core_node6/data/tlog",
          "core":"testSimple1_shard2_replica_n4",
          "shared_storage":"true",
          "state":"down"},
        "core_node8":{
          "dataDir":"hdfs://localhost.localdomain:34079/data/testSimple1/core_node8/data/",
          "base_url":"https://127.0.0.1:34381/solr",
          "node_name":"127.0.0.1:34381_solr",
          "type":"NRT",
          "ulogDir":"hdfs://localhost.localdomain:34079/data/testSimple1/core_node8/data/tlog",
          "core":"testSimple1_shard2_replica_n7",
          "shared_storage":"true",
          "state":"active",
          "leader":"true"}}}},
  "router":{"name":"compositeId"},
  "maxShardsPerNode":"2",
  "autoAddReplicas":"true",
  "nrtReplicas":"2",
  "tlogReplicas":"0"}
	at __randomizedtesting.SeedInfo.seed([9F4FE8CCAF6AF3:382C6B16EB5CBE22]:0)
	at org.junit.Assert.fail(Assert.java:93)
	at org.apache.solr.cloud.SolrCloudTestCase.waitForState(SolrCloudTestCase.java:269)
	at org.apache.solr.cloud.autoscaling.AutoAddReplicasIntegrationTest.testSimple(AutoAddReplicasIntegrationTest.java:103)
	at sun.reflect.NativeMethodAccessorImpl.invoke0(Native Method)
	at sun.reflect.NativeMethodAccessorImpl.invoke(NativeMethodAccessorImpl.java:62)
	at sun.reflect.DelegatingMethodAccessorImpl.invoke(DelegatingMethodAccessorImpl.java:43)
	at java.lang.reflect.Method.invoke(Method.java:498)
	at com.carrotsearch.randomizedtesting.RandomizedRunner.invoke(RandomizedRunner.java:1737)
	at com.carrotsearch.randomizedtesting.RandomizedRunner$8.evaluate(RandomizedRunner.java:934)
	at com.carrotsearch.randomizedtesting.RandomizedRunner$9.evaluate(RandomizedRunner.java:970)
	at com.carrotsearch.randomizedtesting.RandomizedRunner$10.evaluate(RandomizedRunner.java:984)
	at com.carrotsearch.randomizedtesting.rules.SystemPropertiesRestoreRule$1.evaluate(SystemPropertiesRestoreRule.java:57)
	at org.apache.lucene.util.TestRuleSetupTeardownChained$1.evaluate(TestRuleSetupTeardownChained.java:49)
	at org.apache.lucene.util.AbstractBeforeAfterRule$1.evaluate(AbstractBeforeAfterRule.java:45)
	at org.apache.lucene.util.TestRuleThreadAndTestName$1.evaluate(TestRuleThreadAndTestName.java:48)
	at org.apache.lucene.util.TestRuleIgnoreAfterMaxFailures$1.evaluate(TestRuleIgnoreAfterMaxFailures.java:64)
	at org.apache.lucene.util.TestRuleMarkFailure$1.evaluate(TestRuleMarkFailure.java:47)
	at com.carrotsearch.randomizedtesting.rules.StatementAdapter.evaluate(StatementAdapter.java:36)
	at com.carrotsearch.randomizedtesting.ThreadLeakControl$StatementRunner.run(ThreadLeakControl.java:368)
	at com.carrotsearch.randomizedtesting.ThreadLeakControl.forkTimeoutingTask(ThreadLeakControl.java:817)
	at com.carrotsearch.randomizedtesting.ThreadLeakControl$3.evaluate(ThreadLeakControl.java:468)
	at com.carrotsearch.randomizedtesting.RandomizedRunner.runSingleTest(RandomizedRunner.java:943)
	at com.carrotsearch.randomizedtesting.RandomizedRunner$5.evaluate(RandomizedRunner.java:829)
	at com.carrotsearch.randomizedtesting.RandomizedRunner$6.evaluate(RandomizedRunner.java:879)
	at com.carrotsearch.randomizedtesting.RandomizedRunner$7.evaluate(RandomizedRunner.java:890)
	at com.carrotsearch.randomizedtesting.rules.StatementAdapter.evaluate(StatementAdapter.java:36)
	at com.carrotsearch.randomizedtesting.rules.SystemPropertiesRestoreRule$1.evaluate(SystemPropertiesRestoreRule.java:57)
	at org.apache.lucene.util.AbstractBeforeAfterRule$1.evaluate(AbstractBeforeAfterRule.java:45)
	at com.carrotsearch.randomizedtesting.rules.StatementAdapter.evaluate(StatementAdapter.java:36)
	at org.apache.lucene.util.TestRuleStoreClassName$1.evaluate(TestRuleStoreClassName.java:41)
	at com.carrotsearch.randomizedtesting.rules.NoShadowingOrOverridesOnMethodsRule$1.evaluate(NoShadowingOrOverridesOnMethodsRule.java:40)
	at com.carrotsearch.randomizedtesting.rules.NoShadowingOrOverridesOnMethodsRule$1.evaluate(NoShadowingOrOverridesOnMethodsRule.java:40)
	at com.carrotsearch.randomizedtesting.rules.StatementAdapter.evaluate(StatementAdapter.java:36)
	at com.carrotsearch.randomizedtesting.rules.StatementAdapter.evaluate(StatementAdapter.java:36)
	at com.carrotsearch.randomizedtesting.rules.StatementAdapter.evaluate(StatementAdapter.java:36)
	at org.apache.lucene.util.TestRuleAssertionsRequired$1.evaluate(TestRuleAssertionsRequired.java:53)
	at org.apache.lucene.util.TestRuleMarkFailure$1.evaluate(TestRuleMarkFailure.java:47)
	at org.apache.lucene.util.TestRuleIgnoreAfterMaxFailures$1.evaluate(TestRuleIgnoreAfterMaxFailures.java:64)
	at org.apache.lucene.util.TestRuleIgnoreTestSuites$1.evaluate(TestRuleIgnoreTestSuites.java:54)
	at com.carrotsearch.randomizedtesting.rules.StatementAdapter.evaluate(StatementAdapter.java:36)
	at com.carrotsearch.randomizedtesting.ThreadLeakControl$StatementRunner.run(ThreadLeakControl.java:368)
	at java.lang.Thread.run(Thread.java:748)


FAILED:  org.apache.solr.cloud.autoscaling.TriggerIntegrationTest.testListeners

Error Message:


Stack Trace:
java.lang.AssertionError
	at __randomizedtesting.SeedInfo.seed([9F4FE8CCAF6AF3:ED5FD8F871C3F72A]:0)
	at org.junit.Assert.fail(Assert.java:92)
	at org.junit.Assert.assertTrue(Assert.java:43)
	at org.junit.Assert.assertTrue(Assert.java:54)
	at org.apache.solr.cloud.autoscaling.TriggerIntegrationTest.testListeners(TriggerIntegrationTest.java:1053)
	at sun.reflect.NativeMethodAccessorImpl.invoke0(Native Method)
	at sun.reflect.NativeMethodAccessorImpl.invoke(NativeMethodAccessorImpl.java:62)
	at sun.reflect.DelegatingMethodAccessorImpl.invoke(DelegatingMethodAccessorImpl.java:43)
	at java.lang.reflect.Method.invoke(Method.java:498)
	at com.carrotsearch.randomizedtesting.RandomizedRunner.invoke(RandomizedRunner.java:1737)
	at com.carrotsearch.randomizedtesting.RandomizedRunner$8.evaluate(RandomizedRunner.java:934)
	at com.carrotsearch.randomizedtesting.RandomizedRunner$9.evaluate(RandomizedRunner.java:970)
	at com.carrotsearch.randomizedtesting.RandomizedRunner$10.evaluate(RandomizedRunner.java:984)
	at com.carrotsearch.randomizedtesting.rules.SystemPropertiesRestoreRule$1.evaluate(SystemPropertiesRestoreRule.java:57)
	at org.apache.lucene.util.TestRuleSetupTeardownChained$1.evaluate(TestRuleSetupTeardownChained.java:49)
	at org.apache.lucene.util.AbstractBeforeAfterRule$1.evaluate(AbstractBeforeAfterRule.java:45)
	at org.apache.lucene.util.TestRuleThreadAndTestName$1.evaluate(TestRuleThreadAndTestName.java:48)
	at org.apache.lucene.util.TestRuleIgnoreAfterMaxFailures$1.evaluate(TestRuleIgnoreAfterMaxFailures.java:64)
	at org.apache.lucene.util.TestRuleMarkFailure$1.evaluate(TestRuleMarkFailure.java:47)
	at com.carrotsearch.randomizedtesting.rules.StatementAdapter.evaluate(StatementAdapter.java:36)
	at com.carrotsearch.randomizedtesting.ThreadLeakControl$StatementRunner.run(ThreadLeakControl.java:368)
	at com.carrotsearch.randomizedtesting.ThreadLeakControl.forkTimeoutingTask(ThreadLeakControl.java:817)
	at com.carrotsearch.randomizedtesting.ThreadLeakControl$3.evaluate(ThreadLeakControl.java:468)
	at com.carrotsearch.randomizedtesting.RandomizedRunner.runSingleTest(RandomizedRunner.java:943)
	at com.carrotsearch.randomizedtesting.RandomizedRunner$5.evaluate(RandomizedRunner.java:829)
	at com.carrotsearch.randomizedtesting.RandomizedRunner$6.evaluate(RandomizedRunner.java:879)
	at com.carrotsearch.randomizedtesting.RandomizedRunner$7.evaluate(RandomizedRunner.java:890)
	at com.carrotsearch.randomizedtesting.rules.StatementAdapter.evaluate(StatementAdapter.java:36)
	at com.carrotsearch.randomizedtesting.rules.SystemPropertiesRestoreRule$1.evaluate(SystemPropertiesRestoreRule.java:57)
	at org.apache.lucene.util.AbstractBeforeAfterRule$1.evaluate(AbstractBeforeAfterRule.java:45)
	at com.carrotsearch.randomizedtesting.rules.StatementAdapter.evaluate(StatementAdapter.java:36)
	at org.apache.lucene.util.TestRuleStoreClassName$1.evaluate(TestRuleStoreClassName.java:41)
	at com.carrotsearch.randomizedtesting.rules.NoShadowingOrOverridesOnMethodsRule$1.evaluate(NoShadowingOrOverridesOnMethodsRule.java:40)
	at com.carrotsearch.randomizedtesting.rules.NoShadowingOrOverridesOnMethodsRule$1.evaluate(NoShadowingOrOverridesOnMethodsRule.java:40)
	at com.carrotsearch.randomizedtesting.rules.StatementAdapter.evaluate(StatementAdapter.java:36)
	at com.carrotsearch.randomizedtesting.rules.StatementAdapter.evaluate(StatementAdapter.java:36)
	at com.carrotsearch.randomizedtesting.rules.StatementAdapter.evaluate(StatementAdapter.java:36)
	at org.apache.lucene.util.TestRuleAssertionsRequired$1.evaluate(TestRuleAssertionsRequired.java:53)
	at org.apache.lucene.util.TestRuleMarkFailure$1.evaluate(TestRuleMarkFailure.java:47)
	at org.apache.lucene.util.TestRuleIgnoreAfterMaxFailures$1.evaluate(TestRuleIgnoreAfterMaxFailures.java:64)
	at org.apache.lucene.util.TestRuleIgnoreTestSuites$1.evaluate(TestRuleIgnoreTestSuites.java:54)
	at com.carrotsearch.randomizedtesting.rules.StatementAdapter.evaluate(StatementAdapter.java:36)
	at com.carrotsearch.randomizedtesting.ThreadLeakControl$StatementRunner.run(ThreadLeakControl.java:368)
	at java.lang.Thread.run(Thread.java:748)


FAILED:  org.apache.solr.handler.admin.AutoscalingHistoryHandlerTest.testHistory

Error Message:
expected:<5> but was:<0>

Stack Trace:
java.lang.AssertionError: expected:<5> but was:<0>
	at __randomizedtesting.SeedInfo.seed([9F4FE8CCAF6AF3:6D63EB1576E795F4]:0)
	at org.junit.Assert.fail(Assert.java:93)
	at org.junit.Assert.failNotEquals(Assert.java:647)
	at org.junit.Assert.assertEquals(Assert.java:128)
	at org.junit.Assert.assertEquals(Assert.java:472)
	at org.junit.Assert.assertEquals(Assert.java:456)
	at org.apache.solr.handler.admin.AutoscalingHistoryHandlerTest.testHistory(AutoscalingHistoryHandlerTest.java:244)
	at sun.reflect.NativeMethodAccessorImpl.invoke0(Native Method)
	at sun.reflect.NativeMethodAccessorImpl.invoke(NativeMethodAccessorImpl.java:62)
	at sun.reflect.DelegatingMethodAccessorImpl.invoke(DelegatingMethodAccessorImpl.java:43)
	at java.lang.reflect.Method.invoke(Method.java:498)
	at com.carrotsearch.randomizedtesting.RandomizedRunner.invoke(RandomizedRunner.java:1737)
	at com.carrotsearch.randomizedtesting.RandomizedRunner$8.evaluate(RandomizedRunner.java:934)
	at com.carrotsearch.randomizedtesting.RandomizedRunner$9.evaluate(RandomizedRunner.java:970)
	at com.carrotsearch.randomizedtesting.RandomizedRunner$10.evaluate(RandomizedRunner.java:984)
	at com.carrotsearch.randomizedtesting.rules.SystemPropertiesRestoreRule$1.evaluate(SystemPropertiesRestoreRule.java:57)
	at org.apache.lucene.util.TestRuleSetupTeardownChained$1.evaluate(TestRuleSetupTeardownChained.java:49)
	at org.apache.lucene.util.AbstractBeforeAfterRule$1.evaluate(AbstractBeforeAfterRule.java:45)
	at org.apache.lucene.util.TestRuleThreadAndTestName$1.evaluate(TestRuleThreadAndTestName.java:48)
	at org.apache.lucene.util.TestRuleIgnoreAfterMaxFailures$1.evaluate(TestRuleIgnoreAfterMaxFailures.java:64)
	at org.apache.lucene.util.TestRuleMarkFailure$1.evaluate(TestRuleMarkFailure.java:47)
	at com.carrotsearch.randomizedtesting.rules.StatementAdapter.evaluate(StatementAdapter.java:36)
	at com.carrotsearch.randomizedtesting.ThreadLeakControl$StatementRunner.run(ThreadLeakControl.java:368)
	at com.carrotsearch.randomizedtesting.ThreadLeakControl.forkTimeoutingTask(ThreadLeakControl.java:817)
	at com.carrotsearch.randomizedtesting.ThreadLeakControl$3.evaluate(ThreadLeakControl.java:468)
	at com.carrotsearch.randomizedtesting.RandomizedRunner.runSingleTest(RandomizedRunner.java:943)
	at com.carrotsearch.randomizedtesting.RandomizedRunner$5.evaluate(RandomizedRunner.java:829)
	at com.carrotsearch.randomizedtesting.RandomizedRunner$6.evaluate(RandomizedRunner.java:879)
	at com.carrotsearch.randomizedtesting.RandomizedRunner$7.evaluate(RandomizedRunner.java:890)
	at com.carrotsearch.randomizedtesting.rules.StatementAdapter.evaluate(StatementAdapter.java:36)
	at com.carrotsearch.randomizedtesting.rules.SystemPropertiesRestoreRule$1.evaluate(SystemPropertiesRestoreRule.java:57)
	at org.apache.lucene.util.AbstractBeforeAfterRule$1.evaluate(AbstractBeforeAfterRule.java:45)
	at com.carrotsearch.randomizedtesting.rules.StatementAdapter.evaluate(StatementAdapter.java:36)
	at org.apache.lucene.util.TestRuleStoreClassName$1.evaluate(TestRuleStoreClassName.java:41)
	at com.carrotsearch.randomizedtesting.rules.NoShadowingOrOverridesOnMethodsRule$1.evaluate(NoShadowingOrOverridesOnMethodsRule.java:40)
	at com.carrotsearch.randomizedtesting.rules.NoShadowingOrOverridesOnMethodsRule$1.evaluate(NoShadowingOrOverridesOnMethodsRule.java:40)
	at com.carrotsearch.randomizedtesting.rules.StatementAdapter.evaluate(StatementAdapter.java:36)
	at com.carrotsearch.randomizedtesting.rules.StatementAdapter.evaluate(StatementAdapter.java:36)
	at com.carrotsearch.randomizedtesting.rules.StatementAdapter.evaluate(StatementAdapter.java:36)
	at org.apache.lucene.util.TestRuleAssertionsRequired$1.evaluate(TestRuleAssertionsRequired.java:53)
	at org.apache.lucene.util.TestRuleMarkFailure$1.evaluate(TestRuleMarkFailure.java:47)
	at org.apache.lucene.util.TestRuleIgnoreAfterMaxFailures$1.evaluate(TestRuleIgnoreAfterMaxFailures.java:64)
	at org.apache.lucene.util.TestRuleIgnoreTestSuites$1.evaluate(TestRuleIgnoreTestSuites.java:54)
	at com.carrotsearch.randomizedtesting.rules.StatementAdapter.evaluate(StatementAdapter.java:36)
	at com.carrotsearch.randomizedtesting.ThreadLeakControl$StatementRunner.run(ThreadLeakControl.java:368)
	at java.lang.Thread.run(Thread.java:748)




Build Log:
[...truncated 11689 lines...]
   [junit4] Suite: org.apache.solr.handler.admin.AutoscalingHistoryHandlerTest
   [junit4]   2> 38129 INFO  (SUITE-AutoscalingHistoryHandlerTest-seed#[9F4FE8CCAF6AF3]-worker) [    ] o.a.s.SolrTestCaseJ4 SecureRandom sanity checks: test.solr.allowed.securerandom=null & java.security.egd=file:/dev/./urandom
   [junit4]   2> Creating dataDir: /home/jenkins/workspace/Lucene-Solr-master-Linux/solr/build/solr-core/test/J1/temp/solr.handler.admin.AutoscalingHistoryHandlerTest_9F4FE8CCAF6AF3-001/init-core-data-001
   [junit4]   2> 38130 WARN  (SUITE-AutoscalingHistoryHandlerTest-seed#[9F4FE8CCAF6AF3]-worker) [    ] o.a.s.SolrTestCaseJ4 startTrackingSearchers: numOpens=5 numCloses=5
   [junit4]   2> 38131 INFO  (SUITE-AutoscalingHistoryHandlerTest-seed#[9F4FE8CCAF6AF3]-worker) [    ] o.a.s.SolrTestCaseJ4 Using PointFields (NUMERIC_POINTS_SYSPROP=true) w/NUMERIC_DOCVALUES_SYSPROP=true
   [junit4]   2> 38133 INFO  (SUITE-AutoscalingHistoryHandlerTest-seed#[9F4FE8CCAF6AF3]-worker) [    ] o.a.s.SolrTestCaseJ4 Randomized ssl (false) and clientAuth (true) via: @org.apache.solr.util.RandomizeSSL(reason=, ssl=NaN, value=NaN, clientAuth=NaN)
   [junit4]   2> 38133 INFO  (SUITE-AutoscalingHistoryHandlerTest-seed#[9F4FE8CCAF6AF3]-worker) [    ] o.a.s.c.MiniSolrCloudCluster Starting cluster of 3 servers in /home/jenkins/workspace/Lucene-Solr-master-Linux/solr/build/solr-core/test/J1/temp/solr.handler.admin.AutoscalingHistoryHandlerTest_9F4FE8CCAF6AF3-001/tempDir-001
   [junit4]   2> 38133 INFO  (SUITE-AutoscalingHistoryHandlerTest-seed#[9F4FE8CCAF6AF3]-worker) [    ] o.a.s.c.ZkTestServer STARTING ZK TEST SERVER
   [junit4]   2> 38135 INFO  (Thread-53) [    ] o.a.s.c.ZkTestServer client port:0.0.0.0/0.0.0.0:0
   [junit4]   2> 38135 INFO  (Thread-53) [    ] o.a.s.c.ZkTestServer Starting server
   [junit4]   2> 38137 ERROR (Thread-53) [    ] o.a.z.s.ZooKeeperServer ZKShutdownHandler is not registered, so ZooKeeper server won't take any action on ERROR or SHUTDOWN server state changes
   [junit4]   2> 38235 INFO  (SUITE-AutoscalingHistoryHandlerTest-seed#[9F4FE8CCAF6AF3]-worker) [    ] o.a.s.c.ZkTestServer start zk server on port:35351
   [junit4]   2> 38237 INFO  (zkConnectionManagerCallback-61-thread-1) [    ] o.a.s.c.c.ConnectionManager zkClient has connected
   [junit4]   2> 38241 INFO  (jetty-launcher-58-thread-2) [    ] o.e.j.s.Server jetty-9.4.8.v20171121, build timestamp: 2017-11-21T19:27:37-02:00, git hash: 82b8fb23f757335bb3329d540ce37a2a2615f0a8
   [junit4]   2> 38241 INFO  (jetty-launcher-58-thread-1) [    ] o.e.j.s.Server jetty-9.4.8.v20171121, build timestamp: 2017-11-21T19:27:37-02:00, git hash: 82b8fb23f757335bb3329d540ce37a2a2615f0a8
   [junit4]   2> 38245 INFO  (jetty-launcher-58-thread-3) [    ] o.e.j.s.Server jetty-9.4.8.v20171121, build timestamp: 2017-11-21T19:27:37-02:00, git hash: 82b8fb23f757335bb3329d540ce37a2a2615f0a8
   [junit4]   2> 38245 INFO  (jetty-launcher-58-thread-1) [    ] o.e.j.s.session DefaultSessionIdManager workerName=node0
   [junit4]   2> 38245 INFO  (jetty-launcher-58-thread-1) [    ] o.e.j.s.session No SessionScavenger set, using defaults
   [junit4]   2> 38245 INFO  (jetty-launcher-58-thread-1) [    ] o.e.j.s.session Scavenging every 600000ms
   [junit4]   2> 38248 INFO  (jetty-launcher-58-thread-1) [    ] o.e.j.s.h.ContextHandler Started o.e.j.s.ServletContextHandler@c2c04e{/solr,null,AVAILABLE}
   [junit4]   2> 38253 INFO  (jetty-launcher-58-thread-3) [    ] o.e.j.s.session DefaultSessionIdManager workerName=node0
   [junit4]   2> 38253 INFO  (jetty-launcher-58-thread-3) [    ] o.e.j.s.session No SessionScavenger set, using defaults
   [junit4]   2> 38253 INFO  (jetty-launcher-58-thread-3) [    ] o.e.j.s.session Scavenging every 600000ms
   [junit4]   2> 38253 INFO  (jetty-launcher-58-thread-3) [    ] o.e.j.s.h.ContextHandler Started o.e.j.s.ServletContextHandler@1c27cd8{/solr,null,AVAILABLE}
   [junit4]   2> 38253 INFO  (jetty-launcher-58-thread-1) [    ] o.e.j.s.AbstractConnector Started ServerConnector@938463{HTTP/1.1,[http/1.1]}{127.0.0.1:34245}
   [junit4]   2> 38253 INFO  (jetty-launcher-58-thread-1) [    ] o.e.j.s.Server Started @39915ms
   [junit4]   2> 38253 INFO  (jetty-launcher-58-thread-1) [    ] o.a.s.c.s.e.JettySolrRunner Jetty properties: {hostContext=/solr, hostPort=34245}
   [junit4]   2> 38254 ERROR (jetty-launcher-58-thread-1) [    ] o.a.s.u.StartupLoggingUtils Missing Java Option solr.log.dir. Logging may be missing or incomplete.
   [junit4]   2> 38254 INFO  (jetty-launcher-58-thread-3) [    ] o.e.j.s.AbstractConnector Started ServerConnector@1c1480d{HTTP/1.1,[http/1.1]}{127.0.0.1:41827}
   [junit4]   2> 38254 INFO  (jetty-launcher-58-thread-1) [    ] o.a.s.s.SolrDispatchFilter  ___      _       Welcome to Apache Solr™ version 8.0.0
   [junit4]   2> 38254 INFO  (jetty-launcher-58-thread-3) [    ] o.e.j.s.Server Started @39916ms
   [junit4]   2> 38254 INFO  (jetty-launcher-58-thread-1) [    ] o.a.s.s.SolrDispatchFilter / __| ___| |_ _   Starting in cloud mode on port null
   [junit4]   2> 38254 INFO  (jetty-launcher-58-thread-3) [    ] o.a.s.c.s.e.JettySolrRunner Jetty properties: {hostContext=/solr, hostPort=41827}
   [junit4]   2> 38254 INFO  (jetty-launcher-58-thread-1) [    ] o.a.s.s.SolrDispatchFilter \__ \/ _ \ | '_|  Install dir: null
   [junit4]   2> 38254 INFO  (jetty-launcher-58-thread-1) [    ] o.a.s.s.SolrDispatchFilter |___/\___/_|_|    Start time: 2018-01-28T02:57:33.374Z
   [junit4]   2> 38254 ERROR (jetty-launcher-58-thread-3) [    ] o.a.s.u.StartupLoggingUtils Missing Java Option solr.log.dir. Logging may be missing or incomplete.
   [junit4]   2> 38254 INFO  (jetty-launcher-58-thread-3) [    ] o.a.s.s.SolrDispatchFilter  ___      _       Welcome to Apache Solr™ version 8.0.0
   [junit4]   2> 38254 INFO  (jetty-launcher-58-thread-3) [    ] o.a.s.s.SolrDispatchFilter / __| ___| |_ _   Starting in cloud mode on port null
   [junit4]   2> 38254 INFO  (jetty-launcher-58-thread-3) [    ] o.a.s.s.SolrDispatchFilter \__ \/ _ \ | '_|  Install dir: null
   [junit4]   2> 38254 INFO  (jetty-launcher-58-thread-3) [    ] o.a.s.s.SolrDispatchFilter |___/\___/_|_|    Start time: 2018-01-28T02:57:33.374Z
   [junit4]   2> 38255 INFO  (jetty-launcher-58-thread-2) [    ] o.e.j.s.session DefaultSessionIdManager workerName=node0
   [junit4]   2> 38255 INFO  (jetty-launcher-58-thread-2) [    ] o.e.j.s.session No SessionScavenger set, using defaults
   [junit4]   2> 38255 INFO  (jetty-launcher-58-thread-2) [    ] o.e.j.s.session Scavenging every 600000ms
   [junit4]   2> 38259 INFO  (zkConnectionManagerCallback-63-thread-1) [    ] o.a.s.c.c.ConnectionManager zkClient has connected
   [junit4]   2> 38259 INFO  (jetty-launcher-58-thread-2) [    ] o.e.j.s.h.ContextHandler Started o.e.j.s.ServletContextHandler@180ef9c{/solr,null,AVAILABLE}
   [junit4]   2> 38260 INFO  (jetty-launcher-58-thread-2) [    ] o.e.j.s.AbstractConnector Started ServerConnector@65f155{HTTP/1.1,[http/1.1]}{127.0.0.1:34381}
   [junit4]   2> 38260 INFO  (jetty-launcher-58-thread-1) [    ] o.a.s.s.SolrDispatchFilter solr.xml found in ZooKeeper. Loading...
   [junit4]   2> 38260 INFO  (jetty-launcher-58-thread-2) [    ] o.e.j.s.Server Started @39922ms
   [junit4]   2> 38260 INFO  (jetty-launcher-58-thread-2) [    ] o.a.s.c.s.e.JettySolrRunner Jetty properties: {hostContext=/solr, hostPort=34381}
   [junit4]   2> 38260 ERROR (jetty-launcher-58-thread-2) [    ] o.a.s.u.StartupLoggingUtils Missing Java Option solr.log.dir. Logging may be missing or incomplete.
   [junit4]   2> 38260 INFO  (jetty-launcher-58-thread-2) [    ] o.a.s.s.SolrDispatchFilter  ___      _       Welcome to Apache Solr™ version 8.0.0
   [junit4]   2> 38260 INFO  (jetty-launcher-58-thread-2) [    ] o.a.s.s.SolrDispatchFilter / __| ___| |_ _   Starting in cloud mode on port null
   [junit4]   2> 38260 INFO  (jetty-launcher-58-thread-2) [    ] o.a.s.s.SolrDispatchFilter \__ \/ _ \ | '_|  Install dir: null
   [junit4]   2> 38260 INFO  (jetty-launcher-58-thread-2) [    ] o.a.s.s.SolrDispatchFilter |___/\___/_|_|    Start time: 2018-01-28T02:57:33.380Z
   [junit4]   2> 38263 INFO  (zkConnectionManagerCallback-65-thread-1) [    ] o.a.s.c.c.ConnectionManager zkClient has connected
   [junit4]   2> 38265 INFO  (jetty-launcher-58-thread-3) [    ] o.a.s.s.SolrDispatchFilter solr.xml found in ZooKeeper. Loading...
   [junit4]   2> 38275 INFO  (zkConnectionManagerCallback-67-thread-1) [    ] o.a.s.c.c.ConnectionManager zkClient has connected
   [junit4]   2> 38275 INFO  (jetty-launcher-58-thread-2) [    ] o.a.s.s.SolrDispatchFilter solr.xml found in ZooKeeper. Loading...
   [junit4]   2> 38296 INFO  (jetty-launcher-58-thread-2) [    ] o.a.s.c.ZkContainer Zookeeper client=127.0.0.1:35351/solr
   [junit4]   2> 38299 INFO  (jetty-launcher-58-thread-3) [    ] o.a.s.c.ZkContainer Zookeeper client=127.0.0.1:35351/solr
   [junit4]   2> 38305 INFO  (jetty-launcher-58-thread-1) [    ] o.a.s.c.ZkContainer Zookeeper client=127.0.0.1:35351/solr
   [junit4]   2> 38306 INFO  (zkConnectionManagerCallback-72-thread-1) [    ] o.a.s.c.c.ConnectionManager zkClient has connected
   [junit4]   2> 38306 INFO  (zkConnectionManagerCallback-75-thread-1) [    ] o.a.s.c.c.ConnectionManager zkClient has connected
   [junit4]   2> 38319 INFO  (zkConnectionManagerCallback-79-thread-1) [    ] o.a.s.c.c.ConnectionManager zkClient has connected
   [junit4]   2> 38323 INFO  (zkConnectionManagerCallback-81-thread-1-processing-n:127.0.0.1:41827_solr) [n:127.0.0.1:41827_solr    ] o.a.s.c.c.ConnectionManager zkClient has connected
   [junit4]   2> 38326 INFO  (zkConnectionManagerCallback-83-thread-1-processing-n:127.0.0.1:34381_solr) [n:127.0.0.1:34381_solr    ] o.a.s.c.c.ConnectionManager zkClient has connected
   [junit4]   2> 38343 INFO  (zkConnectionManagerCallback-85-thread-1-processing-n:127.0.0.1:34245_solr) [n:127.0.0.1:34245_solr    ] o.a.s.c.c.ConnectionManager zkClient has connected
   [junit4]   2> 38369 INFO  (jetty-launcher-58-thread-3) [n:127.0.0.1:41827_solr    ] o.a.s.c.Overseer Overseer (id=null) closing
   [junit4]   2> 38369 INFO  (jetty-launcher-58-thread-3) [n:127.0.0.1:41827_solr    ] o.a.s.c.OverseerElectionContext I am going to be the leader 127.0.0.1:41827_solr
   [junit4]   2> 38370 INFO  (jetty-launcher-58-thread-3) [n:127.0.0.1:41827_solr    ] o.a.s.c.Overseer Overseer (id=99425206485385223-127.0.0.1:41827_solr-n_0000000000) starting
   [junit4]   2> 38388 DEBUG (OverseerStateUpdate-99425206485385223-127.0.0.1:41827_solr-n_0000000000) [n:127.0.0.1:41827_solr    ] o.a.s.c.Overseer Starting to work on the main queue
   [junit4]   2> 38402 DEBUG (OverseerAutoScalingTriggerThread-99425206485385223-127.0.0.1:41827_solr-n_0000000000) [n:127.0.0.1:41827_solr    ] o.a.s.c.a.OverseerTriggerThread Adding .autoAddReplicas trigger
   [junit4]   2> 38403 DEBUG (OverseerAutoScalingTriggerThread-99425206485385223-127.0.0.1:41827_solr-n_0000000000) [n:127.0.0.1:41827_solr    ] o.a.s.c.a.OverseerTriggerThread Refreshing /autoscaling.json with znode version 1
   [junit4]   2> 38405 INFO  (jetty-launcher-58-thread-3) [n:127.0.0.1:41827_solr    ] o.a.s.c.ZkController Register node as live in ZooKeeper:/live_nodes/127.0.0.1:41827_solr
   [junit4]   2> 38405 DEBUG (OverseerAutoScalingTriggerThread-99425206485385223-127.0.0.1:41827_solr-n_0000000000) [n:127.0.0.1:41827_solr    ] o.a.s.c.a.NodeLostTrigger Initial livenodes: []
   [junit4]   2> 38405 DEBUG (OverseerAutoScalingTriggerThread-99425206485385223-127.0.0.1:41827_solr-n_0000000000) [n:127.0.0.1:41827_solr    ] o.a.s.c.a.OverseerTriggerThread Current znodeVersion 1, lastZnodeVersion -1
   [junit4]   2> 38405 DEBUG (OverseerAutoScalingTriggerThread-99425206485385223-127.0.0.1:41827_solr-n_0000000000) [n:127.0.0.1:41827_solr    ] o.a.s.c.a.OverseerTriggerThread Processed trigger updates upto znodeVersion 1
   [junit4]   2> 38419 INFO  (zkCallback-80-thread-1-processing-n:127.0.0.1:41827_solr) [n:127.0.0.1:41827_solr    ] o.a.s.c.c.ZkStateReader Updated live nodes from ZooKeeper... (0) -> (1)
   [junit4]   2> 38426 DEBUG (OverseerAutoScalingTriggerThread-99425206485385223-127.0.0.1:41827_solr-n_0000000000) [n:127.0.0.1:41827_solr    ] o.a.s.c.a.OverseerTriggerThread -- clean old nodeAdded markers
   [junit4]   2> 38426 DEBUG (OverseerAutoScalingTriggerThread-99425206485385223-127.0.0.1:41827_solr-n_0000000000) [n:127.0.0.1:41827_solr    ] o.a.s.c.a.OverseerTriggerThread Current znodeVersion 1, lastZnodeVersion 1
   [junit4]   2> 38426 DEBUG (ScheduledTrigger-162-thread-1) [n:127.0.0.1:41827_solr    ] o.a.s.c.a.NodeLostTrigger Running NodeLostTrigger: .auto_add_replicas with currently live nodes: 1
   [junit4]   2> 38428 INFO  (jetty-launcher-58-thread-1) [n:127.0.0.1:34245_solr    ] o.a.s.c.c.ZkStateReader Updated live nodes from ZooKeeper... (0) -> (1)
   [junit4]   2> 38430 INFO  (jetty-launcher-58-thread-1) [n:127.0.0.1:34245_solr    ] o.a.s.c.Overseer Overseer (id=null) closing
   [junit4]   2> 38436 INFO  (jetty-launcher-58-thread-1) [n:127.0.0.1:34245_solr    ] o.a.s.c.ZkController Register node as live in ZooKeeper:/live_nodes/127.0.0.1:34245_solr
   [junit4]   2> 38440 DEBUG (OverseerStateUpdate-99425206485385223-127.0.0.1:41827_solr-n_0000000000) [n:127.0.0.1:41827_solr    ] o.a.s.c.Overseer processMessage: queueSize: 1, message = {
   [junit4]   2>   "operation":"downnode",
   [junit4]   2>   "node_name":"127.0.0.1:34245_solr"} current state version: 0
   [junit4]   2> 38440 DEBUG (OverseerStateUpdate-99425206485385223-127.0.0.1:41827_solr-n_0000000000) [n:127.0.0.1:41827_solr    ] o.a.s.c.o.NodeMutator DownNode state invoked for node: 127.0.0.1:34245_solr
   [junit4]   2> 38440 INFO  (zkCallback-80-thread-1-processing-n:127.0.0.1:41827_solr) [n:127.0.0.1:41827_solr    ] o.a.s.c.c.ZkStateReader Updated live nodes from ZooKeeper... (1) -> (2)
   [junit4]   2> 38450 INFO  (jetty-launcher-58-thread-2) [n:127.0.0.1:34381_solr    ] o.a.s.c.c.ZkStateReader Updated live nodes from ZooKeeper... (0) -> (2)
   [junit4]   2> 38452 INFO  (jetty-launcher-58-thread-2) [n:127.0.0.1:34381_solr    ] o.a.s.c.Overseer Overseer (id=null) closing
   [junit4]   2> 38468 INFO  (jetty-launcher-58-thread-2) [n:127.0.0.1:34381_solr    ] o.a.s.c.ZkController Register node as live in ZooKeeper:/live_nodes/127.0.0.1:34381_solr
   [junit4]   2> 38469 DEBUG (OverseerStateUpdate-99425206485385223-127.0.0.1:41827_solr-n_0000000000) [n:127.0.0.1:41827_solr    ] o.a.s.c.Overseer processMessage: queueSize: 2, message = {
   [junit4]   2>   "operation":"downnode",
   [junit4]   2>   "node_name":"127.0.0.1:34381_solr"} current state version: 0
   [junit4]   2> 38469 DEBUG (OverseerStateUpdate-99425206485385223-127.0.0.1:41827_solr-n_0000000000) [n:127.0.0.1:41827_solr    ] o.a.s.c.o.NodeMutator DownNode state invoked for node: 127.0.0.1:34381_solr
   [junit4]   2> 38479 INFO  (zkCallback-84-thread-1-processing-n:127.0.0.1:34245_solr) [n:127.0.0.1:34245_solr    ] o.a.s.c.c.ZkStateReader Updated live nodes from ZooKeeper... (1) -> (2)
   [junit4]   2> 38491 INFO  (zkCallback-80-thread-1-processing-n:127.0.0.1:41827_solr) [n:127.0.0.1:41827_solr    ] o.a.s.c.c.ZkStateReader Updated live nodes from ZooKeeper... (2) -> (3)
   [junit4]   2> 38493 INFO  (zkCallback-84-thread-1-processing-n:127.0.0.1:34245_solr) [n:127.0.0.1:34245_solr    ] o.a.s.c.c.ZkStateReader Updated live nodes from ZooKeeper... (2) -> (3)
   [junit4]   2> 38507 INFO  (zkCallback-82-thread-1-processing-n:127.0.0.1:34381_solr) [n:127.0.0.1:34381_solr    ] o.a.s.c.c.ZkStateReader Updated live nodes from ZooKeeper... (2) -> (3)
   [junit4]   2> 38543 INFO  (jetty-launcher-58-thread-3) [n:127.0.0.1:41827_solr    ] o.a.s.m.r.SolrJmxReporter JMX monitoring for 'solr_41827.solr.node' (registry 'solr.node') enabled at server: com.sun.jmx.mbeanserver.JmxMBeanServer@1a0c2c
   [junit4]   2> 38579 INFO  (jetty-launcher-58-thread-3) [n:127.0.0.1:41827_solr    ] o.a.s.m.r.SolrJmxReporter JMX monitoring for 'solr_41827.solr.jvm' (registry 'solr.jvm') enabled at server: com.sun.jmx.mbeanserver.JmxMBeanServer@1a0c2c
   [junit4]   2> 38579 INFO  (jetty-launcher-58-thread-3) [n:127.0.0.1:41827_solr    ] o.a.s.m.r.SolrJmxReporter JMX monitoring for 'solr_41827.solr.jetty' (registry 'solr.jetty') enabled at server: com.sun.jmx.mbeanserver.JmxMBeanServer@1a0c2c
   [junit4]   2> 38580 INFO  (jetty-launcher-58-thread-3) [n:127.0.0.1:41827_solr    ] o.a.s.c.CorePropertiesLocator Found 0 core definitions underneath /home/jenkins/workspace/Lucene-Solr-master-Linux/solr/build/solr-core/test/J1/temp/solr.handler.admin.AutoscalingHistoryHandlerTest_9F4FE8CCAF6AF3-001/tempDir-001/node3/.
   [junit4]   2> 38625 INFO  (jetty-launcher-58-thread-1) [n:127.0.0.1:34245_solr    ] o.a.s.m.r.SolrJmxReporter JMX monitoring for 'solr_34245.solr.node' (registry 'solr.node') enabled at server: com.sun.jmx.mbeanserver.JmxMBeanServer@1a0c2c
   [junit4]   2> 38633 INFO  (jetty-launcher-58-thread-1) [n:127.0.0.1:34245_solr    ] o.a.s.m.r.SolrJmxReporter JMX monitoring for 'solr_34245.solr.jvm' (registry 'solr.jvm') enabled at server: com.sun.jmx.mbeanserver.JmxMBeanServer@1a0c2c
   [junit4]   2> 38633 INFO  (jetty-launcher-58-thread-1) [n:127.0.0.1:34245_solr    ] o.a.s.m.r.SolrJmxReporter JMX monitoring for 'solr_34245.solr.jetty' (registry 'solr.jetty') enabled at server: com.sun.jmx.mbeanserver.JmxMBeanServer@1a0c2c
   [junit4]   2> 38635 INFO  (jetty-launcher-58-thread-1) [n:127.0.0.1:34245_solr    ] o.a.s.c.CorePropertiesLocator Found 0 core definitions underneath /home/jenkins/workspace/Lucene-Solr-master-Linux/solr/build/solr-core/test/J1/temp/solr.handler.admin.AutoscalingHistoryHandlerTest_9F4FE8CCAF6AF3-001/tempDir-001/node1/.
   [junit4]   2> 38665 INFO  (jetty-launcher-58-thread-2) [n:127.0.0.1:34381_solr    ] o.a.s.m.r.SolrJmxReporter JMX monitoring for 'solr_34381.solr.node' (registry 'solr.node') enabled at server: com.sun.jmx.mbeanserver.JmxMBeanServer@1a0c2c
   [junit4]   2> 38679 INFO  (jetty-launcher-58-thread-2) [n:127.0.0.1:34381_solr    ] o.a.s.m.r.SolrJmxReporter JMX monitoring for 'solr_34381.solr.jvm' (registry 'solr.jvm') enabled at server: com.sun.jmx.mbeanserver.JmxMBeanServer@1a0c2c
   [junit4]   2> 38679 INFO  (jetty-launcher-58-thread-2) [n:127.0.0.1:34381_solr    ] o.a.s.m.r.SolrJmxReporter JMX monitoring for 'solr_34381.solr.jetty' (registry 'solr.jetty') enabled at server: com.sun.jmx.mbeanserver.JmxMBeanServer@1a0c2c
   [junit4]   2> 38683 INFO  (jetty-launcher-58-thread-2) [n:127.0.0.1:34381_solr    ] o.a.s.c.CorePropertiesLocator Found 0 core definitions underneath /home/jenkins/workspace/Lucene-Solr-master-Linux/solr/build/solr-core/test/J1/temp/solr.handler.admin.AutoscalingHistoryHandlerTest_9F4FE8CCAF6AF3-001/tempDir-001/node2/.
   [junit4]   2> 38775 INFO  (zkConnectionManagerCallback-93-thread-1) [    ] o.a.s.c.c.ConnectionManager zkClient has connected
   [junit4]   2> 38810 INFO  (zkConnectionManagerCallback-97-thread-1) [    ] o.a.s.c.c.ConnectionManager zkClient has connected
   [junit4]   2> 38812 INFO  (SUITE-AutoscalingHistoryHandlerTest-seed#[9F4FE8CCAF6AF3]-worker) [    ] o.a.s.c.c.ZkStateReader Updated live nodes from ZooKeeper... (0) -> (3)
   [junit4]   2> 38812 INFO  (SUITE-AutoscalingHistoryHandlerTest-seed#[9F4FE8CCAF6AF3]-worker) [    ] o.a.s.c.s.i.ZkClientClusterStateProvider Cluster at 127.0.0.1:35351/solr ready
   [junit4]   2> 38829 INFO  (qtp16736056-288) [n:127.0.0.1:34381_solr    ] o.a.s.h.a.CollectionsHandler Invoked Collection Action :create with params replicationFactor=3&name=AutoscalingHistoryHandlerTest_collection&nrtReplicas=3&action=CREATE&numShards=1&wt=javabin&version=2 and sendToOCPQueue=true
   [junit4]   2> 38838 INFO  (OverseerThreadFactory-164-thread-1-processing-n:127.0.0.1:41827_solr) [n:127.0.0.1:41827_solr    ] o.a.s.c.a.c.CreateCollectionCmd Create collection AutoscalingHistoryHandlerTest_collection
   [junit4]   2> 38839 INFO  (OverseerThreadFactory-164-thread-1-processing-n:127.0.0.1:41827_solr) [n:127.0.0.1:41827_solr    ] o.a.s.c.c.ZkConfigManager Copying zk node /configs/_default/protwords.txt to /configs/AutoscalingHistoryHandlerTest_collection.AUTOCREATED/protwords.txt
   [junit4]   2> 38840 INFO  (OverseerThreadFactory-164-thread-1-processing-n:127.0.0.1:41827_solr) [n:127.0.0.1:41827_solr    ] o.a.s.c.c.ZkConfigManager Copying zk node /configs/_default/managed-schema to /configs/AutoscalingHistoryHandlerTest_collection.AUTOCREATED/managed-schema
   [junit4]   2> 38841 INFO  (OverseerThreadFactory-164-thread-1-processing-n:127.0.0.1:41827_solr) [n:127.0.0.1:41827_solr    ] o.a.s.c.c.ZkConfigManager Copying zk node /configs/_default/solrconfig.xml to /configs/AutoscalingHistoryHandlerTest_collection.AUTOCREATED/solrconfig.xml
   [junit4]   2> 38842 INFO  (OverseerThreadFactory-164-thread-1-processing-n:127.0.0.1:41827_solr) [n:127.0.0.1:41827_solr    ] o.a.s.c.c.ZkConfigManager Copying zk node /configs/_default/synonyms.txt to /configs/AutoscalingHistoryHandlerTest_collection.AUTOCREATED/synonyms.txt
   [junit4]   2> 38843 INFO  (OverseerThreadFactory-164-thread-1-processing-n:127.0.0.1:41827_solr) [n:127.0.0.1:41827_solr    ] o.a.s.c.c.ZkConfigManager Copying zk node /configs/_default/stopwords.txt to /configs/AutoscalingHistoryHandlerTest_collection.AUTOCREATED/stopwords.txt
   [junit4]   2> 38845 INFO  (OverseerThreadFactory-164-thread-1-processing-n:127.0.0.1:41827_solr) [n:127.0.0.1:41827_solr    ] o.a.s.c.c.ZkConfigManager Copying zk node /configs/_default/lang/contractions_it.txt to /configs/AutoscalingHistoryHandlerTest_collection.AUTOCREATED/lang/contractions_it.txt
   [junit4]   2> 38846 INFO  (OverseerThreadFactory-164-thread-1-processing-n:127.0.0.1:41827_solr) [n:127.0.0.1:41827_solr    ] o.a.s.c.c.ZkConfigManager Copying zk node /configs/_default/lang/stemdict_nl.txt to /configs/AutoscalingHistoryHandlerTest_collection.AUTOCREATED/lang/stemdict_nl.txt
   [junit4]   2> 38847 INFO  (OverseerThreadFactory-164-thread-1-processing-n:127.0.0.1:41827_solr) [n:127.0.0.1:41827_solr    ] o.a.s.c.c.ZkConfigManager Copying zk node /configs/_default/lang/stopwords_hy.txt to /configs/AutoscalingHistoryHandlerTest_collection.AUTOCREATED/lang/stopwords_hy.txt
   [junit4]   2> 38848 INFO  (OverseerThreadFactory-164-thread-1-processing-n:127.0.0.1:41827_solr) [n:127.0.0.1:41827_solr    ] o.a.s.c.c.ZkConfigManager Copying zk node /configs/_default/lang/stopwords_no.txt to /configs/AutoscalingHistoryHandlerTest_collection.AUTOCREATED/lang/stopwords_no.txt
   [junit4]   2> 38849 INFO  (OverseerThreadFactory-164-thread-1-processing-n:127.0.0.1:41827_solr) [n:127.0.0.1:41827_solr    ] o.a.s.c.c.ZkConfigManager Copying zk node /configs/_default/lang/contractions_ca.txt to /configs/AutoscalingHistoryHandlerTest_collection.AUTOCREATED/lang/contractions_ca.txt
   [junit4]   2> 38850 INFO  (OverseerThreadFactory-164-thread-1-processing-n:127.0.0.1:41827_solr) [n:127.0.0.1:41827_solr    ] o.a.s.c.c.ZkConfigManager Copying zk node /configs/_default/lang/stopwords_id.txt to /configs/AutoscalingHistoryHandlerTest_collection.AUTOCREATED/lang/stopwords_id.txt
   [junit4]   2> 38851 INFO  (OverseerThreadFactory-164-thread-1-processing-n:127.0.0.1:41827_solr) [n:127.0.0.1:41827_solr    ] o.a.s.c.c.ZkConfigManager Copying zk node /configs/_default/lang/stopwords_ga.txt to /configs/AutoscalingHistoryHandlerTest_collection.AUTOCREATED/lang/stopwords_ga.txt
   [junit4]   2> 38852 INFO  (OverseerThreadFactory-164-thread-1-processing-n:127.0.0.1:41827_solr) [n:127.0.0.1:41827_solr    ] o.a.s.c.c.ZkConfigManager Copying zk node /configs/_default/lang/stopwords_hi.txt to /configs/AutoscalingHistoryHandlerTest_collection.AUTOCREATED/lang/stopwords_hi.txt
   [junit4]   2> 38854 INFO  (OverseerThreadFactory-164-thread-1-processing-n:127.0.0.1:41827_solr) [n:127.0.0.1:41827_solr    ] o.a.s.c.c.ZkConfigManager Copying zk node /configs/_default/lang/stopwords_da.txt to /configs/AutoscalingHistoryHandlerTest_collection.AUTOCREATED/lang/stopwords_da.txt
   [junit4]   2> 38854 INFO  (OverseerThreadFactory-164-thread-1-processing-n:127.0.0.1:41827_solr) [n:127.0.0.1:41827_solr    ] o.a.s.c.c.ZkConfigManager Copying zk node /configs/_default/lang/stopwords_ja.txt to /configs/AutoscalingHistoryHandlerTest_collection.AUTOCREATED/lang/stopwords_ja.txt
   [junit4]   2> 38855 INFO  (OverseerThreadFactory-164-thread-1-processing-n:127.0.0.1:41827_solr) [n:127.0.0.1:41827_solr    ] o.a.s.c.c.ZkConfigManager Copying zk node /configs/_default/lang/stopwords_pt.txt to /configs/AutoscalingHistoryHandlerTest_collection.AUTOCREATED/lang/stopwords_pt.txt
   [junit4]   2> 38858 INFO  (OverseerThreadFactory-164-thread-1-processing-n:127.0.0.1:41827_solr) [n:127.0.0.1:41827_solr    ] o.a.s.c.c.ZkConfigManager Copying zk node /configs/_default/lang/stopwords_hu.txt to /configs/AutoscalingHistoryHandlerTest_collection.AUTOCREATED/lang/stopwords_hu.txt
   [junit4]   2> 38861 INFO  (OverseerThreadFactory-164-thread-1-processing-n:127.0.0.1:41827_solr) [n:127.0.0.1:41827_solr    ] o.a.s.c.c.ZkConfigManager Copying zk node /configs/_default/lang/stopwords_el.txt to /configs/AutoscalingHistoryHandlerTest_collection.AUTOCREATED/lang/stopwords_el.txt
   [junit4]   2> 38861 INFO  (OverseerThreadFactory-164-thread-1-processing-n:127.0.0.1:41827_solr) [n:127.0.0.1:41827_solr    ] o.a.s.c.c.ZkConfigManager Copying zk node /configs/_default/lang/stopwords_ru.txt to /configs/AutoscalingHistoryHandlerTest_collection.AUTOCREATED/lang/stopwords_ru.txt
   [junit4]   2> 38863 INFO  (OverseerThreadFactory-164-thread-1-processing-n:127.0.0.1:41827_solr) [n:127.0.0.1:41827_solr    ] o.a.s.c.c.ZkConfigManager Copying zk node /configs/_default/lang/stopwords_tr.txt to /configs/AutoscalingHistoryHandlerTest_collection.AUTOCREATED/lang/stopwords_tr.txt
   [junit4]   2> 38863 INFO  (OverseerThreadFactory-164-thread-1-processing-n:127.0.0.1:41827_solr) [n:127.0.0.1:41827_solr    ] o.a.s.c.c.ZkConfigManager Copying zk node /configs/_default/lang/stopwords_ar.txt to /configs/AutoscalingHistoryHandlerTest_collection.AUTOCREATED/lang/stopwords_ar.txt
   [junit4]   2> 38865 INFO  (OverseerThreadFactory-164-thread-1-processing-n:127.0.0.1:41827_solr) [n:127.0.0.1:41827_solr    ] o.a.s.c.c.ZkConfigManager Copying zk node /configs/_default/lang/userdict_ja.txt to /configs/AutoscalingHistoryHandlerTest_collection.AUTOCREATED/lang/userdict_ja.txt
   [junit4]   2> 38866 INFO  (OverseerThreadFactory-164-thread-1-processing-n:127.0.0.1:41827_solr) [n:127.0.0.1:41827_solr    ] o.a.s.c.c.ZkConfigManager Copying zk node /configs/_default/lang/stopwords_eu.txt to /configs/AutoscalingHistoryHandlerTest_collection.AUTOCREATED/lang/stopwords_eu.txt
   [junit4]   2> 38872 INFO  (OverseerThreadFactory-164-thread-1-processing-n:127.0.0.1:41827_solr) [n:127.0.0.1:41827_solr    ] o.a.s.c.c.ZkConfigManager Copying zk node /configs/_default/lang/stopwords_it.txt to /configs/AutoscalingHistoryHandlerTest_collection.AUTOCREATED/lang/stopwords_it.txt
   [junit4]   2> 38873 INFO  (OverseerThreadFactory-164-thread-1-processing-n:127.0.0.1:41827_solr) [n:127.0.0.1:41827_solr    ] o.a.s.c.c.ZkConfigManager Copying zk node /configs/_default/lang/stopwords_cz.txt to /configs/AutoscalingHistoryHandlerTest_collection.AUTOCREATED/lang/stopwords_cz.txt
   [junit4]   2> 38874 INFO  (OverseerThreadFactory-164-thread-1-processing-n:127.0.0.1:41827_solr) [n:127.0.0.1:41827_solr    ] o.a.s.c.c.ZkConfigManager Copying zk node /configs/_default/lang/stoptags_ja.txt to /configs/AutoscalingHistoryHandlerTest_collection.AUTOCREATED/lang/stoptags_ja.txt
   [junit4]   2> 38875 INFO  (OverseerThreadFactory-164-thread-1-processing-n:127.0.0.1:41827_solr) [n:127.0.0.1:41827_solr    ] o.a.s.c.c.ZkConfigManager Copying zk node /configs/_default/lang/contractions_fr.txt to /configs/AutoscalingHistoryHandlerTest_collection.AUTOCREATED/lang/contractions_fr.txt
   [junit4]   2> 38876 INFO  (OverseerThreadFactory-164-thread-1-processing-n:127.0.0.1:41827_solr) [n:127.0.0.1:41827_solr    ] o.a.s.c.c.ZkConfigManager Copying zk node /configs/_default/lang/stopwords_de.txt to /configs/AutoscalingHistoryHandlerTest_collection.AUTOCREATED/lang/stopwords_de.txt
   [junit4]   2> 38878 INFO  (OverseerThreadFactory-164-thread-1-processing-n:127.0.0.1:41827_solr) [n:127.0.0.1:41827_solr    ] o.a.s.c.c.ZkConfigManager Copying zk node /configs/_default/lang/stopwords_fa.txt to /configs/AutoscalingHistoryHandlerTest_collection.AUTOCREATED/lang/stopwords_fa.txt
   [junit4]   2> 38879 INFO  (OverseerThreadFactory-164-thread-1-processing-n:127.0.0.1:41827_solr) [n:127.0.0.1:41827_solr    ] o.a.s.c.c.ZkConfigManager Copying zk node /configs/_default/lang/contractions_ga.txt to /configs/AutoscalingHistoryHandlerTest_collection.AUTOCREATED/lang/contractions_ga.txt
   [junit4]   2> 38880 INFO  (OverseerThreadFactory-164-thread-1-processing-n:127.0.0.1:41827_solr) [n:127.0.0.1:41827_solr    ] o.a.s.c.c.ZkConfigManager Copying zk node /configs/_default/lang/stopwords_ca.txt to /configs/AutoscalingHistoryHandlerTest_collection.AUTOCREATED/lang/stopwords_ca.txt
   [junit4]   2> 38881 INFO  (OverseerThreadFactory-164-thread-1-processing-n:127.0.0.1:41827_solr) [n:127.0.0.1:41827_solr    ] o.a.s.c.c.ZkConfigManager Copying zk node /configs/_default/lang/stopwords_nl.txt to /configs/AutoscalingHistoryHandlerTest_collection.AUTOCREATED/lang/stopwords_nl.txt
   [junit4]   2> 38882 INFO  (OverseerThreadFactory-164-thread-1-processing-n:127.0.0.1:41827_solr) [n:127.0.0.1:41827_solr    ] o.a.s.c.c.ZkConfigManager Copying zk node /configs/_default/lang/stopwords_bg.txt to /configs/AutoscalingHistoryHandlerTest_collection.AUTOCREATED/lang/stopwords_bg.txt
   [junit4]   2> 38882 INFO  (OverseerThreadFactory-164-thread-1-processing-n:127.0.0.1:41827_solr) [n:127.0.0.1:41827_solr    ] o.a.s.c.c.ZkConfigManager Copying zk node /configs/_default/lang/stopwords_lv.txt to /configs/AutoscalingHistoryHandlerTest_collection.AUTOCREATED/lang/stopwords_lv.txt
   [junit4]   2> 38884 INFO  (OverseerThreadFactory-164-thread-1-processing-n:127.0.0.1:41827_solr) [n:127.0.0.1:41827_solr    ] o.a.s.c.c.ZkConfigManager Copying zk node /configs/_default/lang/stopwords_en.txt to /configs/AutoscalingHistoryHandlerTest_collection.AUTOCREATED/lang/stopwords_en.txt
   [junit4]   2> 38885 INFO  (OverseerThreadFactory-164-thread-1-processing-n:127.0.0.1:41827_solr) [n:127.0.0.1:41827_solr    ] o.a.s.c.c.ZkConfigManager Copying zk node /configs/_default/lang/stopwords_es.txt to /configs/AutoscalingHistoryHandlerTest_collection.AUTOCREATED/lang/stopwords_es.txt
   [junit4]   2> 38886 INFO  (OverseerThreadFactory-164-thread-1-processing-n:127.0.0.1:41827_solr) [n:127.0.0.1:41827_solr    ] o.a.s.c.c.ZkConfigManager Copying zk node /configs/_default/lang/stopwords_th.txt to /configs/AutoscalingHistoryHandlerTest_collection.AUTOCREATED/lang/stopwords_th.txt
   [junit4]   2> 38887 INFO  (OverseerThreadFactory-164-thread-1-processing-n:127.0.0.1:41827_solr) [n:127.0.0.1:41827_solr    ] o.a.s.c.c.ZkConfigManager Copying zk node /configs/_default/lang/stopwords_ro.txt to /configs/AutoscalingHistoryHandlerTest_collection.AUTOCREATED/lang/stopwords_ro.txt
   [junit4]   2> 38887 INFO  (OverseerThreadFactory-164-thread-1-processing-n:127.0.0.1:41827_solr) [n:127.0.0.1:41827_solr    ] o.a.s.c.c.ZkConfigManager Copying zk node /configs/_default/lang/stopwords_fr.txt to /configs/AutoscalingHistoryHandlerTest_collection.AUTOCREATED/lang/stopwords_fr.txt
   [junit4]   2> 38888 INFO  (OverseerThreadFactory-164-thread-1-processing-n:127.0.0.1:41827_solr) [n:127.0.0.1:41827_solr    ] o.a.s.c.c.ZkConfigManager Copying zk node /configs/_default/lang/stopwords_sv.txt to /configs/AutoscalingHistoryHandlerTest_collection.AUTOCREATED/lang/stopwords_sv.txt
   [junit4]   2> 38889 INFO  (OverseerThreadFactory-164-thread-1-processing-n:127.0.0.1:41827_solr) [n:127.0.0.1:41827_solr    ] o.a.s.c.c.ZkConfigManager Copying zk node /configs/_default/lang/stopwords_fi.txt to /configs/AutoscalingHistoryHandlerTest_collection.AUTOCREATED/lang/stopwords_fi.txt
   [junit4]   2> 38890 INFO  (OverseerThreadFactory-164-thread-1-processing-n:127.0.0.1:41827_solr) [n:127.0.0.1:41827_solr    ] o.a.s.c.c.ZkConfigManager Copying zk node /configs/_default/lang/hyphenations_ga.txt to /configs/AutoscalingHistoryHandlerTest_collection.AUTOCREATED/lang/hyphenations_ga.txt
   [junit4]   2> 38890 INFO  (OverseerThreadFactory-164-thread-1-processing-n:127.0.0.1:41827_solr) [n:127.0.0.1:41827_solr    ] o.a.s.c.c.ZkConfigManager Copying zk node /configs/_default/lang/stopwords_gl.txt to /configs/AutoscalingHistoryHandlerTest_collection.AUTOCREATED/lang/stopwords_gl.txt
   [junit4]   2> 38891 INFO  (OverseerThreadFactory-164-thread-1-processing-n:127.0.0.1:41827_solr) [n:127.0.0.1:41827_solr    ] o.a.s.c.c.ZkConfigManager Copying zk node /configs/_default/params.json to /configs/AutoscalingHistoryHandlerTest_collection.AUTOCREATED/params.json
   [junit4]   2> 38910 DEBUG (OverseerStateUpdate-99425206485385223-127.0.0.1:41827_solr-n_0000000000) [n:127.0.0.1:41827_solr    ] o.a.s.c.Overseer processMessage: queueSize: 1, message = {
   [junit4]   2>   "name":"AutoscalingHistoryHandlerTest_collection",
   [junit4]   2>   "fromApi":"true",
   [junit4]   2>   "replicationFactor":"3",
   [junit4]   2>   "numShards":"1",
   [junit4]   2>   "nrtReplicas":"3",
   [junit4]   2>   "stateFormat":"2",
   [junit4]   2>   "operation":"create"} current state version: 0
   [junit4]   2> 38910 DEBUG (OverseerStateUpdate-99425206485385223-127.0.0.1:41827_solr-n_0000000000) [n:127.0.0.1:41827_solr    ] o.a.s.c.o.ClusterStateMutator building a new cName: AutoscalingHistoryHandlerTest_collection
   [junit4]   2> 38910 DEBUG (OverseerStateUpdate-99425206485385223-127.0.0.1:41827_solr-n_0000000000) [n:127.0.0.1:41827_solr    ] o.a.s.c.o.ZkStateWriter going to create_collection /collections/AutoscalingHistoryHandlerTest_collection/state.json
   [junit4]   2> 39017 DEBUG (OverseerStateUpdate-99425206485385223-127.0.0.1:41827_solr-n_0000000000) [n:127.0.0.1:41827_solr    ] o.a.s.c.Overseer processMessage: queueSize: 1, message = {
   [junit4]   2>   "operation":"ADDREPLICA",
   [junit4]   2>   "collection":"AutoscalingHistoryHandlerTest_collection",
   [junit4]   2>   "shard":"shard1",
   [junit4]   2>   "core":"AutoscalingHistoryHandlerTest_collection_shard1_replica_n1",
   [junit4]   2>   "state":"down",
   [junit4]   2>   "base_url":"http://127.0.0.1:41827/solr",
   [junit4]   2>   "type":"NRT",
   [junit4]   2>   "waitForFinalState":"false"} current state version: 0
   [junit4]   2> 39017 INFO  (OverseerStateUpdate-99425206485385223-127.0.0.1:41827_solr-n_0000000000) [n:127.0.0.1:41827_solr    ] o.a.s.c.o.SliceMutator createReplica() {
   [junit4]   2>   "operation":"ADDREPLICA",
   [junit4]   2>   "collection":"AutoscalingHistoryHandlerTest_collection",
   [junit4]   2>   "shard":"shard1",
   [junit4]   2>   "core":"AutoscalingHistoryHandlerTest_collection_shard1_replica_n1",
   [junit4]   2>   "state":"down",
   [junit4]   2>   "base_url":"http://127.0.0.1:41827/solr",
   [junit4]   2>   "type":"NRT",
   [junit4]   2>   "waitForFinalState":"false"} 
   [junit4]   2> 39018 DEBUG (OverseerStateUpdate-99425206485385223-127.0.0.1:41827_solr-n_0000000000) [n:127.0.0.1:41827_solr    ] o.a.s.c.o.SliceMutator Old Slice: shard1:{
   [junit4]   2>   "range":"80000000-7fffffff",
   [junit4]   2>   "state":"active",
   [junit4]   2>   "replicas":{}}
   [junit4]   2> 39018 DEBUG (OverseerStateUpdate-99425206485385223-127.0.0.1:41827_solr-n_0000000000) [n:127.0.0.1:41827_solr    ] o.a.s.c.o.SliceMutator New Slice: shard1:{
   [junit4]   2>   "range":"80000000-7fffffff",
   [junit4]   2>   "state":"active",
   [junit4]   2>   "replicas":{"core_node3":{
   [junit4]   2>       "core":"AutoscalingHistoryHandlerTest_collection_shard1_replica_n1",
   [junit4]   2>       "base_url":"http://127.0.0.1:41827/solr",
   [junit4]   2>       "state":"down",
   [junit4]   2>       "node_name":null,
   [junit4]   2>       "type":"NRT"}}}
   [junit4]   2> 39019 DEBUG (OverseerStateUpdate-99425206485385223-127.0.0.1:41827_solr-n_0000000000) [n:127.0.0.1:41827_solr    ] o.a.s.c.Overseer processMessage: queueSize: 2, message = {
   [junit4]   2>   "operation":"ADDREPLICA",
   [junit4]   2>   "collection":"AutoscalingHistoryHandlerTest_collection",
   [junit4]   2>   "shard":"shard1",
   [junit4]   2>   "core":"AutoscalingHistoryHandlerTest_collection_shard1_replica_n2",
   [junit4]   2>   "state":"down",
   [junit4]   2>   "base_url":"http://127.0.0.1:34381/solr",
   [junit4]   2>   "type":"NRT",
   [junit4]   2>   "waitForFinalState":"false"} current state version: 0
   [junit4]   2> 39019 INFO  (OverseerStateUpdate-99425206485385223-127.0.0.1:41827_solr-n_0000000000) [n:127.0.0.1:41827_solr    ] o.a.s.c.o.SliceMutator createReplica() {
   [junit4]   2>   "operation":"ADDREPLICA",
   [junit4]   2>   "collection":"AutoscalingHistoryHandlerTest_collection",
   [junit4]   2>   "shard":"shard1",
   [junit4]   2>   "core":"AutoscalingHistoryHandlerTest_collection_shard1_replica_n2",
   [junit4]   2>   "state":"down",
   [junit4]   2>   "base_url":"http://127.0.0.1:34381/solr",
   [junit4]   2>   "type":"NRT",
   [junit4]   2>   "waitForFinalState":"false"} 
   [junit4]   2> 39019 DEBUG (OverseerStateUpdate-99425206485385223-127.0.0.1:41827_solr-n_0000000000) [n:127.0.0.1:41827_solr    ] o.a.s.c.o.SliceMutator Old Slice: shard1:{
   [junit4]   2>   "range":"80000000-7fffffff",
   [junit4]   2>   "state":"active",
   [junit4]   2>   "replicas":{"core_node3":{
   [junit4]   2>       "core":"AutoscalingHistoryHandlerTest_collection_shard1_replica_n1",
   [junit4]   2>       "base_url":"http://127.0.0.1:41827/solr",
   [junit4]   2>       "state":"down",
   [junit4]   2>       "node_name":null,
   [junit4]   2>       "type":"NRT"}}}
   [junit4]   2> 39019 DEBUG (OverseerStateUpdate-99425206485385223-127.0.0.1:41827_solr-n_0000000000) [n:127.0.0.1:41827_solr    ] o.a.s.c.o.SliceMutator New Slice: shard1:{
   [junit4]   2>   "range":"80000000-7fffffff",
   [junit4]   2>   "state":"active",
   [junit4]   2>   "replicas":{
   [junit4]   2>     "core_node3":{
   [junit4]   2>       "core":"AutoscalingHistoryHandlerTest_collection_shard1_replica_n1",
   [junit4]   2>       "base_url":"http://127.0.0.1:41827/solr",
   [junit4]   2>       "state":"down",
   [junit4]   2>       "node_name":null,
   [junit4]   2>       "type":"NRT"},
   [junit4]   2>     "core_node5":{
   [junit4]   2>       "core":"AutoscalingHistoryHandlerTest_collection_shard1_replica_n2",
   [junit4]   2>       "base_url":"http://127.0.0.1:34381/solr",
   [junit4]   2>       "state":"down",
   [junit4]   2>       "node_name":null,
   [junit4]   2>       "type":"NRT"}}}
   [junit4]   2> 39020 DEBUG (OverseerStateUpdate-99425206485385223-127.0.0.1:41827_solr-n_0000000000) [n:127.0.0.1:41827_solr    ] o.a.s.c.Overseer processMessage: queueSize: 3, message = {
   [junit4]   2>   "operation":"ADDREPLICA",
   [junit4]   2>   "collection":"AutoscalingHistoryHandlerTest_collection",
   [junit4]   2>   "shard":"shard1",
   [junit4]   2>   "core":"AutoscalingHistoryHandlerTest_collection_shard1_replica_n4",
   [junit4]   2>   "state":"down",
   [junit4]   2>   "base_url":"http://127.0.0.1:34245/solr",
   [junit4]   2>   "type":"NRT",
   [junit4]   2>   "waitForFinalState":"false"} current state version: 0
   [junit4]   2> 39020 INFO  (OverseerStateUpdate-99425206485385223-127.0.0.1:41827_solr-n_0000000000) [n:127.0.0.1:41827_solr    ] o.a.s.c.o.SliceMutator createReplica() {
   [junit4]   2>   "operation":"ADDREPLICA",
   [junit4]   2>   "collection":"AutoscalingHistoryHandlerTest_collection",
   [junit4]   2>   "shard":"shard1",
   [junit4]   2>   "core":"AutoscalingHistoryHandlerTest_collection_shard1_replica_n4",
   [junit4]   2>   "state":"down",
   [junit4]   2>   "base_url":"http://127.0.0.1:34245/solr",
   [junit4]   2>   "type":"NRT",
   [junit4]   2>   "waitForFinalState":"false"} 
   [junit4]   2> 39023 DEBUG (OverseerStateUpdate-99425206485385223-127.0.0.1:41827_solr-n_0000000000) [n:127.0.0.1:41827_solr    ] o.a.s.c.o.SliceMutator Old Slice: shard1:{
   [junit4]   2>   "range":"80000000-7fffffff",
   [junit4]   2>   "state":"active",
   [junit4]   2>   "replicas":{
   [junit4]   2>     "core_node3":{
   [junit4]   2>       "core":"AutoscalingHistoryHandlerTest_collection_shard1_replica_n1",
   [junit4]   2>       "base_url":"http://127.0.0.1:41827/solr",
   [junit4]   2>       "state":"down",
   [junit4]   2>       "node_name":null,
   [junit4]   2>       "type":"NRT"},
   [junit4]   2>     "core_node5":{
   [junit4]   2>       "core":"AutoscalingHistoryHandlerTest_collection_shard1_replica_n2",
   [junit4]   2>       "base_url":"http://127.0.0.1:34381/solr",
   [junit4]   2>       "state":"down",
   [junit4]   2>       "node_name":null,
   [junit4]   2>       "type":"NRT"}}}
   [junit4]   2> 39023 DEBUG (OverseerStateUpdate-99425206485385223-127.0.0.1:41827_solr-n_0000000000) [n:127.0.0.1:41827_solr    ] o.a.s.c.o.SliceMutator New Slice: shard1:{
   [junit4]   2>   "range":"80000000-7fffffff",
   [junit4]   2>   "state":"active",
   [junit4]   2>   "replicas":{
   [junit4]   2>     "core_node3":{
   [junit4]   2>       "core":"AutoscalingHistoryHandlerTest_collection_shard1_replica_n1",
   [junit4]   2>       "base_url":"http://127.0.0.1:41827/solr",
   [junit4]   2>       "state":"down",
   [junit4]   2>       "node_name":null,
   [junit4]   2>       "type":"NRT"},
   [junit4]   2>     "core_node5":{
   [junit4]   2>       "core":"AutoscalingHistoryHandlerTest_collection_shard1_replica_n2",
   [junit4]   2>       "base_url":"http://127.0.0.1:34381/solr",
   [junit4]   2>       "state":"down",
   [junit4]   2>       "node_name":null,
   [junit4]   2>       "type":"NRT"},
   [junit4]   2>     "core_node6":{
   [junit4]   2>       "core":"AutoscalingHistoryHandlerTest_collection_shard1_replica_n4",
   [junit4]   2>       "base_url":"http://127.0.0.1:34245/solr",
   [junit4]   2>       "state":"down",
   [junit4]   2>       "node_name":null,
   [junit4]   2>       "type":"NRT"}}}
   [junit4]   2> 39124 DEBUG (OverseerStateUpdate-99425206485385223-127.0.0.1:41827_solr-n_0000000000) [n:127.0.0.1:41827_solr    ] o.a.s.c.o.ZkStateWriter going to update_collection /collections/AutoscalingHistoryHandlerTest_collection/state.json version: 0
   [junit4]   2> 39224 INFO  (qtp16736056-301) [n:127.0.0.1:34381_solr    ] o.a.s.h.a.CoreAdminOperation core create command qt=/admin/cores&coreNodeName=core_node5&collection.configName=AutoscalingHistoryHandlerTest_collection.AUTOCREATED&newCollection=true&name=AutoscalingHistoryHandlerTest_collection_shard1_replica_n2&action=CREATE&numShards=1&collection=AutoscalingHistoryHandlerTest_collection&shard=shard1&wt=javabin&version=2&replicaType=NRT
   [junit4]   2> 39224 INFO  (qtp856224-286) [n:127.0.0.1:34245_solr    ] o.a.s.h.a.CoreAdminOperation core create command qt=/admin/cores&coreNodeName=core_node6&collection.configName=AutoscalingHistoryHandlerTest_collection.AUTOCREATED&newCollection=true&name=AutoscalingHistoryHandlerTest_collection_shard1_replica_n4&action=CREATE&numShards=1&collection=AutoscalingHistoryHandlerTest_collection&shard=shard1&wt=javabin&version=2&replicaType=NRT
   [junit4]   2> 39224 INFO  (qtp16736056-301) [n:127.0.0.1:34381_solr    ] o.a.s.c.TransientSolrCoreCacheDefault Allocating transient cache for 2147483647 transient cores
   [junit4]   2> 39224 INFO  (qtp856224-286) [n:127.0.0.1:34245_solr    ] o.a.s.c.TransientSolrCoreCacheDefault Allocating transient cache for 2147483647 transient cores
   [junit4]   2> 39225 INFO  (qtp19402411-302) [n:127.0.0.1:41827_solr    ] o.a.s.h.a.CoreAdminOperation core create command qt=/admin/cores&coreNodeName=core_node3&collection.configName=AutoscalingHistoryHandlerTest_collection.AUTOCREATED&newCollection=true&name=AutoscalingHistoryHandlerTest_collection_shard1_replica_n1&action=CREATE&numShards=1&collection=AutoscalingHistoryHandlerTest_collection&shard=shard1&wt=javabin&version=2&replicaType=NRT
   [junit4]   2> 39226 INFO  (qtp19402411-302) [n:127.0.0.1:41827_solr    ] o.a.s.c.TransientSolrCoreCacheDefault Allocating transient cache for 2147483647 transient cores
   [junit4]   2> 39236 DEBUG (OverseerStateUpdate-99425206485385223-127.0.0.1:41827_solr-n_0000000000) [n:127.0.0.1:41827_solr    ] o.a.s.c.Overseer processMessage: queueSize: 1, message = {
   [junit4]   2>   "core":"AutoscalingHistoryHandlerTest_collection_shard1_replica_n4",
   [junit4]   2>   "core_node_name":"core_node6",
   [junit4]   2>   "roles":null,
   [junit4]   2>   "base_url":"http://127.0.0.1:34245/solr",
   [junit4]   2>   "node_name":"127.0.0.1:34245_solr",
   [junit4]   2>   "numShards":"1",
   [junit4]   2>   "state":"down",
   [junit4]   2>   "shard":"shard1",
   [junit4]   2>   "collection":"AutoscalingHistoryHandlerTest_collection",
   [junit4]   2>   "type":"NRT",
   [junit4]   2>   "operation":"state"} current state version: 0
   [junit4]   2> 39236 DEBUG (OverseerStateUpdate-99425206485385223-127.0.0.1:41827_solr-n_0000000000) [n:127.0.0.1:41827_solr    ] o.a.s.c.o.ReplicaMutator Update state numShards=1 message={
   [junit4]   2>   "core":"AutoscalingHistoryHandlerTest_collection_shard1_replica_n4",
   [junit4]   2>   "core_node_name":"core_node6",
   [junit4]   2>   "roles":null,
   [junit4]   2>   "base_url":"http://127.0.0.1:34245/solr",
   [junit4]   2>   "node_name":"127.0.0.1:34245_solr",
   [junit4]   2>   "numShards":"1",
   [junit4]   2>   "state":"down",
   [junit4]   2>   "shard":"shard1",
   [junit4]   2>   "collection":"AutoscalingHistoryHandlerTest_collection",
   [junit4]   2>   "type":"NRT",
   [junit4]   2>   "operation":"state"}
   [junit4]   2> 39236 DEBUG (OverseerStateUpdate-99425206485385223-127.0.0.1:41827_solr-n_0000000000) [n:127.0.0.1:41827_solr    ] o.a.s.c.o.ReplicaMutator Will update state for replica: core_node6:{"core":"AutoscalingHistoryHandlerTest_collection_shard1_replica_n4","base_url":"http://127.0.0.1:34245/solr","node_name":"127.0.0.1:34245_solr","state":"down","type":"NRT"}
   [junit4]   2> 39236 DEBUG (OverseerStateUpdate-99425206485385223-127.0.0.1:41827_solr-n_0000000000) [n:127.0.0.1:41827_solr    ] o.a.s.c.o.ReplicaMutator Collection is now: DocCollection(AutoscalingHistoryHandlerTest_collection//collections/AutoscalingHistoryHandlerTest_collection/state.json/1)={
   [junit4]   2>   "pullReplicas":"0",
   [junit4]   2>   "replicationFactor":"3",
   [junit4]   2>   "router":{"name":"compositeId"},
   [junit4]   2>   "maxShardsPerNode":"1",
   [junit4]   2>   "autoAddReplicas":"false",
   [junit4]   2>   "nrtReplicas":"3",
   [junit4]   2>   "tlogReplicas":"0",
   [junit4]   2>   "shards":{"shard1":{
   [junit4]   2>       "range":"80000000-7fffffff",
   [junit4]   2>       "state":"active",
   [junit4]   2>       "replicas":{
   [junit4]   2>         "core_node3":{
   [junit4]   2>           "core":"AutoscalingHistoryHandlerTest_collection_shard1_replica_n1",
   [junit4]   2>           "base_url":"http://127.0.0.1:41827/solr",
   [junit4]   2>           "state":"down",
   [junit4]   2>           "node_name":null,
   [junit4]   2>           "type":"NRT"},
   [junit4]   2>         "core_node5":{
   [junit4]   2>           "core":"AutoscalingHistoryHandlerTest_collection_shard1_replica_n2",
   [junit4]   2>           "base_url":"http://127.0.0.1:34381/solr",
   [junit4]   2>           "state":"down",
   [junit4]   2>           "node_name":null,
   [junit4]   2>           "type":"NRT"},
   [junit4]   2>         "core_node6":{
   [junit4]   2>           "core":"AutoscalingHistoryHandlerTest_collection_shard1_replica_n4",
   [junit4]   2>           "base_url":"http://127.0.0.1:34245/solr",
   [junit4]   2>           "node_name":"127.0.0.1:34245_solr",
   [junit4]   2>           "state":"down",
   [junit4]   2>           "type":"NRT"}}}}}
   [junit4]   2> 39239 DEBUG (OverseerStateUpdate-99425206485385223-127.0.0.1:41827_solr-n_0000000000) [n:127.0.0.1:41827_solr    ] o.a.s.c.Overseer processMessage: queueSize: 3, message = {
   [junit4]   2>   "core":"AutoscalingHistoryHandlerTest_collection_shard1_replica_n1",
   [junit4]   2>   "core_node_name":"core_node3",
   [junit4]   2>   "roles":null,
   [junit4]   2>   "base_url":"http://127.0.0.1:41827/solr",
   [junit4]   2>   "node_name":"127.0.0.1:41827_solr",
   [junit4]   2>   "numShards":"1",
   [junit4]   2>   "state":"down",
   [junit4]   2>   "shard":"shard1",
   [junit4]   2>   "collection":"AutoscalingHistoryHandlerTest_collection",
   [junit4]   2>   "type":"NRT",
   [junit4]   2>   "operation":"state"} current state version: 0
   [junit4]   2> 39239 DEBUG (OverseerStateUpdate-99425206485385223-127.0.0.1:41827_solr-n_0000000000) [n:127.0.0.1:41827_solr    ] o.a.s.c.o.ReplicaMutator Update state numShards=1 message={
   [junit4]   2>   "core":"AutoscalingHistoryHandlerTest_collection_shard1_replica_n1",
   [junit4]   2>   "core_node_name":"core_node3",
   [junit4]   2>   "roles":null,
   [junit4]   2>   "base_url":"http://127.0.0.1:41827/solr",
   [junit4]   2>   "node_name":"127.0.0.1:41827_solr",
   [junit4]   2>   "numShards":"1",
   [junit4]   2>   "state":"down",
   [junit4]   2>   "shard":"shard1",
   [junit4]   2>   "collection":"AutoscalingHistoryHandlerTest_collection",
   [junit4]   2>   "type":"NRT",
   [junit4]   2>   "operation":"state"}
   [junit4]   2> 39240 DEBUG (OverseerStateUpdate-99425206485385223-127.0.0.1:41827_solr-n_0000000000) [n:127.0.0.1:41827_solr    ] o.a.s.c.o.ReplicaMutator Will update state for replica: core_node3:{"core":"AutoscalingHistoryHandlerTest_collection_shard1_replica_n1","base_url":"http://127.0.0.1:41827/solr","node_name":"127.0.0.1:41827_solr","state":"down","type":"NRT"}
   [junit4]   2> 39240 DEBUG (OverseerStateUpdate-99425206485385223-127.0.0.1:41827_solr-n_0000000000) [n:127.0.0.1:41827_solr    ] o.a.s.c.o.ReplicaMutator Collection is now: DocCollection(AutoscalingHistoryHandlerTest_collection//collections/AutoscalingHistoryHandlerTest_collection/state.json/1)={
   [junit4]   2>   "pullReplicas":"0",
   [junit4]   2>   "replicationFactor":"3",
   [junit4]   2>   "router":{"name":"compositeId"},
   [junit4]   2>   "maxShardsPerNode":"1",
   [junit4]   2>   "autoAddReplicas":"false",
   [junit4]   2>   "nrtReplicas":"3",
   [junit4]   2>   "tlogReplicas":"0",
   [junit4]   2>   "shards":{"shard1":{
   [junit4]   2>       "range":"80000000-7fffffff",
   [junit4]   2>       "state":"active",
   [junit4]   2>       "replicas":{
   [junit4]   2>         "core_node3":{
   [junit4]   2>           "core":"AutoscalingHistoryHandlerTest_collection_shard1_replica_n1",
   [junit4]   2>           "base_url":"http://127.0.0.1:41827/solr",
   [junit4]   2>           "node_name":"127.0.0.1:41827_solr",
   [junit4]   2>           "state":"down",
   [junit4]   2>           "type":"NRT"},
   [junit4]   2>         "core_node5":{
   [junit4]   2>           "core":"AutoscalingHistoryHandlerTest_collection_shard1_replica_n2",
   [junit4]   2>           "base_url":"http://127.0.0.1:34381/solr",
   [junit4]   2>           "state":"down",
   [junit4]   2>           "node_name":null,
   [junit4]   2>           "type":"NRT"},
   [junit4]   2>         "core_node6":{
   [junit4]   2>           "core":"AutoscalingHistoryHandlerTest_collection_shard1_replica_n4",
   [junit4]   2>           "base_url":"http://127.0.0.1:34245/solr",
   [junit4]   2>           "node_name":"127.0.0.1:34245_solr",
   [junit4]   2>           "state":"down",
   [junit4]   2>           "type":"NRT"}}}}}
   [junit4]   2> 39240 DEBUG (OverseerStateUpdate-99425206485385223-127.0.0.1:41827_solr-n_0000000000) [n:127.0.0.1:41827_solr    ] o.a.s.c.Overseer processMessage: queueSize: 3, message = {
   [junit4]   2>   "core":"AutoscalingHistoryHandlerTest_collection_shard1_replica_n2",
   [junit4]   2>   "core_node_name":"core_node5",
   [junit4]   2>   "roles":null,
   [junit4]   2>   "base_url":"http://127.0.0.1:34381/solr",
   [junit4]   2>   "node_name":"127.0.0.1:34381_solr",
   [junit4]   2>   "numShards":"1",
   [junit4]   2>   "state":"down",
   [junit4]   2>   "shard":"shard1",
   [junit4]   2>   "collection":"AutoscalingHistoryHandlerTest_collection",
   [junit4]   2>   "type":"NRT",
   [junit4]   2>   "operation":"state"} current state version: 0
   [junit4]   2> 39240 DEBUG (OverseerStateUpdate-99425206485385223-127.0.0.1:41827_solr-n_0000000000) [n:127.0.0.1:41827_solr    ] o.a.s.c.o.ReplicaMutator Update state numShards=1 message={
   [junit4]   2>   "core":"AutoscalingHistoryHandlerTest_collection_shard1_replica_n2",
   [junit4]   2>   "core_node_name":"core_node5",
   [junit4]   2>   "roles":null,
   [junit4]   2>   "base_url":"http://127.0.0.1:34381/solr",
   [junit4]   2>   "node_name":"127.0.0.1:34381_solr",
   [junit4]   2>   "numShards":"1",
   [junit4]   2>   "state":"down",
   [junit4]   2>   "shard":"shard1",
   [junit4]   2>   "collection":"AutoscalingHistoryHandlerTest_collection",
   [junit4]   2>   "type":"NRT",
   [junit4]   2>   "operation":"state"}
   [junit4]   2> 39240 DEBUG (OverseerStateUpdate-99425206485385223-127.0.0.1:41827_solr-n_0000000000) [n:127.0.0.1:41827_solr    ] o.a.s.c.o.ReplicaMutator Will update state for replica: core_node5:{"core":"AutoscalingHistoryHandlerTest_collection_shard1_replica_n2","base_url":"http://127.0.0.1:34381/solr","node_name":"127.0.0.1:34381_solr","state":"down","type":"NRT"}
   [junit4]   2> 39240 DEBUG (OverseerStateUpdate-99425206485385223-127.0.0.1:41827_solr-n_0000000000) [n:127.0.0.1:41827_solr    ] o.a.s.c.o.ReplicaMutator Collection is now: DocCollection(AutoscalingHistoryHandlerTest_collection//collections/AutoscalingHistoryHandlerTest_collection/state.json/1)={
   [junit4]   2>   "pullReplicas":"0",
   [junit4]   2>   "replicationFactor":"3",
   [junit4]   2>   "router":{"name":"compositeId"},
   [junit4]   2>   "maxShardsPerNode":"1",
   [junit4]   2>   "autoAddReplicas":"false",
   [junit4]   2>   "nrtReplicas":"3",
   [junit4]   2>   "tlogReplicas":"0",
   [junit4]   2>   "shards":{"shard1":{
   [junit4]   2>       "range":"80000000-7fffffff",
   [junit4]   2>       "state":"active",
   [junit4]   2>       "replicas":{
   [junit4]   2>         "core_node3":{
   [junit4]   2>           "core":"AutoscalingHistoryHandlerTest_collection_shard1_replica_n1",
   [junit4]   2>           "base_url":"http://127.0.0.1:41827/solr",
   [junit4]   2>           "node_name":"127.0.0.1:41827_solr",
   [junit4]   2>           "state":"down",
   [junit4]   2>           "type":"NRT"},
   [junit4]   2>         "core_node5":{
   [junit4]   2>           "core":"AutoscalingHistoryHandlerTest_collection_shard1_replica_n2",
   [junit4]   2>           "base_url":"http://127.0.0.1:34381/solr",
   [junit4]   2>           "node_name":"127.0.0.1:34381_solr",
   [junit4]   2>           "state":"down",
   [junit4]   2>           "type":"NRT"},
   [junit4]   2>         "core_node6":{
   [junit4]   2>           "core":"AutoscalingHistoryHandlerTest_collection_shard1_replica_n4",
   [junit4]   2>           "base_url":"http://127.0.0.1:34245/solr",
   [junit4]   2>           "node_name":"127.0.0.1:34245_solr",
   [junit4]   2>           "state":"down",
   [junit4]   2>           "type":"NRT"}}}}}
   [junit4]   2> 39341 DEBUG (OverseerStateUpdate-99425206485385223-127.0.0.1:41827_solr-n_0000000000) [n:127.0.0.1:41827_solr    ] o.a.s.c.o.ZkStateWriter going to update_collection /collections/AutoscalingHistoryHandlerTest_collection/state.json version: 1
   [junit4]   2> 39341 INFO  (zkCallback-84-thread-1-processing-n:127.0.0.1:34245_solr) [n:127.0.0.1:34245_solr    ] o.a.s.c.c.ZkStateReader A cluster state change: [WatchedEvent state:SyncConnected type:NodeDataChanged path:/collections/AutoscalingHistoryHandlerTest_collection/state.json] for collection [AutoscalingHistoryHandlerTest_collection] has occurred - updating... (live nodes size: [3])
   [junit4]   2> 39341 INFO  (zkCallback-82-thread-1-processing-n:127.0.0.1:34381_solr) [n:127.0.0.1:34381_solr    ] o.a.s.c.c.ZkStateReader A cluster state change: [WatchedEvent state:SyncConnected type:NodeDataChanged path:/collections/AutoscalingHistoryHandlerTest_collection/state.json] for collection [AutoscalingHistoryHandlerTest_collection] has occurred - updating... (live nodes size: [3])
   [junit4]   2> 39341 INFO  (zkCallback-80-thread-1-processing-n:127.0.0.1:41827_solr) [n:127.0.0.1:41827_solr    ] o.a.s.c.c.ZkStateReader A cluster state change: [WatchedEvent state:SyncConnected type:NodeDataChanged path:/collections/AutoscalingHistoryHandlerTest_collection/state.json] for collection [AutoscalingHistoryHandlerTest_collection] has occurred - updating... (live nodes size: [3])
   [junit4]   2> 39341 INFO  (zkCallback-84-thread-2-processing-n:127.0.0.1:34245_solr) [n:127.0.0.1:34245_solr    ] o.a.s.c.c.ZkStateReader A cluster state change: [WatchedEvent state:SyncConnected type:NodeDataChanged path:/collections/AutoscalingHistoryHandlerTest_collection/state.json] for collection [AutoscalingHistoryHandlerTest_collection] has occurred - updating... (live nodes size: [3])
   [junit4]   2> 39341 INFO  (zkCallback-80-thread-2-processing-n:127.0.0.1:41827_solr) [n:127.0.0.1:41827_solr    ] o.a.s.c.c.ZkStateReader A cluster state change: [WatchedEvent state:SyncConnected type:NodeDataChanged path:/collections/AutoscalingHistoryHandlerTest_collection/state.json] for collection [AutoscalingHistoryHandlerTest_collection] has occurred - updating... (live nodes size: [3])
   [junit4]   2> 39341 INFO  (zkCallback-82-thread-2-processing-n:127.0.0.1:34381_solr) [n:127.0.0.1:34381_solr    ] o.a.s.c.c.ZkStateReader A cluster state change: [WatchedEvent state:SyncConnected type:NodeDataChanged path:/collections/AutoscalingHistoryHandlerTest_collection/state.json] for collection [AutoscalingHistoryHandlerTest_collection] has occurred - updating... (live nodes size: [3])
   [junit4]   2> 39430 DEBUG (ScheduledTrigger-162-thread-1) [n:127.0.0.1:41827_solr    ] o.a.s.c.a.NodeLostTrigger Running NodeLostTrigger: .auto_add_replicas with currently live nodes: 3
   [junit4]   2> 40251 INFO  (qtp19402411-302) [n:127.0.0.1:41827_solr c:AutoscalingHistoryHandlerTest_collection s:shard1 r:core_node3 x:AutoscalingHistoryHandlerTest_collection_shard1_replica_n1] o.a.s.c.RequestParams conf resource params.json loaded . version : 0 
   [junit4]   2> 40251 INFO  (qtp16736056-301) [n:127.0.0.1:34381_solr c:AutoscalingHistoryHandlerTest_collection s:shard1 r:core_node5 x:AutoscalingHistoryHandlerTest_collection_shard1_replica_n2] o.a.s.c.RequestParams conf resource params.json loaded . version : 0 
   [junit4]   2> 40252 INFO  (qtp856224-286) [n:127.0.0.1:34245_solr c:AutoscalingHistoryHandlerTest_collection s:shard1 r:core_node6 x:AutoscalingHistoryHandlerTest_collection_shard1_replica_n4] o.a.s.c.RequestParams conf resource params.json loaded . version : 0 
   [junit4]   2> 40253 INFO  (qtp19402411-302) [n:127.0.0.1:41827_solr c:AutoscalingHistoryHandlerTest_collection s:shard1 r:core_node3 x:AutoscalingHistoryHandlerTest_collection_shard1_replica_n1] o.a.s.c.RequestParams request params refreshed to version 0
   [junit4]   2> 40253 INFO  (qtp16736056-301) [n:127.0.0.1:34381_solr c:AutoscalingHistoryHandlerTest_collection s:shard1 r:core_node5 x:AutoscalingHistoryHandlerTest_collection_shard1_replica_n2] o.a.s.c.RequestParams request params refreshed to version 0
   [junit4]   2> 40253 INFO  (qtp856224-286) [n:127.0.0.1:34245_solr c:AutoscalingHistoryHandlerTest_collection s:shard1 r:core_node6 x:AutoscalingHistoryHandlerTest_collection_shard1_replica_n4] o.a.s.c.RequestParams request params refreshed to version 0
   [junit4]   2> 40254 WARN  (qtp19402411-302) [n:127.0.0.1:41827_solr c:AutoscalingHistoryHandlerTest_collection s:shard1 r:core_node3 x:AutoscalingHistoryHandlerTest_collection_shard1_replica_n1] o.a.s.c.SolrConfig Couldn't add files from /home/jenkins/workspace/Lucene-Solr-master-Linux/solr/build/solr-core/test/J1/temp/solr.handler.admin.AutoscalingHistoryHandlerTest_9F4FE8CCAF6AF3-001/tempDir-001/node3/AutoscalingHistoryHandlerTest_collection_shard1_replica_n1/../../../../contrib/extraction/lib filtered by .*\.jar to classpath: /home/jenkins/workspace/Lucene-Solr-master-Linux/solr/build/solr-core/test/J1/temp/solr.handler.admin.AutoscalingHistoryHandlerTest_9F4FE8CCAF6AF3-001/tempDir-001/node3/AutoscalingHistoryHandlerTest_collection_shard1_replica_n1/../../../../contrib/extraction/lib
   [junit4]   2> 40254 WARN  (qtp19402411-302) [n:127.0.0.1:41827_solr c:AutoscalingHistoryHandlerTest_collection s:shard1 r:core_node3 x:AutoscalingHistoryHandlerTest_collection_shard1_replica_n1] o.a.s.c.SolrConfig Couldn't add files from /home/jenkins/workspace/Lucene-Solr-master-Linux/solr/build/solr-core/test/J1/temp/solr.handler.admin.AutoscalingHistoryHandlerTest_9F4FE8CCAF6AF3-001/tempDir-001/node3/AutoscalingHistoryHandlerTest_collection_shard1_replica_n1/../../../../dist filtered by solr-cell-\d.*\.jar to classpath: /home/jenkins/workspace/Lucene-Solr-master-Linux/solr/build/solr-core/test/J1/temp/solr.handler.admin.AutoscalingHistoryHandlerTest_9F4FE8CCAF6AF3-001/tempDir-001/node3/AutoscalingHistoryHandlerTest_collection_shard1_replica_n1/../../../../dist
   [junit4]   2> 40254 WARN  (qtp19402411-302) [n:127.0.0.1:41827_solr c:AutoscalingHistoryHandlerTest_collection s:shard1 r:core_node3 x:AutoscalingHistoryHandlerTest_collection_shard1_replica_n1] o.a.s.c.SolrConfig Couldn't add files from /home/jenkins/workspace/Lucene-Solr-master-Linux/solr/build/solr-core/test/J1/temp/solr.handler.admin.AutoscalingHistoryHandlerTest_9F4FE8CCAF6AF3-001/tempDir-001/node3/AutoscalingHistoryHandlerTest_collection_shard1_replica_n1/../../../../contrib/clustering/lib filtered by .*\.jar to classpath: /home/jenkins/workspace/Lucene-Solr-master-Linux/solr/build/solr-core/test/J1/temp/solr.handler.admin.AutoscalingHistoryHandlerTest_9F4FE8CCAF6AF3-001/tempDir-001/node3/AutoscalingHistoryHandlerTest_collection_shard1_replica_n1/../../../../contrib/clustering/lib
   [junit4]   2> 40255 WARN  (qtp19402411-302) [n:127.0.0.1:41827_solr c:AutoscalingHistoryHandlerTest_collection s:shard1 r:core_node3 x:AutoscalingHistoryHandlerTest_collection_shard1_replica_n1] o.a.s.c.SolrConfig Couldn't add files from /home/jenkins/workspace/Lucene-Solr-master-Linux/solr/build/solr-core/test/J1/temp/solr.handler.admin.AutoscalingHistoryHandlerTest_9F4FE8CCAF6AF3-001/tempDir-001/node3/AutoscalingHistoryHandlerTest_collection_shard1_replica_n1/../../../../dist filtered by solr-clustering-\d.*\.jar to classpath: /home/jenkins/workspace/Lucene-Solr-master-Linux/solr/build/solr-core/test/J1/temp/solr.handler.admin.AutoscalingHistoryHandlerTest_9F4FE8CCAF6AF3-001/tempDir-001/node3/AutoscalingHistoryHandlerTest_collection_shard1_replica_n1/../../../../dist
   [junit4]   2> 40255 WARN  (qtp19402411-302) [n:127.0.0.1:41827_solr c:AutoscalingHistoryHandlerTest_collection s:shard1 r:core_node3 x:AutoscalingHistoryHandlerTest_collection_shard1_replica_n1] o.a.s.c.SolrConfig Couldn't add files from /home/jenkins/workspace/Lucene-Solr-master-Linux/solr/build/solr-core/test/J1/temp/solr.handler.admin.AutoscalingHistoryHandlerTest_9F4FE8CCAF6AF3-001/tempDir-001/node3/AutoscalingHistoryHandlerTest_collection_shard1_replica_n1/../../../../contrib/langid/lib filtered by .*\.jar to classpath: /home/jenkins/workspace/Lucene-Solr-master-Linux/solr/build/solr-core/test/J1/temp/solr.handler.admin.AutoscalingHistoryHandlerTest_9F4FE8CCAF6AF3-001/tempDir-001/node3/AutoscalingHistoryHandlerTest_collection_shard1_replica_n1/../../../../contrib/langid/lib
   [junit4]   2> 40254 WARN  (qtp856224-286) [n:127.0.0.1:34245_solr c:AutoscalingHistoryHandlerTest_collection s:shard1 r:core_node6 x:AutoscalingHistoryHandlerTest_collection_shard1_replica_n4] o.a.s.c.SolrConfig Couldn't add files from /home/jenkins/workspace/Lucene-Solr-master-Linux/solr/build/solr-core/test/J1/temp/solr.handler.admin.AutoscalingHistoryHandlerTest_9F4FE8CCAF6AF3-001/tempDir-001/node1/AutoscalingHistoryHandlerTest_collection_shard1_replica_n4/../../../../contrib/extraction/lib filtered by .*\.jar to classpath: /home/jenkins/workspace/Lucene-Solr-master-Linux/solr/build/solr-core/test/J1/temp/solr.handler.admin.AutoscalingHistoryHandlerTest_9F4FE8CCAF6AF3-001/tempDir-001/node1/AutoscalingHistoryHandlerTest_collection_shard1_replica_n4/../../../../contrib/extraction/lib
   [junit4]   2> 40255 WARN  (qtp19402411-302) [n:127.0.0.1:41827_solr c:AutoscalingHistoryHandlerTest_collection s:shard1 r:core_node3 x:AutoscalingHistoryHandlerTest_collection_shard1_replica_n1] o.a.s.c.SolrConfig Couldn't add files from /home/jenkins/workspace/Lucene-Solr-master-Linux/solr/build/solr-core/test/J1/temp/solr.handler.admin.AutoscalingHistoryHandlerTest_9F4FE8CCAF6AF3-001/tempDir-001/node3/AutoscalingHistoryHandlerTest_collection_shard1_replica_n1/../../../../dist filtered by solr-langid-\d.*\.jar to classpath: /home/jenkins/workspace/Lucene-Solr-master-Linux/solr/build/solr-core/test/J1/temp/solr.handler.admin.AutoscalingHistoryHandlerTest_9F4FE8CCAF6AF3-001/tempDir-001/node3/AutoscalingHistoryHandlerTest_collection_shard1_replica_n1/../../../../dist
   [junit4]   2> 40263 WARN  (qtp856224-286) [n:127.0.0.1:34245_solr c:AutoscalingHistoryHandlerTest_collection s:shard1 r:core_node6 x:AutoscalingHistoryHandlerTest_collection_shard1_replica_n4] o.a.s.c.SolrConfig Couldn't add files from /home/jenkins/workspace/Lucene-Solr-master-Linux/solr/build/solr-core/test/J1/temp/solr.handler.admin.AutoscalingHistoryHandlerTest_9F4FE8CCAF6AF3-001/tempDir-001/node1/AutoscalingHistoryHandlerTest_collection_shard1_replica_n4/../../../../dist filtered by solr-cell-\d.*\.jar to classpath: /home/jenkins/workspace/Lucene-Solr-master-Linux/solr/build/solr-core/test/J1/temp/solr.handler.admin.AutoscalingHistoryHandlerTest_9F4FE8CCAF6AF3-001/tempDir-001/node1/AutoscalingHistoryHandlerTest_collection_shard1_replica_n4/../../../../dist
   [junit4]   2> 40263 WARN  (qtp19402411-302) [n:127.0.0.1:41827_solr c:AutoscalingHistoryHandlerTest_collection s:shard1 r:core_node3 x:AutoscalingHistoryHandlerTest_collection_shard1_replica_n1] o.a.s.c.SolrConfig Couldn't add files from /home/jenkins/workspace/Lucene-Solr-master-Linux/solr/build/solr-core/test/J1/temp/solr.handler.admin.AutoscalingHistoryHandlerTest_9F4FE8CCAF6AF3-001/tempDir-001/node3/AutoscalingHistoryHandlerTest_collection_shard1_replica_n1/../../../../contrib/velocity/lib filtered by .*\.jar to classpath: /home/jenkins/workspace/Lucene-Solr-master-Linux/solr/build/solr-core/test/J1/temp/solr.handler.admin.AutoscalingHistoryHandlerTest_9F4FE8CCAF6AF3-001/tempDir-001/node3/AutoscalingHistoryHandlerTest_collection_shard1_replica_n1/../../../../contrib/velocity/lib
   [junit4]   2> 40264 WARN  (qtp19402411-302) [n:127.0.0.1:41827_solr c:AutoscalingHistoryHandlerTest_collection s:shard1 r:core_node3 x:AutoscalingHistoryHandlerTest_collection_shard1_replica_n1] o.a.s.c.SolrConfig Couldn't add files from /home/jenkins/workspace/Lucene-Solr-master-Linux/solr/build/solr-core/test/J1/temp/solr.handler.admin.AutoscalingHistoryHandlerTest_9F4FE8CCAF6AF3-001/tempDir-001/node3/AutoscalingHistoryHandlerTest_collection_shard1_replica_n1/../../../../dist filtered by solr-velocity-\d.*\.jar to classpath: /home/jenkins/workspace/Lucene-Solr-master-Linux/solr/build/solr-core/test/J1/temp/solr.handler.admin.AutoscalingHistoryHandlerTest_9F4FE8CCAF6AF3-001/tempDir-001/node3/AutoscalingHistoryHandlerTest_collection_shard1_replica_n1/../../../../dist
   [junit4]   2> 40254 WARN  (qtp16736056-301) [n:127.0.0.1:34381_solr c:AutoscalingHistoryHandlerTest_collection s:shard1 r:core_node5 x:AutoscalingHistoryHandlerTest_collection_shard1_replica_n2] o.a.s.c.SolrConfig Couldn't add files from /home/jenkins/workspace/Lucene-Solr-master-Linux/solr/build/solr-core/test/J1/temp/solr.handler.admin.

[...truncated too long message...]

,UNAVAILABLE}
   [junit4]   2> 3254669 INFO  (zkCallback-9486-thread-4-processing-n:127.0.0.1:40969_solr) [n:127.0.0.1:40969_solr    ] o.a.s.c.OverseerElectionContext I am going to be the leader 127.0.0.1:40969_solr
   [junit4]   2> 3254670 INFO  (jetty-closer-9401-thread-1) [    ] o.e.j.s.session Stopped scavenging
   [junit4]   2> 3254670 INFO  (coreCloseExecutor-6696-thread-1) [n:127.0.0.1:36543_solr c:testMetricTrigger s:shard1 r:core_node6 x:testMetricTrigger_shard1_replica_n5] o.a.s.m.SolrMetricManager Closing metric reporters for registry=solr.collection.testMetricTrigger.shard1.leader, tag=13602561
   [junit4]   2> 3254671 INFO  (jetty-closer-9401-thread-6) [    ] o.e.j.s.h.ContextHandler Stopped o.e.j.s.ServletContextHandler@c174a0{/solr,null,UNAVAILABLE}
   [junit4]   2> 3254671 INFO  (jetty-closer-9401-thread-6) [    ] o.e.j.s.session Stopped scavenging
   [junit4]   2> 3254677 INFO  (coreCloseExecutor-6697-thread-1) [n:127.0.0.1:46333_solr c:testMetricTrigger s:shard1 r:core_node8 x:testMetricTrigger_shard1_replica_n7] o.a.s.m.SolrMetricManager Closing metric reporters for registry=solr.collection.testMetricTrigger.shard1.leader, tag=110688
   [junit4]   2> 3254677 INFO  (coreCloseExecutor-6699-thread-2) [n:127.0.0.1:40969_solr c:collection1 s:shard1 r:core_node14 x:collection1_shard1_replica_n13] o.a.s.m.SolrMetricManager Closing metric reporters for registry=solr.collection.collection1.shard1.leader, tag=9582552
   [junit4]   2> 3254677 INFO  (coreCloseExecutor-6699-thread-1) [n:127.0.0.1:40969_solr c:collection1 s:shard1 r:core_node12 x:collection1_shard1_replica_n11] o.a.s.m.SolrMetricManager Closing metric reporters for registry=solr.core.collection1.shard1.replica_n11, tag=8167752
   [junit4]   2> 3254677 INFO  (coreCloseExecutor-6699-thread-1) [n:127.0.0.1:40969_solr c:collection1 s:shard1 r:core_node12 x:collection1_shard1_replica_n11] o.a.s.m.r.SolrJmxReporter Closing reporter [org.apache.solr.metrics.reporters.SolrJmxReporter@19fbffc: rootName = solr_40969, domain = solr.core.collection1.shard1.replica_n11, service url = null, agent id = null] for registry solr.core.collection1.shard1.replica_n11 / com.codahale.metrics.MetricRegistry@1e7ef3a
   [junit4]   2> 3254678 INFO  (jetty-closer-9401-thread-5) [    ] o.e.j.s.h.ContextHandler Stopped o.e.j.s.ServletContextHandler@37e515{/solr,null,UNAVAILABLE}
   [junit4]   2> 3254678 INFO  (jetty-closer-9401-thread-5) [    ] o.e.j.s.session Stopped scavenging
   [junit4]   2> 3254683 INFO  (coreCloseExecutor-6699-thread-1) [n:127.0.0.1:40969_solr c:collection1 s:shard1 r:core_node12 x:collection1_shard1_replica_n11] o.a.s.m.SolrMetricManager Closing metric reporters for registry=solr.collection.collection1.shard1.leader, tag=8167752
   [junit4]   2> 3254684 INFO  (jetty-closer-9401-thread-3) [    ] o.e.j.s.h.ContextHandler Stopped o.e.j.s.ServletContextHandler@1f8b6f0{/solr,null,UNAVAILABLE}
   [junit4]   2> 3254684 INFO  (jetty-closer-9401-thread-3) [    ] o.e.j.s.session Stopped scavenging
   [junit4]   2> 3254685 ERROR (SUITE-TriggerIntegrationTest-seed#[9F4FE8CCAF6AF3]-worker) [    ] o.a.z.s.ZooKeeperServer ZKShutdownHandler is not registered, so ZooKeeper server won't take any action on ERROR or SHUTDOWN server state changes
   [junit4]   2> 3254685 INFO  (SUITE-TriggerIntegrationTest-seed#[9F4FE8CCAF6AF3]-worker) [    ] o.a.s.c.ZkTestServer connecting to 127.0.0.1:37669 37669
   [junit4]   2> 3258887 INFO  (Thread-5362) [    ] o.a.s.c.ZkTestServer connecting to 127.0.0.1:37669 37669
   [junit4]   2> 3258888 WARN  (Thread-5362) [    ] o.a.s.c.ZkTestServer Watch limit violations: 
   [junit4]   2> Maximum concurrent create/delete watches above limit:
   [junit4]   2> 
   [junit4]   2> 	21	/solr/clusterprops.json
   [junit4]   2> 	21	/solr/aliases.json
   [junit4]   2> 	20	/solr/security.json
   [junit4]   2> 	8	/solr/configs/conf
   [junit4]   2> 
   [junit4]   2> Maximum concurrent data watches above limit:
   [junit4]   2> 
   [junit4]   2> 	131	/solr/collections/collection1/state.json
   [junit4]   2> 	34	/solr/collections/testMetricTrigger/state.json
   [junit4]   2> 	21	/solr/clusterstate.json
   [junit4]   2> 	6	/solr/autoscaling.json
   [junit4]   2> 	4	/solr/overseer_elect/election/99425403632353325-127.0.0.1:40001_solr-n_0000000013
   [junit4]   2> 	3	/solr/overseer_elect/election/99425403632353315-127.0.0.1:36543_solr-n_0000000010
   [junit4]   2> 	2	/solr/overseer_elect/election/99425403632353306-127.0.0.1:40969_solr-n_0000000007
   [junit4]   2> 	2	/solr/collections/collection1/leader_elect/shard1/election/99425403632353297-core_node3-n_0000000000
   [junit4]   2> 	2	/solr/overseer_elect/election/99425403632353300-127.0.0.1:39637_solr-n_0000000005
   [junit4]   2> 	2	/solr/collections/collection1/leader_elect/shard1/election/99425403632353300-core_node8-n_0000000003
   [junit4]   2> 	2	/solr/overseer_elect/election/99425403632353337-127.0.0.1:33247_solr-n_0000000017
   [junit4]   2> 
   [junit4]   2> Maximum concurrent children watches above limit:
   [junit4]   2> 
   [junit4]   2> 	21	/solr/live_nodes
   [junit4]   2> 	21	/solr/collections
   [junit4]   2> 	6	/solr/overseer/queue-work
   [junit4]   2> 	6	/solr/autoscaling/events/.auto_add_replicas
   [junit4]   2> 	6	/solr/overseer/queue
   [junit4]   2> 	6	/solr/overseer/collection-queue-work
   [junit4]   2> 	2	/solr/autoscaling/events/node_lost_triggerMR
   [junit4]   2> 	2	/solr/autoscaling/events/node_added_triggerCTOOR
   [junit4]   2> 
   [junit4]   2> NOTE: leaving temporary files on disk at: /home/jenkins/workspace/Lucene-Solr-master-Linux/solr/build/solr-core/test/J0/temp/solr.cloud.autoscaling.TriggerIntegrationTest_9F4FE8CCAF6AF3-001
   [junit4]   2> NOTE: test params are: codec=Asserting(Lucene70): {id=PostingsFormat(name=MockRandom), x_s=PostingsFormat(name=LuceneVarGapFixedInterval)}, docValues:{_version_=DocValuesFormat(name=Lucene70)}, maxPointsInLeafNode=1119, maxMBSortInHeap=5.8812571913473635, sim=Asserting(org.apache.lucene.search.similarities.AssertingSimilarity@9c5b73), locale=it-CH, timezone=SystemV/PST8
   [junit4]   2> NOTE: Linux 4.13.0-31-generic i386/Oracle Corporation 1.8.0_144 (32-bit)/cpus=8,threads=1,free=173931888,total=429735936
   [junit4]   2> NOTE: All tests run in this JVM: [UpdateParamsTest, SolrIndexMetricsTest, PluginInfoTest, TestRandomFaceting, TestHashPartitioner, TestConfigReload, TestSolrFieldCacheBean, TestCopyFieldCollectionResource, MoveReplicaTest, UUIDFieldTest, TestShardHandlerFactory, FieldAnalysisRequestHandlerTest, TestConfigSetsAPIExclusivity, TestRawResponseWriter, TestImpersonationWithHadoopAuth, SolrIndexConfigTest, SolrCloudExampleTest, SortSpecParsingTest, LargeFieldTest, TestPseudoReturnFields, TestWordDelimiterFilterFactory, TestHashQParserPlugin, TestNestedDocsSort, TestLegacyFieldCache, TestBinaryField, TestDistributedSearch, CloudExitableDirectoryReaderTest, TestDeleteCollectionOnDownNodes, TestTolerantUpdateProcessorRandomCloud, HdfsAutoAddReplicasIntegrationTest, TestFileDictionaryLookup, TestStressLucene, TestFieldCollectionResource, DistribDocExpirationUpdateProcessorTest, TestFieldSortValues, AtomicUpdateProcessorFactoryTest, HdfsWriteToMultipleCollectionsTest, HighlighterConfigTest, EchoParamsTest, TestSimDistributedQueue, TestSort, TestWriterPerf, CoreAdminRequestStatusTest, CursorPagingTest, HLLSerializationTest, ZkSolrClientTest, TestLuceneMatchVersion, CreateCollectionCleanupTest, SaslZkACLProviderTest, HdfsBasicDistributedZk2Test, SuggestComponentTest, DistributedTermsComponentTest, TestSolrCloudWithSecureImpersonation, DistributedFacetExistsSmallTest, TestSQLHandler, RequestLoggingTest, RequestHandlersTest, OpenExchangeRatesOrgProviderTest, TestComponentsName, TestRequestStatusCollectionAPI, CheckHdfsIndexTest, TestStressLiveNodes, TestRemoteStreaming, JavabinLoaderTest, TestHighlightDedupGrouping, ChaosMonkeyNothingIsSafeTest, DeleteLastCustomShardedReplicaTest, IndexBasedSpellCheckerTest, FacetPivotSmallTest, SolrIndexSplitterTest, TestExtendedDismaxParser, TestNoOpRegenerator, TestIBSimilarityFactory, MetricUtilsTest, TestUninvertingReader, TestSubQueryTransformerCrossCore, TestPerFieldSimilarityWithDefaultOverride, TestComplexPhraseLeadingWildcard, TestConfig, SynonymTokenizerTest, TestFastOutputStream, ClassificationUpdateProcessorIntegrationTest, MetricsHandlerTest, JSONWriterTest, PKIAuthenticationIntegrationTest, LeaderFailoverAfterPartitionTest, AssignTest, TestGraphMLResponseWriter, OverseerModifyCollectionTest, TestPointFields, TestDocumentBuilder, TestJoin, BitVectorTest, TestCustomDocTransformer, TestClassicSimilarityFactory, TestSmileRequest, BJQParserTest, TestLegacyNumericUtils, StatsComponentTest, TestLuceneIndexBackCompat, ShufflingReplicaListTransformerTest, TestUniqueKeyFieldResource, XmlUpdateRequestHandlerTest, RemoteQueryErrorTest, TestSlowCompositeReaderWrapper, FullSolrCloudDistribCmdsTest, DefaultValueUpdateProcessorTest, ZkStateReaderTest, TestCollationField, CustomCollectionTest, CollectionsAPIAsyncDistributedZkTest, CoreSorterTest, SuggesterWFSTTest, SolrCoreMetricManagerTest, ChangedSchemaMergeTest, TestMergePolicyConfig, OverseerTaskQueueTest, HdfsThreadLeakTest, CdcrReplicationHandlerTest, TestNamedUpdateProcessors, HdfsDirectoryFactoryTest, SpellCheckCollatorTest, HealthCheckHandlerTest, SimpleFacetsTest, SpatialRPTFieldTypeTest, BasicDistributedZkTest, TestPullReplicaErrorHandling, TestRebalanceLeaders, TestSegmentSorting, TestSkipOverseerOperations, TestTolerantUpdateProcessorCloud, VMParamsZkACLAndCredentialsProvidersTest, SimpleCollectionCreateDeleteTest, TestHdfsCloudBackupRestore, TestLocalFSCloudBackupRestore, AutoAddReplicasIntegrationTest, AutoAddReplicasPlanActionTest, AutoScalingHandlerTest, HttpTriggerListenerTest, MetricTriggerTest, NodeAddedTriggerTest, SearchRateTriggerTest, SystemLogListenerTest, TestPolicyCloud, TriggerIntegrationTest]
   [junit4] Completed [617/770 (4!)] on J0 in 212.69s, 14 tests, 1 failure <<< FAILURES!

[...truncated 44426 lines...]

Mime
View raw message