lucene-dev mailing list archives

Site index · List index
Message view « Date » · « Thread »
Top « Date » · « Thread »
From Policeman Jenkins Server <jenk...@thetaphi.de>
Subject [JENKINS] Lucene-Solr-7.x-Linux (32bit/jdk1.8.0_144) - Build # 1253 - Unstable!
Date Sat, 27 Jan 2018 01:40:27 GMT
Build: https://jenkins.thetaphi.de/job/Lucene-Solr-7.x-Linux/1253/
Java: 32bit/jdk1.8.0_144 -client -XX:+UseSerialGC

2 tests failed.
FAILED:  junit.framework.TestSuite.org.apache.solr.cloud.TestSolrCloudWithSecureImpersonation

Error Message:
2 threads leaked from SUITE scope at org.apache.solr.cloud.TestSolrCloudWithSecureImpersonation:     1) Thread[id=3397, name=jetty-launcher-787-thread-1-EventThread, state=TIMED_WAITING, group=TGRP-TestSolrCloudWithSecureImpersonation]         at sun.misc.Unsafe.park(Native Method)         at java.util.concurrent.locks.LockSupport.parkNanos(LockSupport.java:215)         at java.util.concurrent.locks.AbstractQueuedSynchronizer.doAcquireSharedNanos(AbstractQueuedSynchronizer.java:1037)         at java.util.concurrent.locks.AbstractQueuedSynchronizer.tryAcquireSharedNanos(AbstractQueuedSynchronizer.java:1328)         at java.util.concurrent.CountDownLatch.await(CountDownLatch.java:277)         at org.apache.curator.CuratorZookeeperClient.internalBlockUntilConnectedOrTimedOut(CuratorZookeeperClient.java:323)         at org.apache.curator.RetryLoop.callWithRetry(RetryLoop.java:105)         at org.apache.curator.framework.imps.GetDataBuilderImpl.pathInForeground(GetDataBuilderImpl.java:288)         at org.apache.curator.framework.imps.GetDataBuilderImpl.forPath(GetDataBuilderImpl.java:279)         at org.apache.curator.framework.imps.GetDataBuilderImpl.forPath(GetDataBuilderImpl.java:41)         at org.apache.curator.framework.recipes.shared.SharedValue.readValue(SharedValue.java:244)         at org.apache.curator.framework.recipes.shared.SharedValue.access$100(SharedValue.java:44)         at org.apache.curator.framework.recipes.shared.SharedValue$1.process(SharedValue.java:61)         at org.apache.curator.framework.imps.NamespaceWatcher.process(NamespaceWatcher.java:67)         at org.apache.zookeeper.ClientCnxn$EventThread.processEvent(ClientCnxn.java:530)         at org.apache.zookeeper.ClientCnxn$EventThread.run(ClientCnxn.java:505)    2) Thread[id=3401, name=jetty-launcher-787-thread-2-EventThread, state=TIMED_WAITING, group=TGRP-TestSolrCloudWithSecureImpersonation]         at sun.misc.Unsafe.park(Native Method)         at java.util.concurrent.locks.LockSupport.parkNanos(LockSupport.java:215)         at java.util.concurrent.locks.AbstractQueuedSynchronizer.doAcquireSharedNanos(AbstractQueuedSynchronizer.java:1037)         at java.util.concurrent.locks.AbstractQueuedSynchronizer.tryAcquireSharedNanos(AbstractQueuedSynchronizer.java:1328)         at java.util.concurrent.CountDownLatch.await(CountDownLatch.java:277)         at org.apache.curator.CuratorZookeeperClient.internalBlockUntilConnectedOrTimedOut(CuratorZookeeperClient.java:323)         at org.apache.curator.RetryLoop.callWithRetry(RetryLoop.java:105)         at org.apache.curator.framework.imps.GetDataBuilderImpl.pathInForeground(GetDataBuilderImpl.java:288)         at org.apache.curator.framework.imps.GetDataBuilderImpl.forPath(GetDataBuilderImpl.java:279)         at org.apache.curator.framework.imps.GetDataBuilderImpl.forPath(GetDataBuilderImpl.java:41)         at org.apache.curator.framework.recipes.shared.SharedValue.readValue(SharedValue.java:244)         at org.apache.curator.framework.recipes.shared.SharedValue.access$100(SharedValue.java:44)         at org.apache.curator.framework.recipes.shared.SharedValue$1.process(SharedValue.java:61)         at org.apache.curator.framework.imps.NamespaceWatcher.process(NamespaceWatcher.java:67)         at org.apache.zookeeper.ClientCnxn$EventThread.processEvent(ClientCnxn.java:530)         at org.apache.zookeeper.ClientCnxn$EventThread.run(ClientCnxn.java:505)

Stack Trace:
com.carrotsearch.randomizedtesting.ThreadLeakError: 2 threads leaked from SUITE scope at org.apache.solr.cloud.TestSolrCloudWithSecureImpersonation: 
   1) Thread[id=3397, name=jetty-launcher-787-thread-1-EventThread, state=TIMED_WAITING, group=TGRP-TestSolrCloudWithSecureImpersonation]
        at sun.misc.Unsafe.park(Native Method)
        at java.util.concurrent.locks.LockSupport.parkNanos(LockSupport.java:215)
        at java.util.concurrent.locks.AbstractQueuedSynchronizer.doAcquireSharedNanos(AbstractQueuedSynchronizer.java:1037)
        at java.util.concurrent.locks.AbstractQueuedSynchronizer.tryAcquireSharedNanos(AbstractQueuedSynchronizer.java:1328)
        at java.util.concurrent.CountDownLatch.await(CountDownLatch.java:277)
        at org.apache.curator.CuratorZookeeperClient.internalBlockUntilConnectedOrTimedOut(CuratorZookeeperClient.java:323)
        at org.apache.curator.RetryLoop.callWithRetry(RetryLoop.java:105)
        at org.apache.curator.framework.imps.GetDataBuilderImpl.pathInForeground(GetDataBuilderImpl.java:288)
        at org.apache.curator.framework.imps.GetDataBuilderImpl.forPath(GetDataBuilderImpl.java:279)
        at org.apache.curator.framework.imps.GetDataBuilderImpl.forPath(GetDataBuilderImpl.java:41)
        at org.apache.curator.framework.recipes.shared.SharedValue.readValue(SharedValue.java:244)
        at org.apache.curator.framework.recipes.shared.SharedValue.access$100(SharedValue.java:44)
        at org.apache.curator.framework.recipes.shared.SharedValue$1.process(SharedValue.java:61)
        at org.apache.curator.framework.imps.NamespaceWatcher.process(NamespaceWatcher.java:67)
        at org.apache.zookeeper.ClientCnxn$EventThread.processEvent(ClientCnxn.java:530)
        at org.apache.zookeeper.ClientCnxn$EventThread.run(ClientCnxn.java:505)
   2) Thread[id=3401, name=jetty-launcher-787-thread-2-EventThread, state=TIMED_WAITING, group=TGRP-TestSolrCloudWithSecureImpersonation]
        at sun.misc.Unsafe.park(Native Method)
        at java.util.concurrent.locks.LockSupport.parkNanos(LockSupport.java:215)
        at java.util.concurrent.locks.AbstractQueuedSynchronizer.doAcquireSharedNanos(AbstractQueuedSynchronizer.java:1037)
        at java.util.concurrent.locks.AbstractQueuedSynchronizer.tryAcquireSharedNanos(AbstractQueuedSynchronizer.java:1328)
        at java.util.concurrent.CountDownLatch.await(CountDownLatch.java:277)
        at org.apache.curator.CuratorZookeeperClient.internalBlockUntilConnectedOrTimedOut(CuratorZookeeperClient.java:323)
        at org.apache.curator.RetryLoop.callWithRetry(RetryLoop.java:105)
        at org.apache.curator.framework.imps.GetDataBuilderImpl.pathInForeground(GetDataBuilderImpl.java:288)
        at org.apache.curator.framework.imps.GetDataBuilderImpl.forPath(GetDataBuilderImpl.java:279)
        at org.apache.curator.framework.imps.GetDataBuilderImpl.forPath(GetDataBuilderImpl.java:41)
        at org.apache.curator.framework.recipes.shared.SharedValue.readValue(SharedValue.java:244)
        at org.apache.curator.framework.recipes.shared.SharedValue.access$100(SharedValue.java:44)
        at org.apache.curator.framework.recipes.shared.SharedValue$1.process(SharedValue.java:61)
        at org.apache.curator.framework.imps.NamespaceWatcher.process(NamespaceWatcher.java:67)
        at org.apache.zookeeper.ClientCnxn$EventThread.processEvent(ClientCnxn.java:530)
        at org.apache.zookeeper.ClientCnxn$EventThread.run(ClientCnxn.java:505)
	at __randomizedtesting.SeedInfo.seed([69C86AC3CDAB50BD]:0)


FAILED:  org.apache.solr.cloud.autoscaling.TriggerIntegrationTest.testNodeAddedTriggerRestoreState

Error Message:
The trigger did not fire at all

Stack Trace:
java.lang.AssertionError: The trigger did not fire at all
	at __randomizedtesting.SeedInfo.seed([69C86AC3CDAB50BD:E1F5E3BCF76BB110]:0)
	at org.junit.Assert.fail(Assert.java:93)
	at org.junit.Assert.assertTrue(Assert.java:43)
	at org.apache.solr.cloud.autoscaling.TriggerIntegrationTest.testNodeAddedTriggerRestoreState(TriggerIntegrationTest.java:426)
	at sun.reflect.NativeMethodAccessorImpl.invoke0(Native Method)
	at sun.reflect.NativeMethodAccessorImpl.invoke(NativeMethodAccessorImpl.java:62)
	at sun.reflect.DelegatingMethodAccessorImpl.invoke(DelegatingMethodAccessorImpl.java:43)
	at java.lang.reflect.Method.invoke(Method.java:498)
	at com.carrotsearch.randomizedtesting.RandomizedRunner.invoke(RandomizedRunner.java:1737)
	at com.carrotsearch.randomizedtesting.RandomizedRunner$8.evaluate(RandomizedRunner.java:934)
	at com.carrotsearch.randomizedtesting.RandomizedRunner$9.evaluate(RandomizedRunner.java:970)
	at com.carrotsearch.randomizedtesting.RandomizedRunner$10.evaluate(RandomizedRunner.java:984)
	at com.carrotsearch.randomizedtesting.rules.SystemPropertiesRestoreRule$1.evaluate(SystemPropertiesRestoreRule.java:57)
	at org.apache.lucene.util.TestRuleSetupTeardownChained$1.evaluate(TestRuleSetupTeardownChained.java:49)
	at org.apache.lucene.util.AbstractBeforeAfterRule$1.evaluate(AbstractBeforeAfterRule.java:45)
	at org.apache.lucene.util.TestRuleThreadAndTestName$1.evaluate(TestRuleThreadAndTestName.java:48)
	at org.apache.lucene.util.TestRuleIgnoreAfterMaxFailures$1.evaluate(TestRuleIgnoreAfterMaxFailures.java:64)
	at org.apache.lucene.util.TestRuleMarkFailure$1.evaluate(TestRuleMarkFailure.java:47)
	at com.carrotsearch.randomizedtesting.rules.StatementAdapter.evaluate(StatementAdapter.java:36)
	at com.carrotsearch.randomizedtesting.ThreadLeakControl$StatementRunner.run(ThreadLeakControl.java:368)
	at com.carrotsearch.randomizedtesting.ThreadLeakControl.forkTimeoutingTask(ThreadLeakControl.java:817)
	at com.carrotsearch.randomizedtesting.ThreadLeakControl$3.evaluate(ThreadLeakControl.java:468)
	at com.carrotsearch.randomizedtesting.RandomizedRunner.runSingleTest(RandomizedRunner.java:943)
	at com.carrotsearch.randomizedtesting.RandomizedRunner$5.evaluate(RandomizedRunner.java:829)
	at com.carrotsearch.randomizedtesting.RandomizedRunner$6.evaluate(RandomizedRunner.java:879)
	at com.carrotsearch.randomizedtesting.RandomizedRunner$7.evaluate(RandomizedRunner.java:890)
	at com.carrotsearch.randomizedtesting.rules.StatementAdapter.evaluate(StatementAdapter.java:36)
	at com.carrotsearch.randomizedtesting.rules.SystemPropertiesRestoreRule$1.evaluate(SystemPropertiesRestoreRule.java:57)
	at org.apache.lucene.util.AbstractBeforeAfterRule$1.evaluate(AbstractBeforeAfterRule.java:45)
	at com.carrotsearch.randomizedtesting.rules.StatementAdapter.evaluate(StatementAdapter.java:36)
	at org.apache.lucene.util.TestRuleStoreClassName$1.evaluate(TestRuleStoreClassName.java:41)
	at com.carrotsearch.randomizedtesting.rules.NoShadowingOrOverridesOnMethodsRule$1.evaluate(NoShadowingOrOverridesOnMethodsRule.java:40)
	at com.carrotsearch.randomizedtesting.rules.NoShadowingOrOverridesOnMethodsRule$1.evaluate(NoShadowingOrOverridesOnMethodsRule.java:40)
	at com.carrotsearch.randomizedtesting.rules.StatementAdapter.evaluate(StatementAdapter.java:36)
	at com.carrotsearch.randomizedtesting.rules.StatementAdapter.evaluate(StatementAdapter.java:36)
	at com.carrotsearch.randomizedtesting.rules.StatementAdapter.evaluate(StatementAdapter.java:36)
	at org.apache.lucene.util.TestRuleAssertionsRequired$1.evaluate(TestRuleAssertionsRequired.java:53)
	at org.apache.lucene.util.TestRuleMarkFailure$1.evaluate(TestRuleMarkFailure.java:47)
	at org.apache.lucene.util.TestRuleIgnoreAfterMaxFailures$1.evaluate(TestRuleIgnoreAfterMaxFailures.java:64)
	at org.apache.lucene.util.TestRuleIgnoreTestSuites$1.evaluate(TestRuleIgnoreTestSuites.java:54)
	at com.carrotsearch.randomizedtesting.rules.StatementAdapter.evaluate(StatementAdapter.java:36)
	at com.carrotsearch.randomizedtesting.ThreadLeakControl$StatementRunner.run(ThreadLeakControl.java:368)
	at java.lang.Thread.run(Thread.java:748)




Build Log:
[...truncated 12147 lines...]
   [junit4] Suite: org.apache.solr.cloud.TestSolrCloudWithSecureImpersonation
   [junit4]   2> Creating dataDir: /home/jenkins/workspace/Lucene-Solr-7.x-Linux/solr/build/solr-core/test/J2/temp/solr.cloud.TestSolrCloudWithSecureImpersonation_69C86AC3CDAB50BD-001/init-core-data-001
   [junit4]   2> 441651 WARN  (SUITE-TestSolrCloudWithSecureImpersonation-seed#[69C86AC3CDAB50BD]-worker) [    ] o.a.s.SolrTestCaseJ4 startTrackingSearchers: numOpens=2 numCloses=2
   [junit4]   2> 441651 INFO  (SUITE-TestSolrCloudWithSecureImpersonation-seed#[69C86AC3CDAB50BD]-worker) [    ] o.a.s.SolrTestCaseJ4 Using TrieFields (NUMERIC_POINTS_SYSPROP=false) w/NUMERIC_DOCVALUES_SYSPROP=false
   [junit4]   2> 441653 INFO  (SUITE-TestSolrCloudWithSecureImpersonation-seed#[69C86AC3CDAB50BD]-worker) [    ] o.a.s.SolrTestCaseJ4 Randomized ssl (true) and clientAuth (false) via: @org.apache.solr.util.RandomizeSSL(reason=, ssl=NaN, value=NaN, clientAuth=NaN)
   [junit4]   2> 441654 INFO  (SUITE-TestSolrCloudWithSecureImpersonation-seed#[69C86AC3CDAB50BD]-worker) [    ] o.a.s.SolrTestCaseJ4 SecureRandom sanity checks: test.solr.allowed.securerandom=null & java.security.egd=file:/dev/./urandom
   [junit4]   2> 441682 INFO  (SUITE-TestSolrCloudWithSecureImpersonation-seed#[69C86AC3CDAB50BD]-worker) [    ] o.a.s.c.MiniSolrCloudCluster Starting cluster of 2 servers in /home/jenkins/workspace/Lucene-Solr-7.x-Linux/solr/build/solr-core/test/J2/temp/solr.cloud.TestSolrCloudWithSecureImpersonation_69C86AC3CDAB50BD-001/tempDir-001
   [junit4]   2> 441682 INFO  (SUITE-TestSolrCloudWithSecureImpersonation-seed#[69C86AC3CDAB50BD]-worker) [    ] o.a.s.c.ZkTestServer STARTING ZK TEST SERVER
   [junit4]   2> 441682 INFO  (Thread-605) [    ] o.a.s.c.ZkTestServer client port:0.0.0.0/0.0.0.0:0
   [junit4]   2> 441682 INFO  (Thread-605) [    ] o.a.s.c.ZkTestServer Starting server
   [junit4]   2> 441684 ERROR (Thread-605) [    ] o.a.z.s.ZooKeeperServer ZKShutdownHandler is not registered, so ZooKeeper server won't take any action on ERROR or SHUTDOWN server state changes
   [junit4]   2> 441782 INFO  (SUITE-TestSolrCloudWithSecureImpersonation-seed#[69C86AC3CDAB50BD]-worker) [    ] o.a.s.c.ZkTestServer start zk server on port:33381
   [junit4]   2> 441785 INFO  (zkConnectionManagerCallback-790-thread-1) [    ] o.a.s.c.c.ConnectionManager zkClient has connected
   [junit4]   2> 441792 INFO  (jetty-launcher-787-thread-2) [    ] o.e.j.s.Server jetty-9.4.8.v20171121, build timestamp: 2017-11-21T23:27:37+02:00, git hash: 82b8fb23f757335bb3329d540ce37a2a2615f0a8
   [junit4]   2> 441792 INFO  (jetty-launcher-787-thread-1) [    ] o.e.j.s.Server jetty-9.4.8.v20171121, build timestamp: 2017-11-21T23:27:37+02:00, git hash: 82b8fb23f757335bb3329d540ce37a2a2615f0a8
   [junit4]   2> 441793 INFO  (jetty-launcher-787-thread-2) [    ] o.e.j.s.session DefaultSessionIdManager workerName=node0
   [junit4]   2> 441793 INFO  (jetty-launcher-787-thread-2) [    ] o.e.j.s.session No SessionScavenger set, using defaults
   [junit4]   2> 441793 INFO  (jetty-launcher-787-thread-2) [    ] o.e.j.s.session Scavenging every 660000ms
   [junit4]   2> 441794 INFO  (jetty-launcher-787-thread-1) [    ] o.e.j.s.session DefaultSessionIdManager workerName=node0
   [junit4]   2> 441794 INFO  (jetty-launcher-787-thread-2) [    ] o.e.j.s.h.ContextHandler Started o.e.j.s.ServletContextHandler@b3f784{/solr,null,AVAILABLE}
   [junit4]   2> 441794 INFO  (jetty-launcher-787-thread-1) [    ] o.e.j.s.session No SessionScavenger set, using defaults
   [junit4]   2> 441794 INFO  (jetty-launcher-787-thread-1) [    ] o.e.j.s.session Scavenging every 600000ms
   [junit4]   2> 441794 INFO  (jetty-launcher-787-thread-1) [    ] o.e.j.s.h.ContextHandler Started o.e.j.s.ServletContextHandler@1a026c8{/solr,null,AVAILABLE}
   [junit4]   2> 441796 INFO  (jetty-launcher-787-thread-1) [    ] o.e.j.s.AbstractConnector Started ServerConnector@1dbaf78{SSL,[ssl, http/1.1]}{127.0.0.1:45529}
   [junit4]   2> 441796 INFO  (jetty-launcher-787-thread-2) [    ] o.e.j.s.AbstractConnector Started ServerConnector@7a6f73{SSL,[ssl, http/1.1]}{127.0.0.1:45935}
   [junit4]   2> 441796 INFO  (jetty-launcher-787-thread-1) [    ] o.e.j.s.Server Started @442862ms
   [junit4]   2> 441796 INFO  (jetty-launcher-787-thread-2) [    ] o.e.j.s.Server Started @442862ms
   [junit4]   2> 441796 INFO  (jetty-launcher-787-thread-1) [    ] o.a.s.c.s.e.JettySolrRunner Jetty properties: {hostContext=/solr, hostPort=45529}
   [junit4]   2> 441796 INFO  (jetty-launcher-787-thread-2) [    ] o.a.s.c.s.e.JettySolrRunner Jetty properties: {hostContext=/solr, hostPort=45935}
   [junit4]   2> 441796 ERROR (jetty-launcher-787-thread-1) [    ] o.a.s.u.StartupLoggingUtils Missing Java Option solr.log.dir. Logging may be missing or incomplete.
   [junit4]   2> 441796 ERROR (jetty-launcher-787-thread-2) [    ] o.a.s.u.StartupLoggingUtils Missing Java Option solr.log.dir. Logging may be missing or incomplete.
   [junit4]   2> 441796 INFO  (jetty-launcher-787-thread-1) [    ] o.a.s.s.SolrDispatchFilter  ___      _       Welcome to Apache Solr™ version 7.3.0
   [junit4]   2> 441796 INFO  (jetty-launcher-787-thread-2) [    ] o.a.s.s.SolrDispatchFilter  ___      _       Welcome to Apache Solr™ version 7.3.0
   [junit4]   2> 441796 INFO  (jetty-launcher-787-thread-1) [    ] o.a.s.s.SolrDispatchFilter / __| ___| |_ _   Starting in cloud mode on port null
   [junit4]   2> 441796 INFO  (jetty-launcher-787-thread-2) [    ] o.a.s.s.SolrDispatchFilter / __| ___| |_ _   Starting in cloud mode on port null
   [junit4]   2> 441796 INFO  (jetty-launcher-787-thread-1) [    ] o.a.s.s.SolrDispatchFilter \__ \/ _ \ | '_|  Install dir: null
   [junit4]   2> 441796 INFO  (jetty-launcher-787-thread-2) [    ] o.a.s.s.SolrDispatchFilter \__ \/ _ \ | '_|  Install dir: null
   [junit4]   2> 441796 INFO  (jetty-launcher-787-thread-1) [    ] o.a.s.s.SolrDispatchFilter |___/\___/_|_|    Start time: 2018-01-27T00:43:31.277Z
   [junit4]   2> 441796 INFO  (jetty-launcher-787-thread-2) [    ] o.a.s.s.SolrDispatchFilter |___/\___/_|_|    Start time: 2018-01-27T00:43:31.277Z
   [junit4]   2> 441806 INFO  (zkConnectionManagerCallback-794-thread-1) [    ] o.a.s.c.c.ConnectionManager zkClient has connected
   [junit4]   2> 441806 INFO  (zkConnectionManagerCallback-793-thread-1) [    ] o.a.s.c.c.ConnectionManager zkClient has connected
   [junit4]   2> 441807 INFO  (jetty-launcher-787-thread-2) [    ] o.a.s.s.SolrDispatchFilter solr.xml found in ZooKeeper. Loading...
   [junit4]   2> 441807 INFO  (jetty-launcher-787-thread-1) [    ] o.a.s.s.SolrDispatchFilter solr.xml found in ZooKeeper. Loading...
   [junit4]   2> 441815 WARN  (NIOServerCxn.Factory:0.0.0.0/0.0.0.0:0) [    ] o.a.z.s.NIOServerCnxn caught end of stream exception
   [junit4]   2> EndOfStreamException: Unable to read additional data from client sessionid 0x1613511bfdc0001, likely client has closed socket
   [junit4]   2> 	at org.apache.zookeeper.server.NIOServerCnxn.doIO(NIOServerCnxn.java:239)
   [junit4]   2> 	at org.apache.zookeeper.server.NIOServerCnxnFactory.run(NIOServerCnxnFactory.java:203)
   [junit4]   2> 	at java.lang.Thread.run(Thread.java:748)
   [junit4]   2> 441825 INFO  (jetty-launcher-787-thread-2) [    ] o.a.s.c.ZkContainer Zookeeper client=127.0.0.1:33381/solr
   [junit4]   2> 441825 INFO  (jetty-launcher-787-thread-1) [    ] o.a.s.c.ZkContainer Zookeeper client=127.0.0.1:33381/solr
   [junit4]   2> 441835 INFO  (zkConnectionManagerCallback-799-thread-1) [    ] o.a.s.c.c.ConnectionManager zkClient has connected
   [junit4]   2> 441835 INFO  (zkConnectionManagerCallback-802-thread-1) [    ] o.a.s.c.c.ConnectionManager zkClient has connected
   [junit4]   2> 441844 INFO  (zkConnectionManagerCallback-804-thread-1-processing-n:127.0.0.1:45529_solr) [n:127.0.0.1:45529_solr    ] o.a.s.c.c.ConnectionManager zkClient has connected
   [junit4]   2> 441854 INFO  (zkConnectionManagerCallback-806-thread-1-processing-n:127.0.0.1:45935_solr) [n:127.0.0.1:45935_solr    ] o.a.s.c.c.ConnectionManager zkClient has connected
   [junit4]   2> 441924 INFO  (jetty-launcher-787-thread-2) [n:127.0.0.1:45935_solr    ] o.a.s.c.Overseer Overseer (id=null) closing
   [junit4]   2> 441924 INFO  (jetty-launcher-787-thread-1) [n:127.0.0.1:45529_solr    ] o.a.s.c.Overseer Overseer (id=null) closing
   [junit4]   2> 441925 INFO  (jetty-launcher-787-thread-2) [n:127.0.0.1:45935_solr    ] o.a.s.c.OverseerElectionContext I am going to be the leader 127.0.0.1:45935_solr
   [junit4]   2> 441925 INFO  (jetty-launcher-787-thread-1) [n:127.0.0.1:45529_solr    ] o.a.s.c.ZkController Register node as live in ZooKeeper:/live_nodes/127.0.0.1:45529_solr
   [junit4]   2> 441925 INFO  (jetty-launcher-787-thread-2) [n:127.0.0.1:45935_solr    ] o.a.s.c.Overseer Overseer (id=99419017128443910-127.0.0.1:45935_solr-n_0000000000) starting
   [junit4]   2> 441931 INFO  (zkCallback-805-thread-1-processing-n:127.0.0.1:45935_solr) [n:127.0.0.1:45935_solr    ] o.a.s.c.c.ZkStateReader Updated live nodes from ZooKeeper... (0) -> (1)
   [junit4]   2> 441942 INFO  (zkCallback-803-thread-1-processing-n:127.0.0.1:45529_solr) [n:127.0.0.1:45529_solr    ] o.a.s.c.c.ZkStateReader Updated live nodes from ZooKeeper... (0) -> (1)
   [junit4]   2> 441947 INFO  (jetty-launcher-787-thread-2) [n:127.0.0.1:45935_solr    ] o.a.s.c.ZkController Register node as live in ZooKeeper:/live_nodes/127.0.0.1:45935_solr
   [junit4]   2> 441948 INFO  (zkCallback-803-thread-1-processing-n:127.0.0.1:45529_solr) [n:127.0.0.1:45529_solr    ] o.a.s.c.c.ZkStateReader Updated live nodes from ZooKeeper... (1) -> (2)
   [junit4]   2> 441954 INFO  (zkCallback-805-thread-1-processing-n:127.0.0.1:45935_solr) [n:127.0.0.1:45935_solr    ] o.a.s.c.c.ZkStateReader Updated live nodes from ZooKeeper... (1) -> (2)
   [junit4]   2> 442059 INFO  (jetty-launcher-787-thread-1) [n:127.0.0.1:45529_solr    ] o.a.s.c.CoreContainer Initializing authentication plugin: org.apache.solr.security.HttpParamDelegationTokenPlugin
   [junit4]   2> 442062 WARN  (jetty-launcher-787-thread-1) [n:127.0.0.1:45529_solr    ] o.a.s.c.s.i.Krb5HttpClientBuilder org.apache.solr.client.solrj.impl.Krb5HttpClientBuilder is configured without specifying system property 'java.security.auth.login.config'
   [junit4]   2> 442064 INFO  (jetty-launcher-787-thread-1) [n:127.0.0.1:45529_solr    ] o.a.s.s.KerberosPlugin Params: {solr.kerberos.impersonator.user.noGroups.hosts=*, solr.kerberos.impersonator.user.bogusGroup.groups=__some_bogus_group, token.valid=30, cookie.domain=127.0.0.1, solr.kerberos.impersonator.user.anyHostAnyUser.groups=*, solr.kerberos.impersonator.user.bogusGroup.hosts=*, solr.kerberos.impersonator.user.anyHostAnyUser.hosts=*, token.validity=36000, solr.kerberos.impersonator.user.noHosts.groups=*, type=kerberos, solr.kerberos.impersonator.user.localHostAnyGroup.groups=*, delegation-token.token-kind=solr-dt, solr.kerberos.impersonator.user.wrongHost.hosts=1.1.1.1.1.1, cookie.path=/, zk-dt-secret-manager.znodeWorkingPath=solr/security/zkdtsm, solr.kerberos.impersonator.user.localHostAnyGroup.hosts=localhost.localdomain,localhost,127.0.0.1, signer.secret.provider.zookeeper.path=/token, solr.kerberos.impersonator.user.anyHostUsersGroup.groups=jenkins, zk-dt-secret-manager.enable=true, solr.kerberos.impersonator.user.wrongHost.groups=*, kerberos.name.rules=DEFAULT, signer.secret.provider=zookeeper, solr.kerberos.impersonator.user.anyHostUsersGroup.hosts=*}
   [junit4]   2> 442068 INFO  (jetty-launcher-787-thread-1) [n:127.0.0.1:45529_solr    ] o.a.c.f.i.CuratorFrameworkImpl Starting
   [junit4]   2> 442086 INFO  (jetty-launcher-787-thread-1-EventThread) [n:127.0.0.1:45529_solr    ] o.a.c.f.s.ConnectionStateManager State change: CONNECTED
   [junit4]   2> 442204 INFO  (jetty-launcher-787-thread-2) [n:127.0.0.1:45935_solr    ] o.a.s.c.CoreContainer Initializing authentication plugin: org.apache.solr.security.HttpParamDelegationTokenPlugin
   [junit4]   2> 442204 WARN  (jetty-launcher-787-thread-2) [n:127.0.0.1:45935_solr    ] o.a.s.c.s.i.Krb5HttpClientBuilder org.apache.solr.client.solrj.impl.Krb5HttpClientBuilder is configured without specifying system property 'java.security.auth.login.config'
   [junit4]   2> 442205 INFO  (jetty-launcher-787-thread-2) [n:127.0.0.1:45935_solr    ] o.a.s.s.KerberosPlugin Params: {solr.kerberos.impersonator.user.noGroups.hosts=*, solr.kerberos.impersonator.user.bogusGroup.groups=__some_bogus_group, token.valid=30, cookie.domain=127.0.0.1, solr.kerberos.impersonator.user.anyHostAnyUser.groups=*, solr.kerberos.impersonator.user.bogusGroup.hosts=*, solr.kerberos.impersonator.user.anyHostAnyUser.hosts=*, token.validity=36000, solr.kerberos.impersonator.user.noHosts.groups=*, type=kerberos, solr.kerberos.impersonator.user.localHostAnyGroup.groups=*, delegation-token.token-kind=solr-dt, solr.kerberos.impersonator.user.wrongHost.hosts=1.1.1.1.1.1, cookie.path=/, zk-dt-secret-manager.znodeWorkingPath=solr/security/zkdtsm, solr.kerberos.impersonator.user.localHostAnyGroup.hosts=localhost.localdomain,localhost,127.0.0.1, signer.secret.provider.zookeeper.path=/token, solr.kerberos.impersonator.user.anyHostUsersGroup.groups=jenkins, zk-dt-secret-manager.enable=true, solr.kerberos.impersonator.user.wrongHost.groups=*, kerberos.name.rules=DEFAULT, signer.secret.provider=zookeeper, solr.kerberos.impersonator.user.anyHostUsersGroup.hosts=*}
   [junit4]   2> 442206 INFO  (jetty-launcher-787-thread-2) [n:127.0.0.1:45935_solr    ] o.a.c.f.i.CuratorFrameworkImpl Starting
   [junit4]   2> 442207 INFO  (jetty-launcher-787-thread-2-EventThread) [n:127.0.0.1:45935_solr    ] o.a.c.f.s.ConnectionStateManager State change: CONNECTED
   [junit4]   2> 442219 WARN  (jetty-launcher-787-thread-2) [n:127.0.0.1:45935_solr    ] o.a.s.c.s.i.Krb5HttpClientBuilder org.apache.solr.client.solrj.impl.Krb5HttpClientBuilder is configured without specifying system property 'java.security.auth.login.config'
   [junit4]   2> 442295 INFO  (jetty-launcher-787-thread-2) [n:127.0.0.1:45935_solr    ] o.a.s.m.r.SolrJmxReporter JMX monitoring for 'solr_45935.solr.node' (registry 'solr.node') enabled at server: com.sun.jmx.mbeanserver.JmxMBeanServer@10955d7
   [junit4]   2> 442312 INFO  (jetty-launcher-787-thread-2) [n:127.0.0.1:45935_solr    ] o.a.s.m.r.SolrJmxReporter JMX monitoring for 'solr_45935.solr.jvm' (registry 'solr.jvm') enabled at server: com.sun.jmx.mbeanserver.JmxMBeanServer@10955d7
   [junit4]   2> 442313 INFO  (jetty-launcher-787-thread-2) [n:127.0.0.1:45935_solr    ] o.a.s.m.r.SolrJmxReporter JMX monitoring for 'solr_45935.solr.jetty' (registry 'solr.jetty') enabled at server: com.sun.jmx.mbeanserver.JmxMBeanServer@10955d7
   [junit4]   2> 442315 INFO  (jetty-launcher-787-thread-2) [n:127.0.0.1:45935_solr    ] o.a.s.c.CorePropertiesLocator Found 0 core definitions underneath /home/jenkins/workspace/Lucene-Solr-7.x-Linux/solr/build/solr-core/test/J2/temp/solr.cloud.TestSolrCloudWithSecureImpersonation_69C86AC3CDAB50BD-001/tempDir-001/node2/.
   [junit4]   2> 443100 WARN  (jetty-launcher-787-thread-1) [n:127.0.0.1:45529_solr    ] o.a.s.c.s.i.Krb5HttpClientBuilder org.apache.solr.client.solrj.impl.Krb5HttpClientBuilder is configured without specifying system property 'java.security.auth.login.config'
   [junit4]   2> 443142 INFO  (jetty-launcher-787-thread-1) [n:127.0.0.1:45529_solr    ] o.a.s.m.r.SolrJmxReporter JMX monitoring for 'solr_45529.solr.node' (registry 'solr.node') enabled at server: com.sun.jmx.mbeanserver.JmxMBeanServer@10955d7
   [junit4]   2> 443158 INFO  (jetty-launcher-787-thread-1) [n:127.0.0.1:45529_solr    ] o.a.s.m.r.SolrJmxReporter JMX monitoring for 'solr_45529.solr.jvm' (registry 'solr.jvm') enabled at server: com.sun.jmx.mbeanserver.JmxMBeanServer@10955d7
   [junit4]   2> 443158 INFO  (jetty-launcher-787-thread-1) [n:127.0.0.1:45529_solr    ] o.a.s.m.r.SolrJmxReporter JMX monitoring for 'solr_45529.solr.jetty' (registry 'solr.jetty') enabled at server: com.sun.jmx.mbeanserver.JmxMBeanServer@10955d7
   [junit4]   2> 443160 INFO  (jetty-launcher-787-thread-1) [n:127.0.0.1:45529_solr    ] o.a.s.c.CorePropertiesLocator Found 0 core definitions underneath /home/jenkins/workspace/Lucene-Solr-7.x-Linux/solr/build/solr-core/test/J2/temp/solr.cloud.TestSolrCloudWithSecureImpersonation_69C86AC3CDAB50BD-001/tempDir-001/node1/.
   [junit4]   2> 443203 INFO  (zkConnectionManagerCallback-812-thread-1) [    ] o.a.s.c.c.ConnectionManager zkClient has connected
   [junit4]   2> 443228 INFO  (TEST-TestSolrCloudWithSecureImpersonation.testProxyInvalidGroup-seed#[69C86AC3CDAB50BD]) [    ] o.a.s.SolrTestCaseJ4 ###Starting testProxyInvalidGroup
   [junit4]   2> 443301 WARN  (qtp14527801-3359) [    ] o.a.h.s.ShellBasedUnixGroupsMapping got exception trying to get groups for user bar: id: ‘bar’: no such user
   [junit4]   2> id: ‘bar’: no such user
   [junit4]   2> 
   [junit4]   2> 443306 INFO  (TEST-TestSolrCloudWithSecureImpersonation.testProxyInvalidGroup-seed#[69C86AC3CDAB50BD]) [    ] o.a.s.SolrTestCaseJ4 ###Ending testProxyInvalidGroup
   [junit4]   2> 443327 INFO  (TEST-TestSolrCloudWithSecureImpersonation.testProxyNoConfigGroups-seed#[69C86AC3CDAB50BD]) [    ] o.a.s.SolrTestCaseJ4 ###Starting testProxyNoConfigGroups
   [junit4]   2> 443343 WARN  (qtp14527801-3357) [    ] o.a.h.s.a.s.AuthenticationFilter AuthenticationToken ignored: Invalid AuthenticationToken type
   [junit4]   2> 443348 INFO  (TEST-TestSolrCloudWithSecureImpersonation.testProxyNoConfigGroups-seed#[69C86AC3CDAB50BD]) [    ] o.a.s.SolrTestCaseJ4 ###Ending testProxyNoConfigGroups
   [junit4]   2> 443364 INFO  (TEST-TestSolrCloudWithSecureImpersonation.testProxyValidateAnyHostAnyUser-seed#[69C86AC3CDAB50BD]) [    ] o.a.s.SolrTestCaseJ4 ###Starting testProxyValidateAnyHostAnyUser
   [junit4]   2> 443366 WARN  (qtp14527801-3359) [    ] o.a.h.s.a.s.AuthenticationFilter AuthenticationToken ignored: Invalid AuthenticationToken type
   [junit4]   2> 443367 INFO  (qtp14527801-3359) [n:127.0.0.1:45935_solr    ] o.a.s.h.a.CollectionsHandler Invoked Collection Action :list with params doAs=bar&action=LIST&wt=javabin&version=2 and sendToOCPQueue=true
   [junit4]   2> 443367 INFO  (qtp14527801-3359) [n:127.0.0.1:45935_solr    ] o.a.s.s.HttpSolrCall [admin] webapp=null path=/admin/collections params={doAs=bar&action=LIST&wt=javabin&version=2} status=0 QTime=0
   [junit4]   2> 443368 INFO  (TEST-TestSolrCloudWithSecureImpersonation.testProxyValidateAnyHostAnyUser-seed#[69C86AC3CDAB50BD]) [    ] o.a.s.SolrTestCaseJ4 ###Ending testProxyValidateAnyHostAnyUser
   [junit4]   2> 443387 INFO  (TEST-TestSolrCloudWithSecureImpersonation.testProxyInvalidProxyUser-seed#[69C86AC3CDAB50BD]) [    ] o.a.s.SolrTestCaseJ4 ###Starting testProxyInvalidProxyUser
   [junit4]   2> 443388 WARN  (qtp14527801-3357) [    ] o.a.h.s.a.s.AuthenticationFilter AuthenticationToken ignored: Invalid AuthenticationToken type
   [junit4]   2> 443392 INFO  (TEST-TestSolrCloudWithSecureImpersonation.testProxyInvalidProxyUser-seed#[69C86AC3CDAB50BD]) [    ] o.a.s.SolrTestCaseJ4 ###Ending testProxyInvalidProxyUser
   [junit4]   2> 443410 INFO  (TEST-TestSolrCloudWithSecureImpersonation.testProxyInvalidRemote-seed#[69C86AC3CDAB50BD]) [    ] o.a.s.SolrTestCaseJ4 ###Starting testProxyInvalidRemote
   [junit4]   2> 443412 WARN  (qtp14527801-3359) [n:127.0.0.1:45935_solr    ] o.a.h.s.a.s.AuthenticationFilter AuthenticationToken ignored: Invalid AuthenticationToken type
   [junit4]   2> 443419 INFO  (TEST-TestSolrCloudWithSecureImpersonation.testProxyInvalidRemote-seed#[69C86AC3CDAB50BD]) [    ] o.a.s.SolrTestCaseJ4 ###Ending testProxyInvalidRemote
   [junit4]   2> 443436 INFO  (TEST-TestSolrCloudWithSecureImpersonation.testProxyValidateHost-seed#[69C86AC3CDAB50BD]) [    ] o.a.s.SolrTestCaseJ4 ###Starting testProxyValidateHost
   [junit4]   2> 443438 WARN  (qtp14527801-3357) [    ] o.a.h.s.a.s.AuthenticationFilter AuthenticationToken ignored: Invalid AuthenticationToken type
   [junit4]   2> 443439 INFO  (qtp14527801-3357) [n:127.0.0.1:45935_solr    ] o.a.s.h.a.CollectionsHandler Invoked Collection Action :list with params doAs=bar&action=LIST&wt=javabin&version=2 and sendToOCPQueue=true
   [junit4]   2> 443439 INFO  (qtp14527801-3357) [n:127.0.0.1:45935_solr    ] o.a.s.s.HttpSolrCall [admin] webapp=null path=/admin/collections params={doAs=bar&action=LIST&wt=javabin&version=2} status=0 QTime=0
   [junit4]   2> 443440 INFO  (TEST-TestSolrCloudWithSecureImpersonation.testProxyValidateHost-seed#[69C86AC3CDAB50BD]) [    ] o.a.s.SolrTestCaseJ4 ###Ending testProxyValidateHost
   [junit4]   2> 443456 INFO  (TEST-TestSolrCloudWithSecureImpersonation.testProxyNullProxyUser-seed#[69C86AC3CDAB50BD]) [    ] o.a.s.SolrTestCaseJ4 ###Starting testProxyNullProxyUser
   [junit4]   2> 443457 WARN  (qtp14527801-3359) [n:127.0.0.1:45935_solr    ] o.a.h.s.a.s.AuthenticationFilter AuthenticationToken ignored: Invalid AuthenticationToken type
   [junit4]   2> 443458 INFO  (qtp14527801-3359) [n:127.0.0.1:45935_solr    ] o.a.s.s.SolrDispatchFilter Error authenticating
   [junit4]   2> java.lang.IllegalArgumentException: userName is NULL, empty or contains a '&'
   [junit4]   2> 	at org.apache.hadoop.security.authentication.util.AuthToken.checkForIllegalArgument(AuthToken.java:87)
   [junit4]   2> 	at org.apache.hadoop.security.authentication.util.AuthToken.<init>(AuthToken.java:70)
   [junit4]   2> 	at org.apache.hadoop.security.authentication.server.AuthenticationToken.<init>(AuthenticationToken.java:58)
   [junit4]   2> 	at org.apache.solr.security.HttpParamDelegationTokenPlugin$HttpParamDelegationTokenAuthenticationHandler$HttpParamAuthenticationHandler.authenticate(HttpParamDelegationTokenPlugin.java:213)
   [junit4]   2> 	at org.apache.hadoop.security.token.delegation.web.DelegationTokenAuthenticationHandler.authenticate(DelegationTokenAuthenticationHandler.java:348)
   [junit4]   2> 	at org.apache.solr.security.RequestContinuesRecorderAuthenticationHandler.authenticate(RequestContinuesRecorderAuthenticationHandler.java:69)
   [junit4]   2> 	at org.apache.hadoop.security.authentication.server.AuthenticationFilter.doFilter(AuthenticationFilter.java:518)
   [junit4]   2> 	at org.apache.solr.security.DelegationTokenKerberosFilter.doFilter(DelegationTokenKerberosFilter.java:134)
   [junit4]   2> 	at org.apache.solr.security.HttpParamDelegationTokenPlugin$HttpParamToRequestFilter.doFilter(HttpParamDelegationTokenPlugin.java:245)
   [junit4]   2> 	at org.apache.solr.security.KerberosPlugin.doAuthenticate(KerberosPlugin.java:243)
   [junit4]   2> 	at org.apache.solr.servlet.SolrDispatchFilter.authenticateRequest(SolrDispatchFilter.java:449)
   [junit4]   2> 	at org.apache.solr.servlet.SolrDispatchFilter.doFilter(SolrDispatchFilter.java:349)
   [junit4]   2> 	at org.apache.solr.servlet.SolrDispatchFilter.doFilter(SolrDispatchFilter.java:326)
   [junit4]   2> 	at org.eclipse.jetty.servlet.ServletHandler$CachedChain.doFilter(ServletHandler.java:1637)
   [junit4]   2> 	at org.apache.solr.client.solrj.embedded.JettySolrRunner$DebugFilter.doFilter(JettySolrRunner.java:139)
   [junit4]   2> 	at org.eclipse.jetty.servlet.ServletHandler$CachedChain.doFilter(ServletHandler.java:1637)
   [junit4]   2> 	at org.eclipse.jetty.servlet.ServletHandler.doHandle(ServletHandler.java:533)
   [junit4]   2> 	at org.eclipse.jetty.server.handler.ScopedHandler.nextHandle(ScopedHandler.java:188)
   [junit4]   2> 	at org.eclipse.jetty.server.session.SessionHandler.doHandle(SessionHandler.java:1595)
   [junit4]   2> 	at org.eclipse.jetty.server.handler.ScopedHandler.nextHandle(ScopedHandler.java:188)
   [junit4]   2> 	at org.eclipse.jetty.server.handler.ContextHandler.doHandle(ContextHandler.java:1253)
   [junit4]   2> 	at org.eclipse.jetty.server.handler.ScopedHandler.nextScope(ScopedHandler.java:168)
   [junit4]   2> 	at org.eclipse.jetty.servlet.ServletHandler.doScope(ServletHandler.java:473)
   [junit4]   2> 	at org.eclipse.jetty.server.session.SessionHandler.doScope(SessionHandler.java:1564)
   [junit4]   2> 	at org.eclipse.jetty.server.handler.ScopedHandler.nextScope(ScopedHandler.java:166)
   [junit4]   2> 	at org.eclipse.jetty.server.handler.ContextHandler.doScope(ContextHandler.java:1155)
   [junit4]   2> 	at org.eclipse.jetty.server.handler.ScopedHandler.handle(ScopedHandler.java:141)
   [junit4]   2> 	at org.eclipse.jetty.server.handler.gzip.GzipHandler.handle(GzipHandler.java:527)
   [junit4]   2> 	at org.eclipse.jetty.server.handler.HandlerWrapper.handle(HandlerWrapper.java:132)
   [junit4]   2> 	at org.eclipse.jetty.server.Server.handle(Server.java:530)
   [junit4]   2> 	at org.eclipse.jetty.server.HttpChannel.handle(HttpChannel.java:347)
   [junit4]   2> 	at org.eclipse.jetty.server.HttpConnection.onFillable(HttpConnection.java:256)
   [junit4]   2> 	at org.eclipse.jetty.io.AbstractConnection$ReadCallback.succeeded(AbstractConnection.java:279)
   [junit4]   2> 	at org.eclipse.jetty.io.FillInterest.fillable(FillInterest.java:102)
   [junit4]   2> 	at org.eclipse.jetty.io.ssl.SslConnection.onFillable(SslConnection.java:289)
   [junit4]   2> 	at org.eclipse.jetty.io.ssl.SslConnection$3.succeeded(SslConnection.java:149)
   [junit4]   2> 	at org.eclipse.jetty.io.FillInterest.fillable(FillInterest.java:102)
   [junit4]   2> 	at org.eclipse.jetty.io.ChannelEndPoint$2.run(ChannelEndPoint.java:124)
   [junit4]   2> 	at org.eclipse.jetty.util.thread.strategy.EatWhatYouKill.doProduce(EatWhatYouKill.java:247)
   [junit4]   2> 	at org.eclipse.jetty.util.thread.strategy.EatWhatYouKill.produce(EatWhatYouKill.java:140)
   [junit4]   2> 	at org.eclipse.jetty.util.thread.strategy.EatWhatYouKill.run(EatWhatYouKill.java:131)
   [junit4]   2> 	at org.eclipse.jetty.util.thread.ReservedThreadExecutor$ReservedThread.run(ReservedThreadExecutor.java:382)
   [junit4]   2> 	at org.eclipse.jetty.util.thread.QueuedThreadPool.runJob(QueuedThreadPool.java:708)
   [junit4]   2> 	at org.eclipse.jetty.util.thread.QueuedThreadPool$2.run(QueuedThreadPool.java:626)
   [junit4]   2> 	at java.lang.Thread.run(Thread.java:748)
   [junit4]   2> 443458 WARN  (qtp14527801-3359) [n:127.0.0.1:45935_solr    ] o.e.j.s.HttpChannel /solr/admin/collections
   [junit4]   2> org.apache.solr.common.SolrException: Error during request authentication, 
   [junit4]   2> 	at org.apache.solr.servlet.SolrDispatchFilter.authenticateRequest(SolrDispatchFilter.java:455)
   [junit4]   2> 	at org.apache.solr.servlet.SolrDispatchFilter.doFilter(SolrDispatchFilter.java:349)
   [junit4]   2> 	at org.apache.solr.servlet.SolrDispatchFilter.doFilter(SolrDispatchFilter.java:326)
   [junit4]   2> 	at org.eclipse.jetty.servlet.ServletHandler$CachedChain.doFilter(ServletHandler.java:1637)
   [junit4]   2> 	at org.apache.solr.client.solrj.embedded.JettySolrRunner$DebugFilter.doFilter(JettySolrRunner.java:139)
   [junit4]   2> 	at org.eclipse.jetty.servlet.ServletHandler$CachedChain.doFilter(ServletHandler.java:1637)
   [junit4]   2> 	at org.eclipse.jetty.servlet.ServletHandler.doHandle(ServletHandler.java:533)
   [junit4]   2> 	at org.eclipse.jetty.server.handler.ScopedHandler.nextHandle(ScopedHandler.java:188)
   [junit4]   2> 	at org.eclipse.jetty.server.session.SessionHandler.doHandle(SessionHandler.java:1595)
   [junit4]   2> 	at org.eclipse.jetty.server.handler.ScopedHandler.nextHandle(ScopedHandler.java:188)
   [junit4]   2> 	at org.eclipse.jetty.server.handler.ContextHandler.doHandle(ContextHandler.java:1253)
   [junit4]   2> 	at org.eclipse.jetty.server.handler.ScopedHandler.nextScope(ScopedHandler.java:168)
   [junit4]   2> 	at org.eclipse.jetty.servlet.ServletHandler.doScope(ServletHandler.java:473)
   [junit4]   2> 	at org.eclipse.jetty.server.session.SessionHandler.doScope(SessionHandler.java:1564)
   [junit4]   2> 	at org.eclipse.jetty.server.handler.ScopedHandler.nextScope(ScopedHandler.java:166)
   [junit4]   2> 	at org.eclipse.jetty.server.handler.ContextHandler.doScope(ContextHandler.java:1155)
   [junit4]   2> 	at org.eclipse.jetty.server.handler.ScopedHandler.handle(ScopedHandler.java:141)
   [junit4]   2> 	at org.eclipse.jetty.server.handler.gzip.GzipHandler.handle(GzipHandler.java:527)
   [junit4]   2> 	at org.eclipse.jetty.server.handler.HandlerWrapper.handle(HandlerWrapper.java:132)
   [junit4]   2> 	at org.eclipse.jetty.server.Server.handle(Server.java:530)
   [junit4]   2> 	at org.eclipse.jetty.server.HttpChannel.handle(HttpChannel.java:347)
   [junit4]   2> 	at org.eclipse.jetty.server.HttpConnection.onFillable(HttpConnection.java:256)
   [junit4]   2> 	at org.eclipse.jetty.io.AbstractConnection$ReadCallback.succeeded(AbstractConnection.java:279)
   [junit4]   2> 	at org.eclipse.jetty.io.FillInterest.fillable(FillInterest.java:102)
   [junit4]   2> 	at org.eclipse.jetty.io.ssl.SslConnection.onFillable(SslConnection.java:289)
   [junit4]   2> 	at org.eclipse.jetty.io.ssl.SslConnection$3.succeeded(SslConnection.java:149)
   [junit4]   2> 	at org.eclipse.jetty.io.FillInterest.fillable(FillInterest.java:102)
   [junit4]   2> 	at org.eclipse.jetty.io.ChannelEndPoint$2.run(ChannelEndPoint.java:124)
   [junit4]   2> 	at org.eclipse.jetty.util.thread.strategy.EatWhatYouKill.doProduce(EatWhatYouKill.java:247)
   [junit4]   2> 	at org.eclipse.jetty.util.thread.strategy.EatWhatYouKill.produce(EatWhatYouKill.java:140)
   [junit4]   2> 	at org.eclipse.jetty.util.thread.strategy.EatWhatYouKill.run(EatWhatYouKill.java:131)
   [junit4]   2> 	at org.eclipse.jetty.util.thread.ReservedThreadExecutor$ReservedThread.run(ReservedThreadExecutor.java:382)
   [junit4]   2> 	at org.eclipse.jetty.util.thread.QueuedThreadPool.runJob(QueuedThreadPool.java:708)
   [junit4]   2> 	at org.eclipse.jetty.util.thread.QueuedThreadPool$2.run(QueuedThreadPool.java:626)
   [junit4]   2> 	at java.lang.Thread.run(Thread.java:748)
   [junit4]   2> Caused by: java.lang.IllegalArgumentException: userName is NULL, empty or contains a '&'
   [junit4]   2> 	at org.apache.hadoop.security.authentication.util.AuthToken.checkForIllegalArgument(AuthToken.java:87)
   [junit4]   2> 	at org.apache.hadoop.security.authentication.util.AuthToken.<init>(AuthToken.java:70)
   [junit4]   2> 	at org.apache.hadoop.security.authentication.server.AuthenticationToken.<init>(AuthenticationToken.java:58)
   [junit4]   2> 	at org.apache.solr.security.HttpParamDelegationTokenPlugin$HttpParamDelegationTokenAuthenticationHandler$HttpParamAuthenticationHandler.authenticate(HttpParamDelegationTokenPlugin.java:213)
   [junit4]   2> 	at org.apache.hadoop.security.token.delegation.web.DelegationTokenAuthenticationHandler.authenticate(DelegationTokenAuthenticationHandler.java:348)
   [junit4]   2> 	at org.apache.solr.security.RequestContinuesRecorderAuthenticationHandler.authenticate(RequestContinuesRecorderAuthenticationHandler.java:69)
   [junit4]   2> 	at org.apache.hadoop.security.authentication.server.AuthenticationFilter.doFilter(AuthenticationFilter.java:518)
   [junit4]   2> 	at org.apache.solr.security.DelegationTokenKerberosFilter.doFilter(DelegationTokenKerberosFilter.java:134)
   [junit4]   2> 	at org.apache.solr.security.HttpParamDelegationTokenPlugin$HttpParamToRequestFilter.doFilter(HttpParamDelegationTokenPlugin.java:245)
   [junit4]   2> 	at org.apache.solr.security.KerberosPlugin.doAuthenticate(KerberosPlugin.java:243)
   [junit4]   2> 	at org.apache.solr.servlet.SolrDispatchFilter.authenticateRequest(SolrDispatchFilter.java:449)
   [junit4]   2> 	... 34 more
   [junit4]   2> 443463 INFO  (TEST-TestSolrCloudWithSecureImpersonation.testProxyNullProxyUser-seed#[69C86AC3CDAB50BD]) [    ] o.a.s.SolrTestCaseJ4 ###Ending testProxyNullProxyUser
   [junit4]   2> 443479 INFO  (TEST-TestSolrCloudWithSecureImpersonation.testProxyValidateGroup-seed#[69C86AC3CDAB50BD]) [    ] o.a.s.SolrTestCaseJ4 ###Starting testProxyValidateGroup
   [junit4]   2> 443483 WARN  (qtp14527801-3358) [    ] o.a.h.s.a.s.AuthenticationFilter AuthenticationToken ignored: Invalid AuthenticationToken type
   [junit4]   2> 443484 INFO  (qtp14527801-3358) [n:127.0.0.1:45935_solr    ] o.a.s.h.a.CollectionsHandler Invoked Collection Action :list with params doAs=jenkins&action=LIST&wt=javabin&version=2 and sendToOCPQueue=true
   [junit4]   2> 443484 INFO  (qtp14527801-3358) [n:127.0.0.1:45935_solr    ] o.a.s.s.HttpSolrCall [admin] webapp=null path=/admin/collections params={doAs=jenkins&action=LIST&wt=javabin&version=2} status=0 QTime=0
   [junit4]   2> 443485 INFO  (TEST-TestSolrCloudWithSecureImpersonation.testProxyValidateGroup-seed#[69C86AC3CDAB50BD]) [    ] o.a.s.SolrTestCaseJ4 ###Ending testProxyValidateGroup
   [junit4]   2> 443503 INFO  (TEST-TestSolrCloudWithSecureImpersonation.testProxyUnknownRemote-seed#[69C86AC3CDAB50BD]) [    ] o.a.s.SolrTestCaseJ4 ###Starting testProxyUnknownRemote
   [junit4]   2> 443505 WARN  (qtp14527801-3357) [n:127.0.0.1:45935_solr    ] o.a.h.s.a.s.AuthenticationFilter AuthenticationToken ignored: Invalid AuthenticationToken type
   [junit4]   2> 456683 WARN  (jetty-launcher-787-thread-1-SendThread(127.0.0.1:33381)) [n:127.0.0.1:45529_solr    ] o.a.z.ClientCnxn Client session timed out, have not heard from server in 13522ms for sessionid 0x1613511bfdc0005
   [junit4]   2> 456684 WARN  (jetty-launcher-787-thread-2-SendThread(127.0.0.1:33381)) [n:127.0.0.1:45935_solr    ] o.a.z.ClientCnxn Client session timed out, have not heard from server in 14365ms for sessionid 0x1613511bfdc0006
   [junit4]   2> 456683 WARN  (jetty-launcher-787-thread-1-SendThread(127.0.0.1:33381)) [n:127.0.0.1:45529_solr    ] o.a.z.ClientCnxn Client session timed out, have not heard from server in 13575ms for sessionid 0x1613511bfdc0007
   [junit4]   2> 456683 WARN  (jetty-launcher-787-thread-2-SendThread(127.0.0.1:33381)) [n:127.0.0.1:45935_solr    ] o.a.z.ClientCnxn Client session timed out, have not heard from server in 13576ms for sessionid 0x1613511bfdc0008
   [junit4]   2> 456685 WARN  (NIOServerCxn.Factory:0.0.0.0/0.0.0.0:0) [    ] o.a.z.s.NIOServerCnxn caught end of stream exception
   [junit4]   2> EndOfStreamException: Unable to read additional data from client sessionid 0x1613511bfdc0006, likely client has closed socket
   [junit4]   2> 	at org.apache.zookeeper.server.NIOServerCnxn.doIO(NIOServerCnxn.java:239)
   [junit4]   2> 	at org.apache.zookeeper.server.NIOServerCnxnFactory.run(NIOServerCnxnFactory.java:203)
   [junit4]   2> 	at java.lang.Thread.run(Thread.java:748)
   [junit4]   2> 456686 WARN  (NIOServerCxn.Factory:0.0.0.0/0.0.0.0:0) [    ] o.a.z.s.NIOServerCnxn caught end of stream exception
   [junit4]   2> EndOfStreamException: Unable to read additional data from client sessionid 0x1613511bfdc0007, likely client has closed socket
   [junit4]   2> 	at org.apache.zookeeper.server.NIOServerCnxn.doIO(NIOServerCnxn.java:239)
   [junit4]   2> 	at org.apache.zookeeper.server.NIOServerCnxnFactory.run(NIOServerCnxnFactory.java:203)
   [junit4]   2> 	at java.lang.Thread.run(Thread.java:748)
   [junit4]   2> 456686 WARN  (NIOServerCxn.Factory:0.0.0.0/0.0.0.0:0) [    ] o.a.z.s.NIOServerCnxn caught end of stream exception
   [junit4]   2> EndOfStreamException: Unable to read additional data from client sessionid 0x1613511bfdc0005, likely client has closed socket
   [junit4]   2> 	at org.apache.zookeeper.server.NIOServerCnxn.doIO(NIOServerCnxn.java:239)
   [junit4]   2> 	at org.apache.zookeeper.server.NIOServerCnxnFactory.run(NIOServerCnxnFactory.java:203)
   [junit4]   2> 	at java.lang.Thread.run(Thread.java:748)
   [junit4]   2> 456686 WARN  (NIOServerCxn.Factory:0.0.0.0/0.0.0.0:0) [    ] o.a.z.s.NIOServerCnxn caught end of stream exception
   [junit4]   2> EndOfStreamException: Unable to read additional data from client sessionid 0x1613511bfdc0008, likely client has closed socket
   [junit4]   2> 	at org.apache.zookeeper.server.NIOServerCnxn.doIO(NIOServerCnxn.java:239)
   [junit4]   2> 	at org.apache.zookeeper.server.NIOServerCnxnFactory.run(NIOServerCnxnFactory.java:203)
   [junit4]   2> 	at java.lang.Thread.run(Thread.java:748)
   [junit4]   2> 456689 INFO  (TEST-TestSolrCloudWithSecureImpersonation.testProxyUnknownRemote-seed#[69C86AC3CDAB50BD]) [    ] o.a.s.SolrTestCaseJ4 ###Ending testProxyUnknownRemote
   [junit4]   2> 456715 INFO  (TEST-TestSolrCloudWithSecureImpersonation.testForwarding-seed#[69C86AC3CDAB50BD]) [    ] o.a.s.SolrTestCaseJ4 ###Starting testForwarding
   [junit4]   2> 456718 INFO  (zkConnectionManagerCallback-815-thread-1) [    ] o.a.s.c.c.ConnectionManager zkClient has connected
   [junit4]   2> 456785 WARN  (zkConnectionManagerCallback-804-thread-1-processing-n:127.0.0.1:45529_solr) [n:127.0.0.1:45529_solr    ] o.a.s.c.c.ConnectionManager Watcher org.apache.solr.common.cloud.ConnectionManager@40ee40 name: ZooKeeperConnection Watcher:127.0.0.1:33381/solr got event WatchedEvent state:Disconnected type:None path:null path: null type: None
   [junit4]   2> 456786 WARN  (zkConnectionManagerCallback-804-thread-1-processing-n:127.0.0.1:45529_solr) [n:127.0.0.1:45529_solr    ] o.a.s.c.c.ConnectionManager zkClient has disconnected
   [junit4]   2> 456786 WARN  (zkConnectionManagerCallback-806-thread-1-processing-n:127.0.0.1:45935_solr) [n:127.0.0.1:45935_solr    ] o.a.s.c.c.ConnectionManager Watcher org.apache.solr.common.cloud.ConnectionManager@138d5d7 name: ZooKeeperConnection Watcher:127.0.0.1:33381/solr got event WatchedEvent state:Disconnected type:None path:null path: null type: None
   [junit4]   2> 456786 WARN  (zkConnectionManagerCallback-806-thread-1-processing-n:127.0.0.1:45935_solr) [n:127.0.0.1:45935_solr    ] o.a.s.c.c.ConnectionManager zkClient has disconnected
   [junit4]   2> 456948 INFO  (zkConnectionManagerCallback-818-thread-1) [    ] o.a.s.c.c.ConnectionManager zkClient has connected
   [junit4]   2> 456949 INFO  (TEST-TestSolrCloudWithSecureImpersonation.testForwarding-seed#[69C86AC3CDAB50BD]) [    ] o.a.s.c.c.ZkStateReader Updated live nodes from ZooKeeper... (0) -> (2)
   [junit4]   2> 456950 INFO  (TEST-TestSolrCloudWithSecureImpersonation.testForwarding-seed#[69C86AC3CDAB50BD]) [    ] o.a.s.c.s.i.ZkClientClusterStateProvider Cluster at 127.0.0.1:33381/solr ready
   [junit4]   2> 457000 INFO  (qtp28134270-3361) [n:127.0.0.1:45529_solr    ] o.a.s.h.a.CollectionsHandler Invoked Collection Action :create with params pullReplicas=0&replicationFactor=1&collection.configName=conf1&maxShardsPerNode=1&name=forwardingCollection&nrtReplicas=1&action=CREATE&numShards=1&tlogReplicas=0&wt=javabin&version=2 and sendToOCPQueue=true
   [junit4]   2> 458168 INFO  (zkConnectionManagerCallback-806-thread-1-processing-n:127.0.0.1:45935_solr) [n:127.0.0.1:45935_solr    ] o.a.s.c.c.ConnectionManager zkClient has connected
   [junit4]   2> 458194 INFO  (jetty-launcher-787-thread-2-EventThread) [n:127.0.0.1:45935_solr    ] o.a.c.f.s.ConnectionStateManager State change: SUSPENDED
   [junit4]   2> 458316 INFO  (zkConnectionManagerCallback-804-thread-1-processing-n:127.0.0.1:45529_solr) [n:127.0.0.1:45529_solr    ] o.a.s.c.c.ConnectionManager zkClient has connected
   [junit4]   2> 458318 INFO  (OverseerThreadFactory-1422-thread-1-processing-n:127.0.0.1:45935_solr) [n:127.0.0.1:45935_solr    ] o.a.s.c.a.c.CreateCollectionCmd Create collection forwardingCollection
   [junit4]   2> 458427 INFO  (OverseerStateUpdate-99419017128443910-127.0.0.1:45935_solr-n_0000000000) [n:127.0.0.1:45935_solr    ] o.a.s.c.o.SliceMutator createReplica() {
   [junit4]   2>   "operation":"ADDREPLICA",
   [junit4]   2>   "collection":"forwardingCollection",
   [junit4]   2>   "shard":"shard1",
   [junit4]   2>   "core":"forwardingCollection_shard1_replica_n1",
   [junit4]   2>   "state":"down",
   [junit4]   2>   "base_url":"https://127.0.0.1:45529/solr",
   [junit4]   2>   "type":"NRT",
   [junit4]   2>   "waitForFinalState":"false"} 
   [junit4]   2> 458506 INFO  (jetty-launcher-787-thread-1-EventThread) [n:127.0.0.1:45529_solr    ] o.a.c.f.s.ConnectionStateManager State change: SUSPENDED
   [junit4]   2> 458638 INFO  (qtp28134270-3362) [n:127.0.0.1:45529_solr    ] o.a.s.h.a.CoreAdminOperation core create command qt=/admin/cores&coreNodeName=core_node2&collection.configName=conf1&newCollection=true&name=forwardingCollection_shard1_replica_n1&action=CREATE&numShards=1&collection=forwardingCollection&shard=shard1&wt=javabin&version=2&replicaType=NRT
   [junit4]   2> 458639 INFO  (qtp28134270-3362) [n:127.0.0.1:45529_solr    ] o.a.s.c.TransientSolrCoreCacheDefault Allocating transient cache for 2147483647 transient cores
   [junit4]   2> 458745 INFO  (zkCallback-803-thread-3-processing-n:127.0.0.1:45529_solr) [n:127.0.0.1:45529_solr    ] o.a.s.c.c.ZkStateReader A cluster state change: [WatchedEvent state:SyncConnected type:NodeDataChanged path:/collections/forwardingCollection/state.json] for collection [forwardingCollection] has occurred - updating... (live nodes size: [2])
   [junit4]   2> 458745 INFO  (zkCallback-803-thread-1-processing-n:127.0.0.1:45529_solr) [n:127.0.0.1:45529_solr    ] o.a.s.c.c.ZkStateReader A cluster state change: [WatchedEvent state:SyncConnected type:NodeDataChanged path:/collections/forwardingCollection/state.json] for collection [forwardingCollection] has occurred - updating... (live nodes size: [2])
   [junit4]   2> 459683 INFO  (qtp28134270-3362) [n:127.0.0.1:45529_solr c:forwardingCollection s:shard1 r:core_node2 x:forwardingCollection_shard1_replica_n1] o.a.s.c.SolrConfig Using Lucene MatchVersion: 7.3.0
   [junit4]   2> 459709 INFO  (qtp28134270-3362) [n:127.0.0.1:45529_solr c:forwardingCollection s:shard1 r:core_node2 x:forwardingCollection_shard1_replica_n1] o.a.s.s.IndexSchema [forwardingCollection_shard1_replica_n1] Schema name=test
   [junit4]   2> 459834 INFO  (qtp28134270-3362) [n:127.0.0.1:45529_solr c:forwardingCollection s:shard1 r:core_node2 x:forwardingCollection_shard1_replica_n1] o.a.s.s.IndexSchema Loaded schema test/1.0 with uniqueid field id
   [junit4]   2> 459859 INFO  (qtp28134270-3362) [n:127.0.0.1:45529_solr c:forwardingCollection s:shard1 r:core_node2 x:forwardingCollection_shard1_replica_n1] o.a.s.c.CoreContainer Creating SolrCore 'forwardingCollection_shard1_replica_n1' using configuration from collection forwardingCollection, trusted=true
   [junit4]   2> 459860 INFO  (qtp28134270-3362) [n:127.0.0.1:45529_solr c:forwardingCollection s:shard1 r:core_node2 x:forwardingCollection_shard1_replica_n1] o.a.s.m.r.SolrJmxReporter JMX monitoring for 'solr_45529.solr.core.forwardingCollection.shard1.replica_n1' (registry 'solr.core.forwardingCollection.shard1.replica_n1') enabled at server: com.sun.jmx.mbeanserver.JmxMBeanServer@10955d7
   [junit4]   2> 459860 INFO  (qtp28134270-3362) [n:127.0.0.1:45529_solr c:forwardingCollection s:shard1 r:core_node2 x:forwardingCollection_shard1_replica_n1] o.a.s.c.SolrCore solr.RecoveryStrategy.Builder
   [junit4]   2> 459860 INFO  (qtp28134270-3362) [n:127.0.0.1:45529_solr c:forwardingCollection s:shard1 r:core_node2 x:forwardingCollection_shard1_replica_n1] o.a.s.c.SolrCore [[forwardingCollection_shard1_replica_n1] ] Opening new SolrCore at [/home/jenkins/workspace/Lucene-Solr-7.x-Linux/solr/build/solr-core/test/J2/temp/solr.cloud.TestSolrCloudWithSecureImpersonation_69C86AC3CDAB50BD-001/tempDir-001/node1/forwardingCollection_shard1_replica_n1], dataDir=[/home/jenkins/workspace/Lucene-Solr-7.x-Linux/solr/build/solr-core/test/J2/temp/solr.cloud.TestSolrCloudWithSecureImpersonation_69C86AC3CDAB50BD-001/tempDir-001/node1/./forwardingCollection_shard1_replica_n1/data/]
   [junit4]   2> 459864 INFO  (qtp28134270-3362) [n:127.0.0.1:45529_solr c:forwardingCollection s:shard1 r:core_node2 x:forwardingCollection_shard1_replica_n1] o.a.s.u.RandomMergePolicy RandomMergePolicy wrapping class org.apache.lucene.index.LogByteSizeMergePolicy: [LogByteSizeMergePolicy: minMergeSize=1677721, mergeFactor=47, maxMergeSize=2147483648, maxMergeSizeForForcedMerge=9223372036854775807, calibrateSizeByDeletes=true, maxMergeDocs=2147483647, maxCFSSegmentSizeMB=8.796093022207999E12, noCFSRatio=0.8894820592677872]
   [junit4]   2> 459939 INFO  (qtp28134270-3362) [n:127.0.0.1:45529_solr c:forwardingCollection s:shard1 r:core_node2 x:forwardingCollection_shard1_replica_n1] o.a.s.u.UpdateHandler Using UpdateLog implementation: org.apache.solr.update.UpdateLog
   [junit4]   2> 459939 INFO  (qtp28134270-3362) [n:127.0.0.1:45529_solr c:forwardingCollection s:shard1 r:core_node2 x:forwardingCollection_shard1_replica_n1] o.a.s.u.UpdateLog Initializing UpdateLog: dataDir= defaultSyncLevel=FLUSH numRecordsToKeep=100 maxNumLogsToKeep=10 numVersionBuckets=65536
   [junit4]   2> 459940 INFO  (qtp28134270-3362) [n:127.0.0.1:45529_solr c:forwardingCollection s:shard1 r:core_node2 x:forwardingCollection_shard1_replica_n1] o.a.s.u.CommitTracker Hard AutoCommit: disabled
   [junit4]   2> 459941 INFO  (qtp28134270-3362) [n:127.0.0.1:45529_solr c:forwardingCollection s:shard1 r:core_node2 x:forwardingCollection_shard1_replica_n1] o.a.s.u.CommitTracker Soft AutoCommit: disabled
   [junit4]   2> 459942 INFO  (qtp28134270-3362) [n:127.0.0.1:45529_solr c:forwardingCollection s:shard1 r:core_node2 x:forwardingCollection_shard1_replica_n1] o.a.s.u.RandomMergePolicy RandomMergePolicy wrapping class org.apache.lucene.index.LogByteSizeMergePolicy: [LogByteSizeMergePolicy: minMergeSize=1677721, mergeFactor=12, maxMergeSize=2147483648, maxMergeSizeForForcedMerge=9223372036854775807, calibrateSizeByDeletes=false, maxMergeDocs=2147483647, maxCFSSegmentSizeMB=8.796093022207999E12, noCFSRatio=0.8536914377193153]
   [junit4]   2> 459943 INFO  (qtp28134270-3362) [n:127.0.0.1:45529_solr c:forwardingCollection s:shard1 r:core_node2 x:forwardingCollection_shard1_replica_n1] o.a.s.s.SolrIndexSearcher Opening [Searcher@67901b[forwardingCollection_shard1_replica_n1] main]
   [junit4]   2> 459944 INFO  (qtp28134270-3362) [n:127.0.0.1:45529_solr c:forwardingCollection s:shard1 r:core_node2 x:forwardingCollection_shard1_replica_n1] o.a.s.h.c.SpellCheckComponent Initializing spell checkers
   [junit4]   2> 459964 INFO  (qtp28134270-3362) [n:127.0.0.1:45529_solr c:forwardingCollection s:shard1 r:core_node2 x:forwardingCollection_shard1_replica_n1] o.a.s.s.DirectSolrSpellChecker init: {name=direct,classname=DirectSolrSpellChecker,field=lowerfilt,minQueryLength=3}
   [junit4]   2> 460090 INFO  (qtp28134270-3362) [n:127.0.0.1:45529_solr c:forwardingCollection s:shard1 r:core_node2 x:forwardingCollection_shard1_replica_n1] o.a.s.h.ReplicationHandler Commits will be reserved for 10000ms.
   [junit4]   2> 460091 INFO  (searcherExecutor-1427-thread-1-processing-n:127.0.0.1:45529_solr x:forwardingCollection_shard1_replica_n1 s:shard1 c:forwardingCollection r:core_node2) [n:127.0.0.1:45529_solr c:forwardingCollection s:shard1 r:core_node2 x:forwardingCollection_shard1_replica_n1] o.a.s.h.c.SpellCheckComponent Loading spell index for spellchecker: default
   [junit4]   2> 460091 INFO  (qtp28134270-3362) [n:127.0.0.1:45529_solr c:forwardingCollection s:shard1 r:core_node2 x:forwardingCollection_shard1_replica_n1] o.a.s.u.UpdateLog Could not find max version in index or recent updates, using new clock 1590704293357289472
   [junit4]   2> 460091 INFO  (searcherExecutor-1427-thread-1-processing-n:127.0.0.1:45529_solr x:forwardingCollection_shard1_replica_n1 s:shard1 c:forwardingCollection r:core_node2) [n:127.0.0.1:45529_solr c:forwardingCollection s:shard1 r:core_node2 x:forwardingCollection_shard1_replica_n1] o.a.s.h.c.SpellCheckComponent Loading spell index for spellchecker: direct
   [junit4]   2> 460091 INFO  (searcherExecutor-1427-thread-1-processing-n:127.0.0.1:45529_solr x:forwardingCollection_shard1_replica_n1 s:shard1 c:forwardingCollection r:core_node2) [n:127.0.0.1:45529_solr c:forwardingCollection s:shard1 r:core_node2 x:forwardingCollection_shard1_replica_n1] o.a.s.h.c.SpellCheckComponent Loading spell index for spellchecker: wordbreak
   [junit4]   2> 460091 INFO  (searcherExecutor-1427-thread-1-processing-n:127.0.0.1:45529_solr x:forwardingCollection_shard1_replica_n1 s:shard1 c:forwardingCollection r:core_node2) [n:127.0.0.1:45529_solr c:forwardingCollection s:shard1 r:core_node2 x:forwardingCollection_shard1_replica_n1] o.a.s.h.c.SpellCheckComponent Loading spell index for spellchecker: multipleFields
   [junit4]   2> 460091 INFO  (searcherExecutor-1427-thread-1-processing-n:127.0.0.1:45529_solr x:forwardingCollection_shard1_replica_n1 s:shard1 c:forwardingCollection r:core_node2) [n:127.0.0.1:45529_solr c:forwardingCollection s:shard1 r:core_node2 x:forwardingCollection_shard1_replica_n1] o.a.s.h.c.SpellCheckComponent Loading spell index for spellchecker: jarowinkler
   [junit4]   2> 460092 INFO  (searcherExecutor-1427-thread-1-processing-n:127.0.0.1:45529_solr x:forwardingCollection_shard1_replica_n1 s:shard1 c:forwardingCollection r:core_node2) [n:127.0.0.1:45529_solr c:forwardingCollection s:shard1 r:core_node2 x:forwardingCollection_shard1_replica_n1] o.a.s.h.c.SpellCheckComponent Loading spell index for spellchecker: external
   [junit4]   2> 460092 INFO  (searcherExecutor-1427-thread-1-processing-n:127.0.0.1:45529_solr x:forwardingCollection_shard1_replica_n1 s:shard1 c:forwardingCollection r:core_node2) [n:127.0.0.1:45529_solr c:forwardingCollection s:shard1 r:core_node2 x:forwardingCollection_shard1_replica_n1] o.a.s.h.c.SpellCheckComponent Loading spell index for spellchecker: freq
   [junit4]   2> 460092 INFO  (searcherExecutor-1427-thread-1-processing-n:127.0.0.1:45529_solr x:forwardingCollection_shard1_replica_n1 s:shard1 c:forwardingCollection r:core_node2) [n:127.0.0.1:45529_solr c:forwardingCollection s:shard1 r:core_node2 x:forwardingCollection_shard1_replica_n1] o.a.s.h.c.SpellCheckComponent Loading spell index for spellchecker: fqcn
   [junit4]   2> 460092 INFO  (searcherExecutor-1427-thread-1-processing-n:127.0.0.1:45529_solr x:forwardingCollection_shard1_replica_n1 s:shard1 c:forwardingCollection r:core_node2) [n:127.0.0.1:45529_solr c:forwardingCollection s:shard1 r:core_node2 x:forwardingCollection_shard1_replica_n1] o.a.s.h.c.SpellCheckComponent Loading spell index for spellchecker: perDict
   [junit4]   2> 460104 INFO  (searcherExecutor-1427-thread-1-processing-n:127.0.0.1:45529_solr x:forwardingCollection_shard1_replica_n1 s:shard1 c:forwardingCollection r:core_node2) [n:127.0.0.1:45529_solr c:forwardingCollection s:shard1 r:core_node2 x:forwardingCollection_shard1_replica_n1] o.a.s.c.SolrCore [forwardingCollection_shard1_replica_n1] Registered new searcher Searcher@67901b[forwardingCollection_shard1_replica_n1] main{ExitableDirectoryReader(UninvertingDirectoryReader())}
   [junit4]   2> 460105 INFO  (qtp28134270-3362) [n:127.0.0.1:45529_solr c:forwardingCollection s:shard1 r:core_node2 x:forwardingCollection_shard1_replica_n1] o.a.s.c.ShardLeaderElectionContext Enough replicas found to continue.
   [junit4]   2> 460105 INFO  (qtp28134270-3362) [n:127.0.0.1:45529_solr c:forwardingCollection s:shard1 r:core_node2 x:forwardingCollection_shard1_replica_n1] o.a.s.c.ShardLeaderElectionContext I may be the new leader - try and sync
   [junit4]   2> 460105 INFO  (qtp28134270-3362) [n:127.0.0.1:45529_solr c:forwardingCollection s:shard1 r:core_node2 x:forwardingCollection_shard1_replica_n1] o.a.s.c.SyncStrategy Sync replicas to https://127.0.0.1:45529/solr/forwardingCollection_shard1_replica_n1/
   [junit4]   2> 460105 INFO  (qtp28134270-3362) [n:127.0.0.1:45529_solr c:forwardingCollection s:shard1 r:core_node2 x:forwardingCollection_shard1_replica_n1] o.a.s.c.SyncStrategy Sync Success - now sync replicas to me
   [junit4]   2> 460105 INFO  (qtp28134270-3362) [n:127.0.0.1:45529_solr c:forwardingCollection s:shard1 r:core_node2 x:forwardingCollection_shard1_replica_n1] o.a.s.c.SyncStrategy https://127.0.0.1:45529/solr/forwardingCollection_shard1_replica_n1/ has no replicas
   [junit4]   2> 460105 INFO  (qtp28134270-3362) [n:127.0.0.1:45529_solr c:forwardingCollection s:shard1 r:core_node2 x:forwardingCollection_shard1_replica_n1] o.a.s.c.ShardLeaderElectionContext Found all replicas participating in election, clear LIR
   [junit4]   2> 460107 INFO  (qtp28134270-3362) [n:127.0.0.1:45529_solr c:forwardingCollection s:shard1 r:core_node2 x:forwardingCollection_shard1_replica_n1] o.a.s.c.ShardLeaderElectionContext I am the new leader: https://127.0.0.1:45529/solr/forwardingCollection_shard1_replica_n1/ shard1
   [junit4]   2> 460209 INFO  (zkCallback-803-thread-1-processing-n:127.0.0.1:45529_solr) [n:127.0.0.1:45529_solr    ] o.a.s.c.c.ZkStateReader A cluster state change: [WatchedEvent state:SyncConnected type:NodeDataChanged path:/collections/forwardingCollection/state.json] for collection [forwardingCollection] has occurred - updating... (live nodes size: [2])
   [junit4]   2> 460209 INFO  (zkCallback-803-thread-3-processing-n:127.0.0.1:45529_solr) [n:127.0.0.1:45529_solr    ] o.a.s.c.c.ZkStateReader A cluster state change: [WatchedEvent state:SyncConnected type:NodeDataChanged path:/collections/forwardingCollection/state.json] for collection [forwardingCollection] has occurred - updating... (live nodes size: [2])
   [junit4]   2> 460258 INFO  (qtp28134270-3362) [n:127.0.0.1:45529_solr c:forwardingCollection s:shard1 r:core_node2 x:forwardingCollection_shard1_replica_n1] o.a.s.c.ZkController I am the leader, no recovery necessary
   [junit4]   2> 460260 INFO  (qtp28134270-3362) [n:127.0.0.1:45529_solr c:forwardingCollection s:shard1 r:core_node2 x:forwardingCollection_shard1_replica_n1] o.a.s.s.HttpSolrCall [admin] webapp=null path=/admin/cores params={qt=/admin/cores&coreNodeName=core_node2&collection.configName=conf1&newCollection=true&name=forwardingCollection_shard1_replica_n1&action=CREATE&numShards=1&collection=forwardingCollection&shard=shard1&wt=javabin&version=2&replicaType=NRT} status=0 QTime=1622
   [junit4]   2> 460264 INFO  (qtp28134270-3361) [n:127.0.0.1:45529_solr    ] o.a.s.h.a.CollectionsHandler Wait for new collection to be active for at most 30 seconds. Check all shard replicas
   [junit4]   2> 460320 INFO  (OverseerCollectionConfigSetProcessor-99419017128443910-127.0.0.1:45935_solr-n_0000000000) [n:127.0.0.1:45935_solr    ] o.a.s.c.OverseerTaskQueue Response ZK path: /overseer/collection-queue-work/qnr-0000000000 doesn't exist.  Requestor may have disconnected from ZooKeeper
   [junit4]   2> 460361 INFO  (zkCallback-803-thread-3-processing-n:127.0.0.1:45529_solr) [n:127.0.0.1:45529_solr    ] o.a.s.c.c.ZkStateReader A cluster state change: [WatchedEvent state:SyncConnected type:NodeDataChanged path:/collections/forwardingCollection/state.json] for collection [forwardingCollection] has occurred - updating... (live nodes size: [2])
   [junit4]   2> 460361 INFO  (zkCallback-803-thread-1-processing-n:127.0.0.1:45529_solr) [n:127.0.0.1:45529_solr    ] o.a.s.c.c.ZkStateReader A cluster state change: [WatchedEvent state:SyncConnected type:NodeDataChanged path:/collections/forwardingCollection/state.json] for collection [forwardingCollection] has occurred - updating... (live nodes size: [2])
   [junit4]   2> 461264 INFO  (qtp28134270-3361) [n:127.0.0.1:45529_solr    ] o.a.s.s.HttpSolrCall [admin] webapp=null path=/admin/collections params={pullReplicas=0&replicationFactor=1&collection.configName=conf1&maxShardsPerNode=1&name=forwardingCollection&nrtReplicas=1&action=CREATE&numShards=1&tlogReplicas=0&wt=javabin&version=2} status=0 QTime=4264
   [junit4]   2> 461265 INFO  (TEST-TestSolrCloudWithSecureImpersonation.testForwarding-seed#[69C86AC3CDAB50BD]) [    ] o.a.s.c.AbstractDistribZkTestBase Wait for recoveries to finish - collection: forwardingCollection failOnTimeout:true timeout (sec):100
   [junit4]   2> 461266 INFO  (TEST-TestSolrCloudWithSecureImpersonation.testForwarding-seed#[69C86AC3CDAB50BD]) [    ] o.a.s.c.AbstractDistribZkTestBase Recoveries finished - collection: forwardingCollection
   [junit4]   2> 461270 INFO  (qtp14527801-3349) [n:127.0.0.1:45935_solr    ] o.a.s.c.TransientSolrCoreCacheDefault Allocating transient cache for 2147483647 transient cores
   [junit4]   2> 461276 INFO  (qtp28134270-3361) [n:127.0.0.1:45529_solr c:forwardingCollection s:shard1 r:core_node2 x:forwardingCollection_shard1_replica_n1] o.a.s.c.S.Request [forwardingCollection_shard1_replica_n1]  webapp=/solr path=/select params={q=*:*&wt=javabin&version=2} hits=0 status=0 QTime=0
   [junit4]   2> 461283 INFO  (qtp28134270-3352) [n:127.0.0.1:45529_solr c:forwardingCollection s:shard1 r:core_node2 x:forwardingCollection_shard1_replica_n1] o.a.s.c.S.Request [forwardingCollection_shard1_replica_n1]  webapp=/solr path=/select params={q=*:*&wt=javabin&version=2} hits=0 status=0 QTime=0
   [junit4]   2> 461284 INFO  (TEST-TestSolrCloudWithSecureImpersonation.testForwarding-seed#[69C86AC3CDAB50BD]) [    ] o.a.s.SolrTestCaseJ4 ###Ending testForwarding
   [junit4]   2> 461297 INFO  (TEST-TestSolrCloudWithSecureImpersonation.testProxyNoConfigHosts-seed#[69C86AC3CDAB50BD]) [    ] o.a.s.SolrTestCaseJ4 ###Starting testProxyNoConfigHosts
   [junit4]   2> 461299 WARN  (qtp14527801-3358) [n:127.0.0.1:45935_solr    ] o.a.h.s.a.s.AuthenticationFilter AuthenticationToken ignored: Invalid AuthenticationToken type
   [junit4]   2> 461302 INFO  (TEST-TestSolrCloudWithSecureImpersonation.testProxyNoConfigHosts-seed#[69C86AC3CDAB50BD]) [    ] o.a.s.SolrTestCaseJ4 ###Ending testProxyNoConfigHosts
   [junit4]   2> 461318 INFO  (TEST-TestSolrCloudWithSecureImpersonation.testProxyWrongHost-seed#[69C86AC3CDAB50BD]) [    ] o.a.s.SolrTestCaseJ4 ###Starting testProxyWrongHost
   [junit4]   2> 461319 WARN  (qtp14527801-3349) [n:127.0.0.1:45935_solr    ] o.a.h.s.a.s.AuthenticationFilter AuthenticationToken ignored: Invalid AuthenticationToken type
   [junit4]   2> 461329 INFO  (TEST-TestSolrCloudWithSecureImpersonation.testProxyWrongHost-seed#[69C86AC3CDAB50BD]) [    ] o.a.s.SolrTestCaseJ4 ###Ending testProxyWrongHost
   [junit4]   2> 461334 INFO  (jetty-closer-788-thread-2) [    ] o.e.j.s.AbstractConnector Stopped ServerConnector@1dbaf78{SSL,[ssl, http/1.1]}{127.0.0.1:0}
   [junit4]   2> 461334 INFO  (jetty-closer-788-thread-2) [    ] o.a.s.c.CoreContainer Shutting down CoreContainer instance=30871814
   [junit4]   2> 461334 INFO  (jetty-closer-788-thread-2) [    ] o.a.s.m.SolrMetricManager Closing metric reporters for registry=solr.node, tag=null
   [junit4]   2> 461334 INFO  (jetty-closer-788-thread-2) [    ] o.a.s.m.r.SolrJmxReporter Closing reporter [org.apache.solr.metrics.reporters.SolrJmxReporter@1bbb70c: rootName = solr_45529, domain = solr.node, service url = null, agent id = null] for registry solr.node / com.codahale.metrics.MetricRegistry@1bd20e1
   [junit4]   2> 461334 INFO  (jetty-closer-788-thread-1) [    ] o.e.j.s.AbstractConnector Stopped ServerConnector@7a6f73{SSL,[ssl, http/1.1]}{127.0.0.1:0}
   [junit4]   2> 461335 INFO  (jetty-closer-788-thread-1) [    ] o.a.s.c.CoreContainer Shutting down CoreContainer instance=1441436
   [junit4]   2> 461335 INFO  (jetty-closer-788-thread-1) [    ] o.a.s.m.SolrMetricManager Closing metric reporters for registry=solr.node, tag=null
   [junit4]   2> 461335 INFO  (jetty-closer-788-thread-1) [    ] o.a.s.m.r.SolrJmxReporter Closing reporter [org.apache.solr.metrics.reporters.SolrJmxReporter@f0b3d8: rootName = solr_45935, domain = solr.node, service url = null, agent id = null] for registry solr.node / com.codahale.metrics.MetricRegistry@19afc2
   [junit4]   2> 461340 INFO  (jetty-closer-788-thread-2) [    ] o.a.s.m.SolrMetricManager Closing metric reporters for registry=solr.jvm, tag=null
   [junit4]   2> 461341 INFO  (jetty-closer-788-thread-2) [    ] o.a.s.m.r.SolrJmxReporter Closing reporter [org.apache.solr.metrics.reporters.SolrJmxReporter@1ed54ba: rootName = solr_45529, domain = solr.jvm, service url = null, agent id = null] for registry solr.jvm / com.codahale.metrics.MetricRegistry@16a1b02
   [junit4]   2> 461343 INFO  (jetty-closer-788-thread-1) [    ] o.a.s.m.SolrMetricManager Closing metric reporters for registry=solr.jvm, tag=null
   [junit4]   2> 461343 INFO  (jetty-closer-788-thread-1) [    ] o.a.s.m.r.SolrJmxReporter Closing reporter [org.apache.solr.metrics.reporters.SolrJmxReporter@1de4d53: rootName = solr_45935, domain = solr.jvm, service url = null, agent id = null] for registry solr.jvm / com.codahale.metrics.MetricRegistry@16a1b02
   [junit4]   2> 461347 INFO  (jetty-closer-788-thread-2) [    ] o.a.s.m.SolrMetricManager Closing metric reporters for registry=solr.jetty, tag=null
   [junit4]   2> 461347 INFO  (jetty-closer-788-thread-2) [    ] o.a.s.m.r.SolrJmxReporter Closing reporter [org.apache.solr.metrics.reporters.SolrJmxReporter@9eee8c: rootName = solr_45529, domain = solr.jetty, service url = null, agent id = null] for registry solr.jetty / com.codahale.metrics.MetricRegistry@c4531e
   [junit4]   2> 461348 INFO  (jetty-closer-788-thread-2) [    ] o.a.s.c.ZkController Remove node as live in ZooKeeper:/live_nodes/127.0.0.1:45529_solr
   [junit4]   2> 461349 INFO  (jetty-closer-788-thread-2) [    ] o.a.s.m.SolrMetricManager Closing metric reporters for registry=solr.cluster, tag=null
   [junit4]   2> 461349 INFO  (zkCallback-805-thread-3-processing-n:127.0.0.1:45935_solr) [n:127.0.0.1:45935_solr    ] o.a.s.c.c.ZkStateReader Updated live nodes from ZooKeeper... (2) -> (1)
   [junit4]   2> 461349 INFO  (zkCallback-803-thread-1-processing-n:127.0.0.1:45529_solr) [n:127.0.0.1:45529_solr    ] o.a.s.c.c.ZkStateReader Updated live nodes from ZooKeeper... (2) -> (1)
   [junit4]   2> 461351 INFO  (jetty-closer-788-thread-1) [    ] o.a.s.m.SolrMetricManager Closing metric reporters for registry=solr.jetty, tag=null
   [junit4]   2> 461351 INFO  (jetty-closer-788-thread-1) [    ] o.a.s.m.r.SolrJmxReporter Closing reporter [org.apache.solr.metrics.reporters.SolrJmxReporter@97010f: rootName = solr_45935, domain = solr.jetty, service url = null, agent id = null] for registry solr.jetty / com.codahale.metrics.MetricRegistry@c4531e
   [junit4]   2> 461352 INFO  (jetty-closer-788-thread-1) [    ] o.a.s.c.ZkController Remove node as live in ZooKeeper:/live_nodes/127.0.0.1:45935_solr
   [junit4]   2> 461352 INFO  (jetty-closer-788-thread-1) [    ] o.a.s.m.SolrMetricManager Closing metric reporters for registry=solr.cluster, tag=null
   [junit4]   2> 461352 INFO  (zkCallback-805-thread-3-processing-n:127.0.0.1:45935_solr) [n:127.0.0.1:45935_solr    ] o.a.s.c.c.ZkStateReader Updated live nodes from ZooKeeper... (1) -> (0)
   [junit4]   2> 461353 INFO  (zkCallback-803-thread-1-processing-n:127.0.0.1:45529_solr) [n:127.0.0.1:45529_solr    ] o.a.s.c.c.ZkStateReader Updated live nodes from ZooKeeper... (1) -> (0)
   [junit4]   2> 461354 INFO  (coreCloseExecutor-1432-thread-1) [n:127.0.0.1:45529_solr c:forwardingCollection s:shard1 r:core_node2 x:forwardingCollection_shard1_replica_n1] o.a.s.c.SolrCore [forwardingCollection_shard1_replica_n1]  CLOSING SolrCore org.apache.solr.core.SolrCore@cac375
   [junit4]   2> 461355 INFO  (coreCloseExecutor-1432-thread-1) [n:127.0.0.1:45529_solr c:forwardingCollection s:shard1 r:core_node2 x:forwardingCollection_shard1_replica_n1] o.a.s.m.SolrMetricManager Closing metric reporters for registry=solr.core.forwardingCollection.shard1.replica_n1, tag=13288309
   [junit4]   2> 461355 INFO  (coreCloseExecutor-1432-thread-1) [n:127.0.0.1:45529_solr c:forwardingCollection s:shard1 r:core_node2 x:forwardingCollection_shard1_replica_n1] o.a.s.m.r.SolrJmxReporter Closing reporter [org.apache.solr.metrics.reporters.SolrJmxReporter@c3f5bd: rootName = solr_45529, domain = solr.core.forwardingCollection.shard1.replica_n1, service url = null, agent id = null] for registry solr.core.forwardingCollection.shard1.replica_n1 / com.codahale.metrics.MetricRegistry@f939bf
   [junit4]   2> 461355 INFO  (jetty-closer-788-thread-1) [    ] o.a.s.c.Overseer Overseer (id=99419017128443910-127.0.0.1:45935_solr-n_0000000000) closing
   [junit4]   2> 461355 INFO  (OverseerStateUpdate-99419017128443910-127.0.0.1:45935_solr-n_0000000000) [n:127.0.0.1:45935_solr    ] o.a.s.c.Overseer Overseer Loop exiting : 127.0.0.1:45935_solr
   [junit4]   2> 461355 WARN  (OverseerAutoScalingTriggerThread-99419017128443910-127.0.0.1:45935_solr-n_0000000000) [n:127.0.0.1:45935_solr    ] o.a.s.c.a.OverseerTriggerThread OverseerTriggerThread woken up but we are closed, exiting.
   [junit4]   2> 461356 ERROR (Thread[Thread-622,5,TGRP-TestSolrCloudWithSecureImpersonation]) [n:127.0.0.1:45935_solr    ] o.a.h.s.t.d.AbstractDelegationTokenSecretManager ExpiredTokenRemover received java.lang.InterruptedException: sleep interrupted
   [junit4]   2> 461356 INFO  (zkCallback-803-thread-1-processing-n:127.0.0.1:45529_solr) [n:127.0.0.1:45529_solr    ] o.a.s.c.OverseerElectionContext I am going to be the leader 127.0.0.1:45529_solr
   [junit4]   2> 461357 INFO  (jetty-closer-788-thread-1) [    ] o.e.j.s.h.ContextHandler Stopped o.e.j.s.ServletContextHandler@b3f784{/solr,null,UNAVAILABLE}
   [junit4]   2> 461358 INFO  (jetty-closer-788-thread-1) [    ] o.e.j.s.session Stopped scavenging
   [junit4]   2> 461380 INFO  (coreCloseExecutor-1432-thread-1) [n:127.0.0.1:45529_solr c:forwardingCollection s:shard1 r:core_node2 x:forwardingCollection_shard1_replica_n1] o.a.s.m.SolrMetricManager Closing metric reporters for registry=solr.collection.forwardingCollection.shard1.leader, tag=13288309
   [junit4]   2> 461383 ERROR (Thread[Thread-625,5,TGRP-TestSolrCloudWithSecureImpersonation]) [n:127.0.0.1:45529_solr    ] o.a.h.s.t.d.AbstractDelegationTokenSecretManager ExpiredTokenRemover received java.lang.InterruptedException: sleep interrupted
   [junit4]   2> 461384 INFO  (jetty-closer-788-thread-2) [    ] o.e.j.s.h.ContextHandler Stopped o.e.j.s.ServletContextHandler@1a026c8{/solr,null,UNAVAILABLE}
   [junit4]   2> 461384 INFO  (jetty-closer-788-thread-2) [    ] o.e.j.s.session Stopped scavenging
   [junit4]   2> 461384 ERROR (SUITE-TestSolrCloudWithSecureImpersonation-seed#[69C86AC3CDAB50BD]-worker) [    ] o.a.z.s.ZooKeeperServer ZKShutdownHandler is not registered, so ZooKeeper server won't take any action on ERROR or SHUTDOWN server state changes
   [junit4]   2> 461384 INFO  (SUITE-TestSolrCloudWithSecureImpersonation-seed#[69C86AC3CDAB50BD]-worker) [    ] o.a.s.c.ZkTestServer connecting to 127.0.0.1:33381 33381
   [junit4]   2> 466495 INFO  (Thread-605) [    ] o.a.s.c.ZkTestServer connecting to 127.0.0.1:33381 33381
   [junit4]   2> 466501 WARN  (Thread-605) [    ] o.a.s.c.ZkTestServer Watch limit violations: 
   [junit4]   2> Maximum concurrent create/delete watches above limit:
   [junit4]   2> 
   [junit4]   2> 	3	/solr/aliases.json
   [junit4]   2> 	2	/solr/security.json
   [junit4]   2> 
   [junit4]   2> Maximum concurrent data watches above limit:
   [junit4]   2> 
   [junit4]   2> 	5	/solr/collections/forwardingCollection/state.json
   [junit4]   2> 	4	/solr/security/zkdtsm/ZKDTSMRoot/ZKDTSMKeyIdRoot
   [junit4]   2> 	3	/solr/clusterstate.json
   [junit4]   2> 	3	/solr/security/zkdtsm/ZKDTSMRoot/ZKDTSMSeqNumRoot
   [junit4]   2> 	3	/solr/clusterprops.json
   [junit4]   2> 	2	/solr/security/zkdtsm/ZKDTSMRoot/ZKDTSMMasterKeyRoot/DK_1
   [junit4]   2> 	2	/solr/security/zkdtsm/ZKDTSMRoot/ZKDTSMMasterKeyRoot/DK_3
   [junit4]   2> 	2	/solr/security/zkdtsm/ZKDTSMRoot/ZKDTSMMasterKeyRoot/DK_2
   [junit4]   2> 	2	/solr/security/zkdtsm/ZKDTSMRoot/ZKDTSMMasterKeyRoot/DK_4
   [junit4]   2> 
   [junit4]   2> Maximum concurrent children watches above limit:
   [junit4]   2> 
   [junit4]   2> 	4	/solr/security/zkdtsm/ZKDTSMRoot/ZKDTSMMasterKeyRoot
   [junit4]   2> 	3	/solr/live_nodes
   [junit4]   2> 	3	/solr/collections
   [junit4]   2> 	2	/solr/security/zkdtsm/ZKDTSMRoot/ZKDTSMTokensRoot
   [junit4]   2> 
   [junit4]   2> 466515 INFO  (SUITE-TestSolrCloudWithSecureImpersonation-seed#[69C86AC3CDAB50BD]-worker) [    ] o.a.s.SolrTestCaseJ4 ------------------------------------------------------- Done waiting for tracked resources to be released
   [junit4]   2> Jan 27, 2018 12:43:56 AM com.carrotsearch.randomizedtesting.ThreadLeakControl checkThreadLeaks
   [junit4]   2> WARNING: Will linger awaiting termination of 2 leaked thread(s).
   [junit4]   2> Jan 27, 2018 12:44:16 AM com.carrotsearch.randomizedtesting.ThreadLeakControl checkThreadLeaks
   [junit4]   2> SEVERE: 2 threads leaked from SUITE scope at org.apache.solr.cloud.TestSolrCloudWithSecureImpersonation: 
   [junit4]   2>    1) Thread[id=3397, name=jetty-launcher-787-thread-1-EventThread, state=TIMED_WAITING, group=TGRP-TestSolrCloudWithSecureImpersonation]
   [junit4]   2>         at sun.misc.Unsafe.park(Native Method)
   [junit4]   2>         at java.util.concurrent.locks.LockSupport.parkNanos(LockSupport.java:215)
   [junit4]   2>         at java.util.concurrent.locks.AbstractQueuedSynchronizer.doAcquireSharedNanos(AbstractQueuedSynchronizer.java:1037)
   [junit4]   2>         at java.util.concurrent.locks.AbstractQueuedSynchronizer.tryAcquireSharedNanos(AbstractQueuedSynchronizer.java:1328)
   [junit4]   2>         at java.util.concurrent.CountDownLatch.await(CountDownLatch.java:277)
   [junit4]   2>         at org.apache.curator.CuratorZookeeperClient.internalBlockUntilConnectedOrTimedOut(CuratorZookeeperClient.java:323)
   [junit4]   2>         at org.apache.curator.RetryLoop.callWithRetry(RetryLoop.java:105)
   [junit4]   2>         at org.apache.curator.framework.imps.GetDataBuilderImpl.pathInForeground(GetDataBuilderImpl.java:288)
   [junit4]   2>         at org.apache.curator.framework.imps.GetDataBuilderImpl.forPath(GetDataBuilderImpl.java:279)
   [junit4]   2>         at org.apache.curator.framework.imps.GetDataBuilderImpl.forPath(GetDataBuilderImpl.java:41)
   [junit4]   2>         at org.apache.curator.framework.recipes.shared.SharedValue.readValue(SharedValue.java:244)
   [junit4]   2>         at org.apache.curator.framework.recipes.shared.SharedValue.access$100(SharedValue.java:44)
   [junit4]   2>         at org.apache.curator.framework.recipes.shared.SharedValue$1.process(SharedValue.java:61)
   [junit4]   2>         at org.apache.curator.framework.imps.NamespaceWatcher.process(NamespaceWatcher.java:67)
   [junit4]   2>         at org.apache.zookeeper.ClientCnxn$EventThread.processEvent(ClientCnxn.java:530)
   [junit4]   2>         at org.apache.zookeeper.ClientCnxn$EventThread.run(ClientCnxn.java:505)
   [junit4]   2>    2) Thread[id=3401, name=jetty-launcher-787-thread-2-EventThread, state=TIMED_WAITING, group=TGRP-TestSolrCloudWithSecureImpersonation]
   [junit4]   2>         at sun.misc.Unsafe.park(Native Method)
   [junit4]   2>         at java.util.concurrent.locks.LockSupport.parkNanos(LockSupport.java:215)
   [junit4]   2>         at java.util.concurrent.locks.AbstractQueuedSynchronizer.doAcquireSharedNanos(AbstractQueuedSynchronizer.java:1037)
   [junit4]   2>         at java.util.concurrent.locks.AbstractQueuedSynchronizer.tryAcquireSharedNanos(AbstractQueuedSynchronizer.java:1328)
   [junit4]   2>         at java.util.concurrent.CountDownLatch.await(CountDownLatch.java:277)
   [junit4]   2>         at org.apache.curator.CuratorZookeeperClient.internalBlockUntilConnectedOrTimedOut(CuratorZookeeperClient.java:323)
   [junit4]   2>         at org.apache.curator.RetryLoop.callWithRetry(RetryLoop.java:105)
   [junit4]   2>         at org.apache.curator.framework.imps.GetDataBuilderImpl.pathInForeground(GetDataBuilderImpl.java:288)
   [junit4]   2>         at org.apache.curator.framework.imps.GetDataBuilderImpl.forPath(GetDataBuilderImpl.java:279)
   [junit4]   2>         at org.apache.curator.framework.imps.GetDataBuilderImpl.forPath(GetDataBuilderImpl.java:41)
   [junit4]   2>         at org.apache.curator.framework.recipes.shared.SharedValue.readValue(SharedValue.java:244)
   [junit4]   2>         at org.apache.curator.framework.recipes.shared.SharedValue.access$100(SharedValue.java:44)
   [junit4]   2>         at org.apache.curator.framework.recipes.shared.SharedValue$1.process(SharedValue.java:61)
   [junit4]   2>         at org.apache.curator.framework.imps.NamespaceWatcher.process(NamespaceWatcher.java:67)
   [junit4]   2>         at org.apache.zookeeper.ClientCnxn$EventThread.processEvent(ClientCnxn.java:530)
   [junit4]   2>         at org.apache.zookeeper.ClientCnxn$EventThread.run(ClientCnxn.java:505)
   [junit4]   2> Jan 27, 2018 12:44:16 AM com.carrotsearch.randomizedtesting.ThreadLeakControl tryToInterruptAll
   [junit4]   2> INFO: Starting to interrupt leaked threads:
   [junit4]   2>    1) Thread[id=3397, name=jetty-launcher-787-thread-1-EventThread, state=TIMED_WAITING, group=TGRP-TestSolrCloudWithSecureImpersonation]
   [junit4]   2>    2) Thread[id=3401, name=jetty-launcher-787-thread-2-EventThread, state=TIMED_WAITING, group=TGRP-TestSolrCloudWithSecureImpersonation]
   [junit4]   2> 486620 ERROR (jetty-launcher-787-thread-1-EventThread) [n:127.0.0.1:45529_solr    ] o.a.c.f.i.CuratorFrameworkImpl Watcher exception
   [junit4]   2> java.lang.InterruptedException
   [junit4]   2> 	at java.util.concurrent.locks.AbstractQueuedSynchronizer.doAcquireSharedNanos(AbstractQueuedSynchronizer.java:1039)
   [junit4]   2> 	at java.util.concurrent.locks.AbstractQueuedSynchronizer.tryAcquireSharedNanos(AbstractQueuedSynchronizer.java:1328)
   [junit4]   2> 	at java.util.concurrent.CountDownLatch.await(CountDownLatch.java:277)
   [junit4]   2> 	at org.apache.curator.CuratorZookeeperClient.internalBlockUntilConnectedOrTimedOut(CuratorZookeeperClient.java:323)
   [junit4]   2> 	at org.apache.curator.RetryLoop.callWithRetry(RetryLoop.java:105)
   [junit4]   2> 	at org.apache.curator.framework.imps.GetDataBuilderImpl.pathInForeground(GetDataBuilderImpl.java:288)
   [junit4]   2> 	at org.apache.curator.framework.imps.GetDataBuilderImpl.forPath(GetDataBuilderImpl.java:279)
   [junit4]   2> 	at org.apache.curator.framework.imps.GetDataBuilderImpl.forPath(GetDataBuilderImpl.java:41)
   [junit4]   2> 	at org.apache.curator.framework.recipes.shared.SharedValue.readValue(SharedValue.java:244)
   [junit4]   2> 	at org.apache.curator.framework.recipes.shared.SharedValue.access$100(SharedValue.java:44)
   [junit4]   2> 	at org.apache.curator.framework.recipes.shared.SharedValue$1.process(SharedValue.java:61)
   [junit4]   2> 	at org.apache.curator.framework.imps.NamespaceWatcher.process(NamespaceWatcher.java:67)
   [junit4]   2> 	at org.apache.zookeeper.ClientCnxn$EventThread.processEvent(ClientCnxn.java:530)
   [junit4]   2> 	at org.apache.zookeeper.ClientCnxn$EventThread.run(ClientCnxn.java:505)
   [junit4]   2> 486620 ERROR (jetty-launcher-787-thread-2-EventThread) [n:127.0.0.1:45935_solr    ] o.a.c.f.i.CuratorFrameworkImpl Watcher exception
   [junit4]   2> java.lang.InterruptedException
   [junit4]   2> 	at java.util.concurrent.locks.AbstractQueuedSynchronizer.doAcquireSharedNanos(AbstractQueuedSynchronizer.java:1039)
   [junit4]   2> 	at java.util.concurrent.locks.AbstractQueuedSynchronizer.tryAcquireSharedNanos(AbstractQueuedSynchronizer.java:1328)
   [junit4]   2> 	at java.util.concurrent.CountDownLatch.await(CountDownLatch.java:277)
   [junit4]   2> 	at org.apache.curator.CuratorZookeeperClient.internalBlockUntilConnectedOrTimedOut(CuratorZookeeperClient.java:323)
   [junit4]   2> 	at org.apache.curator.RetryLoop.callWithRetry(RetryLoop.java:105)
   [junit4]   2> 	at org.apache.curator.framework.imps.GetDataBuilderImpl.pathInForeground(GetDataBuilderImpl.java:288)
   [junit4]   2> 	at org.apache.curator.framework.imps.GetDataBuilderImpl.forPath(GetDataBuilderImpl.java:279)
   [junit4]   2> 	at org.apache.curator.framework.imps.GetDataBuilderImpl.forPath(GetDataBuilderImpl.java:41)
   [junit4]   2> 	at org.apache.curator.framework.recipes.shared.SharedValue.readValue(SharedValue.java:244)
   [junit4]   2> 	at org.apache.curator.framework.recipes.shared.SharedValue.access$100(SharedValue.java:44)
   [junit4]   2> 	at org.apache.curator.framework.recipes.shared.SharedValue$1.process(SharedValue.java:61)
   [junit4]   2> 	at org.apache.curator.framework.imps.NamespaceWatcher.process(NamespaceWatcher.java:67)
   [junit4]   2> 	at org.apache.zookeeper.ClientCnxn$EventThread.processEvent(ClientCnxn.java:530)
   [junit4]   2> 	at org.apache.zookeeper.ClientCnxn$EventThread.run(ClientCnxn.java:505)
   [junit4]   2> Jan 27, 2018 12:44:16 AM com.carrotsearch.randomizedtesting.ThreadLeakControl tryToInterruptAll
   [junit4]   2> INFO: All leaked threads terminated.
   [junit4]   2> NOTE: test params are: codec=DummyCompressingStoredFields(storedFieldsFormat=CompressingStoredFieldsFormat(compressionMode=DUMMY, chunkSize=6, maxDocsPerChunk=944, blockSize=177), termVectorsFormat=CompressingTermVectorsFormat(compressionMode=DUMMY, chunkSize=6, blockSize=177)), sim=RandomSimilarity(queryNorm=false): {}, locale=en-IE, timezone=Canada/Central
   [junit4]   2> NOTE: Linux 4.13.0-31-generic i386/Oracle Corporation 1.8.0_144 (32-bit)/cpus=8,threads=1,free=177001632,total=334577664
   [junit4]   2> NOTE: All tests run in this JVM: [MetricsHandlerTest, TestUseDocValuesAsStored, HttpSolrCallGetCoreTest, CdcrReplicationHandlerTest, TestDynamicLoading, TestConfigOverlay, TestValueSourceCache, SaslZkACLProviderTest, TestLFUCache, TestInitParams, SolrJmxReporterCloudTest, SimpleCollectionCreateDeleteTest, TestSimDistributedQueue, OutOfBoxZkACLAndCredentialsProvidersTest, TestReloadDeadlock, SolrMetricsIntegrationTest, UnloadDistributedZkTest, CollectionsAPISolrJTest, URLClassifyProcessorTest, OverseerModifyCollectionTest, BlockJoinFacetSimpleTest, TestAnalyzedSuggestions, IndexSchemaRuntimeFieldTest, StatelessScriptUpdateProcessorFactoryTest, PingRequestHandlerTest, TestMaxTokenLenTokenizer, BJQParserTest, TestImpersonationWithHadoopAuth, TestNodeAddedTrigger, SpellCheckCollatorWithCollapseTest, ZkStateReaderTest, TestFieldCacheSortRandom, TestCloudSchemaless, FileBasedSpellCheckerTest, TestRequestStatusCollectionAPI, ReturnFieldsTest, TestSolrCloudWithSecureImpersonation]
   [junit4]   2> NOTE: reproduce with: ant test  -Dtestcase=TestSolrCloudWithSecureImpersonation -Dtests.seed=69C86AC3CDAB50BD -Dtests.multiplier=3 -Dtests.slow=true -Dtests.locale=en-IE -Dtests.timezone=Canada/Central -Dtests.asserts=true -Dtests.file.encoding=UTF-8
   [junit4] ERROR   0.00s J2 | TestSolrCloudWithSecureImpersonation (suite) <<<
   [junit4]    > Throwable #1: com.carrotsearch.randomizedtesting.ThreadLeakError: 2 threads leaked from SUITE scope at org.apache.solr.cloud.TestSolrCloudWithSecureImpersonation: 
   [junit4]    >    1) Thread[id=3397, name=jetty-launcher-787-thread-1-EventThread, state=TIMED_WAITING, group=TGRP-TestSolrCloudWithSecureImpersonation]
   [junit4]    >         at sun.misc.Unsafe

[...truncated too long message...]

4]   2> 	at org.apache.zookeeper.server.NIOServerCnxnFactory.run(NIOServerCnxnFactory.java:203)
   [junit4]   2> 	at java.lang.Thread.run(Thread.java:748)
   [junit4]   2> 2831934 INFO  (jetty-closer-4603-thread-4) [    ] o.e.j.s.h.ContextHandler Stopped o.e.j.s.ServletContextHandler@71e681{/solr,null,UNAVAILABLE}
   [junit4]   2> 2831935 INFO  (jetty-closer-4603-thread-4) [    ] o.e.j.s.session Stopped scavenging
   [junit4]   2> 2831935 WARN  (NIOServerCxn.Factory:0.0.0.0/0.0.0.0:0) [    ] o.a.z.s.NIOServerCnxn caught end of stream exception
   [junit4]   2> EndOfStreamException: Unable to read additional data from client sessionid 0x1613532f6d30033, likely client has closed socket
   [junit4]   2> 	at org.apache.zookeeper.server.NIOServerCnxn.doIO(NIOServerCnxn.java:239)
   [junit4]   2> 	at org.apache.zookeeper.server.NIOServerCnxnFactory.run(NIOServerCnxnFactory.java:203)
   [junit4]   2> 	at java.lang.Thread.run(Thread.java:748)
   [junit4]   2> 2831941 INFO  (coreCloseExecutor-9042-thread-1) [n:127.0.0.1:40293_solr c:testMetricTrigger s:shard2 r:core_node4 x:testMetricTrigger_shard2_replica_n2] o.a.s.m.SolrMetricManager Closing metric reporters for registry=solr.collection.testMetricTrigger.shard2.leader, tag=11042030
   [junit4]   2> 2831941 INFO  (coreCloseExecutor-9042-thread-2) [n:127.0.0.1:40293_solr c:collection1 s:shard1 r:core_node3 x:collection1_shard1_replica_n1] o.a.s.m.SolrMetricManager Closing metric reporters for registry=solr.collection.collection1.shard1.leader, tag=23218435
   [junit4]   2> 2831943 INFO  (jetty-closer-4603-thread-2) [    ] o.e.j.s.h.ContextHandler Stopped o.e.j.s.ServletContextHandler@5cc401{/solr,null,UNAVAILABLE}
   [junit4]   2> 2831943 INFO  (jetty-closer-4603-thread-2) [    ] o.e.j.s.session Stopped scavenging
   [junit4]   2> 2833426 INFO  (jetty-closer-4603-thread-9) [    ] o.e.j.s.h.ContextHandler Stopped o.e.j.s.ServletContextHandler@e35dff{/solr,null,UNAVAILABLE}
   [junit4]   2> 2833426 INFO  (jetty-closer-4603-thread-9) [    ] o.e.j.s.session Stopped scavenging
   [junit4]   2> 2833434 INFO  (jetty-closer-4603-thread-8) [    ] o.e.j.s.h.ContextHandler Stopped o.e.j.s.ServletContextHandler@1889a0d{/solr,null,UNAVAILABLE}
   [junit4]   2> 2833435 INFO  (jetty-closer-4603-thread-8) [    ] o.e.j.s.session Stopped scavenging
   [junit4]   2> 2833435 ERROR (SUITE-TriggerIntegrationTest-seed#[69C86AC3CDAB50BD]-worker) [    ] o.a.z.s.ZooKeeperServer ZKShutdownHandler is not registered, so ZooKeeper server won't take any action on ERROR or SHUTDOWN server state changes
   [junit4]   2> 2833435 INFO  (SUITE-TriggerIntegrationTest-seed#[69C86AC3CDAB50BD]-worker) [    ] o.a.s.c.ZkTestServer connecting to 127.0.0.1:34673 34673
   [junit4]   2> 2838550 INFO  (Thread-9519) [    ] o.a.s.c.ZkTestServer connecting to 127.0.0.1:34673 34673
   [junit4]   2> 2838551 WARN  (Thread-9519) [    ] o.a.s.c.ZkTestServer Watch limit violations: 
   [junit4]   2> Maximum concurrent create/delete watches above limit:
   [junit4]   2> 
   [junit4]   2> 	22	/solr/aliases.json
   [junit4]   2> 	21	/solr/security.json
   [junit4]   2> 	10	/solr/configs/conf
   [junit4]   2> 
   [junit4]   2> Maximum concurrent data watches above limit:
   [junit4]   2> 
   [junit4]   2> 	107	/solr/collections/collection1/state.json
   [junit4]   2> 	37	/solr/collections/testMetricTrigger/state.json
   [junit4]   2> 	22	/solr/clusterprops.json
   [junit4]   2> 	22	/solr/clusterstate.json
   [junit4]   2> 	6	/solr/autoscaling.json
   [junit4]   2> 	4	/solr/overseer_elect/election/99419159784521766-127.0.0.1:44361_solr-n_0000000011
   [junit4]   2> 	2	/solr/overseer_elect/election/99419159784521763-127.0.0.1:46245_solr-n_0000000010
   [junit4]   2> 	2	/solr/overseer_elect/election/99419159784521754-127.0.0.1:40293_solr-n_0000000007
   [junit4]   2> 	2	/solr/collections/collection1/leader_elect/shard1/election/99419159784521785-core_node6-n_0000000002
   [junit4]   2> 	2	/solr/overseer_elect/election/99419159784521779-127.0.0.1:38739_solr-n_0000000015
   [junit4]   2> 	2	/solr/overseer_elect/election/99419159784521785-127.0.0.1:40647_solr-n_0000000017
   [junit4]   2> 	2	/solr/overseer_elect/election/99419159784521760-127.0.0.1:40011_solr-n_0000000009
   [junit4]   2> 	2	/solr/overseer_elect/election/99419159784521748-127.0.0.1:46807_solr-n_0000000005
   [junit4]   2> 
   [junit4]   2> Maximum concurrent children watches above limit:
   [junit4]   2> 
   [junit4]   2> 	22	/solr/live_nodes
   [junit4]   2> 	22	/solr/collections
   [junit4]   2> 	6	/solr/overseer/queue-work
   [junit4]   2> 	6	/solr/autoscaling/events/.auto_add_replicas
   [junit4]   2> 	6	/solr/overseer/queue
   [junit4]   2> 	6	/solr/overseer/collection-queue-work
   [junit4]   2> 	2	/solr/autoscaling/events/node_lost_triggerMR
   [junit4]   2> 	2	/solr/autoscaling/events/node_added_triggerCTOOR
   [junit4]   2> 
   [junit4]   2> NOTE: leaving temporary files on disk at: /home/jenkins/workspace/Lucene-Solr-7.x-Linux/solr/build/solr-core/test/J1/temp/solr.cloud.autoscaling.TriggerIntegrationTest_69C86AC3CDAB50BD-001
   [junit4]   2> NOTE: test params are: codec=Asserting(Lucene70), sim=RandomSimilarity(queryNorm=false): {}, locale=is-IS, timezone=America/Barbados
   [junit4]   2> NOTE: Linux 4.13.0-31-generic i386/Oracle Corporation 1.8.0_144 (32-bit)/cpus=8,threads=1,free=100348400,total=518979584
   [junit4]   2> NOTE: All tests run in this JVM: [DistributedFacetPivotWhiteBoxTest, TestRecoveryHdfs, LoggingHandlerTest, BadComponentTest, TestSolr4Spatial, FastVectorHighlighterTest, TestSystemIdResolver, UpdateRequestProcessorFactoryTest, TestSerializedLuceneMatchVersion, TestRecovery, TestFastLRUCache, TestSimpleTrackingShardHandler, DeleteNodeTest, CollectionTooManyReplicasTest, TestEmbeddedSolrServerAdminHandler, NumberUtilsTest, RecoveryAfterSoftCommitTest, BigEndianAscendingWordSerializerTest, TestSolrConfigHandlerCloud, SuggesterTest, TestQueryUtils, TestRTimerTree, TestPayloadCheckQParserPlugin, TestDistribStateManager, DistributedIntervalFacetingTest, TestSortByMinMaxFunction, TemplateUpdateProcessorTest, TestRTGBase, BasicZkTest, InfoHandlerTest, BasicAuthStandaloneTest, TestRandomRequestDistribution, TestCloudManagedSchema, TestZkAclsWithHadoopAuth, TestLegacyFieldReuse, TestPartialUpdateDeduplication, QueryEqualityTest, HdfsSyncSliceTest, SimplePostToolTest, TestSolrIndexConfig, TestFieldTypeCollectionResource, OverseerTest, ConcurrentDeleteAndCreateCollectionTest, ManagedSchemaRoundRobinCloudTest, TestNumericTokenStream, DeleteStatusTest, RankQueryTest, AnalyticsMergeStrategyTest, TestFuzzyAnalyzedSuggestions, TestIntervalFaceting, CloneFieldUpdateProcessorFactoryTest, TestTrackingShardHandlerFactory, DirectSolrConnectionTest, TestBulkSchemaAPI, SolrInfoBeanTest, TestElisionMultitermQuery, TestExpandComponent, TestPullReplica, QueryParsingTest, DistribJoinFromCollectionTest, DOMUtilTest, TestManagedSynonymFilterFactory, TestFoldingMultitermQuery, TestStressVersions, CSVRequestHandlerTest, TestCharFilters, TestSimpleQParserPlugin, TestScoreJoinQPScore, TestBlendedInfixSuggestions, TestCloudRecovery, AnalysisErrorHandlingTest, TestGeoJSONResponseWriter, TestSearchPerf, FullHLLTest, TermsComponentTest, TestExceedMaxTermLength, TestSolrCoreParser, ExecutePlanActionTest, V2ApiIntegrationTest, TestMacros, ClassificationUpdateProcessorFactoryTest, TestJettySolrRunner, ImplicitSnitchTest, TestFieldCacheWithThreads, TestXmlQParserPlugin, AsyncCallRequestStatusResponseTest, TestSubQueryTransformer, LeaderElectionContextKeyTest, TestNonDefinedSimilarityFactory, MoveReplicaHDFSTest, TestHalfAndHalfDocValues, SimpleMLTQParserTest, TestUnifiedSolrHighlighter, SampleTest, TestConfigSetProperties, AlternateDirectoryTest, DocValuesNotIndexedTest, SOLR749Test, TestSchemaResource, SparseHLLTest, SortByFunctionTest, ResourceLoaderTest, OverseerStatusTest, DistributedMLTComponentTest, MetricsConfigTest, TestStressInPlaceUpdates, ConfigureRecoveryStrategyTest, BasicFunctionalityTest, TestDistributedGrouping, TestLegacyNumericRangeQueryBuilder, TestManagedResource, TolerantUpdateProcessorTest, TestMiniSolrCloudClusterSSL, RequiredFieldsTest, TestDynamicFieldResource, TestLeaderElectionZkExpiry, TestCollapseQParserPlugin, DistributedSuggestComponentTest, SSLMigrationTest, PathHierarchyTokenizerFactoryTest, ShardSplitTest, TestStressUserVersions, SliceStateTest, WrapperMergePolicyFactoryTest, TestInPlaceUpdatesStandalone, DistributedFacetPivotLongTailTest, TestCustomStream, TestAuthenticationFramework, RecoveryZkTest, TestReplicationHandler, TestZkChroot, ShardRoutingCustomTest, ZkControllerTest, TestRealTimeGet, TestJoin, SolrCoreTest, PeerSyncTest, DirectUpdateHandlerTest, TestBadConfig, HighlighterTest, SoftAutoCommitTest, SpellPossibilityIteratorTest, TestCodecSupport, TestPerFieldSimilarity, TestBM25SimilarityFactory, ScriptEngineTest, PluginInfoTest, TestSuggestSpellingConverter, SpellingQueryConverterTest, TestSolrJ, SystemInfoHandlerTest, FileUtilsTest, TestCursorMarkWithoutUniqueKey, TestTolerantSearch, TestEmbeddedSolrServerConstructors, TestEmbeddedSolrServerSchemaAPI, ConnectionReuseTest, ChaosMonkeyNothingIsSafeWithPullReplicasTest, ConcurrentCreateRoutedAliasTest, ConnectionManagerTest, DeleteInactiveReplicaTest, DeleteLastCustomShardedReplicaTest, DeleteShardTest, DistribCursorPagingTest, DistributedQueueTest, ForceLeaderTest, PeerSyncReplicationTest, TestCloudPseudoReturnFields, TestConfigSetsAPIExclusivity, TestConfigSetsAPIZkFailure, TestDownShardTolerantSearch, TestExclusionRuleCollectionAccess, TestLeaderElectionWithEmptyReplica, TestPrepRecovery, TestSolrCloudWithDelegationTokens, TestTolerantUpdateProcessorCloud, TlogReplayBufferedWhileIndexingTest, VMParamsZkACLAndCredentialsProvidersTest, CollectionsAPIAsyncDistributedZkTest, TestCollectionsAPIViaSolrCloudCluster, AutoAddReplicasIntegrationTest, TriggerIntegrationTest]
   [junit4] Completed [629/769 (2!)] on J1 in 220.21s, 14 tests, 1 failure <<< FAILURES!

[...truncated 44355 lines...]

Mime
View raw message