lucene-dev mailing list archives

Site index · List index
Message view « Date » · « Thread »
Top « Date » · « Thread »
From Policeman Jenkins Server <jenk...@thetaphi.de>
Subject [JENKINS] Lucene-Solr-7.x-MacOSX (64bit/jdk-9) - Build # 391 - Still Unstable!
Date Wed, 10 Jan 2018 06:15:00 GMT
Build: https://jenkins.thetaphi.de/job/Lucene-Solr-7.x-MacOSX/391/
Java: 64bit/jdk-9 -XX:-UseCompressedOops -XX:+UseG1GC

1 tests failed.
FAILED:  org.apache.solr.update.processor.TimeRoutedAliasUpdateProcessorTest.testParse

Error Message:
Error from server at https://127.0.0.1:63876/solr: Collection : myalias_2017-10-24 is part of alias myalias remove or modify the alias before removing this collection.

Stack Trace:
org.apache.solr.client.solrj.impl.HttpSolrClient$RemoteSolrException: Error from server at https://127.0.0.1:63876/solr: Collection : myalias_2017-10-24 is part of alias myalias remove or modify the alias before removing this collection.
	at __randomizedtesting.SeedInfo.seed([D28104AB87FC3CBE:BD044FF33B8A0F51]:0)
	at org.apache.solr.client.solrj.impl.HttpSolrClient.executeMethod(HttpSolrClient.java:643)
	at org.apache.solr.client.solrj.impl.HttpSolrClient.request(HttpSolrClient.java:255)
	at org.apache.solr.client.solrj.impl.HttpSolrClient.request(HttpSolrClient.java:244)
	at org.apache.solr.client.solrj.impl.LBHttpSolrClient.doRequest(LBHttpSolrClient.java:483)
	at org.apache.solr.client.solrj.impl.LBHttpSolrClient.request(LBHttpSolrClient.java:413)
	at org.apache.solr.client.solrj.impl.CloudSolrClient.sendRequest(CloudSolrClient.java:1104)
	at org.apache.solr.client.solrj.impl.CloudSolrClient.requestWithRetryOnStaleState(CloudSolrClient.java:884)
	at org.apache.solr.client.solrj.impl.CloudSolrClient.request(CloudSolrClient.java:817)
	at org.apache.solr.client.solrj.SolrRequest.process(SolrRequest.java:194)
	at org.apache.solr.client.solrj.SolrRequest.process(SolrRequest.java:211)
	at org.apache.solr.update.processor.TimeRoutedAliasUpdateProcessorTest.doBefore(TimeRoutedAliasUpdateProcessorTest.java:84)
	at java.base/jdk.internal.reflect.NativeMethodAccessorImpl.invoke0(Native Method)
	at java.base/jdk.internal.reflect.NativeMethodAccessorImpl.invoke(NativeMethodAccessorImpl.java:62)
	at java.base/jdk.internal.reflect.DelegatingMethodAccessorImpl.invoke(DelegatingMethodAccessorImpl.java:43)
	at java.base/java.lang.reflect.Method.invoke(Method.java:564)
	at com.carrotsearch.randomizedtesting.RandomizedRunner.invoke(RandomizedRunner.java:1737)
	at com.carrotsearch.randomizedtesting.RandomizedRunner$9.evaluate(RandomizedRunner.java:968)
	at com.carrotsearch.randomizedtesting.RandomizedRunner$10.evaluate(RandomizedRunner.java:984)
	at com.carrotsearch.randomizedtesting.rules.SystemPropertiesRestoreRule$1.evaluate(SystemPropertiesRestoreRule.java:57)
	at org.apache.lucene.util.TestRuleSetupTeardownChained$1.evaluate(TestRuleSetupTeardownChained.java:49)
	at org.apache.lucene.util.AbstractBeforeAfterRule$1.evaluate(AbstractBeforeAfterRule.java:45)
	at org.apache.lucene.util.TestRuleThreadAndTestName$1.evaluate(TestRuleThreadAndTestName.java:48)
	at org.apache.lucene.util.TestRuleIgnoreAfterMaxFailures$1.evaluate(TestRuleIgnoreAfterMaxFailures.java:64)
	at org.apache.lucene.util.TestRuleMarkFailure$1.evaluate(TestRuleMarkFailure.java:47)
	at com.carrotsearch.randomizedtesting.rules.StatementAdapter.evaluate(StatementAdapter.java:36)
	at com.carrotsearch.randomizedtesting.ThreadLeakControl$StatementRunner.run(ThreadLeakControl.java:368)
	at com.carrotsearch.randomizedtesting.ThreadLeakControl.forkTimeoutingTask(ThreadLeakControl.java:817)
	at com.carrotsearch.randomizedtesting.ThreadLeakControl$3.evaluate(ThreadLeakControl.java:468)
	at com.carrotsearch.randomizedtesting.RandomizedRunner.runSingleTest(RandomizedRunner.java:943)
	at com.carrotsearch.randomizedtesting.RandomizedRunner$5.evaluate(RandomizedRunner.java:829)
	at com.carrotsearch.randomizedtesting.RandomizedRunner$6.evaluate(RandomizedRunner.java:879)
	at com.carrotsearch.randomizedtesting.RandomizedRunner$7.evaluate(RandomizedRunner.java:890)
	at com.carrotsearch.randomizedtesting.rules.StatementAdapter.evaluate(StatementAdapter.java:36)
	at com.carrotsearch.randomizedtesting.rules.SystemPropertiesRestoreRule$1.evaluate(SystemPropertiesRestoreRule.java:57)
	at org.apache.lucene.util.AbstractBeforeAfterRule$1.evaluate(AbstractBeforeAfterRule.java:45)
	at com.carrotsearch.randomizedtesting.rules.StatementAdapter.evaluate(StatementAdapter.java:36)
	at org.apache.lucene.util.TestRuleStoreClassName$1.evaluate(TestRuleStoreClassName.java:41)
	at com.carrotsearch.randomizedtesting.rules.NoShadowingOrOverridesOnMethodsRule$1.evaluate(NoShadowingOrOverridesOnMethodsRule.java:40)
	at com.carrotsearch.randomizedtesting.rules.NoShadowingOrOverridesOnMethodsRule$1.evaluate(NoShadowingOrOverridesOnMethodsRule.java:40)
	at com.carrotsearch.randomizedtesting.rules.StatementAdapter.evaluate(StatementAdapter.java:36)
	at com.carrotsearch.randomizedtesting.rules.StatementAdapter.evaluate(StatementAdapter.java:36)
	at org.apache.lucene.util.TestRuleAssertionsRequired$1.evaluate(TestRuleAssertionsRequired.java:53)
	at org.apache.lucene.util.TestRuleMarkFailure$1.evaluate(TestRuleMarkFailure.java:47)
	at org.apache.lucene.util.TestRuleIgnoreAfterMaxFailures$1.evaluate(TestRuleIgnoreAfterMaxFailures.java:64)
	at org.apache.lucene.util.TestRuleIgnoreTestSuites$1.evaluate(TestRuleIgnoreTestSuites.java:54)
	at com.carrotsearch.randomizedtesting.rules.StatementAdapter.evaluate(StatementAdapter.java:36)
	at com.carrotsearch.randomizedtesting.ThreadLeakControl$StatementRunner.run(ThreadLeakControl.java:368)
	at java.base/java.lang.Thread.run(Thread.java:844)




Build Log:
[...truncated 14246 lines...]
   [junit4] Suite: org.apache.solr.update.processor.TimeRoutedAliasUpdateProcessorTest
   [junit4]   2> Creating dataDir: /Users/jenkins/workspace/Lucene-Solr-7.x-MacOSX/solr/build/solr-core/test/J0/temp/solr.update.processor.TimeRoutedAliasUpdateProcessorTest_D28104AB87FC3CBE-001/init-core-data-001
   [junit4]   2> 3888230 WARN  (SUITE-TimeRoutedAliasUpdateProcessorTest-seed#[D28104AB87FC3CBE]-worker) [    ] o.a.s.SolrTestCaseJ4 startTrackingSearchers: numOpens=2 numCloses=2
   [junit4]   2> 3888231 INFO  (SUITE-TimeRoutedAliasUpdateProcessorTest-seed#[D28104AB87FC3CBE]-worker) [    ] o.a.s.SolrTestCaseJ4 Using PointFields (NUMERIC_POINTS_SYSPROP=true) w/NUMERIC_DOCVALUES_SYSPROP=true
   [junit4]   2> 3888231 INFO  (SUITE-TimeRoutedAliasUpdateProcessorTest-seed#[D28104AB87FC3CBE]-worker) [    ] o.a.s.SolrTestCaseJ4 Randomized ssl (true) and clientAuth (false) via: @org.apache.solr.util.RandomizeSSL(reason="", value=0.0/0.0, ssl=0.0/0.0, clientAuth=0.0/0.0) w/ MAC_OS_X supressed clientAuth
   [junit4]   2> 3888232 INFO  (SUITE-TimeRoutedAliasUpdateProcessorTest-seed#[D28104AB87FC3CBE]-worker) [    ] o.a.s.SolrTestCaseJ4 SecureRandom sanity checks: test.solr.allowed.securerandom=null & java.security.egd=file:/dev/./urandom
   [junit4]   2> 3888232 INFO  (SUITE-TimeRoutedAliasUpdateProcessorTest-seed#[D28104AB87FC3CBE]-worker) [    ] o.a.s.c.MiniSolrCloudCluster Starting cluster of 2 servers in /Users/jenkins/workspace/Lucene-Solr-7.x-MacOSX/solr/build/solr-core/test/J0/temp/solr.update.processor.TimeRoutedAliasUpdateProcessorTest_D28104AB87FC3CBE-001/tempDir-001
   [junit4]   2> 3888232 INFO  (SUITE-TimeRoutedAliasUpdateProcessorTest-seed#[D28104AB87FC3CBE]-worker) [    ] o.a.s.c.ZkTestServer STARTING ZK TEST SERVER
   [junit4]   2> 3888233 INFO  (Thread-7330) [    ] o.a.s.c.ZkTestServer client port:0.0.0.0/0.0.0.0:0
   [junit4]   2> 3888233 INFO  (Thread-7330) [    ] o.a.s.c.ZkTestServer Starting server
   [junit4]   2> 3888236 ERROR (Thread-7330) [    ] o.a.z.s.ZooKeeperServer ZKShutdownHandler is not registered, so ZooKeeper server won't take any action on ERROR or SHUTDOWN server state changes
   [junit4]   2> 3888338 INFO  (SUITE-TimeRoutedAliasUpdateProcessorTest-seed#[D28104AB87FC3CBE]-worker) [    ] o.a.s.c.ZkTestServer start zk server on port:63874
   [junit4]   2> 3888359 INFO  (zkConnectionManagerCallback-8488-thread-1) [    ] o.a.s.c.c.ConnectionManager zkClient has connected
   [junit4]   2> 3888365 INFO  (jetty-launcher-8485-thread-2) [    ] o.e.j.s.Server jetty-9.3.20.v20170531
   [junit4]   2> 3888365 INFO  (jetty-launcher-8485-thread-1) [    ] o.e.j.s.Server jetty-9.3.20.v20170531
   [junit4]   2> 3888368 INFO  (jetty-launcher-8485-thread-2) [    ] o.e.j.s.h.ContextHandler Started o.e.j.s.ServletContextHandler@22bd89ce{/solr,null,AVAILABLE}
   [junit4]   2> 3888368 INFO  (jetty-launcher-8485-thread-1) [    ] o.e.j.s.h.ContextHandler Started o.e.j.s.ServletContextHandler@17885eea{/solr,null,AVAILABLE}
   [junit4]   2> 3888369 INFO  (jetty-launcher-8485-thread-2) [    ] o.e.j.s.AbstractConnector Started ServerConnector@21986ddd{SSL,[ssl, http/1.1]}{127.0.0.1:63876}
   [junit4]   2> 3888369 INFO  (jetty-launcher-8485-thread-1) [    ] o.e.j.s.AbstractConnector Started ServerConnector@6747c6b7{SSL,[ssl, http/1.1]}{127.0.0.1:63877}
   [junit4]   2> 3888370 INFO  (jetty-launcher-8485-thread-2) [    ] o.e.j.s.Server Started @3890479ms
   [junit4]   2> 3888370 INFO  (jetty-launcher-8485-thread-1) [    ] o.e.j.s.Server Started @3890479ms
   [junit4]   2> 3888370 INFO  (jetty-launcher-8485-thread-2) [    ] o.a.s.c.s.e.JettySolrRunner Jetty properties: {hostContext=/solr, hostPort=63876}
   [junit4]   2> 3888370 INFO  (jetty-launcher-8485-thread-1) [    ] o.a.s.c.s.e.JettySolrRunner Jetty properties: {hostContext=/solr, hostPort=63877}
   [junit4]   2> 3888370 ERROR (jetty-launcher-8485-thread-1) [    ] o.a.s.u.StartupLoggingUtils Missing Java Option solr.log.dir. Logging may be missing or incomplete.
   [junit4]   2> 3888370 ERROR (jetty-launcher-8485-thread-2) [    ] o.a.s.u.StartupLoggingUtils Missing Java Option solr.log.dir. Logging may be missing or incomplete.
   [junit4]   2> 3888370 INFO  (jetty-launcher-8485-thread-1) [    ] o.a.s.s.SolrDispatchFilter  ___      _       Welcome to Apache Solr? version 7.3.0
   [junit4]   2> 3888371 INFO  (jetty-launcher-8485-thread-2) [    ] o.a.s.s.SolrDispatchFilter  ___      _       Welcome to Apache Solr? version 7.3.0
   [junit4]   2> 3888371 INFO  (jetty-launcher-8485-thread-1) [    ] o.a.s.s.SolrDispatchFilter / __| ___| |_ _   Starting in cloud mode on port null
   [junit4]   2> 3888371 INFO  (jetty-launcher-8485-thread-2) [    ] o.a.s.s.SolrDispatchFilter / __| ___| |_ _   Starting in cloud mode on port null
   [junit4]   2> 3888371 INFO  (jetty-launcher-8485-thread-1) [    ] o.a.s.s.SolrDispatchFilter \__ \/ _ \ | '_|  Install dir: null
   [junit4]   2> 3888371 INFO  (jetty-launcher-8485-thread-2) [    ] o.a.s.s.SolrDispatchFilter \__ \/ _ \ | '_|  Install dir: null
   [junit4]   2> 3888371 INFO  (jetty-launcher-8485-thread-1) [    ] o.a.s.s.SolrDispatchFilter |___/\___/_|_|    Start time: 2018-01-10T06:00:02.404361Z
   [junit4]   2> 3888371 INFO  (jetty-launcher-8485-thread-2) [    ] o.a.s.s.SolrDispatchFilter |___/\___/_|_|    Start time: 2018-01-10T06:00:02.404415Z
   [junit4]   2> 3888373 INFO  (zkConnectionManagerCallback-8490-thread-1) [    ] o.a.s.c.c.ConnectionManager zkClient has connected
   [junit4]   2> 3888373 INFO  (zkConnectionManagerCallback-8492-thread-1) [    ] o.a.s.c.c.ConnectionManager zkClient has connected
   [junit4]   2> 3888374 INFO  (jetty-launcher-8485-thread-2) [    ] o.a.s.s.SolrDispatchFilter solr.xml found in ZooKeeper. Loading...
   [junit4]   2> 3888374 INFO  (jetty-launcher-8485-thread-1) [    ] o.a.s.s.SolrDispatchFilter solr.xml found in ZooKeeper. Loading...
   [junit4]   2> 3888383 INFO  (jetty-launcher-8485-thread-2) [    ] o.a.s.c.ZkContainer Zookeeper client=127.0.0.1:63874/solr
   [junit4]   2> 3888383 INFO  (jetty-launcher-8485-thread-1) [    ] o.a.s.c.ZkContainer Zookeeper client=127.0.0.1:63874/solr
   [junit4]   2> 3888385 INFO  (zkConnectionManagerCallback-8498-thread-1) [    ] o.a.s.c.c.ConnectionManager zkClient has connected
   [junit4]   2> 3888385 INFO  (zkConnectionManagerCallback-8500-thread-1) [    ] o.a.s.c.c.ConnectionManager zkClient has connected
   [junit4]   2> 3888387 WARN  (NIOServerCxn.Factory:0.0.0.0/0.0.0.0:0) [    ] o.a.z.s.NIOServerCnxn caught end of stream exception
   [junit4]   2> EndOfStreamException: Unable to read additional data from client sessionid 0x160dea76bdd0004, likely client has closed socket
   [junit4]   2> 	at org.apache.zookeeper.server.NIOServerCnxn.doIO(NIOServerCnxn.java:239)
   [junit4]   2> 	at org.apache.zookeeper.server.NIOServerCnxnFactory.run(NIOServerCnxnFactory.java:203)
   [junit4]   2> 	at java.base/java.lang.Thread.run(Thread.java:844)
   [junit4]   2> 3888388 WARN  (NIOServerCxn.Factory:0.0.0.0/0.0.0.0:0) [    ] o.a.z.s.NIOServerCnxn caught end of stream exception
   [junit4]   2> EndOfStreamException: Unable to read additional data from client sessionid 0x160dea76bdd0003, likely client has closed socket
   [junit4]   2> 	at org.apache.zookeeper.server.NIOServerCnxn.doIO(NIOServerCnxn.java:239)
   [junit4]   2> 	at org.apache.zookeeper.server.NIOServerCnxnFactory.run(NIOServerCnxnFactory.java:203)
   [junit4]   2> 	at java.base/java.lang.Thread.run(Thread.java:844)
   [junit4]   2> 3888389 INFO  (zkConnectionManagerCallback-8503-thread-1-processing-n:127.0.0.1:63876_solr) [n:127.0.0.1:63876_solr    ] o.a.s.c.c.ConnectionManager zkClient has connected
   [junit4]   2> 3888389 INFO  (zkConnectionManagerCallback-8504-thread-1-processing-n:127.0.0.1:63877_solr) [n:127.0.0.1:63877_solr    ] o.a.s.c.c.ConnectionManager zkClient has connected
   [junit4]   2> 3888572 INFO  (jetty-launcher-8485-thread-2) [n:127.0.0.1:63876_solr    ] o.a.s.c.Overseer Overseer (id=null) closing
   [junit4]   2> 3888572 INFO  (jetty-launcher-8485-thread-2) [n:127.0.0.1:63876_solr    ] o.a.s.c.OverseerElectionContext I am going to be the leader 127.0.0.1:63876_solr
   [junit4]   2> 3888574 INFO  (jetty-launcher-8485-thread-2) [n:127.0.0.1:63876_solr    ] o.a.s.c.Overseer Overseer (id=99324002452701189-127.0.0.1:63876_solr-n_0000000000) starting
   [junit4]   2> 3888581 INFO  (jetty-launcher-8485-thread-1) [n:127.0.0.1:63877_solr    ] o.a.s.c.Overseer Overseer (id=null) closing
   [junit4]   2> 3888582 INFO  (jetty-launcher-8485-thread-1) [n:127.0.0.1:63877_solr    ] o.a.s.c.ZkController Register node as live in ZooKeeper:/live_nodes/127.0.0.1:63877_solr
   [junit4]   2> 3888584 INFO  (zkCallback-8501-thread-1-processing-n:127.0.0.1:63876_solr) [n:127.0.0.1:63876_solr    ] o.a.s.c.c.ZkStateReader Updated live nodes from ZooKeeper... (0) -> (1)
   [junit4]   2> 3888587 INFO  (zkCallback-8502-thread-1-processing-n:127.0.0.1:63877_solr) [n:127.0.0.1:63877_solr    ] o.a.s.c.c.ZkStateReader Updated live nodes from ZooKeeper... (0) -> (1)
   [junit4]   2> 3888588 INFO  (jetty-launcher-8485-thread-2) [n:127.0.0.1:63876_solr    ] o.a.s.c.ZkController Register node as live in ZooKeeper:/live_nodes/127.0.0.1:63876_solr
   [junit4]   2> 3888590 INFO  (zkCallback-8501-thread-1-processing-n:127.0.0.1:63876_solr) [n:127.0.0.1:63876_solr    ] o.a.s.c.c.ZkStateReader Updated live nodes from ZooKeeper... (1) -> (2)
   [junit4]   2> 3888594 INFO  (zkCallback-8502-thread-1-processing-n:127.0.0.1:63877_solr) [n:127.0.0.1:63877_solr    ] o.a.s.c.c.ZkStateReader Updated live nodes from ZooKeeper... (1) -> (2)
   [junit4]   2> 3888641 INFO  (jetty-launcher-8485-thread-2) [n:127.0.0.1:63876_solr    ] o.a.s.m.r.SolrJmxReporter JMX monitoring for 'solr_63876.solr.node' (registry 'solr.node') enabled at server: com.sun.jmx.mbeanserver.JmxMBeanServer@563b499d
   [junit4]   2> 3888650 INFO  (jetty-launcher-8485-thread-1) [n:127.0.0.1:63877_solr    ] o.a.s.m.r.SolrJmxReporter JMX monitoring for 'solr_63877.solr.node' (registry 'solr.node') enabled at server: com.sun.jmx.mbeanserver.JmxMBeanServer@563b499d
   [junit4]   2> 3888664 INFO  (jetty-launcher-8485-thread-2) [n:127.0.0.1:63876_solr    ] o.a.s.m.r.SolrJmxReporter JMX monitoring for 'solr_63876.solr.jvm' (registry 'solr.jvm') enabled at server: com.sun.jmx.mbeanserver.JmxMBeanServer@563b499d
   [junit4]   2> 3888665 INFO  (jetty-launcher-8485-thread-2) [n:127.0.0.1:63876_solr    ] o.a.s.m.r.SolrJmxReporter JMX monitoring for 'solr_63876.solr.jetty' (registry 'solr.jetty') enabled at server: com.sun.jmx.mbeanserver.JmxMBeanServer@563b499d
   [junit4]   2> 3888667 INFO  (jetty-launcher-8485-thread-2) [n:127.0.0.1:63876_solr    ] o.a.s.c.CorePropertiesLocator Found 0 core definitions underneath /Users/jenkins/workspace/Lucene-Solr-7.x-MacOSX/solr/build/solr-core/test/J0/temp/solr.update.processor.TimeRoutedAliasUpdateProcessorTest_D28104AB87FC3CBE-001/tempDir-001/node2/.
   [junit4]   2> 3888667 INFO  (jetty-launcher-8485-thread-1) [n:127.0.0.1:63877_solr    ] o.a.s.m.r.SolrJmxReporter JMX monitoring for 'solr_63877.solr.jvm' (registry 'solr.jvm') enabled at server: com.sun.jmx.mbeanserver.JmxMBeanServer@563b499d
   [junit4]   2> 3888667 INFO  (jetty-launcher-8485-thread-1) [n:127.0.0.1:63877_solr    ] o.a.s.m.r.SolrJmxReporter JMX monitoring for 'solr_63877.solr.jetty' (registry 'solr.jetty') enabled at server: com.sun.jmx.mbeanserver.JmxMBeanServer@563b499d
   [junit4]   2> 3888669 INFO  (jetty-launcher-8485-thread-1) [n:127.0.0.1:63877_solr    ] o.a.s.c.CorePropertiesLocator Found 0 core definitions underneath /Users/jenkins/workspace/Lucene-Solr-7.x-MacOSX/solr/build/solr-core/test/J0/temp/solr.update.processor.TimeRoutedAliasUpdateProcessorTest_D28104AB87FC3CBE-001/tempDir-001/node1/.
   [junit4]   2> 3888718 INFO  (zkConnectionManagerCallback-8510-thread-1) [    ] o.a.s.c.c.ConnectionManager zkClient has connected
   [junit4]   2> 3888735 INFO  (qtp1020007657-37114) [n:127.0.0.1:63876_solr    ] o.a.s.h.a.CollectionsHandler Invoked Collection Action :clusterstatus with params action=CLUSTERSTATUS&wt=javabin&version=2 and sendToOCPQueue=true
   [junit4]   2> 3888736 INFO  (qtp1020007657-37114) [n:127.0.0.1:63876_solr    ] o.a.s.s.HttpSolrCall [admin] webapp=null path=/admin/collections params={action=CLUSTERSTATUS&wt=javabin&version=2} status=0 QTime=1
   [junit4]   2> 3888750 INFO  (TEST-TimeRoutedAliasUpdateProcessorTest.test-seed#[D28104AB87FC3CBE]) [    ] o.a.s.SolrTestCaseJ4 ###Starting test
   [junit4]   2> 3888753 INFO  (qtp1020007657-37112) [n:127.0.0.1:63876_solr    ] o.a.s.h.a.CollectionsHandler Invoked Collection Action :clusterstatus with params action=CLUSTERSTATUS&wt=javabin&version=2 and sendToOCPQueue=true
   [junit4]   2> 3888754 INFO  (qtp1020007657-37112) [n:127.0.0.1:63876_solr    ] o.a.s.s.HttpSolrCall [admin] webapp=null path=/admin/collections params={action=CLUSTERSTATUS&wt=javabin&version=2} status=0 QTime=0
   [junit4]   2> 3888755 INFO  (qtp1020007657-37113) [n:127.0.0.1:63876_solr    ] o.a.s.h.a.CollectionsHandler Invoked Collection Action :clusterstatus with params action=CLUSTERSTATUS&wt=javabin&version=2 and sendToOCPQueue=true
   [junit4]   2> 3888756 INFO  (qtp1020007657-37113) [n:127.0.0.1:63876_solr    ] o.a.s.s.HttpSolrCall [admin] webapp=null path=/admin/collections params={action=CLUSTERSTATUS&wt=javabin&version=2} status=0 QTime=0
   [junit4]   2> 3888759 INFO  (qtp1020007657-37122) [n:127.0.0.1:63876_solr    ] o.a.s.h.a.CollectionsHandler Invoked Collection Action :list with params action=LIST&wt=javabin&version=2 and sendToOCPQueue=true
   [junit4]   2> 3888759 INFO  (qtp1020007657-37122) [n:127.0.0.1:63876_solr    ] o.a.s.s.HttpSolrCall [admin] webapp=null path=/admin/collections params={action=LIST&wt=javabin&version=2} status=0 QTime=0
   [junit4]   2> 3888760 INFO  (qtp1020007657-37119) [n:127.0.0.1:63876_solr    ] o.a.s.h.a.CollectionsHandler Invoked Collection Action :clusterstatus with params action=CLUSTERSTATUS&wt=javabin&version=2 and sendToOCPQueue=true
   [junit4]   2> 3888761 INFO  (qtp1020007657-37119) [n:127.0.0.1:63876_solr    ] o.a.s.s.HttpSolrCall [admin] webapp=null path=/admin/collections params={action=CLUSTERSTATUS&wt=javabin&version=2} status=0 QTime=1
   [junit4]   2> 3888762 INFO  (qtp1020007657-37109) [n:127.0.0.1:63876_solr    ] o.a.s.h.a.CollectionsHandler Invoked Collection Action :clusterstatus with params action=CLUSTERSTATUS&wt=javabin&version=2 and sendToOCPQueue=true
   [junit4]   2> 3888763 INFO  (qtp1020007657-37109) [n:127.0.0.1:63876_solr    ] o.a.s.s.HttpSolrCall [admin] webapp=null path=/admin/collections params={action=CLUSTERSTATUS&wt=javabin&version=2} status=0 QTime=0
   [junit4]   2> 3888764 INFO  (qtp1020007657-37112) [n:127.0.0.1:63876_solr    ] o.a.s.h.a.CollectionsHandler Invoked Collection Action :create with params pullReplicas=0&replicationFactor=1&name=timeConfig&nrtReplicas=1&action=CREATE&numShards=1&tlogReplicas=0&wt=javabin&version=2 and sendToOCPQueue=true
   [junit4]   2> 3888767 INFO  (OverseerThreadFactory-16183-thread-1-processing-n:127.0.0.1:63876_solr) [n:127.0.0.1:63876_solr    ] o.a.s.c.CreateCollectionCmd Create collection timeConfig
   [junit4]   2> 3888767 INFO  (OverseerThreadFactory-16183-thread-1-processing-n:127.0.0.1:63876_solr) [n:127.0.0.1:63876_solr    ] o.a.s.c.CreateCollectionCmd Only _default config set found, using it.
   [junit4]   2> 3888768 INFO  (OverseerThreadFactory-16183-thread-1-processing-n:127.0.0.1:63876_solr) [n:127.0.0.1:63876_solr    ] o.a.s.c.c.ZkConfigManager Copying zk node /configs/_default/managed-schema to /configs/timeConfig/managed-schema
   [junit4]   2> 3888771 INFO  (OverseerThreadFactory-16183-thread-1-processing-n:127.0.0.1:63876_solr) [n:127.0.0.1:63876_solr    ] o.a.s.c.c.ZkConfigManager Copying zk node /configs/_default/protwords.txt to /configs/timeConfig/protwords.txt
   [junit4]   2> 3888774 INFO  (OverseerThreadFactory-16183-thread-1-processing-n:127.0.0.1:63876_solr) [n:127.0.0.1:63876_solr    ] o.a.s.c.c.ZkConfigManager Copying zk node /configs/_default/solrconfig.xml to /configs/timeConfig/solrconfig.xml
   [junit4]   2> 3888776 INFO  (OverseerThreadFactory-16183-thread-1-processing-n:127.0.0.1:63876_solr) [n:127.0.0.1:63876_solr    ] o.a.s.c.c.ZkConfigManager Copying zk node /configs/_default/synonyms.txt to /configs/timeConfig/synonyms.txt
   [junit4]   2> 3888779 INFO  (OverseerThreadFactory-16183-thread-1-processing-n:127.0.0.1:63876_solr) [n:127.0.0.1:63876_solr    ] o.a.s.c.c.ZkConfigManager Copying zk node /configs/_default/stopwords.txt to /configs/timeConfig/stopwords.txt
   [junit4]   2> 3888783 INFO  (OverseerThreadFactory-16183-thread-1-processing-n:127.0.0.1:63876_solr) [n:127.0.0.1:63876_solr    ] o.a.s.c.c.ZkConfigManager Copying zk node /configs/_default/lang/contractions_it.txt to /configs/timeConfig/lang/contractions_it.txt
   [junit4]   2> 3888786 INFO  (OverseerThreadFactory-16183-thread-1-processing-n:127.0.0.1:63876_solr) [n:127.0.0.1:63876_solr    ] o.a.s.c.c.ZkConfigManager Copying zk node /configs/_default/lang/contractions_ca.txt to /configs/timeConfig/lang/contractions_ca.txt
   [junit4]   2> 3888789 INFO  (OverseerThreadFactory-16183-thread-1-processing-n:127.0.0.1:63876_solr) [n:127.0.0.1:63876_solr    ] o.a.s.c.c.ZkConfigManager Copying zk node /configs/_default/lang/stemdict_nl.txt to /configs/timeConfig/lang/stemdict_nl.txt
   [junit4]   2> 3888792 INFO  (OverseerThreadFactory-16183-thread-1-processing-n:127.0.0.1:63876_solr) [n:127.0.0.1:63876_solr    ] o.a.s.c.c.ZkConfigManager Copying zk node /configs/_default/lang/stopwords_hy.txt to /configs/timeConfig/lang/stopwords_hy.txt
   [junit4]   2> 3888798 INFO  (OverseerThreadFactory-16183-thread-1-processing-n:127.0.0.1:63876_solr) [n:127.0.0.1:63876_solr    ] o.a.s.c.c.ZkConfigManager Copying zk node /configs/_default/lang/stopwords_no.txt to /configs/timeConfig/lang/stopwords_no.txt
   [junit4]   2> 3888801 INFO  (OverseerThreadFactory-16183-thread-1-processing-n:127.0.0.1:63876_solr) [n:127.0.0.1:63876_solr    ] o.a.s.c.c.ZkConfigManager Copying zk node /configs/_default/lang/stopwords_id.txt to /configs/timeConfig/lang/stopwords_id.txt
   [junit4]   2> 3888804 INFO  (OverseerThreadFactory-16183-thread-1-processing-n:127.0.0.1:63876_solr) [n:127.0.0.1:63876_solr    ] o.a.s.c.c.ZkConfigManager Copying zk node /configs/_default/lang/stopwords_da.txt to /configs/timeConfig/lang/stopwords_da.txt
   [junit4]   2> 3888807 INFO  (OverseerThreadFactory-16183-thread-1-processing-n:127.0.0.1:63876_solr) [n:127.0.0.1:63876_solr    ] o.a.s.c.c.ZkConfigManager Copying zk node /configs/_default/lang/stopwords_ga.txt to /configs/timeConfig/lang/stopwords_ga.txt
   [junit4]   2> 3888809 INFO  (OverseerThreadFactory-16183-thread-1-processing-n:127.0.0.1:63876_solr) [n:127.0.0.1:63876_solr    ] o.a.s.c.c.ZkConfigManager Copying zk node /configs/_default/lang/stopwords_hi.txt to /configs/timeConfig/lang/stopwords_hi.txt
   [junit4]   2> 3888812 INFO  (OverseerThreadFactory-16183-thread-1-processing-n:127.0.0.1:63876_solr) [n:127.0.0.1:63876_solr    ] o.a.s.c.c.ZkConfigManager Copying zk node /configs/_default/lang/stopwords_ja.txt to /configs/timeConfig/lang/stopwords_ja.txt
   [junit4]   2> 3888815 INFO  (OverseerThreadFactory-16183-thread-1-processing-n:127.0.0.1:63876_solr) [n:127.0.0.1:63876_solr    ] o.a.s.c.c.ZkConfigManager Copying zk node /configs/_default/lang/stopwords_pt.txt to /configs/timeConfig/lang/stopwords_pt.txt
   [junit4]   2> 3888818 INFO  (OverseerThreadFactory-16183-thread-1-processing-n:127.0.0.1:63876_solr) [n:127.0.0.1:63876_solr    ] o.a.s.c.c.ZkConfigManager Copying zk node /configs/_default/lang/stopwords_hu.txt to /configs/timeConfig/lang/stopwords_hu.txt
   [junit4]   2> 3888820 INFO  (OverseerThreadFactory-16183-thread-1-processing-n:127.0.0.1:63876_solr) [n:127.0.0.1:63876_solr    ] o.a.s.c.c.ZkConfigManager Copying zk node /configs/_default/lang/stopwords_el.txt to /configs/timeConfig/lang/stopwords_el.txt
   [junit4]   2> 3888824 INFO  (OverseerThreadFactory-16183-thread-1-processing-n:127.0.0.1:63876_solr) [n:127.0.0.1:63876_solr    ] o.a.s.c.c.ZkConfigManager Copying zk node /configs/_default/lang/stopwords_ru.txt to /configs/timeConfig/lang/stopwords_ru.txt
   [junit4]   2> 3888827 INFO  (OverseerThreadFactory-16183-thread-1-processing-n:127.0.0.1:63876_solr) [n:127.0.0.1:63876_solr    ] o.a.s.c.c.ZkConfigManager Copying zk node /configs/_default/lang/stopwords_tr.txt to /configs/timeConfig/lang/stopwords_tr.txt
   [junit4]   2> 3888830 INFO  (OverseerThreadFactory-16183-thread-1-processing-n:127.0.0.1:63876_solr) [n:127.0.0.1:63876_solr    ] o.a.s.c.c.ZkConfigManager Copying zk node /configs/_default/lang/stopwords_ar.txt to /configs/timeConfig/lang/stopwords_ar.txt
   [junit4]   2> 3888833 INFO  (OverseerThreadFactory-16183-thread-1-processing-n:127.0.0.1:63876_solr) [n:127.0.0.1:63876_solr    ] o.a.s.c.c.ZkConfigManager Copying zk node /configs/_default/lang/userdict_ja.txt to /configs/timeConfig/lang/userdict_ja.txt
   [junit4]   2> 3888836 INFO  (OverseerThreadFactory-16183-thread-1-processing-n:127.0.0.1:63876_solr) [n:127.0.0.1:63876_solr    ] o.a.s.c.c.ZkConfigManager Copying zk node /configs/_default/lang/stopwords_eu.txt to /configs/timeConfig/lang/stopwords_eu.txt
   [junit4]   2> 3888840 INFO  (OverseerThreadFactory-16183-thread-1-processing-n:127.0.0.1:63876_solr) [n:127.0.0.1:63876_solr    ] o.a.s.c.c.ZkConfigManager Copying zk node /configs/_default/lang/stopwords_it.txt to /configs/timeConfig/lang/stopwords_it.txt
   [junit4]   2> 3888841 INFO  (OverseerThreadFactory-16183-thread-1-processing-n:127.0.0.1:63876_solr) [n:127.0.0.1:63876_solr    ] o.a.s.c.c.ZkConfigManager Copying zk node /configs/_default/lang/stopwords_cz.txt to /configs/timeConfig/lang/stopwords_cz.txt
   [junit4]   2> 3888848 INFO  (OverseerThreadFactory-16183-thread-1-processing-n:127.0.0.1:63876_solr) [n:127.0.0.1:63876_solr    ] o.a.s.c.c.ZkConfigManager Copying zk node /configs/_default/lang/stoptags_ja.txt to /configs/timeConfig/lang/stoptags_ja.txt
   [junit4]   2> 3888852 INFO  (OverseerThreadFactory-16183-thread-1-processing-n:127.0.0.1:63876_solr) [n:127.0.0.1:63876_solr    ] o.a.s.c.c.ZkConfigManager Copying zk node /configs/_default/lang/contractions_fr.txt to /configs/timeConfig/lang/contractions_fr.txt
   [junit4]   2> 3888855 INFO  (OverseerThreadFactory-16183-thread-1-processing-n:127.0.0.1:63876_solr) [n:127.0.0.1:63876_solr    ] o.a.s.c.c.ZkConfigManager Copying zk node /configs/_default/lang/stopwords_de.txt to /configs/timeConfig/lang/stopwords_de.txt
   [junit4]   2> 3888858 INFO  (OverseerThreadFactory-16183-thread-1-processing-n:127.0.0.1:63876_solr) [n:127.0.0.1:63876_solr    ] o.a.s.c.c.ZkConfigManager Copying zk node /configs/_default/lang/stopwords_fa.txt to /configs/timeConfig/lang/stopwords_fa.txt
   [junit4]   2> 3888861 INFO  (OverseerThreadFactory-16183-thread-1-processing-n:127.0.0.1:63876_solr) [n:127.0.0.1:63876_solr    ] o.a.s.c.c.ZkConfigManager Copying zk node /configs/_default/lang/contractions_ga.txt to /configs/timeConfig/lang/contractions_ga.txt
   [junit4]   2> 3888865 INFO  (OverseerThreadFactory-16183-thread-1-processing-n:127.0.0.1:63876_solr) [n:127.0.0.1:63876_solr    ] o.a.s.c.c.ZkConfigManager Copying zk node /configs/_default/lang/stopwords_ca.txt to /configs/timeConfig/lang/stopwords_ca.txt
   [junit4]   2> 3888867 INFO  (OverseerThreadFactory-16183-thread-1-processing-n:127.0.0.1:63876_solr) [n:127.0.0.1:63876_solr    ] o.a.s.c.c.ZkConfigManager Copying zk node /configs/_default/lang/stopwords_nl.txt to /configs/timeConfig/lang/stopwords_nl.txt
   [junit4]   2> 3888870 INFO  (OverseerThreadFactory-16183-thread-1-processing-n:127.0.0.1:63876_solr) [n:127.0.0.1:63876_solr    ] o.a.s.c.c.ZkConfigManager Copying zk node /configs/_default/lang/stopwords_bg.txt to /configs/timeConfig/lang/stopwords_bg.txt
   [junit4]   2> 3888874 INFO  (OverseerThreadFactory-16183-thread-1-processing-n:127.0.0.1:63876_solr) [n:127.0.0.1:63876_solr    ] o.a.s.c.c.ZkConfigManager Copying zk node /configs/_default/lang/stopwords_en.txt to /configs/timeConfig/lang/stopwords_en.txt
   [junit4]   2> 3888877 INFO  (OverseerThreadFactory-16183-thread-1-processing-n:127.0.0.1:63876_solr) [n:127.0.0.1:63876_solr    ] o.a.s.c.c.ZkConfigManager Copying zk node /configs/_default/lang/stopwords_es.txt to /configs/timeConfig/lang/stopwords_es.txt
   [junit4]   2> 3888880 INFO  (OverseerThreadFactory-16183-thread-1-processing-n:127.0.0.1:63876_solr) [n:127.0.0.1:63876_solr    ] o.a.s.c.c.ZkConfigManager Copying zk node /configs/_default/lang/stopwords_lv.txt to /configs/timeConfig/lang/stopwords_lv.txt
   [junit4]   2> 3888884 INFO  (OverseerThreadFactory-16183-thread-1-processing-n:127.0.0.1:63876_solr) [n:127.0.0.1:63876_solr    ] o.a.s.c.c.ZkConfigManager Copying zk node /configs/_default/lang/stopwords_ro.txt to /configs/timeConfig/lang/stopwords_ro.txt
   [junit4]   2> 3888887 INFO  (OverseerThreadFactory-16183-thread-1-processing-n:127.0.0.1:63876_solr) [n:127.0.0.1:63876_solr    ] o.a.s.c.c.ZkConfigManager Copying zk node /configs/_default/lang/stopwords_th.txt to /configs/timeConfig/lang/stopwords_th.txt
   [junit4]   2> 3888890 INFO  (OverseerThreadFactory-16183-thread-1-processing-n:127.0.0.1:63876_solr) [n:127.0.0.1:63876_solr    ] o.a.s.c.c.ZkConfigManager Copying zk node /configs/_default/lang/stopwords_fr.txt to /configs/timeConfig/lang/stopwords_fr.txt
   [junit4]   2> 3888893 INFO  (OverseerThreadFactory-16183-thread-1-processing-n:127.0.0.1:63876_solr) [n:127.0.0.1:63876_solr    ] o.a.s.c.c.ZkConfigManager Copying zk node /configs/_default/lang/stopwords_sv.txt to /configs/timeConfig/lang/stopwords_sv.txt
   [junit4]   2> 3888896 INFO  (OverseerThreadFactory-16183-thread-1-processing-n:127.0.0.1:63876_solr) [n:127.0.0.1:63876_solr    ] o.a.s.c.c.ZkConfigManager Copying zk node /configs/_default/lang/stopwords_fi.txt to /configs/timeConfig/lang/stopwords_fi.txt
   [junit4]   2> 3888899 INFO  (OverseerThreadFactory-16183-thread-1-processing-n:127.0.0.1:63876_solr) [n:127.0.0.1:63876_solr    ] o.a.s.c.c.ZkConfigManager Copying zk node /configs/_default/lang/hyphenations_ga.txt to /configs/timeConfig/lang/hyphenations_ga.txt
   [junit4]   2> 3888902 INFO  (OverseerThreadFactory-16183-thread-1-processing-n:127.0.0.1:63876_solr) [n:127.0.0.1:63876_solr    ] o.a.s.c.c.ZkConfigManager Copying zk node /configs/_default/lang/stopwords_gl.txt to /configs/timeConfig/lang/stopwords_gl.txt
   [junit4]   2> 3888908 INFO  (OverseerThreadFactory-16183-thread-1-processing-n:127.0.0.1:63876_solr) [n:127.0.0.1:63876_solr    ] o.a.s.c.c.ZkConfigManager Copying zk node /configs/_default/params.json to /configs/timeConfig/params.json
   [junit4]   2> 3889042 INFO  (OverseerStateUpdate-99324002452701189-127.0.0.1:63876_solr-n_0000000000) [n:127.0.0.1:63876_solr    ] o.a.s.c.o.SliceMutator createReplica() {
   [junit4]   2>   "operation":"ADDREPLICA",
   [junit4]   2>   "collection":"timeConfig",
   [junit4]   2>   "shard":"shard1",
   [junit4]   2>   "core":"timeConfig_shard1_replica_n1",
   [junit4]   2>   "state":"down",
   [junit4]   2>   "base_url":"https://127.0.0.1:63877/solr",
   [junit4]   2>   "type":"NRT",
   [junit4]   2>   "waitForFinalState":"false"} 
   [junit4]   2> 3889258 INFO  (qtp1637874263-37120) [n:127.0.0.1:63877_solr    ] o.a.s.h.a.CoreAdminOperation core create command qt=/admin/cores&coreNodeName=core_node2&collection.configName=timeConfig&newCollection=true&name=timeConfig_shard1_replica_n1&action=CREATE&numShards=1&collection=timeConfig&shard=shard1&wt=javabin&version=2&replicaType=NRT
   [junit4]   2> 3889258 INFO  (qtp1637874263-37120) [n:127.0.0.1:63877_solr    ] o.a.s.c.TransientSolrCoreCacheDefault Allocating transient cache for 2147483647 transient cores
   [junit4]   2> 3889367 INFO  (zkCallback-8502-thread-1-processing-n:127.0.0.1:63877_solr) [n:127.0.0.1:63877_solr    ] o.a.s.c.c.ZkStateReader A cluster state change: [WatchedEvent state:SyncConnected type:NodeDataChanged path:/collections/timeConfig/state.json] for collection [timeConfig] has occurred - updating... (live nodes size: [2])
   [junit4]   2> 3889368 INFO  (zkCallback-8502-thread-2-processing-n:127.0.0.1:63877_solr) [n:127.0.0.1:63877_solr    ] o.a.s.c.c.ZkStateReader A cluster state change: [WatchedEvent state:SyncConnected type:NodeDataChanged path:/collections/timeConfig/state.json] for collection [timeConfig] has occurred - updating... (live nodes size: [2])
   [junit4]   2> 3890275 INFO  (qtp1637874263-37120) [n:127.0.0.1:63877_solr c:timeConfig s:shard1 r:core_node2 x:timeConfig_shard1_replica_n1] o.a.s.c.RequestParams conf resource params.json loaded . version : 0 
   [junit4]   2> 3890275 INFO  (qtp1637874263-37120) [n:127.0.0.1:63877_solr c:timeConfig s:shard1 r:core_node2 x:timeConfig_shard1_replica_n1] o.a.s.c.RequestParams request params refreshed to version 0
   [junit4]   2> 3890276 WARN  (qtp1637874263-37120) [n:127.0.0.1:63877_solr c:timeConfig s:shard1 r:core_node2 x:timeConfig_shard1_replica_n1] o.a.s.c.SolrConfig Couldn't add files from /Users/jenkins/workspace/Lucene-Solr-7.x-MacOSX/solr/build/solr-core/test/J0/temp/solr.update.processor.TimeRoutedAliasUpdateProcessorTest_D28104AB87FC3CBE-001/tempDir-001/node1/timeConfig_shard1_replica_n1/../../../../contrib/extraction/lib filtered by .*\.jar to classpath: /Users/jenkins/workspace/Lucene-Solr-7.x-MacOSX/solr/build/solr-core/test/J0/temp/solr.update.processor.TimeRoutedAliasUpdateProcessorTest_D28104AB87FC3CBE-001/tempDir-001/node1/timeConfig_shard1_replica_n1/../../../../contrib/extraction/lib
   [junit4]   2> 3890276 WARN  (qtp1637874263-37120) [n:127.0.0.1:63877_solr c:timeConfig s:shard1 r:core_node2 x:timeConfig_shard1_replica_n1] o.a.s.c.SolrConfig Couldn't add files from /Users/jenkins/workspace/Lucene-Solr-7.x-MacOSX/solr/build/solr-core/test/J0/temp/solr.update.processor.TimeRoutedAliasUpdateProcessorTest_D28104AB87FC3CBE-001/tempDir-001/node1/timeConfig_shard1_replica_n1/../../../../dist filtered by solr-cell-\d.*\.jar to classpath: /Users/jenkins/workspace/Lucene-Solr-7.x-MacOSX/solr/build/solr-core/test/J0/temp/solr.update.processor.TimeRoutedAliasUpdateProcessorTest_D28104AB87FC3CBE-001/tempDir-001/node1/timeConfig_shard1_replica_n1/../../../../dist
   [junit4]   2> 3890277 WARN  (qtp1637874263-37120) [n:127.0.0.1:63877_solr c:timeConfig s:shard1 r:core_node2 x:timeConfig_shard1_replica_n1] o.a.s.c.SolrConfig Couldn't add files from /Users/jenkins/workspace/Lucene-Solr-7.x-MacOSX/solr/build/solr-core/test/J0/temp/solr.update.processor.TimeRoutedAliasUpdateProcessorTest_D28104AB87FC3CBE-001/tempDir-001/node1/timeConfig_shard1_replica_n1/../../../../contrib/clustering/lib filtered by .*\.jar to classpath: /Users/jenkins/workspace/Lucene-Solr-7.x-MacOSX/solr/build/solr-core/test/J0/temp/solr.update.processor.TimeRoutedAliasUpdateProcessorTest_D28104AB87FC3CBE-001/tempDir-001/node1/timeConfig_shard1_replica_n1/../../../../contrib/clustering/lib
   [junit4]   2> 3890277 WARN  (qtp1637874263-37120) [n:127.0.0.1:63877_solr c:timeConfig s:shard1 r:core_node2 x:timeConfig_shard1_replica_n1] o.a.s.c.SolrConfig Couldn't add files from /Users/jenkins/workspace/Lucene-Solr-7.x-MacOSX/solr/build/solr-core/test/J0/temp/solr.update.processor.TimeRoutedAliasUpdateProcessorTest_D28104AB87FC3CBE-001/tempDir-001/node1/timeConfig_shard1_replica_n1/../../../../dist filtered by solr-clustering-\d.*\.jar to classpath: /Users/jenkins/workspace/Lucene-Solr-7.x-MacOSX/solr/build/solr-core/test/J0/temp/solr.update.processor.TimeRoutedAliasUpdateProcessorTest_D28104AB87FC3CBE-001/tempDir-001/node1/timeConfig_shard1_replica_n1/../../../../dist
   [junit4]   2> 3890277 WARN  (qtp1637874263-37120) [n:127.0.0.1:63877_solr c:timeConfig s:shard1 r:core_node2 x:timeConfig_shard1_replica_n1] o.a.s.c.SolrConfig Couldn't add files from /Users/jenkins/workspace/Lucene-Solr-7.x-MacOSX/solr/build/solr-core/test/J0/temp/solr.update.processor.TimeRoutedAliasUpdateProcessorTest_D28104AB87FC3CBE-001/tempDir-001/node1/timeConfig_shard1_replica_n1/../../../../contrib/langid/lib filtered by .*\.jar to classpath: /Users/jenkins/workspace/Lucene-Solr-7.x-MacOSX/solr/build/solr-core/test/J0/temp/solr.update.processor.TimeRoutedAliasUpdateProcessorTest_D28104AB87FC3CBE-001/tempDir-001/node1/timeConfig_shard1_replica_n1/../../../../contrib/langid/lib
   [junit4]   2> 3890277 WARN  (qtp1637874263-37120) [n:127.0.0.1:63877_solr c:timeConfig s:shard1 r:core_node2 x:timeConfig_shard1_replica_n1] o.a.s.c.SolrConfig Couldn't add files from /Users/jenkins/workspace/Lucene-Solr-7.x-MacOSX/solr/build/solr-core/test/J0/temp/solr.update.processor.TimeRoutedAliasUpdateProcessorTest_D28104AB87FC3CBE-001/tempDir-001/node1/timeConfig_shard1_replica_n1/../../../../dist filtered by solr-langid-\d.*\.jar to classpath: /Users/jenkins/workspace/Lucene-Solr-7.x-MacOSX/solr/build/solr-core/test/J0/temp/solr.update.processor.TimeRoutedAliasUpdateProcessorTest_D28104AB87FC3CBE-001/tempDir-001/node1/timeConfig_shard1_replica_n1/../../../../dist
   [junit4]   2> 3890278 WARN  (qtp1637874263-37120) [n:127.0.0.1:63877_solr c:timeConfig s:shard1 r:core_node2 x:timeConfig_shard1_replica_n1] o.a.s.c.SolrConfig Couldn't add files from /Users/jenkins/workspace/Lucene-Solr-7.x-MacOSX/solr/build/solr-core/test/J0/temp/solr.update.processor.TimeRoutedAliasUpdateProcessorTest_D28104AB87FC3CBE-001/tempDir-001/node1/timeConfig_shard1_replica_n1/../../../../contrib/velocity/lib filtered by .*\.jar to classpath: /Users/jenkins/workspace/Lucene-Solr-7.x-MacOSX/solr/build/solr-core/test/J0/temp/solr.update.processor.TimeRoutedAliasUpdateProcessorTest_D28104AB87FC3CBE-001/tempDir-001/node1/timeConfig_shard1_replica_n1/../../../../contrib/velocity/lib
   [junit4]   2> 3890278 WARN  (qtp1637874263-37120) [n:127.0.0.1:63877_solr c:timeConfig s:shard1 r:core_node2 x:timeConfig_shard1_replica_n1] o.a.s.c.SolrConfig Couldn't add files from /Users/jenkins/workspace/Lucene-Solr-7.x-MacOSX/solr/build/solr-core/test/J0/temp/solr.update.processor.TimeRoutedAliasUpdateProcessorTest_D28104AB87FC3CBE-001/tempDir-001/node1/timeConfig_shard1_replica_n1/../../../../dist filtered by solr-velocity-\d.*\.jar to classpath: /Users/jenkins/workspace/Lucene-Solr-7.x-MacOSX/solr/build/solr-core/test/J0/temp/solr.update.processor.TimeRoutedAliasUpdateProcessorTest_D28104AB87FC3CBE-001/tempDir-001/node1/timeConfig_shard1_replica_n1/../../../../dist
   [junit4]   2> 3890285 INFO  (qtp1637874263-37120) [n:127.0.0.1:63877_solr c:timeConfig s:shard1 r:core_node2 x:timeConfig_shard1_replica_n1] o.a.s.c.SolrConfig Using Lucene MatchVersion: 7.3.0
   [junit4]   2> 3890306 INFO  (qtp1637874263-37120) [n:127.0.0.1:63877_solr c:timeConfig s:shard1 r:core_node2 x:timeConfig_shard1_replica_n1] o.a.s.s.IndexSchema [timeConfig_shard1_replica_n1] Schema name=default-config
   [junit4]   2> 3890550 INFO  (qtp1637874263-37120) [n:127.0.0.1:63877_solr c:timeConfig s:shard1 r:core_node2 x:timeConfig_shard1_replica_n1] o.a.s.s.IndexSchema Loaded schema default-config/1.6 with uniqueid field id
   [junit4]   2> 3890596 INFO  (qtp1637874263-37120) [n:127.0.0.1:63877_solr c:timeConfig s:shard1 r:core_node2 x:timeConfig_shard1_replica_n1] o.a.s.c.CoreContainer Creating SolrCore 'timeConfig_shard1_replica_n1' using configuration from collection timeConfig, trusted=true
   [junit4]   2> 3890597 INFO  (qtp1637874263-37120) [n:127.0.0.1:63877_solr c:timeConfig s:shard1 r:core_node2 x:timeConfig_shard1_replica_n1] o.a.s.m.r.SolrJmxReporter JMX monitoring for 'solr_63877.solr.core.timeConfig.shard1.replica_n1' (registry 'solr.core.timeConfig.shard1.replica_n1') enabled at server: com.sun.jmx.mbeanserver.JmxMBeanServer@563b499d
   [junit4]   2> 3890597 INFO  (qtp1637874263-37120) [n:127.0.0.1:63877_solr c:timeConfig s:shard1 r:core_node2 x:timeConfig_shard1_replica_n1] o.a.s.c.SolrCore solr.RecoveryStrategy.Builder
   [junit4]   2> 3890597 INFO  (qtp1637874263-37120) [n:127.0.0.1:63877_solr c:timeConfig s:shard1 r:core_node2 x:timeConfig_shard1_replica_n1] o.a.s.c.SolrCore [[timeConfig_shard1_replica_n1] ] Opening new SolrCore at [/Users/jenkins/workspace/Lucene-Solr-7.x-MacOSX/solr/build/solr-core/test/J0/temp/solr.update.processor.TimeRoutedAliasUpdateProcessorTest_D28104AB87FC3CBE-001/tempDir-001/node1/timeConfig_shard1_replica_n1], dataDir=[/Users/jenkins/workspace/Lucene-Solr-7.x-MacOSX/solr/build/solr-core/test/J0/temp/solr.update.processor.TimeRoutedAliasUpdateProcessorTest_D28104AB87FC3CBE-001/tempDir-001/node1/./timeConfig_shard1_replica_n1/data/]
   [junit4]   2> 3890601 INFO  (qtp1637874263-37120) [n:127.0.0.1:63877_solr c:timeConfig s:shard1 r:core_node2 x:timeConfig_shard1_replica_n1] o.a.s.r.XSLTResponseWriter xsltCacheLifetimeSeconds=5
   [junit4]   2> 3890656 INFO  (qtp1637874263-37120) [n:127.0.0.1:63877_solr c:timeConfig s:shard1 r:core_node2 x:timeConfig_shard1_replica_n1] o.a.s.u.UpdateHandler Using UpdateLog implementation: org.apache.solr.update.UpdateLog
   [junit4]   2> 3890656 INFO  (qtp1637874263-37120) [n:127.0.0.1:63877_solr c:timeConfig s:shard1 r:core_node2 x:timeConfig_shard1_replica_n1] o.a.s.u.UpdateLog Initializing UpdateLog: dataDir= defaultSyncLevel=FLUSH numRecordsToKeep=100 maxNumLogsToKeep=10 numVersionBuckets=65536
   [junit4]   2> 3890659 INFO  (qtp1637874263-37120) [n:127.0.0.1:63877_solr c:timeConfig s:shard1 r:core_node2 x:timeConfig_shard1_replica_n1] o.a.s.u.CommitTracker Hard AutoCommit: if uncommited for 15000ms; 
   [junit4]   2> 3890659 INFO  (qtp1637874263-37120) [n:127.0.0.1:63877_solr c:timeConfig s:shard1 r:core_node2 x:timeConfig_shard1_replica_n1] o.a.s.u.CommitTracker Soft AutoCommit: disabled
   [junit4]   2> 3890673 INFO  (qtp1637874263-37120) [n:127.0.0.1:63877_solr c:timeConfig s:shard1 r:core_node2 x:timeConfig_shard1_replica_n1] o.a.s.s.SolrIndexSearcher Opening [Searcher@23363c79[timeConfig_shard1_replica_n1] main]
   [junit4]   2> 3890675 INFO  (qtp1637874263-37120) [n:127.0.0.1:63877_solr c:timeConfig s:shard1 r:core_node2 x:timeConfig_shard1_replica_n1] o.a.s.r.ManagedResourceStorage Configured ZooKeeperStorageIO with znodeBase: /configs/timeConfig
   [junit4]   2> 3890676 INFO  (qtp1637874263-37120) [n:127.0.0.1:63877_solr c:timeConfig s:shard1 r:core_node2 x:timeConfig_shard1_replica_n1] o.a.s.r.ManagedResourceStorage Loaded null at path _rest_managed.json using ZooKeeperStorageIO:path=/configs/timeConfig
   [junit4]   2> 3890676 INFO  (qtp1637874263-37120) [n:127.0.0.1:63877_solr c:timeConfig s:shard1 r:core_node2 x:timeConfig_shard1_replica_n1] o.a.s.s.ZkIndexSchemaReader Creating ZooKeeper watch for the managed schema at /configs/timeConfig/managed-schema
   [junit4]   2> 3890677 INFO  (qtp1637874263-37120) [n:127.0.0.1:63877_solr c:timeConfig s:shard1 r:core_node2 x:timeConfig_shard1_replica_n1] o.a.s.s.ZkIndexSchemaReader Current schema version 0 is already the latest
   [junit4]   2> 3890677 INFO  (qtp1637874263-37120) [n:127.0.0.1:63877_solr c:timeConfig s:shard1 r:core_node2 x:timeConfig_shard1_replica_n1] o.a.s.h.c.SpellCheckComponent Initializing spell checkers
   [junit4]   2> 3890678 INFO  (qtp1637874263-37120) [n:127.0.0.1:63877_solr c:timeConfig s:shard1 r:core_node2 x:timeConfig_shard1_replica_n1] o.a.s.s.DirectSolrSpellChecker init: {name=default,field=_text_,classname=solr.DirectSolrSpellChecker,distanceMeasure=internal,accuracy=0.5,maxEdits=2,minPrefix=1,maxInspections=5,minQueryLength=4,maxQueryFrequency=0.01}
   [junit4]   2> 3890680 INFO  (qtp1637874263-37120) [n:127.0.0.1:63877_solr c:timeConfig s:shard1 r:core_node2 x:timeConfig_shard1_replica_n1] o.a.s.h.ReplicationHandler Commits will be reserved for 10000ms.
   [junit4]   2> 3890680 INFO  (searcherExecutor-16188-thread-1-processing-n:127.0.0.1:63877_solr x:timeConfig_shard1_replica_n1 s:shard1 c:timeConfig r:core_node2) [n:127.0.0.1:63877_solr c:timeConfig s:shard1 r:core_node2 x:timeConfig_shard1_replica_n1] o.a.s.c.QuerySenderListener QuerySenderListener sending requests to Searcher@23363c79[timeConfig_shard1_replica_n1] main{ExitableDirectoryReader(UninvertingDirectoryReader())}
   [junit4]   2> 3890680 INFO  (searcherExecutor-16188-thread-1-processing-n:127.0.0.1:63877_solr x:timeConfig_shard1_replica_n1 s:shard1 c:timeConfig r:core_node2) [n:127.0.0.1:63877_solr c:timeConfig s:shard1 r:core_node2 x:timeConfig_shard1_replica_n1] o.a.s.c.QuerySenderListener QuerySenderListener done.
   [junit4]   2> 3890680 INFO  (searcherExecutor-16188-thread-1-processing-n:127.0.0.1:63877_solr x:timeConfig_shard1_replica_n1 s:shard1 c:timeConfig r:core_node2) [n:127.0.0.1:63877_solr c:timeConfig s:shard1 r:core_node2 x:timeConfig_shard1_replica_n1] o.a.s.h.c.SpellCheckComponent Loading spell index for spellchecker: default
   [junit4]   2> 3890681 INFO  (searcherExecutor-16188-thread-1-processing-n:127.0.0.1:63877_solr x:timeConfig_shard1_replica_n1 s:shard1 c:timeConfig r:core_node2) [n:127.0.0.1:63877_solr c:timeConfig s:shard1 r:core_node2 x:timeConfig_shard1_replica_n1] o.a.s.c.SolrCore [timeConfig_shard1_replica_n1] Registered new searcher Searcher@23363c79[timeConfig_shard1_replica_n1] main{ExitableDirectoryReader(UninvertingDirectoryReader())}
   [junit4]   2> 3890681 INFO  (qtp1637874263-37120) [n:127.0.0.1:63877_solr c:timeConfig s:shard1 r:core_node2 x:timeConfig_shard1_replica_n1] o.a.s.u.UpdateLog Could not find max version in index or recent updates, using new clock 1589184041806987264
   [junit4]   2> 3890687 INFO  (qtp1637874263-37120) [n:127.0.0.1:63877_solr c:timeConfig s:shard1 r:core_node2 x:timeConfig_shard1_replica_n1] o.a.s.c.ShardLeaderElectionContext Enough replicas found to continue.
   [junit4]   2> 3890687 INFO  (qtp1637874263-37120) [n:127.0.0.1:63877_solr c:timeConfig s:shard1 r:core_node2 x:timeConfig_shard1_replica_n1] o.a.s.c.ShardLeaderElectionContext I may be the new leader - try and sync
   [junit4]   2> 3890687 INFO  (qtp1637874263-37120) [n:127.0.0.1:63877_solr c:timeConfig s:shard1 r:core_node2 x:timeConfig_shard1_replica_n1] o.a.s.c.SyncStrategy Sync replicas to https://127.0.0.1:63877/solr/timeConfig_shard1_replica_n1/
   [junit4]   2> 3890687 INFO  (qtp1637874263-37120) [n:127.0.0.1:63877_solr c:timeConfig s:shard1 r:core_node2 x:timeConfig_shard1_replica_n1] o.a.s.c.SyncStrategy Sync Success - now sync replicas to me
   [junit4]   2> 3890687 INFO  (qtp1637874263-37120) [n:127.0.0.1:63877_solr c:timeConfig s:shard1 r:core_node2 x:timeConfig_shard1_replica_n1] o.a.s.c.SyncStrategy https://127.0.0.1:63877/solr/timeConfig_shard1_replica_n1/ has no replicas
   [junit4]   2> 3890687 INFO  (qtp1637874263-37120) [n:127.0.0.1:63877_solr c:timeConfig s:shard1 r:core_node2 x:timeConfig_shard1_replica_n1] o.a.s.c.ShardLeaderElectionContext Found all replicas participating in election, clear LIR
   [junit4]   2> 3890692 INFO  (qtp1637874263-37120) [n:127.0.0.1:63877_solr c:timeConfig s:shard1 r:core_node2 x:timeConfig_shard1_replica_n1] o.a.s.c.ShardLeaderElectionContext I am the new leader: https://127.0.0.1:63877/solr/timeConfig_shard1_replica_n1/ shard1
   [junit4]   2> 3890796 INFO  (zkCallback-8502-thread-2-processing-n:127.0.0.1:63877_solr) [n:127.0.0.1:63877_solr    ] o.a.s.c.c.ZkStateReader A cluster state change: [WatchedEvent state:SyncConnected type:NodeDataChanged path:/collections/timeConfig/state.json] for collection [timeConfig] has occurred - updating... (live nodes size: [2])
   [junit4]   2> 3890796 INFO  (zkCallback-8502-thread-1-processing-n:127.0.0.1:63877_solr) [n:127.0.0.1:63877_solr    ] o.a.s.c.c.ZkStateReader A cluster state change: [WatchedEvent state:SyncConnected type:NodeDataChanged path:/collections/timeConfig/state.json] for collection [timeConfig] has occurred - updating... (live nodes size: [2])
   [junit4]   2> 3890797 INFO  (qtp1637874263-37120) [n:127.0.0.1:63877_solr c:timeConfig s:shard1 r:core_node2 x:timeConfig_shard1_replica_n1] o.a.s.c.ZkController I am the leader, no recovery necessary
   [junit4]   2> 3890800 INFO  (qtp1637874263-37120) [n:127.0.0.1:63877_solr c:timeConfig s:shard1 r:core_node2 x:timeConfig_shard1_replica_n1] o.a.s.s.HttpSolrCall [admin] webapp=null path=/admin/cores params={qt=/admin/cores&coreNodeName=core_node2&collection.configName=timeConfig&newCollection=true&name=timeConfig_shard1_replica_n1&action=CREATE&numShards=1&collection=timeConfig&shard=shard1&wt=javabin&version=2&replicaType=NRT} status=0 QTime=1542
   [junit4]   2> 3890803 INFO  (qtp1020007657-37112) [n:127.0.0.1:63876_solr    ] o.a.s.h.a.CollectionsHandler Wait for new collection to be active for at most 30 seconds. Check all shard replicas
   [junit4]   2> 3890901 INFO  (zkCallback-8502-thread-1-processing-n:127.0.0.1:63877_solr) [n:127.0.0.1:63877_solr    ] o.a.s.c.c.ZkStateReader A cluster state change: [WatchedEvent state:SyncConnected type:NodeDataChanged path:/collections/timeConfig/state.json] for collection [timeConfig] has occurred - updating... (live nodes size: [2])
   [junit4]   2> 3890901 INFO  (zkCallback-8502-thread-2-processing-n:127.0.0.1:63877_solr) [n:127.0.0.1:63877_solr    ] o.a.s.c.c.ZkStateReader A cluster state change: [WatchedEvent state:SyncConnected type:NodeDataChanged path:/collections/timeConfig/state.json] for collection [timeConfig] has occurred - updating... (live nodes size: [2])
   [junit4]   2> 3891805 INFO  (qtp1020007657-37112) [n:127.0.0.1:63876_solr    ] o.a.s.s.HttpSolrCall [admin] webapp=null path=/admin/collections params={pullReplicas=0&replicationFactor=1&name=timeConfig&nrtReplicas=1&action=CREATE&numShards=1&tlogReplicas=0&wt=javabin&version=2} status=0 QTime=3041
   [junit4]   2> 3891808 INFO  (qtp1020007657-37113) [n:127.0.0.1:63876_solr    ] o.a.s.h.a.CollectionsHandler Invoked Collection Action :clusterstatus with params action=CLUSTERSTATUS&wt=javabin&version=2 and sendToOCPQueue=true
   [junit4]   2> 3891811 INFO  (qtp1020007657-37113) [n:127.0.0.1:63876_solr    ] o.a.s.s.HttpSolrCall [admin] webapp=null path=/admin/collections params={action=CLUSTERSTATUS&wt=javabin&version=2} status=0 QTime=2
   [junit4]   2> 3891818 INFO  (qtp1637874263-37123) [n:127.0.0.1:63877_solr c:timeConfig s:shard1 r:core_node2 x:timeConfig_shard1_replica_n1] o.a.s.h.SolrConfigHandler Executed config commands successfully and persisted to ZK [{"set-user-property":{"timePartitionAliasName":"myalias"}}, {"set-user-property":{"update.autoCreateFields":false}}, {"add-updateprocessor":{
   [junit4]   2>     "name":"tolerant",
   [junit4]   2>     "class":"solr.TolerantUpdateProcessorFactory"}}, {"add-updateprocessor":{
   [junit4]   2>     "name":"inc",
   [junit4]   2>     "class":"org.apache.solr.update.processor.TimeRoutedAliasUpdateProcessorTest$IncrementURPFactory",
   [junit4]   2>     "fieldName":"integer_i"}}]
   [junit4]   2> 3891818 INFO  (qtp1637874263-37123) [n:127.0.0.1:63877_solr c:timeConfig s:shard1 r:core_node2 x:timeConfig_shard1_replica_n1] o.a.s.h.SolrConfigHandler Waiting up to 30 secs for 1 replicas to set the property overlay to be of version 0 for collection timeConfig
   [junit4]   2> 3891818 INFO  (solrHandlerExecutor-16193-thread-1-processing-n:127.0.0.1:63877_solr x:timeConfig_shard1_replica_n1 s:shard1 c:timeConfig r:core_node2) [n:127.0.0.1:63877_solr c:timeConfig s:shard1 r:core_node2 x:timeConfig_shard1_replica_n1] o.a.s.h.SolrConfigHandler Time elapsed : 0 secs, maxWait 30
   [junit4]   2> 3891822 INFO  (Thread-7349) [n:127.0.0.1:63877_solr    ] o.a.s.c.SolrCore config update listener called for core timeConfig_shard1_replica_n1
   [junit4]   2> 3891823 INFO  (Thread-7349) [n:127.0.0.1:63877_solr    ] o.a.s.c.SolrCore core reload timeConfig_shard1_replica_n1
   [junit4]   2> 3891832 INFO  (Thread-7349) [n:127.0.0.1:63877_solr    ] o.a.s.c.RequestParams conf resource params.json loaded . version : 0 
   [junit4]   2> 3891832 INFO  (Thread-7349) [n:127.0.0.1:63877_solr    ] o.a.s.c.RequestParams request params refreshed to version 0
   [junit4]   2> 3891833 WARN  (Thread-7349) [n:127.0.0.1:63877_solr    ] o.a.s.c.SolrConfig Couldn't add files from /Users/jenkins/workspace/Lucene-Solr-7.x-MacOSX/solr/build/solr-core/test/J0/temp/solr.update.processor.TimeRoutedAliasUpdateProcessorTest_D28104AB87FC3CBE-001/tempDir-001/node1/timeConfig_shard1_replica_n1/../../../../contrib/extraction/lib filtered by .*\.jar to classpath: /Users/jenkins/workspace/Lucene-Solr-7.x-MacOSX/solr/build/solr-core/test/J0/temp/solr.update.processor.TimeRoutedAliasUpdateProcessorTest_D28104AB87FC3CBE-001/tempDir-001/node1/timeConfig_shard1_replica_n1/../../../../contrib/extraction/lib
   [junit4]   2> 3891833 WARN  (Thread-7349) [n:127.0.0.1:63877_solr    ] o.a.s.c.SolrConfig Couldn't add files from /Users/jenkins/workspace/Lucene-Solr-7.x-MacOSX/solr/build/solr-core/test/J0/temp/solr.update.processor.TimeRoutedAliasUpdateProcessorTest_D28104AB87FC3CBE-001/tempDir-001/node1/timeConfig_shard1_replica_n1/../../../../dist filtered by solr-cell-\d.*\.jar to classpath: /Users/jenkins/workspace/Lucene-Solr-7.x-MacOSX/solr/build/solr-core/test/J0/temp/solr.update.processor.TimeRoutedAliasUpdateProcessorTest_D28104AB87FC3CBE-001/tempDir-001/node1/timeConfig_shard1_replica_n1/../../../../dist
   [junit4]   2> 3891833 WARN  (Thread-7349) [n:127.0.0.1:63877_solr    ] o.a.s.c.SolrConfig Couldn't add files from /Users/jenkins/workspace/Lucene-Solr-7.x-MacOSX/solr/build/solr-core/test/J0/temp/solr.update.processor.TimeRoutedAliasUpdateProcessorTest_D28104AB87FC3CBE-001/tempDir-001/node1/timeConfig_shard1_replica_n1/../../../../contrib/clustering/lib filtered by .*\.jar to classpath: /Users/jenkins/workspace/Lucene-Solr-7.x-MacOSX/solr/build/solr-core/test/J0/temp/solr.update.processor.TimeRoutedAliasUpdateProcessorTest_D28104AB87FC3CBE-001/tempDir-001/node1/timeConfig_shard1_replica_n1/../../../../contrib/clustering/lib
   [junit4]   2> 3891833 WARN  (Thread-7349) [n:127.0.0.1:63877_solr    ] o.a.s.c.SolrConfig Couldn't add files from /Users/jenkins/workspace/Lucene-Solr-7.x-MacOSX/solr/build/solr-core/test/J0/temp/solr.update.processor.TimeRoutedAliasUpdateProcessorTest_D28104AB87FC3CBE-001/tempDir-001/node1/timeConfig_shard1_replica_n1/../../../../dist filtered by solr-clustering-\d.*\.jar to classpath: /Users/jenkins/workspace/Lucene-Solr-7.x-MacOSX/solr/build/solr-core/test/J0/temp/solr.update.processor.TimeRoutedAliasUpdateProcessorTest_D28104AB87FC3CBE-001/tempDir-001/node1/timeConfig_shard1_replica_n1/../../../../dist
   [junit4]   2> 3891834 WARN  (Thread-7349) [n:127.0.0.1:63877_solr    ] o.a.s.c.SolrConfig Couldn't add files from /Users/jenkins/workspace/Lucene-Solr-7.x-MacOSX/solr/build/solr-core/test/J0/temp/solr.update.processor.TimeRoutedAliasUpdateProcessorTest_D28104AB87FC3CBE-001/tempDir-001/node1/timeConfig_shard1_replica_n1/../../../../contrib/langid/lib filtered by .*\.jar to classpath: /Users/jenkins/workspace/Lucene-Solr-7.x-MacOSX/solr/build/solr-core/test/J0/temp/solr.update.processor.TimeRoutedAliasUpdateProcessorTest_D28104AB87FC3CBE-001/tempDir-001/node1/timeConfig_shard1_replica_n1/../../../../contrib/langid/lib
   [junit4]   2> 3891834 WARN  (Thread-7349) [n:127.0.0.1:63877_solr    ] o.a.s.c.SolrConfig Couldn't add files from /Users/jenkins/workspace/Lucene-Solr-7.x-MacOSX/solr/build/solr-core/test/J0/temp/solr.update.processor.TimeRoutedAliasUpdateProcessorTest_D28104AB87FC3CBE-001/tempDir-001/node1/timeConfig_shard1_replica_n1/../../../../dist filtered by solr-langid-\d.*\.jar to classpath: /Users/jenkins/workspace/Lucene-Solr-7.x-MacOSX/solr/build/solr-core/test/J0/temp/solr.update.processor.TimeRoutedAliasUpdateProcessorTest_D28104AB87FC3CBE-001/tempDir-001/node1/timeConfig_shard1_replica_n1/../../../../dist
   [junit4]   2> 3891834 WARN  (Thread-7349) [n:127.0.0.1:63877_solr    ] o.a.s.c.SolrConfig Couldn't add files from /Users/jenkins/workspace/Lucene-Solr-7.x-MacOSX/solr/build/solr-core/test/J0/temp/solr.update.processor.TimeRoutedAliasUpdateProcessorTest_D28104AB87FC3CBE-001/tempDir-001/node1/timeConfig_shard1_replica_n1/../../../../contrib/velocity/lib filtered by .*\.jar to classpath: /Users/jenkins/workspace/Lucene-Solr-7.x-MacOSX/solr/build/solr-core/test/J0/temp/solr.update.processor.TimeRoutedAliasUpdateProcessorTest_D28104AB87FC3CBE-001/tempDir-001/node1/timeConfig_shard1_replica_n1/../../../../contrib/velocity/lib
   [junit4]   2> 3891834 WARN  (Thread-7349) [n:127.0.0.1:63877_solr    ] o.a.s.c.SolrConfig Couldn't add files from /Users/jenkins/workspace/Lucene-Solr-7.x-MacOSX/solr/build/solr-core/test/J0/temp/solr.update.processor.TimeRoutedAliasUpdateProcessorTest_D28104AB87FC3CBE-001/tempDir-001/node1/timeConfig_shard1_replica_n1/../../../../dist filtered by solr-velocity-\d.*\.jar to classpath: /Users/jenkins/workspace/Lucene-Solr-7.x-MacOSX/solr/build/solr-core/test/J0/temp/solr.update.processor.TimeRoutedAliasUpdateProcessorTest_D28104AB87FC3CBE-001/tempDir-001/node1/timeConfig_shard1_replica_n1/../../../../dist
   [junit4]   2> 3891841 INFO  (Thread-7349) [n:127.0.0.1:63877_solr    ] o.a.s.c.SolrConfig Using Lucene MatchVersion: 7.3.0
   [junit4]   2> 3891862 INFO  (Thread-7349) [n:127.0.0.1:63877_solr    ] o.a.s.s.IndexSchema [timeConfig_shard1_replica_n1] Schema name=default-config
   [junit4]   2> 3891930 INFO  (qtp1637874263-37118) [n:127.0.0.1:63877_solr c:timeConfig s:shard1 r:core_node2 x:timeConfig_shard1_replica_n1] o.a.s.h.SolrConfigHandler expecting overlay version 0 but my version is -1
   [junit4]   2> 3891931 INFO  (qtp1637874263-37118) [n:127.0.0.1:63877_solr c:timeConfig s:shard1 r:core_node2 x:timeConfig_shard1_replica_n1] o.a.s.c.S.Request [timeConfig_shard1_replica_n1]  webapp=/solr path=/config/znodeVersion params={overlay=0&wt=javabin&version=2} status=0 QTime=0
   [junit4]   2> 3891931 INFO  (SolrConfigHandler-refreshconf) [n:127.0.0.1:63877_solr c:timeConfig s:shard1 r:core_node2 x:timeConfig_shard1_replica_n1] o.a.s.h.SolrConfigHandler Another reload is in progress . Not doing anything
   [junit4]   2> 3891931 INFO  (solrHandlerExecutor-16193-thread-1-processing-n:127.0.0.1:63877_solr x:timeConfig_shard1_replica_n1 s:shard1 c:timeConfig r:core_node2) [n:127.0.0.1:63877_solr c:timeConfig s:shard1 r:core_node2 x:timeConfig_shard1_replica_n1] o.a.s.h.SolrConfigHandler Could not get expectedVersion 0 from https://127.0.0.1:63877/solr/timeConfig_shard1_replica_n1/ for prop overlay   after 1 attempts
   [junit4]   2> 3891931 INFO  (solrHandlerExecutor-16193-thread-1-processing-n:127.0.0.1:63877_solr x:timeConfig_shard1_replica_n1 s:shard1 c:timeConfig r:core_node2) [n:127.0.0.1:63877_solr c:timeConfig s:shard1 r:core_node2 x:timeConfig_shard1_replica_n1] o.a.s.h.SolrConfigHandler Time elapsed : 0 secs, maxWait 30
   [junit4]   2> 3892036 INFO  (qtp1637874263-37120) [n:127.0.0.1:63877_solr c:timeConfig s:shard1 r:core_node2 x:timeConfig_shard1_replica_n1] o.a.s.h.SolrConfigHandler expecting overlay version 0 but my version is -1
   [junit4]   2> 3892036 INFO  (qtp1637874263-37120) [n:127.0.0.1:63877_solr c:timeConfig s:shard1 r:core_node2 x:timeConfig_shard1_replica_n1] o.a.s.c.S.Request [timeConfig_shard1_replica_n1]  webapp=/solr path=/config/znodeVersion params={overlay=0&wt=javabin&version=2} status=0 QTime=0
   [junit4]   2> 3892036 INFO  (SolrConfigHandler-refreshconf) [n:127.0.0.1:63877_solr c:timeConfig s:shard1 r:core_node2 x:timeConfig_shard1_replica_n1] o.a.s.h.SolrConfigHandler Another reload is in progress . Not doing anything
   [junit4]   2> 3892037 INFO  (solrHandlerExecutor-16193-thread-1-processing-n:127.0.0.1:63877_solr x:timeConfig_shard1_replica_n1 s:shard1 c:timeConfig r:core_node2) [n:127.0.0.1:63877_solr c:timeConfig s:shard1 r:core_node2 x:timeConfig_shard1_replica_n1] o.a.s.h.SolrConfigHandler Could not get expectedVersion 0 from https://127.0.0.1:63877/solr/timeConfig_shard1_replica_n1/ for prop overlay   after 2 attempts
   [junit4]   2> 3892037 INFO  (solrHandlerExecutor-16193-thread-1-processing-n:127.0.0.1:63877_solr x:timeConfig_shard1_replica_n1 s:shard1 c:timeConfig r:core_node2) [n:127.0.0.1:63877_solr c:timeConfig s:shard1 r:core_node2 x:timeConfig_shard1_replica_n1] o.a.s.h.SolrConfigHandler Time elapsed : 0 secs, maxWait 30
   [junit4]   2> 3892060 INFO  (Thread-7349) [n:127.0.0.1:63877_solr    ] o.a.s.s.IndexSchema Loaded schema default-config/1.6 with uniqueid field id
   [junit4]   2> 3892108 INFO  (Thread-7349) [n:127.0.0.1:63877_solr    ] o.a.s.c.CoreContainer Reloading SolrCore 'timeConfig_shard1_replica_n1' using configuration from collection timeConfig
   [junit4]   2> 3892143 INFO  (qtp1637874263-37121) [n:127.0.0.1:63877_solr c:timeConfig s:shard1 r:core_node2 x:timeConfig_shard1_replica_n1] o.a.s.h.SolrConfigHandler expecting overlay version 0 but my version is -1
   [junit4]   2> 3892143 INFO  (qtp1637874263-37121) [n:127.0.0.1:63877_solr c:timeConfig s:shard1 r:core_node2 x:timeConfig_shard1_replica_n1] o.a.s.c.S.Request [timeConfig_shard1_replica_n1]  webapp=/solr path=/config/znodeVersion params={overlay=0&wt=javabin&version=2} status=0 QTime=0
   [junit4]   2> 3892143 INFO  (SolrConfigHandler-refreshconf) [n:127.0.0.1:63877_solr c:timeConfig s:shard1 r:core_node2 x:timeConfig_shard1_replica_n1] o.a.s.h.SolrConfigHandler Another reload is in progress . Not doing anything
   [junit4]   2> 3892144 INFO  (solrHandlerExecutor-16193-thread-1-processing-n:127.0.0.1:63877_solr x:timeConfig_shard1_replica_n1 s:shard1 c:timeConfig r:core_node2) [n:127.0.0.1:63877_solr c:timeConfig s:shard1 r:core_node2 x:timeConfig_shard1_replica_n1] o.a.s.h.SolrConfigHandler Could not get expectedVersion 0 from https://127.0.0.1:63877/solr/timeConfig_shard1_replica_n1/ for prop overlay   after 3 attempts
   [junit4]   2> 3892144 INFO  (solrHandlerExecutor-16193-thread-1-processing-n:127.0.0.1:63877_solr x:timeConfig_shard1_replica_n1 s:shard1 c:timeConfig r:core_node2) [n:127.0.0.1:63877_solr c:timeConfig s:shard1 r:core_node2 x:timeConfig_shard1_replica_n1] o.a.s.h.SolrConfigHandler Time elapsed : 0 secs, maxWait 30
   [junit4]   2> 3892150 INFO  (Thread-7349) [n:127.0.0.1:63877_solr c:timeConfig s:shard1 r:core_node2 x:timeConfig_shard1_replica_n1] o.a.s.m.r.SolrJmxReporter JMX monitoring for 'solr_63877.solr.core.timeConfig.shard1.replica_n1' (registry 'solr.core.timeConfig.shard1.replica_n1') enabled at server: com.sun.jmx.mbeanserver.JmxMBeanServer@563b499d
   [junit4]   2> 3892150 INFO  (Thread-7349) [n:127.0.0.1:63877_solr c:timeConfig s:shard1 r:core_node2 x:timeConfig_shard1_replica_n1] o.a.s.c.SolrCore [[timeConfig_shard1_replica_n1] ] Opening new SolrCore at [/Users/jenkins/workspace/Lucene-Solr-7.x-MacOSX/solr/build/solr-core/test/J0/temp/solr.update.processor.TimeRoutedAliasUpdateProcessorTest_D28104AB87FC3CBE-001/tempDir-001/node1/timeConfig_shard1_replica_n1], dataDir=[/Users/jenkins/workspace/Lucene-Solr-7.x-MacOSX/solr/build/solr-core/test/J0/temp/solr.update.processor.TimeRoutedAliasUpdateProcessorTest_D28104AB87FC3CBE-001/tempDir-001/node1/./timeConfig_shard1_replica_n1/data/]
   [junit4]   2> 3892153 INFO  (Thread-7349) [n:127.0.0.1:63877_solr c:timeConfig s:shard1 r:core_node2 x:timeConfig_shard1_replica_n1] o.a.s.r.XSLTResponseWriter xsltCacheLifetimeSeconds=5
   [junit4]   2> 3892185 INFO  (Thread-7349) [n:127.0.0.1:63877_solr c:timeConfig s:shard1 r:core_node2 x:timeConfig_shard1_replica_n1] o.a.s.u.CommitTracker Hard AutoCommit: if uncommited for 15000ms; 
   [junit4]   2> 3892185 INFO  (Thread-7349) [n:127.0.0.1:63877_solr c:timeConfig s:shard1 r:core_node2 x:timeConfig_shard1_replica_n1] o.a.s.u.CommitTracker Soft AutoCommit: disabled
   [junit4]   2> 3892186 INFO  (Thread-7349) [n:127.0.0.1:63877_solr c:timeConfig s:shard1 r:core_node2 x:timeConfig_shard1_replica_n1] o.a.s.s.SolrIndexSearcher Opening [Searcher@5e852fa[timeConfig_shard1_replica_n1] main]
   [junit4]   2> 3892188 INFO  (Thread-7349) [n:127.0.0.1:63877_solr c:timeConfig s:shard1 r:core_node2 x:timeConfig_shard1_replica_n1] o.a.s.r.ManagedResourceStorage Configured ZooKeeperStorageIO with znodeBase: /configs/timeConfig
   [junit4]   2> 3892188 INFO  (Thread-7349) [n:127.0.0.1:63877_solr c:timeConfig s:shard1 r:core_node2 x:timeConfig_shard1_replica_n1] o.a.s.r.ManagedResourceStorage Loaded null at path _rest_managed.json using ZooKeeperStorageIO:path=/configs/timeConfig
   [junit4]   2> 3892188 INFO  (Thread-7349) [n:127.0.0.1:63877_solr c:timeConfig s:shard1 r:core_node2 x:timeConfig_shard1_replica_n1] o.a.s.s.ZkIndexSchemaReader Creating ZooKeeper watch for the managed schema at /configs/timeConfig/managed-schema
   [junit4]   2> 3892189 INFO  (Thread-7349) [n:127.0.0.1:63877_solr c:timeConfig s:shard1 r:core_node2 x:timeConfig_shard1_replica_n1] o.a.s.s.ZkIndexSchemaReader Current schema version 0 is already the latest
   [junit4]   2> 3892189 INFO  (Thread-7349) [n:127.0.0.1:63877_solr c:timeConfig s:shard1 r:core_node2 x:timeConfig_shard1_replica_n1] o.a.s.h.c.SpellCheckComponent Initializing spell checkers
   [junit4]   2> 3892189 INFO  (Thread-7349) [n:127.0.0.1:63877_solr c:timeConfig s:shard1 r:core_node2 x:timeConfig_shard1_replica_n1] o.a.s.s.DirectSolrSpellChecker init: {name=default,field=_text_,classname=solr.DirectSolrSpellChecker,distanceMeasure=internal,accuracy=0.5,maxEdits=2,minPrefix=1,maxInspections=5,minQueryLength=4,maxQueryFrequency=0.01}
   [junit4]   2> 3892190 INFO  (Thread-7349) [n:127.0.0.1:63877_solr c:timeConfig s:shard1 r:core_node2 x:timeConfig_shard1_replica_n1] o.a.s.h.ReplicationHandler Commits will be reserved for 10000ms.
   [junit4]   2> 3892190 INFO  (searcherExecutor-16194-thread-1-processing-n:127.0.0.1:63877_solr x:timeConfig_shard1_replica_n1 s:shard1 c:timeConfig r:core_node2) [n:127.0.0.1:63877_solr c:timeConfig s:shard1 r:core_node2 x:timeConfig_shard1_replica_n1] o.a.s.c.QuerySenderListener QuerySenderListener sending requests to Searcher@5e852fa[timeConfig_shard1_replica_n1] main{ExitableDirectoryReader(UninvertingDirectoryReader())}
   [junit4]   2> 3892190 INFO  (searcherExecutor-16194-thread-1-processing-n:127.0.0.1:63877_solr x:timeConfig_shard1_replica_n1 s:shard1 c:timeConfig r:core_node2) [n:127.0.0.1:63877_solr c:timeConfig s:shard1 r:core_node2 x:timeConfig_shard1_replica_n1] o.a.s.c.QuerySenderListener QuerySenderListener done.
   [junit4]   2> 3892190 INFO  (searcherExecutor-16194-thread-1-processing-n:127.0.0.1:63877_solr x:timeConfig_shard1_replica_n1 s:shard1 c:timeConfig r:core_node2) [n:127.0.0.1:63877_solr c:timeConfig s:shard1 r:core_node2 x:timeConfig_shard1_replica_n1] o.a.s.h.c.SpellCheckComponent Loading spell index for spellchecker: default
   [junit4]   2> 3892192 INFO  (searcherExecutor-16194-thread-1-processing-n:127.0.0.1:63877_solr x:timeConfig_shard1_replica_n1 s:shard1 c:timeConfig r:core_node2) [n:127.0.0.1:63877_solr c:timeConfig s:shard1 r:core_node2 x:timeConfig_shard1_replica_n1] o.a.s.c.SolrCore [timeConfig_shard1_replica_n1] Registered new searcher Searcher@5e852fa[timeConfig_shard1_replica_n1] main{ExitableDirectoryReader(UninvertingDirectoryReader())}
   [junit4]   2> 3892193 INFO  (Thread-7349) [n:127.0.0.1:63877_solr c:timeConfig s:shard1 r:core_node2 x:timeConfig_shard1_replica_n1] o.a.s.u.UpdateLog Could not find max version in index or recent updates, using new clock 1589184043392434176
   [junit4]   2> 3892212 INFO  (Thread-7349) [n:127.0.0.1:63877_solr c:timeConfig s:shard1 r:core_node2 x:timeConfig_shard1_replica_n1] o.a.s.u.DefaultSolrCoreState New IndexWriter is ready to be used.
   [junit4]   2> 3892212 INFO  (Thread-7349) [n:127.0.0.1:63877_solr c:timeConfig s:shard1 r:core_node2 x:timeConfig_shard1_replica_n1] o.a.s.s.SolrIndexSearcher Opening [Searcher@79830a27[timeConfig_shard1_replica_n1] main]
   [junit4]   2> 3892212 INFO  (searcherExecutor-16194-thread-1-processing-n:127.0.0.1:63877_solr x:timeConfig_shard1_replica_n1 s:shard1 c:timeConfig r:core_node2) [n:127.0.0.1:63877_solr c:timeConfig s:shard1 r:core_node2 x:timeConfig_shard1_replica_n1] o.a.s.c.QuerySenderListener QuerySenderListener sending requests to Searcher@79830a27[timeConfig_shard1_replica_n1] main{ExitableDirectoryReader(UninvertingDirectoryReader())}
   [junit4]   2> 3892213 INFO  (searcherExecutor-16194-thread-1-processing-n:127.0.0.1:63877_solr x:timeConfig_shard1_replica_n1 s:shard1 c:timeConfig r:core_node2) [n:127.0.0.1:63877_solr c:timeConfig s:shard1 r:core_node2 x:timeConfig_shard1_replica_n1] o.a.s.c.QuerySenderListener QuerySenderListener done.
   [junit4]   2> 3892215 INFO  (searcherExecutor-16194-thread-1-processing-n:127.0.0.1:63877_solr x:timeConfig_shard1_replica_n1 s:shard1 c:timeConfig r:core_node2) [n:127.0.0.1:63877_solr c:timeConfig s:shard1 r:core_node2 x:timeConfig_shard1_replica_n1] o.a.s.c.SolrCore [timeConfig_shard1_replica_n1] Registered new searcher Searcher@79830a27[timeConfig_shard1_replica_n1] main{ExitableDirectoryReader(UninvertingDirectoryReader())}
   [junit4]   2> 3892249 INFO  (qtp1637874263-37124) [n:127.0.0.1:63877_solr c:timeConfig s:shard1 r:core_node2 x:timeConfig_shard1_replica_n1] o.a.s.h.SolrConfigHandler I already have the expected version 0 of config
   [junit4]   2> 3892249 INFO  (qtp1637874263-37124) [n:127.0.0.1:63877_solr c:timeConfig s:shard1 r:core_node2 x:timeConfig_shard1_replica_n1] o.a.s.h.SolrConfigHandler isStale false , resourceloader org.apache.solr.cloud.ZkSolrResourceLoader
   [junit4]   2> 3892249 INFO  (qtp1637874263-37124) [n:127.0.0.1:63877_solr c:timeConfig s:shard1 r:core_node2 x:timeConfig_shard1_replica_n1] o.a.s.c.S.Request [timeConfig_shard1_replica_n1]  webapp=/solr path=/config/znodeVersion params={overlay=0&wt=javabin&version=2} status=0 QTime=0
   [junit4]   2> 3892250 INFO  (qtp1637874263-37123) [n:127.0.0.1:63877_solr c:timeConfig s:shard1 r:core_node2 x:timeConfig_shard1_replica_n1] o.a.s.h.SolrConfigHandler Took 431.0ms to set the property overlay to be of version 0 for collection timeConfig
   [junit4]   2> 3892250 INFO  (qtp1637874263-37123) [n:127.0.0.1:63877_solr c:timeConfig s:shard1 r:core_node2 x:timeConfig_shard1_replica_n1] o.a.s.c.SolrCore [timeConfig_shard1_replica_n1]  CLOSING SolrCore org.apache.solr.core.SolrCore@265f7c8f
   [junit4]   2> 3892250 INFO  (qtp1637874263-37123) [n:127.0.0.1:63877_solr c:timeConfig s:shard1 r:core_node2 x:timeConfig_shard1_replica_n1] o.a.s.m.SolrMetricManager Closing metric reporters for registry=solr.core.timeConfig.shard1.replica_n1, tag=643792015
   [junit4]   2> 3892250 INFO  (qtp1637874263-37123) [n:127.0.0.1:63877_solr c:timeConfig s:shard1 r:core_node2 x:timeConfig_shard1_replica_n1] o.a.s.m.r.SolrJmxReporter Closing reporter [org.apache.solr.metrics.reporters.SolrJmxReporter@93734b7: rootName = solr_63877, domain = solr.core.timeConfig.shard1.replica_n1, service url = null, agent id = null] for registry solr.core.timeConfig.shard1.replica_n1 / com.codahale.metrics.MetricRegistry@642ad392
   [junit4]   2> 3892257 INFO  (qtp1637874263-37123) [n:127.0.0.1:63877_solr c:timeConfig s:shard1 r:core_node2 x:timeConfig_shard1_replica_n1] o.a.s.m.SolrMetricManager Closing metric reporters for registry=solr.collection.timeConfig.shard1.leader, tag=643792015
   [junit4]   2> 3892258 INFO  (qtp1020007657-37114) [n:127.0.0.1:63876_solr    ] o.a.s.h.a.CollectionsHandler Invoked Collection Action :clusterstatus with params action=CLUSTERSTATUS&wt=javabin&version=2 and sendToOCPQueue=true
   [junit4]   2> 3892259 INFO  (qtp1020007657-37114) [n:127.0.0.1:63876_solr    ] o.a.s.s.HttpSolrCall [admin] webapp=null path=/admin/collections params={action=CLUSTERSTATUS&wt=javabin&version=2} status=0 QTime=1
   [junit4]   2> 3892264 INFO  (qtp1637874263-37124) [n:127.0.0.1:63877_solr c:timeConfig s:shard1 r:core_node2 x:timeConfig_shard1_replica_n1] o.a.s.c.ZkController Persisted config data to node /configs/timeConfig/params.json 
   [junit4]   2> 3892265 INFO  (qtp1637874263-37124) [n:127.0.0.1:63877_solr c:timeConfig s:shard1 r:core_node2 x:timeConfig_shard1_replica_n1] o.a.s.h.SolrConfigHandler Waiting up to 30 secs for 1 replicas to set the property params to be of version 1 for collection timeConfig
   [junit4]   2> 3892266 INFO  (Thread-7350) [n:127.0.0.1:63877_solr    ] o.a.s.c.SolrCore config update listener called for core timeConfig_shard1_replica_n1
   [junit4]   2> 3892266 INFO  (solrHandlerExecutor-16198-thread-1-processing-n:127.0.0.1:63877_solr x:timeConfig_shard1_replica_n1 s:shard1 c:timeConfig r:core_node2) [n:127.0.0.1:63877_solr c:timeConfig s:shard1 r:core_node2 x:timeConfig_shard1_replica_n1] o.a.s.h.SolrConfigHandler Time elapsed : 0 secs, maxWait 30
   [junit4]   2> 3892267 INFO  (Thread-7350) [n:127.0.0.1:63877_solr    ] o.a.s.c.RequestParams conf resource params.json loaded . version : 1 
   [junit4]   2> 3892267 INFO  (Thread-7350) [n:127.0.0.1:63877_solr    ] o.a.s.c.RequestParams request params refreshed to version 1
   [junit4]   2> 3892374 INFO  (qtp1637874263-37123) [n:127.0.0.1:63877_solr c:timeConfig s:shard1 r:core_node2 x:timeConfig_shard1_replica_n1] o.a.s.h.SolrConfigHandler I already have the expected version 1 of params
   [junit4]   2> 3892375 INFO  (qtp1637874263-37123) [n:127.0.0.1:63877_solr c:timeConfig s:shard1 r:core_node2 x:timeConfig_shard1_replica_n1] o.a.s.h.SolrConfigHandler isStale false , resourceloader org.apache.solr.cloud.ZkSolrResourceLoader
   [junit4]   2> 3892375 INFO  (qtp1637874263-37123) [n:127.0.0.1:63877_solr c:timeConfig s:shard1 r:core_node2 x:timeConfig_shard1_replica_n1] o.a.s.c.S.Request [timeConfig_shard1_replica_n1]  webapp=/solr path=/config/znodeVersion params={params=1&wt=javabin&version=2} status=0 QTime=0
   [junit4]   2> 3892375 INFO  (qtp1637874263-37124) [n:127.0.0.1:63877_solr c:timeConfig s:shard1 r:core_node2 x:timeConfig_shard1_replica_n1] o.a.s.h.SolrConfigHandler Took 110.0ms to set the property params to be of version 1 for collection timeConfig
   [junit4]   2> 3892375 INFO  (qtp1637874263-37124) [n:127.0.0.1:63877_solr c:timeConfig s:shard1 r:core_node2 x:timeConfig_shard1_replica_n1] o.a.s.c.S.Request [timeConfig_shard1_replica_n1]  webapp=/solr path=/config/params params={wt=javabin&version=2} status=0 QTime=112
   [junit4]   2> 3892376 INFO  (qtp1020007657-37122) [n:127.0.0.1:63876_solr    ] o.a.s.h.a.CollectionsHandler Invoked Collection Action :clusterstatus with params action=CLUSTERSTATUS&wt=javabin&version=2 and sendToOCPQueue=true
   [junit4]   2> 3892379 INFO  (qtp1020007657-37122) [n:127.0.0.1:63876_solr    ] o.a.s.s.HttpSolrCall [admin] webapp=null path=/admin/collections params={action=CLUSTERSTATUS&wt=javabin&version=2} status=0 QTime=2
   [junit4]   2> 3892379 INFO  (qtp1020007657-37119) [n:127.0.0.1:63876_solr    ] o.a.s.h.a.CollectionsHandler Invoked Collection Action :clusterstatus with params action=CLUSTERSTATUS&wt=javabin&version=2 and sendToOCPQueue=true
   [junit4]   2> 3892381 INFO  (qtp1020007657-37119) [n:127.0.0.1:63876_solr    ] o.a.s.s.HttpSolrCall [admin] webapp=null path=/admin/collections params={action=CLUSTERSTATUS&wt=javabin&version=2} status=0 QTime=2
   [junit4]   2> 3892382 INFO  (qtp1020007657-37109) [n:127.0.0.1:63876_solr    ] o.a.s.h.a.CollectionsHandler Invoked Collection Action :delete with params name=timeConfig&action=DELETE&wt=javabin&version=2 and sendToOCPQueue=true
   [junit4]   2> 3892385 INFO  (OverseerCollectionConfigSetProcessor-99324002452701189-127.0.0.1:63876_solr-n_0000000000) [n:127.0.0.1:63876_solr    ] o.a.s.c.OverseerTaskQueue Response ZK path: /overseer/collection-queue-work/qnr-0000000000 doesn't exist.  Requestor may have disconnected from ZooKeeper
   [junit4]   2> 3892385 INFO  (OverseerThreadFactory-16183-thread-2-processing-n:127.0.0.1:63876_solr) [n:127.0.0.1:63876_solr    ] o.a.s.c.OverseerCollectionMessageHandler Executing Collection Cmd : action=UNLOAD&deleteInstanceDir=true&deleteDataDir=true
   [junit4]   2> 3892387 INFO  (qtp1637874263-37120) [n:127.0.0.1:63877_solr    ] o.a.s.m.SolrMetricManager Closing metric reporters for registry=solr.core.timeConfig.shard1.replica_n1, tag=null
   [junit4]   2> 3892387 INFO  (qtp1637874263-37120) [n:127.0.0.1:63877_solr    ] o.a.s.m.r.SolrJmxReporter Closing reporter [org.apache.solr.metrics.reporters.SolrJmxReporter@731a14b8: rootName = solr_63877, domain = solr.core.timeConfig.shard1.replica_n1, service url = null, agent id = null] for registry solr.core.timeConfig.shard1.replica_n1 / com.codahale.metrics.MetricRegistry@642ad392
   [junit4]   2> 3892398 INFO  (qtp1637874263-37120) [n:127.0.0.1:63877_solr    ] o.a.s.c.SolrCore [timeConfig_shard1_replica_n1]  CLOSING SolrCore org.apache.solr.core.SolrCore@798242e4
   [junit4]   2> 3892398 INFO  (qtp1637874263-37120) [n:127.0.0.1:63877_solr    ] o.a.s.m.SolrMetricManager Closing metric reporters for registry=solr.core.timeConfig.shard1.replica_n1, tag=2038579940
   [junit4]   2> 3892398 INFO  (qtp1637874263-37120) [n:127.0.0.1:63877_solr    ] o.a.s.m.SolrMetricManager Closing metric reporters for registry=solr.collection.timeConfig.shard1.leader, tag=2038579940
   [junit4]   2> 3892405 INFO  (qtp1637874263-37120) [n:127.0.0.1:63877_solr    ] o.a.s.s.HttpSolrCall [admin] webapp=null path=/admin/cores params={deleteInstanceDir=true&core=timeConfig_shard1_replica_n1&qt=/admin/cores&deleteDataDir=true&action=UNLOAD&wt=javabin&version=2} status=0 QTime=19
   [junit4]   2> 3893135 INFO  (qtp1020007657-37109) [n:127.0.0.1:63876_solr    ] o.a.s.s.HttpSolrCall [admin] webapp=null path=/admin/collections params={name=timeConfig&action=DELETE&wt=javabin&version=2} status=0 QTime=752
   [junit4]   2> 3893135 INFO  (qtp1020007657-37112) [n:127.0.0.1:63876_solr    ] o.a.s.h.a.CollectionsHandler Invoked Collection Action :clusterstatus with params action=CLUSTERSTATUS&wt=javabin&version=2 and sendToOCPQueue=true
   [junit4]   2> 3893136 INFO  (qtp1020007657-37112) [n:127.0.0.1:63876_solr    ] o.a.s.s.HttpSolrCall [admin] webapp=null path=/admin/collections params={action=CLUSTERSTATUS&wt=javabin&version=2} status=0 QTime=0
   [junit4]   2> 3893137 INFO  (qtp1020007657-37113) [n:127.0.0.1:63876_solr    ] o.a.s.h.a.CollectionsHandler Invoked Collection Action :clusterstatus with params action=CLUSTERSTATUS&wt=javabin&version=2 and sendToOCPQueue=true
   [junit4]   2> 3893138 INFO  (qtp1020007657-37113) [n:127.0.0.1:63876_solr    ] o.a.s.s.HttpSolrCall [admin] webapp=null path=/admin/collections params={action=CLUSTERSTATUS&wt=javabin&version=2} status=0 QTime=0
   [junit4]   2> 3893138 INFO  (qtp1020007657-37114) [n:127.0.0.1:63876_solr    ] o.a.s.h.a.CollectionsHandler Invoked Collection Action :create with params replicationFactor=2&property.timePartitionAliasName=myalias&collection.configName=timeConfig&maxShardsPerNode=2&name=myalias_2017-10-23&nrtReplicas=2&action=CREATE&numShards=2&wt=javabin&version=2 and sendToOCPQueue=true
   [junit4]   2> 3893141 INFO  (OverseerThreadFactory-16183-thread-3-processing-n:127.0.0.1:63876_solr) [n:127.0.0.1:63876_solr    ] o.a.s.c.CreateCollectionCmd Create collection myalias_2017-10-23
   [junit4]   2> 3893142 INFO  (OverseerCollectionConfigSetProcessor-99324002452701189-127.0.0.1:63876_solr-n_0000000000) [n:127.0.0.1:63876_solr    ] o.a.s.c.OverseerTaskQueue Response ZK path: /overseer/collection-queue-work/qnr-0000000002 doesn't exist.  Requestor may have disconnected from ZooKeeper
   [junit4]   2> 3893361 INFO  (OverseerStateUpdate-99324002452701189-127.0.0.1:63876_solr-n_0000000000) [n:127.0.0.1:63876_solr    ] o.a.s.c.o.SliceMutator createReplica() {
   [junit4]   2>   "operation":"ADDREPLICA",
   [junit4]   2>   "collection":"myalias_2017-10-23",
   [junit4]   2>   "shard":"shard1",
   [junit4]   2>   "core":"myalias_2017-10-23_shard1_replica_n1",
   [junit4]   2>   "state":"down",
   [junit4]   2>   "base_url":"https://127.0.0.1:63877/solr",
   [junit4]   2>   "type":"NRT",
   [junit4]   2>   "waitForFinalState":"false"} 
   [junit4]   2> 3893386 INFO  (OverseerStateUpdate-99324002452701189-127.0.0.1:63876_solr-n_0000000000) [n:127.0.0.1:63876_solr    ] o.a.s.c.o.SliceMutator createReplica() {
   [junit4]   2>   "operation":"ADDREPLICA",
   [junit4]   2>   "collection":"myalias_2017-10-23",
   [junit4]   2>   "shard":"shard1",
   [junit4]   2>   "core":"myalias_2017-10-23_shard1_replica_n2",
   [junit4]   2>   "state":"down",
   [junit4]   2>   "base_url":"https://127.0.0.1:63876/solr",
   [junit4]   2>   "type":"NRT",
   [junit4]   2>   "waitForFinalState":"false"} 
   [junit4]   2> 3893389 INFO  (OverseerStateUpdate-99324002452701189-127.0.0.1:63876_solr-n_0000000000) [n:127.0.0.1:63876_solr    ] o.a.s.c.o.SliceMutator createReplica() {
   [junit4]   2>   "operation":"ADDREPLICA",
   [junit4]   2>   "collection":"myalias_2017-10-23",
   [junit4]   2>   "shard":"shard2",
   [junit4]   2>   "core":"myalias_2017-10-23_shard2_replica_n4",
   [junit4]   2>   "state":"down",
   [junit4]   2>   "base_url":"https://127.0.0.1:63877/solr",
   [junit4]   2>   "type":"NRT",
   [junit4]   2>   "waitForFinalState":"false"} 
   [junit4]   2> 3893396 INFO  (OverseerStateUpdate-99324002452701189-127.0.0.1:63876_solr-n_0000000000) [n:127.0.0.1:63876_solr    ] o.a.s.c.o.SliceMutator createReplica() {
   [junit4]   2>   "operation":"ADDREPLICA",
   [junit4]   2>   "collection":"myalias_2017-10-23",
   [junit4]   2>   "shard":"shard2",
   [junit4]   2>   "core":"myalias_2017-10-23_shard2_replica_n6",
   [junit4]   2>   "state":"down",
   [junit4]   2>   "base_url":"https://127.0.0.1:63876/solr",
   [junit4]   2>   "type":"NRT",
   [junit4]   2>   "waitForFinalState":"false"} 
   [junit4]   2> 3893615 INFO  (qtp1637874263-37118) [n:127.0.0.1:63877_solr    ] o.a.s.h.a.CoreAdminOperation core create command qt=/admin/cores&collection.configName=timeConfig&newCollection=true&collection=myalias_2017-10-23&version=2&replicaType=NRT&coreNodeName=core_node3&property.timePartitionAliasName=myalias&name=myalias_2017-10-23_shard1_replica_n1&action=CREATE&numShards=2&shard=shard1&wt=javabin
   [junit4]   2> 3893619 INFO  (qtp1020007657-37119) [n:127.0.0.1:63876_solr    ] o.a.s.h.a.CoreAdminOperation core create command qt=/admin/cores&collection.configName=timeConfig&newCollection=true&collection=myalias_2017-10-23&version=2&replicaType=NRT&coreNodeName=core_node5&property.timePartitionAliasName=myalias&name=myalias_2017-10-23_shard1_replica_n2&action=CREATE&numShards=2&shard=shard1&wt=javabin
   [junit4]   2> 3893619 INFO  (qtp1637874263-37111) [n:127.0.0.1:63877_solr    ] o.a.s.h.a.CoreAdminOperation core create command qt=/admin/cores&collection.configName=timeConfig&newCollection=true&collection=myalias_2017-10-23&version=2&replicaType=NRT&coreNodeName=core_node7&property.timePartitionAliasName=myalias&name=myalias_2017-10-23_shard2_replica_n4&action=CREATE&numShards=2&shard=shard2&wt=javabin
   [junit4]   2> 3893619 INFO  (qtp1020007657-37119) [n:127.0.0.1:63876_solr    ] o.a.s.c.TransientSolrCoreCacheDefault Allocating transient cache for 2147483647 transient cores
   [junit4]   2> 3893620 INFO  (qtp1020007657-37122) [n:127.0.0.1:63876_solr    ] o.a.s.h.a.CoreAdminOperation core create command qt=/admin/cores&collection.configName=timeConfig&newCollection=true&collection=myalias_2017-10-23&version=2&replicaType=NRT&coreNodeName=core_node8&property.timePartitionAliasName=myalias&name=myalias_2017-10-23_shard2_replica_n6&action=CREATE&numShards=2&shard=shard2&wt=javabin
   [junit4]   2> 3893735 INFO  (zkCallback-8501-thread-2-processing-n:127.0.0.1:63876_solr) [n:127.0.0.1:63876_solr    ] o.a.s.c.c.ZkStateReader A cluster state change: [WatchedEvent state:SyncConnected type:NodeDataChanged path:/collections/myalias_2017-10-23/state.json] for collection [myalias_2017-10-23] has occurred - updating... (live nodes size: [2])
   [junit4]   2> 3893736 INFO  (zkCallback-8502-thread-1-processing-n:127.0.0.1:63877_solr) [n:127.0.0.1:63877_solr    ] o.a.s.c.c.ZkStateReader A cluster state change: [WatchedEvent state:SyncConnected type:NodeDataChanged path:/collections/myalias_2017-10-23/state.json] for collection [myalias_2017-10-23] has occurred - updating... (live nodes size: [2])
   [junit4]   2> 3893736 INFO  (zkCallback-8501-thread-3-processing-n:127.0.0.1:63876_solr) [n:127.0.0.1:63876_solr    ] o.a.s.c.c.ZkStateReader A cluster state change: [WatchedEvent state:SyncConnected type:NodeDataChanged path:/collections/myalias_2017-10-23/state.json] for collection [myalias_2017-10-23] has occurred - updating... (live nodes size: [2])
   [junit4]   2> 3893735 INFO  (zkCallback-8502-thread-2-processing-n:127.0.0.1:63877_solr) [n:127.0.0.1:63877_solr    ] o.a.s.c.c.ZkStateReader A cluster state change: [WatchedEvent state:SyncConnected type:NodeDataChanged path:/collections/myalias_2017-10-23/state.json] for collection [myalias_2017-10-23] has occurred - updating... (live nodes size: [2])
   [junit4]   2> 3893736 INFO  (zkCallback-8502-thread-3-processing-n:127.0.0.1:63877_solr) [n:127.0.0.1:63877_solr    ] o.a.s.c.c.ZkStateReader A cluster state change: [WatchedEvent state:SyncConnected type:NodeDataChanged path:/collections/myalias_2017-10-23/state.json] for collection [myalias_2017-10-23] has occurred - updating... (live nodes size: [2])
   [junit4]   2> 3893735 INFO  (zkCallback-8501-thread-1-processing-n:127.0.0.1:63876_solr) [n:127.0.0.1:63876_solr    ] o.a.s.c.c.ZkStateReader A cluster state change: [WatchedEvent state:SyncConnected type:NodeDataChanged path:/collections/myalias_2017-10-23/state.json] for collection [myalias_2017-10-23] has occurred - updating... (live nodes size: [2])
   [junit4]   2> 3894640 INFO  (qtp1637874263-37111) [n:127.0.0.1:63877_solr c:myalias_2017-10-23 s:shard2 r:core_node7 x:myalias_2017-10-23_shard2_replica_n4] o.a.s.c.RequestParams conf resource params.json loaded . version : 1 
   [junit4]   2> 3894640 INFO  (qtp1637874263-37111) [n:127.0.0.1:63877_solr c:myalias_2017-10-23 s:shard2 r:core_node7 x:myalias_2017-10-23_shard2_replica_n4] o.a.s.c.RequestParams request params refreshed to version 1
   [junit4]   2> 3894640 INFO  (qtp1020007657-37119) [n:127.0.0.1:63876_solr c:myalias_2017-10-23 s:shard1 r:core_node5 x:myalias_2017-10-23_shard1_replica_n2] o.a.s.c.RequestParams conf resource params.json loaded . version : 1 
   [junit4]   2> 3894641 INFO  (qtp1020007657-37119) [n:127.0.0.1:63876_solr c:myalias_2017-10-23 s:shard1 r:core_node5 x:myalias_2017-10-23_shard1_replica_n2] o.a.s.c.RequestParams request params refreshed to version 1
   [junit4]   2> 3894641 WARN  (qtp1637874263-37111) [n:127.0.0.1:63877_solr c:myalias_2017-10-23 s:shard2 r:core_node7 x:myalias_2017-10-23_shard2_replica_n4] o.a.s.c.SolrConfig Couldn't add files from /Users/jenkins/workspace/Lucene-Solr-7.x-MacOSX/solr/build/solr-core/test/J0/temp/solr.update.processor.TimeRoutedAliasUpdateProcessorTest_D28104AB87FC3CBE-001/tempDir-001/node1/myalias_2017-10-23_shard2_replica_n4/../../../../contrib/extraction/lib filtered by .*\.jar to classpath: /Users/jenkins/workspace/Lucene-Solr-7.x-MacOSX/solr/build/solr-core/test/J0/temp/solr.update.processor.TimeRoutedAliasUpdateProcessorTest_D28104AB87FC3CBE-001/tempDir-001/node1/myalias_2017-10-23_shard2_replica_n4/../../../../contrib/extraction/lib
   [junit4]   2> 3894641 WARN  (qtp1637874263-37111) [n:127.0.0.1:63877_solr c:myalias_2017-10-23 s:shard2 r:core_node7 x:myalias_2017-10-23_shard2_replica_n4] o.a.s.c.SolrConfig Couldn't add files from /Users/jenkins/workspace/Lucene-Solr-7.x-MacOSX/solr/build/solr-core/test/J0/temp/solr.update.processor.TimeRoutedAliasUpdateProcessorTest_D28104AB87FC3CBE-001/tempDir-001/node1/myalias_2017-10-23_shard2_replica_n4/../../../../dist filtered by solr-cell-\d.*\.jar to classpath: /Users/jenkins/workspace/Lucene-Solr-7.x-MacOSX/solr/build/solr-core/test/J0/temp/solr.update.processor.TimeRoutedAliasUpdateProcessorTest_D28104AB87FC3CBE-001/tempDir-001/node1/myalias_2017-10-23_shard2_replica_n4/../../../../dist
   [junit4]   2> 3894641 WARN  (qtp1020007657-37119) [n:127.0.0.1:63876_solr c:myalias_2017-10-23 s:shard1 r:core_node5 x:myalias_2017-10-23_shard1_replica_n2] o.a.s.c.SolrConfig Couldn't add files from /Users/jenkins/workspace/Lucene-Solr-7.x-MacOSX/solr/build/solr-core/test/J0/temp/solr.update.processor.TimeRoutedAliasUpdateProcessorTest_D28104AB87FC3CBE-001/tempDir-001/node2/myalias_2017-10-23_shard1_replica_n2/../../../../contrib/extraction/lib filtered by .*\.jar to classpath: /Users/jenkins/workspace/Lucene-Solr-7.x-MacOSX/solr/build/solr-core/test/J0/temp/solr.update.processor.TimeRoutedAliasUpdateProcessorTest_D28104AB87FC3CBE-001/tempDir-001/node2/myalias_2017-10-23_shard1_replica_n2/../../../../contrib/extraction/lib
   [junit4]   2> 3894641 WARN  (qtp1637874263-3

[...truncated too long message...]

rmance, ConfigSetsAPITest, SharedFSAutoReplicaFailoverTest, TestConfigSets, TestSystemCollAutoCreate, TestPointFields, CollectionReloadTest, TestTriggerIntegration, TestEmbeddedSolrServerAdminHandler, TestSolrXml, TestCloudPseudoReturnFields, TestDefaultStatsCache, AddSchemaFieldsUpdateProcessorFactoryTest, CSVRequestHandlerTest, IgnoreCommitOptimizeUpdateProcessorFactoryTest, ZkStateReaderTest, RulesTest, DirectSolrConnectionTest, TestSimpleTextCodec, SuggesterTest, TestChildDocTransformer, TestDFRSimilarityFactory, TestSolrConfigHandlerCloud, TestConfigSetImmutable, OverriddenZkACLAndCredentialsProvidersTest, TestExceedMaxTermLength, BadIndexSchemaTest, AlternateDirectoryTest, CollectionsAPISolrJTest, TestSolrCoreSnapshots, PathHierarchyTokenizerFactoryTest, ConjunctionSolrSpellCheckerTest, TestImplicitCoreProperties, ZkControllerTest, OverseerStatusTest, CursorPagingTest, TestRawResponseWriter, TestNumericRangeQuery64, DirectUpdateHandlerOptimizeTest, CleanupOldIndexTest, RAMDirectoryFactoryTest, TestCopyFieldCollectionResource, AutoAddReplicasIntegrationTest, RollingRestartTest, TestRangeQuery, TestLocalFSCloudBackupRestore, HdfsCollectionsAPIDistributedZkTest, TestSweetSpotSimilarityFactory, AnalysisErrorHandlingTest, MultiTermTest, TestConfigSetsAPI, TestInPlaceUpdatesDistrib, PrimitiveFieldTypeTest, BasicAuthStandaloneTest, TestSurroundQueryParser, URLClassifyProcessorTest, TestSizeLimitedDistributedMap, CollectionTooManyReplicasTest, ClassificationUpdateProcessorIntegrationTest, TestFieldCacheReopen, BlockJoinFacetDistribTest, XsltUpdateRequestHandlerTest, DeleteNodeTest, TestBinaryField, DistanceFunctionTest, NodeAddedTriggerTest, TestXIncludeConfig, SignatureUpdateProcessorFactoryTest, DeleteInactiveReplicaTest, TestFilteredDocIdSet, TestIBSimilarityFactory, DisMaxRequestHandlerTest, TestSolrCoreProperties, UUIDFieldTest, DateMathParserTest, DistributedFacetExistsSmallTest, TestPrepRecovery, SimpleMLTQParserTest, TestPHPSerializedResponseWriter, TestPolicyCloud, UnloadDistributedZkTest, TestSlowCompositeReaderWrapper, WordBreakSolrSpellCheckerTest, HdfsChaosMonkeyNothingIsSafeTest, TestSolrCLIRunExample, RankQueryTest, InfixSuggestersTest, HdfsDirectoryFactoryTest, LeaderInitiatedRecoveryOnShardRestartTest, CoreMergeIndexesAdminHandlerTest, TestJmxIntegration, TestPhraseSuggestions, BitVectorTest, TestQuerySenderNoQuery, TestConfigReload, TestLFUCache, WrapperMergePolicyFactoryTest, TestDelegationWithHadoopAuth, DistributedFacetPivotSmallTest, TestLegacyField, ResourceLoaderTest, TestStressInPlaceUpdates, TestReversedWildcardFilterFactory, SpellCheckCollatorTest, ClusterStateUpdateTest, TestFieldCacheSortRandom, HighlighterConfigTest, ChaosMonkeyNothingIsSafeTest, BigEndianAscendingWordDeserializerTest, DirectoryFactoryTest, TestFieldResource, CdcrRequestHandlerTest, MetricsHandlerTest, ResponseLogComponentTest, ImplicitSnitchTest, RequestHandlersTest, TestRecoveryHdfs, TestGenericDistributedQueue, DistributedVersionInfoTest, PeerSyncReplicationTest, MinimalSchemaTest, RegexBoostProcessorTest, TestReplicationHandler, TestUseDocValuesAsStored2, BasicDistributedZkTest, ReplicationFactorTest, TestCloudDeleteByQuery, HdfsRecoverLeaseTest, TestSolrCloudWithSecureImpersonation, TestHdfsCloudBackupRestore, SolrIndexMetricsTest, DateFieldTest, CoreAdminCreateDiscoverTest, TestRealTimeGet, TestCloudJSONFacetJoinDomain, TestUninvertingReader, PreAnalyzedUpdateProcessorTest, TestGeoJSONResponseWriter, BlockJoinFacetSimpleTest, SpellCheckComponentTest, SolrJmxReporterTest, BinaryUpdateRequestHandlerTest, HttpTriggerListenerTest, TestScoreJoinQPNoScore, HighlighterMaxOffsetTest, TestSchemaVersionResource, TestUniqueKeyFieldResource, FieldAnalysisRequestHandlerTest, TestRuleBasedAuthorizationPlugin, TestSortByMinMaxFunction, UUIDUpdateProcessorFallbackTest, SolrXmlInZkTest, HdfsThreadLeakTest, DistributedQueryElevationComponentTest, TestHighFrequencyDictionaryFactory, TestMinMaxOnMultiValuedField, TestCustomDocTransformer, RequiredFieldsTest, TestPerFieldSimilarityWithDefaultOverride, TestInitParams, AtomicUpdatesTest, TestJsonFacetRefinement, TestCollectionAPIs, TestBulkSchemaConcurrent, HttpSolrCallGetCoreTest, TestCursorMarkWithoutUniqueKey, TestHttpShardHandlerFactory, SyncSliceTest, OpenCloseCoreStressTest, OverseerTest, LeaderElectionIntegrationTest, ShardRoutingTest, RecoveryZkTest, FullSolrCloudDistribCmdsTest, TestRandomFaceting, LeaderElectionTest, ZkSolrClientTest, TestZkChroot, TestRandomDVFaceting, ZkCLITest, ShardRoutingCustomTest, TestDistributedSearch, TestDistributedGrouping, TestFaceting, TestRecovery, TestHashPartitioner, DistributedSpellCheckComponentTest, TermVectorComponentDistributedTest, TestJoin, TestReload, DistributedTermsComponentTest, TestCoreContainer, SimpleFacetsTest, TestSolr4Spatial, StatsComponentTest, TestGroupingSearch, SolrCmdDistributorTest, PeerSyncTest, ConvertedLegacyTest, TestFiltering, TestFunctionQuery, TestLazyCores, DirectUpdateHandlerTest, TestBadConfig, HighlighterTest, ShowFileRequestHandlerTest, TestCoreDiscovery, AnalysisAfterCoreReloadTest, TestExtendedDismaxParser, CoreAdminHandlerTest, SolrRequestParserTest, TestFoldingMultitermQuery, DocValuesTest, SuggesterTSTTest, TestStressLucene, SpatialFilterTest, SuggesterWFSTTest, TestCSVLoader, PolyFieldTest, NoCacheHeaderTest, TestPseudoReturnFields, TestUpdate, TestAtomicUpdateErrorCases, QueryEqualityTest, DefaultValueUpdateProcessorTest, StatelessScriptUpdateProcessorFactoryTest, SortByFunctionTest, TestRemoteStreaming, TestSolrDeletionPolicy1, SolrInfoBeanTest, DebugComponentTest, IndexBasedSpellCheckerTest, TestWriterPerf, TestQueryTypes, FileBasedSpellCheckerTest, TermsComponentTest, XmlUpdateRequestHandlerTest, TestSolrQueryParser, FastVectorHighlighterTest, IndexSchemaRuntimeFieldTest, SolrPluginUtilsTest, IndexSchemaTest, TestCollationField, ReturnFieldsTest, QueryParsingTest, TestAnalyzedSuggestions, UniqFieldsUpdateProcessorFactoryTest, TestPartialUpdateDeduplication, TestComponentsName, TestQuerySenderListener, UpdateParamsTest, CopyFieldTest, SolrIndexConfigTest, BadComponentTest, TestStressRecovery, TestSolrDeletionPolicy2, SampleTest, TestSearchPerf, NumericFieldsTest, TestConfig, OutputWriterTest, TestFuzzyAnalyzedSuggestions, ExternalFileFieldSortTest, TestPostingsSolrHighlighter, NotRequiredUniqueKeyTest, SpellPossibilityIteratorTest, TestCharFilters, TestCodecSupport, TestPerFieldSimilarity, TestLMDirichletSimilarityFactory, TestLMJelinekMercerSimilarityFactory, TestFastWriter, TimeZoneUtilsTest, TestFastOutputStream, ScriptEngineTest, OpenExchangeRatesOrgProviderTest, PreAnalyzedFieldTest, TestSystemIdResolver, PrimUtilsTest, TestSuggestSpellingConverter, SpellingQueryConverterTest, ClusterStateTest, TestSolrJ, TestUtils, TestDocumentBuilder, SliceStateTest, FileUtilsTest, CircularListTest, DistributedMLTComponentTest, TestRTGBase, SolrTestCaseJ4Test, TestCrossCoreJoin, TestHighlightDedupGrouping, TestSimpleTrackingShardHandler, TestTolerantSearch, TestEmbeddedSolrServerConstructors, TestEmbeddedSolrServerSchemaAPI, TestJettySolrRunner, ConnectionReuseTest, AliasIntegrationTest, AssignBackwardCompatibilityTest, AssignTest, AsyncCallRequestStatusResponseTest, ChaosMonkeyNothingIsSafeWithPullReplicasTest, ChaosMonkeySafeLeaderWithPullReplicasTest, ConnectionManagerTest, CreateCollectionCleanupTest, DeleteReplicaTest, DeleteShardTest, DeleteStatusTest, DistribCursorPagingTest, DistribDocExpirationUpdateProcessorTest, DistribJoinFromCollectionTest, DocValuesNotIndexedTest, ForceLeaderTest, LeaderElectionContextKeyTest, LeaderFailureAfterFreshStartTest, LeaderInitiatedRecoveryOnCommitTest, MigrateRouteKeyTest, NodeMutatorTest, OutOfBoxZkACLAndCredentialsProvidersTest, OverseerModifyCollectionTest, OverseerRolesTest, RecoveryAfterSoftCommitTest, SaslZkACLProviderTest, ShardSplitTest, TestPullReplicaErrorHandling, TestRebalanceLeaders, TestRequestStatusCollectionAPI, TestShortCircuitedRequests, TestSolrCloudWithDelegationTokens, TestStressCloudBlindAtomicUpdates, TestTolerantUpdateProcessorRandomCloud, TestUtilizeNode, TlogReplayBufferedWhileIndexingTest, TriLevelCompositeIdRoutingTest, AutoScalingHandlerTest, ExecutePlanActionTest, MetricTriggerTest, TriggerIntegrationTest, TestNRTOpen, TestReloadAndDeleteDocs, TestShardHandlerFactory, TestSolrCloudSnapshots, TestSQLHandlerNonCloud, TestSolrConfigHandlerConcurrent, V2StandaloneTest, CoreAdminRequestStatusTest, PropertiesRequestHandlerTest, SecurityConfHandlerTest, SegmentsInfoRequestHandlerTest, TestConfigsApi, TestCoreAdminApis, DistributedDebugComponentTest, DistributedFacetPivotLargeTest, DistributedFacetPivotWhiteBoxTest, DistributedQueryComponentOptimizationTest, ReplicaListTransformerTest, ShufflingReplicaListTransformerTest, SpatialHeatmapFacetsTest, TestExpandComponent, TestTrackingShardHandlerFactory, CheckHdfsIndexTest, TestLegacyNumericUtils, TestMultiValuedNumericRangeQuery, TestNumericRangeQuery32, TestNumericTokenStream, MetricsConfigTest, SolrMetricManagerTest, SolrMetricReporterTest, SolrGangliaReporterTest, SolrSlf4jReporterTest, TestIntervalFaceting, TestStreamBody, TestMacroExpander, TestMacros, TestJavabinTupleStreamParser, TestPushWriter, TestRetrieveFieldsOptimizer, TestSubQueryTransformer, TestSubQueryTransformerCrossCore, TestManagedResource, TestManagedResourceStorage, TestBulkSchemaAPI, TestManagedSynonymFilterFactory, EnumFieldTest, SpatialRPTFieldTypeTest, TestCloudSchemaless, TestSolrCoreParser, TestTrieFacet, BJQParserTest, TestCloudNestedDocsSort, TestClassicSimilarityFactory, TestDFISimilarityFactory, TestExactSharedStatsCache, TestAuthorizationFramework, TestLegacyFieldCache, PeerSyncWithIndexFingerprintCachingTest, UpdateLogTest, ClassificationUpdateProcessorTest, CloneFieldUpdateProcessorFactoryTest, DocExpirationUpdateProcessorFactoryTest, TemplateUpdateProcessorTest, TimeRoutedAliasUpdateProcessorTest]
   [junit4] Completed [766/766 (1!)] on J0 in 20.97s, 2 tests, 1 error <<< FAILURES!

[...truncated 40835 lines...]

Mime
View raw message