lucene-dev mailing list archives

Site index · List index
Message view « Date » · « Thread »
Top « Date » · « Thread »
From Policeman Jenkins Server <jenk...@thetaphi.de>
Subject [JENKINS] Lucene-Solr-7.x-Linux (32bit/jdk1.8.0_144) - Build # 1098 - Unstable!
Date Mon, 01 Jan 2018 23:59:22 GMT
Build: https://jenkins.thetaphi.de/job/Lucene-Solr-7.x-Linux/1098/
Java: 32bit/jdk1.8.0_144 -client -XX:+UseParallelGC

5 tests failed.
FAILED:  junit.framework.TestSuite.org.apache.solr.cloud.autoscaling.sim.TestGenericDistributedQueue

Error Message:
Suite timeout exceeded (>= 7200000 msec).

Stack Trace:
java.lang.Exception: Suite timeout exceeded (>= 7200000 msec).
	at __randomizedtesting.SeedInfo.seed([F70B69DD77D3190E]:0)


FAILED:  org.apache.solr.cloud.ForceLeaderTest.testLastPublishedStateIsActive

Error Message:
Could not set replica [core_node4] as down. Last known state of the replica: active

Stack Trace:
org.apache.solr.common.SolrException: Could not set replica [core_node4] as down. Last known state of the replica: active
	at __randomizedtesting.SeedInfo.seed([F70B69DD77D3190E:1F69574CD0DE1B52]:0)
	at org.apache.solr.cloud.ForceLeaderTest.setReplicaState(ForceLeaderTest.java:262)
	at org.apache.solr.cloud.ForceLeaderTest.testLastPublishedStateIsActive(ForceLeaderTest.java:187)
	at sun.reflect.NativeMethodAccessorImpl.invoke0(Native Method)
	at sun.reflect.NativeMethodAccessorImpl.invoke(NativeMethodAccessorImpl.java:62)
	at sun.reflect.DelegatingMethodAccessorImpl.invoke(DelegatingMethodAccessorImpl.java:43)
	at java.lang.reflect.Method.invoke(Method.java:498)
	at com.carrotsearch.randomizedtesting.RandomizedRunner.invoke(RandomizedRunner.java:1737)
	at com.carrotsearch.randomizedtesting.RandomizedRunner$8.evaluate(RandomizedRunner.java:934)
	at com.carrotsearch.randomizedtesting.RandomizedRunner$9.evaluate(RandomizedRunner.java:970)
	at com.carrotsearch.randomizedtesting.RandomizedRunner$10.evaluate(RandomizedRunner.java:984)
	at org.apache.solr.BaseDistributedSearchTestCase$ShardsRepeatRule$ShardsFixedStatement.callStatement(BaseDistributedSearchTestCase.java:993)
	at org.apache.solr.BaseDistributedSearchTestCase$ShardsRepeatRule$ShardsStatement.evaluate(BaseDistributedSearchTestCase.java:968)
	at com.carrotsearch.randomizedtesting.rules.SystemPropertiesRestoreRule$1.evaluate(SystemPropertiesRestoreRule.java:57)
	at org.apache.lucene.util.TestRuleSetupTeardownChained$1.evaluate(TestRuleSetupTeardownChained.java:49)
	at org.apache.lucene.util.AbstractBeforeAfterRule$1.evaluate(AbstractBeforeAfterRule.java:45)
	at org.apache.lucene.util.TestRuleThreadAndTestName$1.evaluate(TestRuleThreadAndTestName.java:48)
	at org.apache.lucene.util.TestRuleIgnoreAfterMaxFailures$1.evaluate(TestRuleIgnoreAfterMaxFailures.java:64)
	at org.apache.lucene.util.TestRuleMarkFailure$1.evaluate(TestRuleMarkFailure.java:47)
	at com.carrotsearch.randomizedtesting.rules.StatementAdapter.evaluate(StatementAdapter.java:36)
	at com.carrotsearch.randomizedtesting.ThreadLeakControl$StatementRunner.run(ThreadLeakControl.java:368)
	at com.carrotsearch.randomizedtesting.ThreadLeakControl.forkTimeoutingTask(ThreadLeakControl.java:817)
	at com.carrotsearch.randomizedtesting.ThreadLeakControl$3.evaluate(ThreadLeakControl.java:468)
	at com.carrotsearch.randomizedtesting.RandomizedRunner.runSingleTest(RandomizedRunner.java:943)
	at com.carrotsearch.randomizedtesting.RandomizedRunner$5.evaluate(RandomizedRunner.java:829)
	at com.carrotsearch.randomizedtesting.RandomizedRunner$6.evaluate(RandomizedRunner.java:879)
	at com.carrotsearch.randomizedtesting.RandomizedRunner$7.evaluate(RandomizedRunner.java:890)
	at com.carrotsearch.randomizedtesting.rules.StatementAdapter.evaluate(StatementAdapter.java:36)
	at com.carrotsearch.randomizedtesting.rules.SystemPropertiesRestoreRule$1.evaluate(SystemPropertiesRestoreRule.java:57)
	at org.apache.lucene.util.AbstractBeforeAfterRule$1.evaluate(AbstractBeforeAfterRule.java:45)
	at com.carrotsearch.randomizedtesting.rules.StatementAdapter.evaluate(StatementAdapter.java:36)
	at org.apache.lucene.util.TestRuleStoreClassName$1.evaluate(TestRuleStoreClassName.java:41)
	at com.carrotsearch.randomizedtesting.rules.NoShadowingOrOverridesOnMethodsRule$1.evaluate(NoShadowingOrOverridesOnMethodsRule.java:40)
	at com.carrotsearch.randomizedtesting.rules.NoShadowingOrOverridesOnMethodsRule$1.evaluate(NoShadowingOrOverridesOnMethodsRule.java:40)
	at com.carrotsearch.randomizedtesting.rules.StatementAdapter.evaluate(StatementAdapter.java:36)
	at com.carrotsearch.randomizedtesting.rules.StatementAdapter.evaluate(StatementAdapter.java:36)
	at com.carrotsearch.randomizedtesting.rules.StatementAdapter.evaluate(StatementAdapter.java:36)
	at org.apache.lucene.util.TestRuleAssertionsRequired$1.evaluate(TestRuleAssertionsRequired.java:53)
	at org.apache.lucene.util.TestRuleMarkFailure$1.evaluate(TestRuleMarkFailure.java:47)
	at org.apache.lucene.util.TestRuleIgnoreAfterMaxFailures$1.evaluate(TestRuleIgnoreAfterMaxFailures.java:64)
	at org.apache.lucene.util.TestRuleIgnoreTestSuites$1.evaluate(TestRuleIgnoreTestSuites.java:54)
	at com.carrotsearch.randomizedtesting.rules.StatementAdapter.evaluate(StatementAdapter.java:36)
	at com.carrotsearch.randomizedtesting.ThreadLeakControl$StatementRunner.run(ThreadLeakControl.java:368)
	at java.lang.Thread.run(Thread.java:748)


FAILED:  org.apache.solr.cloud.TestAuthenticationFramework.testBasics

Error Message:
Error from server at http://127.0.0.1:45569/solr/testcollection_shard1_replica_n3: Expected mime type application/octet-stream but got text/html. <html> <head> <meta http-equiv="Content-Type" content="text/html;charset=ISO-8859-1"/> <title>Error 404 </title> </head> <body> <h2>HTTP ERROR: 404</h2> <p>Problem accessing /solr/testcollection_shard1_replica_n3/update. Reason: <pre>    Can not find: /solr/testcollection_shard1_replica_n3/update</pre></p> <hr /><a href="http://eclipse.org/jetty">Powered by Jetty:// 9.3.20.v20170531</a><hr/> </body> </html> 

Stack Trace:
org.apache.solr.client.solrj.impl.CloudSolrClient$RouteException: Error from server at http://127.0.0.1:45569/solr/testcollection_shard1_replica_n3: Expected mime type application/octet-stream but got text/html. <html>
<head>
<meta http-equiv="Content-Type" content="text/html;charset=ISO-8859-1"/>
<title>Error 404 </title>
</head>
<body>
<h2>HTTP ERROR: 404</h2>
<p>Problem accessing /solr/testcollection_shard1_replica_n3/update. Reason:
<pre>    Can not find: /solr/testcollection_shard1_replica_n3/update</pre></p>
<hr /><a href="http://eclipse.org/jetty">Powered by Jetty:// 9.3.20.v20170531</a><hr/>
</body>
</html>

	at __randomizedtesting.SeedInfo.seed([F70B69DD77D3190E:CAD3C7F14F3D477E]:0)
	at org.apache.solr.client.solrj.impl.CloudSolrClient.directUpdate(CloudSolrClient.java:550)
	at org.apache.solr.client.solrj.impl.CloudSolrClient.sendRequest(CloudSolrClient.java:1013)
	at org.apache.solr.client.solrj.impl.CloudSolrClient.requestWithRetryOnStaleState(CloudSolrClient.java:884)
	at org.apache.solr.client.solrj.impl.CloudSolrClient.requestWithRetryOnStaleState(CloudSolrClient.java:946)
	at org.apache.solr.client.solrj.impl.CloudSolrClient.requestWithRetryOnStaleState(CloudSolrClient.java:946)
	at org.apache.solr.client.solrj.impl.CloudSolrClient.requestWithRetryOnStaleState(CloudSolrClient.java:946)
	at org.apache.solr.client.solrj.impl.CloudSolrClient.requestWithRetryOnStaleState(CloudSolrClient.java:946)
	at org.apache.solr.client.solrj.impl.CloudSolrClient.requestWithRetryOnStaleState(CloudSolrClient.java:946)
	at org.apache.solr.client.solrj.impl.CloudSolrClient.request(CloudSolrClient.java:817)
	at org.apache.solr.client.solrj.SolrRequest.process(SolrRequest.java:194)
	at org.apache.solr.client.solrj.request.UpdateRequest.commit(UpdateRequest.java:233)
	at org.apache.solr.cloud.TestAuthenticationFramework.collectionCreateSearchDeleteTwice(TestAuthenticationFramework.java:126)
	at org.apache.solr.cloud.TestAuthenticationFramework.testBasics(TestAuthenticationFramework.java:74)
	at sun.reflect.NativeMethodAccessorImpl.invoke0(Native Method)
	at sun.reflect.NativeMethodAccessorImpl.invoke(NativeMethodAccessorImpl.java:62)
	at sun.reflect.DelegatingMethodAccessorImpl.invoke(DelegatingMethodAccessorImpl.java:43)
	at java.lang.reflect.Method.invoke(Method.java:498)
	at com.carrotsearch.randomizedtesting.RandomizedRunner.invoke(RandomizedRunner.java:1737)
	at com.carrotsearch.randomizedtesting.RandomizedRunner$8.evaluate(RandomizedRunner.java:934)
	at com.carrotsearch.randomizedtesting.RandomizedRunner$9.evaluate(RandomizedRunner.java:970)
	at com.carrotsearch.randomizedtesting.RandomizedRunner$10.evaluate(RandomizedRunner.java:984)
	at com.carrotsearch.randomizedtesting.rules.SystemPropertiesRestoreRule$1.evaluate(SystemPropertiesRestoreRule.java:57)
	at org.apache.lucene.util.TestRuleSetupTeardownChained$1.evaluate(TestRuleSetupTeardownChained.java:49)
	at org.apache.lucene.util.AbstractBeforeAfterRule$1.evaluate(AbstractBeforeAfterRule.java:45)
	at org.apache.lucene.util.TestRuleThreadAndTestName$1.evaluate(TestRuleThreadAndTestName.java:48)
	at org.apache.lucene.util.TestRuleIgnoreAfterMaxFailures$1.evaluate(TestRuleIgnoreAfterMaxFailures.java:64)
	at org.apache.lucene.util.TestRuleMarkFailure$1.evaluate(TestRuleMarkFailure.java:47)
	at com.carrotsearch.randomizedtesting.rules.StatementAdapter.evaluate(StatementAdapter.java:36)
	at com.carrotsearch.randomizedtesting.ThreadLeakControl$StatementRunner.run(ThreadLeakControl.java:368)
	at com.carrotsearch.randomizedtesting.ThreadLeakControl.forkTimeoutingTask(ThreadLeakControl.java:817)
	at com.carrotsearch.randomizedtesting.ThreadLeakControl$3.evaluate(ThreadLeakControl.java:468)
	at com.carrotsearch.randomizedtesting.RandomizedRunner.runSingleTest(RandomizedRunner.java:943)
	at com.carrotsearch.randomizedtesting.RandomizedRunner$5.evaluate(RandomizedRunner.java:829)
	at com.carrotsearch.randomizedtesting.RandomizedRunner$6.evaluate(RandomizedRunner.java:879)
	at com.carrotsearch.randomizedtesting.RandomizedRunner$7.evaluate(RandomizedRunner.java:890)
	at com.carrotsearch.randomizedtesting.rules.StatementAdapter.evaluate(StatementAdapter.java:36)
	at com.carrotsearch.randomizedtesting.rules.SystemPropertiesRestoreRule$1.evaluate(SystemPropertiesRestoreRule.java:57)
	at org.apache.lucene.util.AbstractBeforeAfterRule$1.evaluate(AbstractBeforeAfterRule.java:45)
	at com.carrotsearch.randomizedtesting.rules.StatementAdapter.evaluate(StatementAdapter.java:36)
	at org.apache.lucene.util.TestRuleStoreClassName$1.evaluate(TestRuleStoreClassName.java:41)
	at com.carrotsearch.randomizedtesting.rules.NoShadowingOrOverridesOnMethodsRule$1.evaluate(NoShadowingOrOverridesOnMethodsRule.java:40)
	at com.carrotsearch.randomizedtesting.rules.NoShadowingOrOverridesOnMethodsRule$1.evaluate(NoShadowingOrOverridesOnMethodsRule.java:40)
	at com.carrotsearch.randomizedtesting.rules.StatementAdapter.evaluate(StatementAdapter.java:36)
	at com.carrotsearch.randomizedtesting.rules.StatementAdapter.evaluate(StatementAdapter.java:36)
	at com.carrotsearch.randomizedtesting.rules.StatementAdapter.evaluate(StatementAdapter.java:36)
	at org.apache.lucene.util.TestRuleAssertionsRequired$1.evaluate(TestRuleAssertionsRequired.java:53)
	at org.apache.lucene.util.TestRuleMarkFailure$1.evaluate(TestRuleMarkFailure.java:47)
	at org.apache.lucene.util.TestRuleIgnoreAfterMaxFailures$1.evaluate(TestRuleIgnoreAfterMaxFailures.java:64)
	at org.apache.lucene.util.TestRuleIgnoreTestSuites$1.evaluate(TestRuleIgnoreTestSuites.java:54)
	at com.carrotsearch.randomizedtesting.rules.StatementAdapter.evaluate(StatementAdapter.java:36)
	at com.carrotsearch.randomizedtesting.ThreadLeakControl$StatementRunner.run(ThreadLeakControl.java:368)
	at java.lang.Thread.run(Thread.java:748)
Caused by: org.apache.solr.client.solrj.impl.HttpSolrClient$RemoteSolrException: Error from server at http://127.0.0.1:45569/solr/testcollection_shard1_replica_n3: Expected mime type application/octet-stream but got text/html. <html>
<head>
<meta http-equiv="Content-Type" content="text/html;charset=ISO-8859-1"/>
<title>Error 404 </title>
</head>
<body>
<h2>HTTP ERROR: 404</h2>
<p>Problem accessing /solr/testcollection_shard1_replica_n3/update. Reason:
<pre>    Can not find: /solr/testcollection_shard1_replica_n3/update</pre></p>
<hr /><a href="http://eclipse.org/jetty">Powered by Jetty:// 9.3.20.v20170531</a><hr/>
</body>
</html>

	at org.apache.solr.client.solrj.impl.HttpSolrClient.executeMethod(HttpSolrClient.java:607)
	at org.apache.solr.client.solrj.impl.HttpSolrClient.request(HttpSolrClient.java:255)
	at org.apache.solr.client.solrj.impl.HttpSolrClient.request(HttpSolrClient.java:244)
	at org.apache.solr.client.solrj.impl.LBHttpSolrClient.doRequest(LBHttpSolrClient.java:483)
	at org.apache.solr.client.solrj.impl.LBHttpSolrClient.request(LBHttpSolrClient.java:413)
	at org.apache.solr.client.solrj.impl.CloudSolrClient.lambda$directUpdate$0(CloudSolrClient.java:527)
	at java.util.concurrent.FutureTask.run(FutureTask.java:266)
	at org.apache.solr.common.util.ExecutorUtil$MDCAwareThreadPoolExecutor.lambda$execute$0(ExecutorUtil.java:188)
	at java.util.concurrent.ThreadPoolExecutor.runWorker(ThreadPoolExecutor.java:1149)
	at java.util.concurrent.ThreadPoolExecutor$Worker.run(ThreadPoolExecutor.java:624)
	... 1 more


FAILED:  org.apache.solr.cloud.autoscaling.sim.TestGenericDistributedQueue.testDistributedQueue

Error Message:
Test abandoned because suite timeout was reached.

Stack Trace:
java.lang.Exception: Test abandoned because suite timeout was reached.
	at __randomizedtesting.SeedInfo.seed([F70B69DD77D3190E]:0)


FAILED:  org.apache.solr.schema.TestBulkSchemaConcurrent.test

Error Message:
Timeout occured while waiting response from server at: https://127.0.0.1:32863

Stack Trace:
org.apache.solr.client.solrj.SolrServerException: Timeout occured while waiting response from server at: https://127.0.0.1:32863
	at __randomizedtesting.SeedInfo.seed([F70B69DD77D3190E:7F5F5607D92F74F6]:0)
	at org.apache.solr.client.solrj.impl.HttpSolrClient.executeMethod(HttpSolrClient.java:654)
	at org.apache.solr.client.solrj.impl.HttpSolrClient.request(HttpSolrClient.java:255)
	at org.apache.solr.client.solrj.impl.HttpSolrClient.request(HttpSolrClient.java:244)
	at org.apache.solr.client.solrj.impl.LBHttpSolrClient.doRequest(LBHttpSolrClient.java:483)
	at org.apache.solr.client.solrj.impl.LBHttpSolrClient.request(LBHttpSolrClient.java:413)
	at org.apache.solr.client.solrj.impl.CloudSolrClient.sendRequest(CloudSolrClient.java:1104)
	at org.apache.solr.client.solrj.impl.CloudSolrClient.requestWithRetryOnStaleState(CloudSolrClient.java:884)
	at org.apache.solr.client.solrj.impl.CloudSolrClient.request(CloudSolrClient.java:817)
	at org.apache.solr.client.solrj.SolrRequest.process(SolrRequest.java:194)
	at org.apache.solr.client.solrj.SolrRequest.process(SolrRequest.java:211)
	at org.apache.solr.cloud.AbstractFullDistribZkTestBase.createServers(AbstractFullDistribZkTestBase.java:320)
	at org.apache.solr.BaseDistributedSearchTestCase$ShardsRepeatRule$ShardsFixedStatement.callStatement(BaseDistributedSearchTestCase.java:991)
	at org.apache.solr.BaseDistributedSearchTestCase$ShardsRepeatRule$ShardsStatement.evaluate(BaseDistributedSearchTestCase.java:968)
	at com.carrotsearch.randomizedtesting.rules.SystemPropertiesRestoreRule$1.evaluate(SystemPropertiesRestoreRule.java:57)
	at org.apache.lucene.util.TestRuleSetupTeardownChained$1.evaluate(TestRuleSetupTeardownChained.java:49)
	at org.apache.lucene.util.AbstractBeforeAfterRule$1.evaluate(AbstractBeforeAfterRule.java:45)
	at org.apache.lucene.util.TestRuleThreadAndTestName$1.evaluate(TestRuleThreadAndTestName.java:48)
	at org.apache.lucene.util.TestRuleIgnoreAfterMaxFailures$1.evaluate(TestRuleIgnoreAfterMaxFailures.java:64)
	at org.apache.lucene.util.TestRuleMarkFailure$1.evaluate(TestRuleMarkFailure.java:47)
	at com.carrotsearch.randomizedtesting.rules.StatementAdapter.evaluate(StatementAdapter.java:36)
	at com.carrotsearch.randomizedtesting.ThreadLeakControl$StatementRunner.run(ThreadLeakControl.java:368)
	at com.carrotsearch.randomizedtesting.ThreadLeakControl.forkTimeoutingTask(ThreadLeakControl.java:817)
	at com.carrotsearch.randomizedtesting.ThreadLeakControl$3.evaluate(ThreadLeakControl.java:468)
	at com.carrotsearch.randomizedtesting.RandomizedRunner.runSingleTest(RandomizedRunner.java:943)
	at com.carrotsearch.randomizedtesting.RandomizedRunner$5.evaluate(RandomizedRunner.java:829)
	at com.carrotsearch.randomizedtesting.RandomizedRunner$6.evaluate(RandomizedRunner.java:879)
	at com.carrotsearch.randomizedtesting.RandomizedRunner$7.evaluate(RandomizedRunner.java:890)
	at com.carrotsearch.randomizedtesting.rules.StatementAdapter.evaluate(StatementAdapter.java:36)
	at com.carrotsearch.randomizedtesting.rules.SystemPropertiesRestoreRule$1.evaluate(SystemPropertiesRestoreRule.java:57)
	at org.apache.lucene.util.AbstractBeforeAfterRule$1.evaluate(AbstractBeforeAfterRule.java:45)
	at com.carrotsearch.randomizedtesting.rules.StatementAdapter.evaluate(StatementAdapter.java:36)
	at org.apache.lucene.util.TestRuleStoreClassName$1.evaluate(TestRuleStoreClassName.java:41)
	at com.carrotsearch.randomizedtesting.rules.NoShadowingOrOverridesOnMethodsRule$1.evaluate(NoShadowingOrOverridesOnMethodsRule.java:40)
	at com.carrotsearch.randomizedtesting.rules.NoShadowingOrOverridesOnMethodsRule$1.evaluate(NoShadowingOrOverridesOnMethodsRule.java:40)
	at com.carrotsearch.randomizedtesting.rules.StatementAdapter.evaluate(StatementAdapter.java:36)
	at com.carrotsearch.randomizedtesting.rules.StatementAdapter.evaluate(StatementAdapter.java:36)
	at com.carrotsearch.randomizedtesting.rules.StatementAdapter.evaluate(StatementAdapter.java:36)
	at org.apache.lucene.util.TestRuleAssertionsRequired$1.evaluate(TestRuleAssertionsRequired.java:53)
	at org.apache.lucene.util.TestRuleMarkFailure$1.evaluate(TestRuleMarkFailure.java:47)
	at org.apache.lucene.util.TestRuleIgnoreAfterMaxFailures$1.evaluate(TestRuleIgnoreAfterMaxFailures.java:64)
	at org.apache.lucene.util.TestRuleIgnoreTestSuites$1.evaluate(TestRuleIgnoreTestSuites.java:54)
	at com.carrotsearch.randomizedtesting.rules.StatementAdapter.evaluate(StatementAdapter.java:36)
	at com.carrotsearch.randomizedtesting.ThreadLeakControl$StatementRunner.run(ThreadLeakControl.java:368)
	at java.lang.Thread.run(Thread.java:748)
Caused by: java.net.SocketTimeoutException: Read timed out
	at java.net.SocketInputStream.socketRead0(Native Method)
	at java.net.SocketInputStream.socketRead(SocketInputStream.java:116)
	at java.net.SocketInputStream.read(SocketInputStream.java:171)
	at java.net.SocketInputStream.read(SocketInputStream.java:141)
	at sun.security.ssl.InputRecord.readFully(InputRecord.java:465)
	at sun.security.ssl.InputRecord.read(InputRecord.java:503)
	at sun.security.ssl.SSLSocketImpl.readRecord(SSLSocketImpl.java:983)
	at sun.security.ssl.SSLSocketImpl.readDataRecord(SSLSocketImpl.java:940)
	at sun.security.ssl.AppInputStream.read(AppInputStream.java:105)
	at org.apache.http.impl.io.SessionInputBufferImpl.streamRead(SessionInputBufferImpl.java:137)
	at org.apache.http.impl.io.SessionInputBufferImpl.fillBuffer(SessionInputBufferImpl.java:153)
	at org.apache.http.impl.io.SessionInputBufferImpl.readLine(SessionInputBufferImpl.java:282)
	at org.apache.http.impl.conn.DefaultHttpResponseParser.parseHead(DefaultHttpResponseParser.java:138)
	at org.apache.http.impl.conn.DefaultHttpResponseParser.parseHead(DefaultHttpResponseParser.java:56)
	at org.apache.http.impl.io.AbstractMessageParser.parse(AbstractMessageParser.java:259)
	at org.apache.http.impl.DefaultBHttpClientConnection.receiveResponseHeader(DefaultBHttpClientConnection.java:163)
	at org.apache.http.impl.conn.CPoolProxy.receiveResponseHeader(CPoolProxy.java:165)
	at org.apache.http.protocol.HttpRequestExecutor.doReceiveResponse(HttpRequestExecutor.java:273)
	at org.apache.http.protocol.HttpRequestExecutor.execute(HttpRequestExecutor.java:125)
	at org.apache.http.impl.execchain.MainClientExec.execute(MainClientExec.java:272)
	at org.apache.http.impl.execchain.ProtocolExec.execute(ProtocolExec.java:185)
	at org.apache.http.impl.execchain.RetryExec.execute(RetryExec.java:89)
	at org.apache.http.impl.execchain.RedirectExec.execute(RedirectExec.java:111)
	at org.apache.http.impl.client.InternalHttpClient.doExecute(InternalHttpClient.java:185)
	at org.apache.http.impl.client.CloseableHttpClient.execute(CloseableHttpClient.java:83)
	at org.apache.http.impl.client.CloseableHttpClient.execute(CloseableHttpClient.java:56)
	at org.apache.solr.client.solrj.impl.HttpSolrClient.executeMethod(HttpSolrClient.java:542)
	... 43 more




Build Log:
[...truncated 12880 lines...]
   [junit4] Suite: org.apache.solr.cloud.TestAuthenticationFramework
   [junit4]   2> 1454179 INFO  (SUITE-TestAuthenticationFramework-seed#[F70B69DD77D3190E]-worker) [    ] o.a.s.SolrTestCaseJ4 SecureRandom sanity checks: test.solr.allowed.securerandom=null & java.security.egd=file:/dev/./urandom
   [junit4]   2> Creating dataDir: /home/jenkins/workspace/Lucene-Solr-7.x-Linux/solr/build/solr-core/test/J1/temp/solr.cloud.TestAuthenticationFramework_F70B69DD77D3190E-001/init-core-data-001
   [junit4]   2> 1454179 WARN  (SUITE-TestAuthenticationFramework-seed#[F70B69DD77D3190E]-worker) [    ] o.a.s.SolrTestCaseJ4 startTrackingSearchers: numOpens=7 numCloses=7
   [junit4]   2> 1454180 INFO  (SUITE-TestAuthenticationFramework-seed#[F70B69DD77D3190E]-worker) [    ] o.a.s.SolrTestCaseJ4 Using PointFields (NUMERIC_POINTS_SYSPROP=true) w/NUMERIC_DOCVALUES_SYSPROP=true
   [junit4]   2> 1454181 INFO  (SUITE-TestAuthenticationFramework-seed#[F70B69DD77D3190E]-worker) [    ] o.a.s.SolrTestCaseJ4 Randomized ssl (false) and clientAuth (true) via: @org.apache.solr.util.RandomizeSSL(reason=, ssl=NaN, value=NaN, clientAuth=NaN)
   [junit4]   2> 1454183 INFO  (TEST-TestAuthenticationFramework.testBasics-seed#[F70B69DD77D3190E]) [    ] o.a.s.c.MiniSolrCloudCluster Starting cluster of 2 servers in /home/jenkins/workspace/Lucene-Solr-7.x-Linux/solr/build/solr-core/test/J1/temp/solr.cloud.TestAuthenticationFramework_F70B69DD77D3190E-001/tempDir-001
   [junit4]   2> 1454183 INFO  (TEST-TestAuthenticationFramework.testBasics-seed#[F70B69DD77D3190E]) [    ] o.a.s.c.ZkTestServer STARTING ZK TEST SERVER
   [junit4]   2> 1454183 INFO  (Thread-2133) [    ] o.a.s.c.ZkTestServer client port:0.0.0.0/0.0.0.0:0
   [junit4]   2> 1454183 INFO  (Thread-2133) [    ] o.a.s.c.ZkTestServer Starting server
   [junit4]   2> 1454185 ERROR (Thread-2133) [    ] o.a.z.s.ZooKeeperServer ZKShutdownHandler is not registered, so ZooKeeper server won't take any action on ERROR or SHUTDOWN server state changes
   [junit4]   2> 1454283 INFO  (TEST-TestAuthenticationFramework.testBasics-seed#[F70B69DD77D3190E]) [    ] o.a.s.c.ZkTestServer start zk server on port:38365
   [junit4]   2> 1454286 INFO  (zkConnectionManagerCallback-2093-thread-1) [    ] o.a.s.c.c.ConnectionManager zkClient has connected
   [junit4]   2> 1454291 INFO  (jetty-launcher-2090-thread-1) [    ] o.e.j.s.Server jetty-9.3.20.v20170531
   [junit4]   2> 1454294 INFO  (jetty-launcher-2090-thread-2) [    ] o.e.j.s.Server jetty-9.3.20.v20170531
   [junit4]   2> 1454296 INFO  (jetty-launcher-2090-thread-1) [    ] o.e.j.s.h.ContextHandler Started o.e.j.s.ServletContextHandler@25f4cb{/solr,null,AVAILABLE}
   [junit4]   2> 1454296 INFO  (jetty-launcher-2090-thread-2) [    ] o.e.j.s.h.ContextHandler Started o.e.j.s.ServletContextHandler@20b8df{/solr,null,AVAILABLE}
   [junit4]   2> 1454298 INFO  (jetty-launcher-2090-thread-1) [    ] o.e.j.s.AbstractConnector Started ServerConnector@1e49d69{HTTP/1.1,[http/1.1]}{127.0.0.1:42027}
   [junit4]   2> 1454298 INFO  (jetty-launcher-2090-thread-2) [    ] o.e.j.s.AbstractConnector Started ServerConnector@90f21d{HTTP/1.1,[http/1.1]}{127.0.0.1:45569}
   [junit4]   2> 1454298 INFO  (jetty-launcher-2090-thread-1) [    ] o.e.j.s.Server Started @1455144ms
   [junit4]   2> 1454298 INFO  (jetty-launcher-2090-thread-2) [    ] o.e.j.s.Server Started @1455144ms
   [junit4]   2> 1454298 INFO  (jetty-launcher-2090-thread-1) [    ] o.a.s.c.s.e.JettySolrRunner Jetty properties: {hostContext=/solr, hostPort=42027}
   [junit4]   2> 1454298 INFO  (jetty-launcher-2090-thread-2) [    ] o.a.s.c.s.e.JettySolrRunner Jetty properties: {hostContext=/solr, hostPort=45569}
   [junit4]   2> 1454298 ERROR (jetty-launcher-2090-thread-1) [    ] o.a.s.u.StartupLoggingUtils Missing Java Option solr.log.dir. Logging may be missing or incomplete.
   [junit4]   2> 1454298 INFO  (jetty-launcher-2090-thread-1) [    ] o.a.s.s.SolrDispatchFilter  ___      _       Welcome to Apache Solr™ version 7.3.0
   [junit4]   2> 1454298 INFO  (jetty-launcher-2090-thread-1) [    ] o.a.s.s.SolrDispatchFilter / __| ___| |_ _   Starting in cloud mode on port null
   [junit4]   2> 1454298 INFO  (jetty-launcher-2090-thread-1) [    ] o.a.s.s.SolrDispatchFilter \__ \/ _ \ | '_|  Install dir: null
   [junit4]   2> 1454298 INFO  (jetty-launcher-2090-thread-1) [    ] o.a.s.s.SolrDispatchFilter |___/\___/_|_|    Start time: 2018-01-01T21:30:57.340Z
   [junit4]   2> 1454298 ERROR (jetty-launcher-2090-thread-2) [    ] o.a.s.u.StartupLoggingUtils Missing Java Option solr.log.dir. Logging may be missing or incomplete.
   [junit4]   2> 1454299 INFO  (jetty-launcher-2090-thread-2) [    ] o.a.s.s.SolrDispatchFilter  ___      _       Welcome to Apache Solr™ version 7.3.0
   [junit4]   2> 1454299 INFO  (jetty-launcher-2090-thread-2) [    ] o.a.s.s.SolrDispatchFilter / __| ___| |_ _   Starting in cloud mode on port null
   [junit4]   2> 1454299 INFO  (jetty-launcher-2090-thread-2) [    ] o.a.s.s.SolrDispatchFilter \__ \/ _ \ | '_|  Install dir: null
   [junit4]   2> 1454299 INFO  (jetty-launcher-2090-thread-2) [    ] o.a.s.s.SolrDispatchFilter |___/\___/_|_|    Start time: 2018-01-01T21:30:57.341Z
   [junit4]   2> 1454304 INFO  (zkConnectionManagerCallback-2095-thread-1) [    ] o.a.s.c.c.ConnectionManager zkClient has connected
   [junit4]   2> 1454305 INFO  (jetty-launcher-2090-thread-2) [    ] o.a.s.s.SolrDispatchFilter solr.xml found in ZooKeeper. Loading...
   [junit4]   2> 1454306 INFO  (zkConnectionManagerCallback-2097-thread-1) [    ] o.a.s.c.c.ConnectionManager zkClient has connected
   [junit4]   2> 1454306 INFO  (jetty-launcher-2090-thread-1) [    ] o.a.s.s.SolrDispatchFilter solr.xml found in ZooKeeper. Loading...
   [junit4]   2> 1454315 INFO  (jetty-launcher-2090-thread-2) [    ] o.a.s.c.ZkContainer Zookeeper client=127.0.0.1:38365/solr
   [junit4]   2> 1454316 INFO  (jetty-launcher-2090-thread-1) [    ] o.a.s.c.ZkContainer Zookeeper client=127.0.0.1:38365/solr
   [junit4]   2> 1454317 INFO  (zkConnectionManagerCallback-2105-thread-1) [    ] o.a.s.c.c.ConnectionManager zkClient has connected
   [junit4]   2> 1454319 INFO  (zkConnectionManagerCallback-2102-thread-1) [    ] o.a.s.c.c.ConnectionManager zkClient has connected
   [junit4]   2> 1454328 INFO  (zkConnectionManagerCallback-2109-thread-1-processing-n:127.0.0.1:45569_solr) [n:127.0.0.1:45569_solr    ] o.a.s.c.c.ConnectionManager zkClient has connected
   [junit4]   2> 1454328 INFO  (zkConnectionManagerCallback-2107-thread-1-processing-n:127.0.0.1:42027_solr) [n:127.0.0.1:42027_solr    ] o.a.s.c.c.ConnectionManager zkClient has connected
   [junit4]   2> 1454396 INFO  (jetty-launcher-2090-thread-2) [n:127.0.0.1:45569_solr    ] o.a.s.c.Overseer Overseer (id=null) closing
   [junit4]   2> 1454396 INFO  (jetty-launcher-2090-thread-1) [n:127.0.0.1:42027_solr    ] o.a.s.c.Overseer Overseer (id=null) closing
   [junit4]   2> 1454397 INFO  (jetty-launcher-2090-thread-2) [n:127.0.0.1:45569_solr    ] o.a.s.c.OverseerElectionContext I am going to be the leader 127.0.0.1:45569_solr
   [junit4]   2> 1454397 INFO  (jetty-launcher-2090-thread-1) [n:127.0.0.1:42027_solr    ] o.a.s.c.ZkController Register node as live in ZooKeeper:/live_nodes/127.0.0.1:42027_solr
   [junit4]   2> 1454398 INFO  (jetty-launcher-2090-thread-2) [n:127.0.0.1:45569_solr    ] o.a.s.c.Overseer Overseer (id=99276702169563142-127.0.0.1:45569_solr-n_0000000000) starting
   [junit4]   2> 1454402 INFO  (zkCallback-2106-thread-1-processing-n:127.0.0.1:42027_solr) [n:127.0.0.1:42027_solr    ] o.a.s.c.c.ZkStateReader Updated live nodes from ZooKeeper... (0) -> (1)
   [junit4]   2> 1454405 INFO  (zkCallback-2108-thread-1-processing-n:127.0.0.1:45569_solr) [n:127.0.0.1:45569_solr    ] o.a.s.c.c.ZkStateReader Updated live nodes from ZooKeeper... (0) -> (1)
   [junit4]   2> 1454423 INFO  (jetty-launcher-2090-thread-2) [n:127.0.0.1:45569_solr    ] o.a.s.c.ZkController Register node as live in ZooKeeper:/live_nodes/127.0.0.1:45569_solr
   [junit4]   2> 1454424 INFO  (zkCallback-2106-thread-1-processing-n:127.0.0.1:42027_solr) [n:127.0.0.1:42027_solr    ] o.a.s.c.c.ZkStateReader Updated live nodes from ZooKeeper... (1) -> (2)
   [junit4]   2> 1454430 INFO  (zkCallback-2108-thread-1-processing-n:127.0.0.1:45569_solr) [n:127.0.0.1:45569_solr    ] o.a.s.c.c.ZkStateReader Updated live nodes from ZooKeeper... (1) -> (2)
   [junit4]   2> 1454518 INFO  (jetty-launcher-2090-thread-1) [n:127.0.0.1:42027_solr    ] o.a.s.c.CoreContainer Initializing authentication plugin: org.apache.solr.cloud.TestAuthenticationFramework$MockAuthenticationPlugin
   [junit4]   2> 1454556 INFO  (jetty-launcher-2090-thread-1) [n:127.0.0.1:42027_solr    ] o.a.s.m.r.SolrJmxReporter JMX monitoring for 'solr_42027.solr.node' (registry 'solr.node') enabled at server: com.sun.jmx.mbeanserver.JmxMBeanServer@c44202
   [junit4]   2> 1454567 INFO  (jetty-launcher-2090-thread-1) [n:127.0.0.1:42027_solr    ] o.a.s.m.r.SolrJmxReporter JMX monitoring for 'solr_42027.solr.jvm' (registry 'solr.jvm') enabled at server: com.sun.jmx.mbeanserver.JmxMBeanServer@c44202
   [junit4]   2> 1454567 INFO  (jetty-launcher-2090-thread-1) [n:127.0.0.1:42027_solr    ] o.a.s.m.r.SolrJmxReporter JMX monitoring for 'solr_42027.solr.jetty' (registry 'solr.jetty') enabled at server: com.sun.jmx.mbeanserver.JmxMBeanServer@c44202
   [junit4]   2> 1454568 INFO  (jetty-launcher-2090-thread-1) [n:127.0.0.1:42027_solr    ] o.a.s.c.CorePropertiesLocator Found 0 core definitions underneath /home/jenkins/workspace/Lucene-Solr-7.x-Linux/solr/build/solr-core/test/J1/temp/solr.cloud.TestAuthenticationFramework_F70B69DD77D3190E-001/tempDir-001/node1/.
   [junit4]   2> 1454608 INFO  (jetty-launcher-2090-thread-2) [n:127.0.0.1:45569_solr    ] o.a.s.c.CoreContainer Initializing authentication plugin: org.apache.solr.cloud.TestAuthenticationFramework$MockAuthenticationPlugin
   [junit4]   2> 1454634 INFO  (jetty-launcher-2090-thread-2) [n:127.0.0.1:45569_solr    ] o.a.s.m.r.SolrJmxReporter JMX monitoring for 'solr_45569.solr.node' (registry 'solr.node') enabled at server: com.sun.jmx.mbeanserver.JmxMBeanServer@c44202
   [junit4]   2> 1454643 INFO  (jetty-launcher-2090-thread-2) [n:127.0.0.1:45569_solr    ] o.a.s.m.r.SolrJmxReporter JMX monitoring for 'solr_45569.solr.jvm' (registry 'solr.jvm') enabled at server: com.sun.jmx.mbeanserver.JmxMBeanServer@c44202
   [junit4]   2> 1454643 INFO  (jetty-launcher-2090-thread-2) [n:127.0.0.1:45569_solr    ] o.a.s.m.r.SolrJmxReporter JMX monitoring for 'solr_45569.solr.jetty' (registry 'solr.jetty') enabled at server: com.sun.jmx.mbeanserver.JmxMBeanServer@c44202
   [junit4]   2> 1454644 INFO  (jetty-launcher-2090-thread-2) [n:127.0.0.1:45569_solr    ] o.a.s.c.CorePropertiesLocator Found 0 core definitions underneath /home/jenkins/workspace/Lucene-Solr-7.x-Linux/solr/build/solr-core/test/J1/temp/solr.cloud.TestAuthenticationFramework_F70B69DD77D3190E-001/tempDir-001/node2/.
   [junit4]   2> 1454675 INFO  (zkConnectionManagerCallback-2115-thread-1) [    ] o.a.s.c.c.ConnectionManager zkClient has connected
   [junit4]   2> 1454678 INFO  (zkConnectionManagerCallback-2119-thread-1) [    ] o.a.s.c.c.ConnectionManager zkClient has connected
   [junit4]   2> 1454679 INFO  (TEST-TestAuthenticationFramework.testBasics-seed#[F70B69DD77D3190E]) [    ] o.a.s.c.c.ZkStateReader Updated live nodes from ZooKeeper... (0) -> (2)
   [junit4]   2> 1454680 INFO  (TEST-TestAuthenticationFramework.testBasics-seed#[F70B69DD77D3190E]) [    ] o.a.s.c.s.i.ZkClientClusterStateProvider Cluster at 127.0.0.1:38365/solr ready
   [junit4]   2> 1454682 INFO  (TEST-TestAuthenticationFramework.testBasics-seed#[F70B69DD77D3190E]) [    ] o.a.s.SolrTestCaseJ4 ###Starting testBasics
   [junit4]   2> 1454685 INFO  (qtp6272479-10141) [n:127.0.0.1:42027_solr    ] o.a.s.h.a.CollectionsHandler Invoked Collection Action :create with params replicationFactor=2&collection.configName=solrCloudCollectionConfig&maxShardsPerNode=2&name=testcollection&nrtReplicas=2&action=CREATE&numShards=2&wt=javabin&version=2 and sendToOCPQueue=true
   [junit4]   2> 1454687 INFO  (OverseerThreadFactory-4001-thread-1-processing-n:127.0.0.1:45569_solr) [n:127.0.0.1:45569_solr    ] o.a.s.c.CreateCollectionCmd Create collection testcollection
   [junit4]   2> 1454794 INFO  (OverseerStateUpdate-99276702169563142-127.0.0.1:45569_solr-n_0000000000) [n:127.0.0.1:45569_solr    ] o.a.s.c.o.SliceMutator createReplica() {
   [junit4]   2>   "operation":"ADDREPLICA",
   [junit4]   2>   "collection":"testcollection",
   [junit4]   2>   "shard":"shard1",
   [junit4]   2>   "core":"testcollection_shard1_replica_n1",
   [junit4]   2>   "state":"down",
   [junit4]   2>   "base_url":"http://127.0.0.1:42027/solr",
   [junit4]   2>   "type":"NRT",
   [junit4]   2>   "waitForFinalState":"false"} 
   [junit4]   2> 1454798 INFO  (OverseerStateUpdate-99276702169563142-127.0.0.1:45569_solr-n_0000000000) [n:127.0.0.1:45569_solr    ] o.a.s.c.o.SliceMutator createReplica() {
   [junit4]   2>   "operation":"ADDREPLICA",
   [junit4]   2>   "collection":"testcollection",
   [junit4]   2>   "shard":"shard1",
   [junit4]   2>   "core":"testcollection_shard1_replica_n3",
   [junit4]   2>   "state":"down",
   [junit4]   2>   "base_url":"http://127.0.0.1:45569/solr",
   [junit4]   2>   "type":"NRT",
   [junit4]   2>   "waitForFinalState":"false"} 
   [junit4]   2> 1454800 INFO  (OverseerStateUpdate-99276702169563142-127.0.0.1:45569_solr-n_0000000000) [n:127.0.0.1:45569_solr    ] o.a.s.c.o.SliceMutator createReplica() {
   [junit4]   2>   "operation":"ADDREPLICA",
   [junit4]   2>   "collection":"testcollection",
   [junit4]   2>   "shard":"shard2",
   [junit4]   2>   "core":"testcollection_shard2_replica_n4",
   [junit4]   2>   "state":"down",
   [junit4]   2>   "base_url":"http://127.0.0.1:42027/solr",
   [junit4]   2>   "type":"NRT",
   [junit4]   2>   "waitForFinalState":"false"} 
   [junit4]   2> 1454802 INFO  (OverseerStateUpdate-99276702169563142-127.0.0.1:45569_solr-n_0000000000) [n:127.0.0.1:45569_solr    ] o.a.s.c.o.SliceMutator createReplica() {
   [junit4]   2>   "operation":"ADDREPLICA",
   [junit4]   2>   "collection":"testcollection",
   [junit4]   2>   "shard":"shard2",
   [junit4]   2>   "core":"testcollection_shard2_replica_n6",
   [junit4]   2>   "state":"down",
   [junit4]   2>   "base_url":"http://127.0.0.1:45569/solr",
   [junit4]   2>   "type":"NRT",
   [junit4]   2>   "waitForFinalState":"false"} 
   [junit4]   2> 1455007 INFO  (qtp6272479-10137) [n:127.0.0.1:42027_solr    ] o.a.s.h.a.CoreAdminOperation core create command qt=/admin/cores&coreNodeName=core_node7&collection.configName=solrCloudCollectionConfig&newCollection=true&name=testcollection_shard2_replica_n4&action=CREATE&numShards=2&collection=testcollection&shard=shard2&wt=javabin&version=2&replicaType=NRT
   [junit4]   2> 1455008 INFO  (qtp6272479-10137) [n:127.0.0.1:42027_solr    ] o.a.s.c.TransientSolrCoreCacheDefault Allocating transient cache for 2147483647 transient cores
   [junit4]   2> 1455008 INFO  (qtp6272479-10145) [n:127.0.0.1:42027_solr    ] o.a.s.h.a.CoreAdminOperation core create command qt=/admin/cores&coreNodeName=core_node2&collection.configName=solrCloudCollectionConfig&newCollection=true&name=testcollection_shard1_replica_n1&action=CREATE&numShards=2&collection=testcollection&shard=shard1&wt=javabin&version=2&replicaType=NRT
   [junit4]   2> 1455010 INFO  (qtp12940565-10148) [n:127.0.0.1:45569_solr    ] o.a.s.h.a.CoreAdminOperation core create command qt=/admin/cores&coreNodeName=core_node5&collection.configName=solrCloudCollectionConfig&newCollection=true&name=testcollection_shard1_replica_n3&action=CREATE&numShards=2&collection=testcollection&shard=shard1&wt=javabin&version=2&replicaType=NRT
   [junit4]   2> 1455011 INFO  (qtp12940565-10148) [n:127.0.0.1:45569_solr    ] o.a.s.c.TransientSolrCoreCacheDefault Allocating transient cache for 2147483647 transient cores
   [junit4]   2> 1455013 INFO  (qtp12940565-10140) [n:127.0.0.1:45569_solr    ] o.a.s.h.a.CoreAdminOperation core create command qt=/admin/cores&coreNodeName=core_node8&collection.configName=solrCloudCollectionConfig&newCollection=true&name=testcollection_shard2_replica_n6&action=CREATE&numShards=2&collection=testcollection&shard=shard2&wt=javabin&version=2&replicaType=NRT
   [junit4]   2> 1455117 INFO  (zkCallback-2108-thread-1-processing-n:127.0.0.1:45569_solr) [n:127.0.0.1:45569_solr    ] o.a.s.c.c.ZkStateReader A cluster state change: [WatchedEvent state:SyncConnected type:NodeDataChanged path:/collections/testcollection/state.json] for collection [testcollection] has occurred - updating... (live nodes size: [2])
   [junit4]   2> 1455117 INFO  (zkCallback-2106-thread-1-processing-n:127.0.0.1:42027_solr) [n:127.0.0.1:42027_solr    ] o.a.s.c.c.ZkStateReader A cluster state change: [WatchedEvent state:SyncConnected type:NodeDataChanged path:/collections/testcollection/state.json] for collection [testcollection] has occurred - updating... (live nodes size: [2])
   [junit4]   2> 1455117 INFO  (zkCallback-2108-thread-2-processing-n:127.0.0.1:45569_solr) [n:127.0.0.1:45569_solr    ] o.a.s.c.c.ZkStateReader A cluster state change: [WatchedEvent state:SyncConnected type:NodeDataChanged path:/collections/testcollection/state.json] for collection [testcollection] has occurred - updating... (live nodes size: [2])
   [junit4]   2> 1456028 INFO  (qtp12940565-10140) [n:127.0.0.1:45569_solr c:testcollection s:shard2 r:core_node8 x:testcollection_shard2_replica_n6] o.a.s.c.SolrConfig Using Lucene MatchVersion: 7.3.0
   [junit4]   2> 1456029 INFO  (qtp6272479-10137) [n:127.0.0.1:42027_solr c:testcollection s:shard2 r:core_node7 x:testcollection_shard2_replica_n4] o.a.s.c.SolrConfig Using Lucene MatchVersion: 7.3.0
   [junit4]   2> 1456032 INFO  (qtp6272479-10145) [n:127.0.0.1:42027_solr c:testcollection s:shard1 r:core_node2 x:testcollection_shard1_replica_n1] o.a.s.c.SolrConfig Using Lucene MatchVersion: 7.3.0
   [junit4]   2> 1456032 INFO  (qtp12940565-10148) [n:127.0.0.1:45569_solr c:testcollection s:shard1 r:core_node5 x:testcollection_shard1_replica_n3] o.a.s.c.SolrConfig Using Lucene MatchVersion: 7.3.0
   [junit4]   2> 1456039 INFO  (qtp12940565-10140) [n:127.0.0.1:45569_solr c:testcollection s:shard2 r:core_node8 x:testcollection_shard2_replica_n6] o.a.s.s.IndexSchema [testcollection_shard2_replica_n6] Schema name=minimal
   [junit4]   2> 1456039 INFO  (qtp6272479-10137) [n:127.0.0.1:42027_solr c:testcollection s:shard2 r:core_node7 x:testcollection_shard2_replica_n4] o.a.s.s.IndexSchema [testcollection_shard2_replica_n4] Schema name=minimal
   [junit4]   2> 1456041 INFO  (qtp12940565-10148) [n:127.0.0.1:45569_solr c:testcollection s:shard1 r:core_node5 x:testcollection_shard1_replica_n3] o.a.s.s.IndexSchema [testcollection_shard1_replica_n3] Schema name=minimal
   [junit4]   2> 1456042 INFO  (qtp6272479-10137) [n:127.0.0.1:42027_solr c:testcollection s:shard2 r:core_node7 x:testcollection_shard2_replica_n4] o.a.s.s.IndexSchema Loaded schema minimal/1.1 with uniqueid field id
   [junit4]   2> 1456042 INFO  (qtp6272479-10137) [n:127.0.0.1:42027_solr c:testcollection s:shard2 r:core_node7 x:testcollection_shard2_replica_n4] o.a.s.c.CoreContainer Creating SolrCore 'testcollection_shard2_replica_n4' using configuration from collection testcollection, trusted=true
   [junit4]   2> 1456042 INFO  (qtp12940565-10140) [n:127.0.0.1:45569_solr c:testcollection s:shard2 r:core_node8 x:testcollection_shard2_replica_n6] o.a.s.s.IndexSchema Loaded schema minimal/1.1 with uniqueid field id
   [junit4]   2> 1456042 INFO  (qtp12940565-10140) [n:127.0.0.1:45569_solr c:testcollection s:shard2 r:core_node8 x:testcollection_shard2_replica_n6] o.a.s.c.CoreContainer Creating SolrCore 'testcollection_shard2_replica_n6' using configuration from collection testcollection, trusted=true
   [junit4]   2> 1456043 INFO  (qtp6272479-10137) [n:127.0.0.1:42027_solr c:testcollection s:shard2 r:core_node7 x:testcollection_shard2_replica_n4] o.a.s.m.r.SolrJmxReporter JMX monitoring for 'solr_42027.solr.core.testcollection.shard2.replica_n4' (registry 'solr.core.testcollection.shard2.replica_n4') enabled at server: com.sun.jmx.mbeanserver.JmxMBeanServer@c44202
   [junit4]   2> 1456043 INFO  (qtp12940565-10140) [n:127.0.0.1:45569_solr c:testcollection s:shard2 r:core_node8 x:testcollection_shard2_replica_n6] o.a.s.m.r.SolrJmxReporter JMX monitoring for 'solr_45569.solr.core.testcollection.shard2.replica_n6' (registry 'solr.core.testcollection.shard2.replica_n6') enabled at server: com.sun.jmx.mbeanserver.JmxMBeanServer@c44202
   [junit4]   2> 1456043 INFO  (qtp6272479-10137) [n:127.0.0.1:42027_solr c:testcollection s:shard2 r:core_node7 x:testcollection_shard2_replica_n4] o.a.s.c.SolrCore solr.RecoveryStrategy.Builder
   [junit4]   2> 1456043 INFO  (qtp12940565-10140) [n:127.0.0.1:45569_solr c:testcollection s:shard2 r:core_node8 x:testcollection_shard2_replica_n6] o.a.s.c.SolrCore solr.RecoveryStrategy.Builder
   [junit4]   2> 1456043 INFO  (qtp6272479-10137) [n:127.0.0.1:42027_solr c:testcollection s:shard2 r:core_node7 x:testcollection_shard2_replica_n4] o.a.s.c.SolrCore [[testcollection_shard2_replica_n4] ] Opening new SolrCore at [/home/jenkins/workspace/Lucene-Solr-7.x-Linux/solr/build/solr-core/test/J1/temp/solr.cloud.TestAuthenticationFramework_F70B69DD77D3190E-001/tempDir-001/node1/testcollection_shard2_replica_n4], dataDir=[/home/jenkins/workspace/Lucene-Solr-7.x-Linux/solr/build/solr-core/test/J1/temp/solr.cloud.TestAuthenticationFramework_F70B69DD77D3190E-001/tempDir-001/node1/./testcollection_shard2_replica_n4/data/]
   [junit4]   2> 1456043 INFO  (qtp12940565-10140) [n:127.0.0.1:45569_solr c:testcollection s:shard2 r:core_node8 x:testcollection_shard2_replica_n6] o.a.s.c.SolrCore [[testcollection_shard2_replica_n6] ] Opening new SolrCore at [/home/jenkins/workspace/Lucene-Solr-7.x-Linux/solr/build/solr-core/test/J1/temp/solr.cloud.TestAuthenticationFramework_F70B69DD77D3190E-001/tempDir-001/node2/testcollection_shard2_replica_n6], dataDir=[/home/jenkins/workspace/Lucene-Solr-7.x-Linux/solr/build/solr-core/test/J1/temp/solr.cloud.TestAuthenticationFramework_F70B69DD77D3190E-001/tempDir-001/node2/./testcollection_shard2_replica_n6/data/]
   [junit4]   2> 1456043 INFO  (qtp12940565-10148) [n:127.0.0.1:45569_solr c:testcollection s:shard1 r:core_node5 x:testcollection_shard1_replica_n3] o.a.s.s.IndexSchema Loaded schema minimal/1.1 with uniqueid field id
   [junit4]   2> 1456043 INFO  (qtp12940565-10148) [n:127.0.0.1:45569_solr c:testcollection s:shard1 r:core_node5 x:testcollection_shard1_replica_n3] o.a.s.c.CoreContainer Creating SolrCore 'testcollection_shard1_replica_n3' using configuration from collection testcollection, trusted=true
   [junit4]   2> 1456044 INFO  (qtp12940565-10148) [n:127.0.0.1:45569_solr c:testcollection s:shard1 r:core_node5 x:testcollection_shard1_replica_n3] o.a.s.m.r.SolrJmxReporter JMX monitoring for 'solr_45569.solr.core.testcollection.shard1.replica_n3' (registry 'solr.core.testcollection.shard1.replica_n3') enabled at server: com.sun.jmx.mbeanserver.JmxMBeanServer@c44202
   [junit4]   2> 1456044 INFO  (qtp12940565-10148) [n:127.0.0.1:45569_solr c:testcollection s:shard1 r:core_node5 x:testcollection_shard1_replica_n3] o.a.s.c.SolrCore solr.RecoveryStrategy.Builder
   [junit4]   2> 1456044 INFO  (qtp12940565-10148) [n:127.0.0.1:45569_solr c:testcollection s:shard1 r:core_node5 x:testcollection_shard1_replica_n3] o.a.s.c.SolrCore [[testcollection_shard1_replica_n3] ] Opening new SolrCore at [/home/jenkins/workspace/Lucene-Solr-7.x-Linux/solr/build/solr-core/test/J1/temp/solr.cloud.TestAuthenticationFramework_F70B69DD77D3190E-001/tempDir-001/node2/testcollection_shard1_replica_n3], dataDir=[/home/jenkins/workspace/Lucene-Solr-7.x-Linux/solr/build/solr-core/test/J1/temp/solr.cloud.TestAuthenticationFramework_F70B69DD77D3190E-001/tempDir-001/node2/./testcollection_shard1_replica_n3/data/]
   [junit4]   2> 1456050 INFO  (qtp6272479-10145) [n:127.0.0.1:42027_solr c:testcollection s:shard1 r:core_node2 x:testcollection_shard1_replica_n1] o.a.s.s.IndexSchema [testcollection_shard1_replica_n1] Schema name=minimal
   [junit4]   2> 1456062 INFO  (qtp6272479-10145) [n:127.0.0.1:42027_solr c:testcollection s:shard1 r:core_node2 x:testcollection_shard1_replica_n1] o.a.s.s.IndexSchema Loaded schema minimal/1.1 with uniqueid field id
   [junit4]   2> 1456062 INFO  (qtp6272479-10145) [n:127.0.0.1:42027_solr c:testcollection s:shard1 r:core_node2 x:testcollection_shard1_replica_n1] o.a.s.c.CoreContainer Creating SolrCore 'testcollection_shard1_replica_n1' using configuration from collection testcollection, trusted=true
   [junit4]   2> 1456064 INFO  (qtp6272479-10145) [n:127.0.0.1:42027_solr c:testcollection s:shard1 r:core_node2 x:testcollection_shard1_replica_n1] o.a.s.m.r.SolrJmxReporter JMX monitoring for 'solr_42027.solr.core.testcollection.shard1.replica_n1' (registry 'solr.core.testcollection.shard1.replica_n1') enabled at server: com.sun.jmx.mbeanserver.JmxMBeanServer@c44202
   [junit4]   2> 1456064 INFO  (qtp6272479-10145) [n:127.0.0.1:42027_solr c:testcollection s:shard1 r:core_node2 x:testcollection_shard1_replica_n1] o.a.s.c.SolrCore solr.RecoveryStrategy.Builder
   [junit4]   2> 1456064 INFO  (qtp6272479-10145) [n:127.0.0.1:42027_solr c:testcollection s:shard1 r:core_node2 x:testcollection_shard1_replica_n1] o.a.s.c.SolrCore [[testcollection_shard1_replica_n1] ] Opening new SolrCore at [/home/jenkins/workspace/Lucene-Solr-7.x-Linux/solr/build/solr-core/test/J1/temp/solr.cloud.TestAuthenticationFramework_F70B69DD77D3190E-001/tempDir-001/node1/testcollection_shard1_replica_n1], dataDir=[/home/jenkins/workspace/Lucene-Solr-7.x-Linux/solr/build/solr-core/test/J1/temp/solr.cloud.TestAuthenticationFramework_F70B69DD77D3190E-001/tempDir-001/node1/./testcollection_shard1_replica_n1/data/]
   [junit4]   2> 1456139 INFO  (qtp12940565-10140) [n:127.0.0.1:45569_solr c:testcollection s:shard2 r:core_node8 x:testcollection_shard2_replica_n6] o.a.s.u.UpdateHandler Using UpdateLog implementation: org.apache.solr.update.UpdateLog
   [junit4]   2> 1456139 INFO  (qtp12940565-10140) [n:127.0.0.1:45569_solr c:testcollection s:shard2 r:core_node8 x:testcollection_shard2_replica_n6] o.a.s.u.UpdateLog Initializing UpdateLog: dataDir=null defaultSyncLevel=FLUSH numRecordsToKeep=100 maxNumLogsToKeep=10 numVersionBuckets=65536
   [junit4]   2> 1456140 INFO  (qtp12940565-10140) [n:127.0.0.1:45569_solr c:testcollection s:shard2 r:core_node8 x:testcollection_shard2_replica_n6] o.a.s.u.CommitTracker Hard AutoCommit: disabled
   [junit4]   2> 1456141 INFO  (qtp12940565-10140) [n:127.0.0.1:45569_solr c:testcollection s:shard2 r:core_node8 x:testcollection_shard2_replica_n6] o.a.s.u.CommitTracker Soft AutoCommit: disabled
   [junit4]   2> 1456143 INFO  (qtp12940565-10140) [n:127.0.0.1:45569_solr c:testcollection s:shard2 r:core_node8 x:testcollection_shard2_replica_n6] o.a.s.s.SolrIndexSearcher Opening [Searcher@1627d93[testcollection_shard2_replica_n6] main]
   [junit4]   2> 1456145 INFO  (qtp12940565-10140) [n:127.0.0.1:45569_solr c:testcollection s:shard2 r:core_node8 x:testcollection_shard2_replica_n6] o.a.s.r.ManagedResourceStorage Configured ZooKeeperStorageIO with znodeBase: /configs/solrCloudCollectionConfig
   [junit4]   2> 1456146 INFO  (qtp12940565-10140) [n:127.0.0.1:45569_solr c:testcollection s:shard2 r:core_node8 x:testcollection_shard2_replica_n6] o.a.s.r.ManagedResourceStorage Loaded null at path _rest_managed.json using ZooKeeperStorageIO:path=/configs/solrCloudCollectionConfig
   [junit4]   2> 1456147 INFO  (qtp12940565-10140) [n:127.0.0.1:45569_solr c:testcollection s:shard2 r:core_node8 x:testcollection_shard2_replica_n6] o.a.s.h.ReplicationHandler Commits will be reserved for 10000ms.
   [junit4]   2> 1456148 INFO  (searcherExecutor-4007-thread-1-processing-n:127.0.0.1:45569_solr x:testcollection_shard2_replica_n6 s:shard2 c:testcollection r:core_node8) [n:127.0.0.1:45569_solr c:testcollection s:shard2 r:core_node8 x:testcollection_shard2_replica_n6] o.a.s.c.SolrCore [testcollection_shard2_replica_n6] Registered new searcher Searcher@1627d93[testcollection_shard2_replica_n6] main{ExitableDirectoryReader(UninvertingDirectoryReader())}
   [junit4]   2> 1456149 INFO  (qtp12940565-10140) [n:127.0.0.1:45569_solr c:testcollection s:shard2 r:core_node8 x:testcollection_shard2_replica_n6] o.a.s.u.UpdateLog Could not find max version in index or recent updates, using new clock 1588427236773462016
   [junit4]   2> 1456155 INFO  (qtp12940565-10140) [n:127.0.0.1:45569_solr c:testcollection s:shard2 r:core_node8 x:testcollection_shard2_replica_n6] o.a.s.c.ShardLeaderElectionContext Waiting until we see more replicas up for shard shard2: total=2 found=1 timeoutin=9999ms
   [junit4]   2> 1456158 INFO  (qtp6272479-10137) [n:127.0.0.1:42027_solr c:testcollection s:shard2 r:core_node7 x:testcollection_shard2_replica_n4] o.a.s.u.UpdateHandler Using UpdateLog implementation: org.apache.solr.update.UpdateLog
   [junit4]   2> 1456158 INFO  (qtp6272479-10137) [n:127.0.0.1:42027_solr c:testcollection s:shard2 r:core_node7 x:testcollection_shard2_replica_n4] o.a.s.u.UpdateLog Initializing UpdateLog: dataDir=null defaultSyncLevel=FLUSH numRecordsToKeep=100 maxNumLogsToKeep=10 numVersionBuckets=65536
   [junit4]   2> 1456160 INFO  (qtp6272479-10137) [n:127.0.0.1:42027_solr c:testcollection s:shard2 r:core_node7 x:testcollection_shard2_replica_n4] o.a.s.u.CommitTracker Hard AutoCommit: disabled
   [junit4]   2> 1456160 INFO  (qtp6272479-10137) [n:127.0.0.1:42027_solr c:testcollection s:shard2 r:core_node7 x:testcollection_shard2_replica_n4] o.a.s.u.CommitTracker Soft AutoCommit: disabled
   [junit4]   2> 1456162 INFO  (qtp6272479-10137) [n:127.0.0.1:42027_solr c:testcollection s:shard2 r:core_node7 x:testcollection_shard2_replica_n4] o.a.s.s.SolrIndexSearcher Opening [Searcher@1b4d4b1[testcollection_shard2_replica_n4] main]
   [junit4]   2> 1456163 INFO  (qtp12940565-10148) [n:127.0.0.1:45569_solr c:testcollection s:shard1 r:core_node5 x:testcollection_shard1_replica_n3] o.a.s.u.UpdateHandler Using UpdateLog implementation: org.apache.solr.update.UpdateLog
   [junit4]   2> 1456163 INFO  (qtp12940565-10148) [n:127.0.0.1:45569_solr c:testcollection s:shard1 r:core_node5 x:testcollection_shard1_replica_n3] o.a.s.u.UpdateLog Initializing UpdateLog: dataDir=null defaultSyncLevel=FLUSH numRecordsToKeep=100 maxNumLogsToKeep=10 numVersionBuckets=65536
   [junit4]   2> 1456164 INFO  (qtp6272479-10137) [n:127.0.0.1:42027_solr c:testcollection s:shard2 r:core_node7 x:testcollection_shard2_replica_n4] o.a.s.r.ManagedResourceStorage Configured ZooKeeperStorageIO with znodeBase: /configs/solrCloudCollectionConfig
   [junit4]   2> 1456164 INFO  (qtp6272479-10137) [n:127.0.0.1:42027_solr c:testcollection s:shard2 r:core_node7 x:testcollection_shard2_replica_n4] o.a.s.r.ManagedResourceStorage Loaded null at path _rest_managed.json using ZooKeeperStorageIO:path=/configs/solrCloudCollectionConfig
   [junit4]   2> 1456164 INFO  (qtp12940565-10148) [n:127.0.0.1:45569_solr c:testcollection s:shard1 r:core_node5 x:testcollection_shard1_replica_n3] o.a.s.u.CommitTracker Hard AutoCommit: disabled
   [junit4]   2> 1456164 INFO  (qtp12940565-10148) [n:127.0.0.1:45569_solr c:testcollection s:shard1 r:core_node5 x:testcollection_shard1_replica_n3] o.a.s.u.CommitTracker Soft AutoCommit: disabled
   [junit4]   2> 1456165 INFO  (qtp6272479-10137) [n:127.0.0.1:42027_solr c:testcollection s:shard2 r:core_node7 x:testcollection_shard2_replica_n4] o.a.s.h.ReplicationHandler Commits will be reserved for 10000ms.
   [junit4]   2> 1456166 INFO  (qtp6272479-10137) [n:127.0.0.1:42027_solr c:testcollection s:shard2 r:core_node7 x:testcollection_shard2_replica_n4] o.a.s.u.UpdateLog Could not find max version in index or recent updates, using new clock 1588427236791287808
   [junit4]   2> 1456167 INFO  (qtp12940565-10148) [n:127.0.0.1:45569_solr c:testcollection s:shard1 r:core_node5 x:testcollection_shard1_replica_n3] o.a.s.s.SolrIndexSearcher Opening [Searcher@19a77ee[testcollection_shard1_replica_n3] main]
   [junit4]   2> 1456167 INFO  (searcherExecutor-4006-thread-1-processing-n:127.0.0.1:42027_solr x:testcollection_shard2_replica_n4 s:shard2 c:testcollection r:core_node7) [n:127.0.0.1:42027_solr c:testcollection s:shard2 r:core_node7 x:testcollection_shard2_replica_n4] o.a.s.c.SolrCore [testcollection_shard2_replica_n4] Registered new searcher Searcher@1b4d4b1[testcollection_shard2_replica_n4] main{ExitableDirectoryReader(UninvertingDirectoryReader())}
   [junit4]   2> 1456169 INFO  (qtp12940565-10148) [n:127.0.0.1:45569_solr c:testcollection s:shard1 r:core_node5 x:testcollection_shard1_replica_n3] o.a.s.r.ManagedResourceStorage Configured ZooKeeperStorageIO with znodeBase: /configs/solrCloudCollectionConfig
   [junit4]   2> 1456169 INFO  (qtp12940565-10148) [n:127.0.0.1:45569_solr c:testcollection s:shard1 r:core_node5 x:testcollection_shard1_replica_n3] o.a.s.r.ManagedResourceStorage Loaded null at path _rest_managed.json using ZooKeeperStorageIO:path=/configs/solrCloudCollectionConfig
   [junit4]   2> 1456170 INFO  (qtp12940565-10148) [n:127.0.0.1:45569_solr c:testcollection s:shard1 r:core_node5 x:testcollection_shard1_replica_n3] o.a.s.h.ReplicationHandler Commits will be reserved for 10000ms.
   [junit4]   2> 1456171 INFO  (qtp12940565-10148) [n:127.0.0.1:45569_solr c:testcollection s:shard1 r:core_node5 x:testcollection_shard1_replica_n3] o.a.s.u.UpdateLog Could not find max version in index or recent updates, using new clock 1588427236796530688
   [junit4]   2> 1456172 INFO  (searcherExecutor-4008-thread-1-processing-n:127.0.0.1:45569_solr x:testcollection_shard1_replica_n3 s:shard1 c:testcollection r:core_node5) [n:127.0.0.1:45569_solr c:testcollection s:shard1 r:core_node5 x:testcollection_shard1_replica_n3] o.a.s.c.SolrCore [testcollection_shard1_replica_n3] Registered new searcher Searcher@19a77ee[testcollection_shard1_replica_n3] main{ExitableDirectoryReader(UninvertingDirectoryReader())}
   [junit4]   2> 1456173 INFO  (qtp6272479-10145) [n:127.0.0.1:42027_solr c:testcollection s:shard1 r:core_node2 x:testcollection_shard1_replica_n1] o.a.s.u.UpdateHandler Using UpdateLog implementation: org.apache.solr.update.UpdateLog
   [junit4]   2> 1456173 INFO  (qtp6272479-10145) [n:127.0.0.1:42027_solr c:testcollection s:shard1 r:core_node2 x:testcollection_shard1_replica_n1] o.a.s.u.UpdateLog Initializing UpdateLog: dataDir=null defaultSyncLevel=FLUSH numRecordsToKeep=100 maxNumLogsToKeep=10 numVersionBuckets=65536
   [junit4]   2> 1456174 INFO  (qtp6272479-10145) [n:127.0.0.1:42027_solr c:testcollection s:shard1 r:core_node2 x:testcollection_shard1_replica_n1] o.a.s.u.CommitTracker Hard AutoCommit: disabled
   [junit4]   2> 1456174 INFO  (qtp6272479-10145) [n:127.0.0.1:42027_solr c:testcollection s:shard1 r:core_node2 x:testcollection_shard1_replica_n1] o.a.s.u.CommitTracker Soft AutoCommit: disabled
   [junit4]   2> 1456176 INFO  (qtp12940565-10148) [n:127.0.0.1:45569_solr c:testcollection s:shard1 r:core_node5 x:testcollection_shard1_replica_n3] o.a.s.c.ShardLeaderElectionContext Waiting until we see more replicas up for shard shard1: total=2 found=1 timeoutin=9999ms
   [junit4]   2> 1456176 INFO  (qtp6272479-10145) [n:127.0.0.1:42027_solr c:testcollection s:shard1 r:core_node2 x:testcollection_shard1_replica_n1] o.a.s.s.SolrIndexSearcher Opening [Searcher@1ee38f5[testcollection_shard1_replica_n1] main]
   [junit4]   2> 1456177 INFO  (qtp6272479-10145) [n:127.0.0.1:42027_solr c:testcollection s:shard1 r:core_node2 x:testcollection_shard1_replica_n1] o.a.s.r.ManagedResourceStorage Configured ZooKeeperStorageIO with znodeBase: /configs/solrCloudCollectionConfig
   [junit4]   2> 1456178 INFO  (qtp6272479-10145) [n:127.0.0.1:42027_solr c:testcollection s:shard1 r:core_node2 x:testcollection_shard1_replica_n1] o.a.s.r.ManagedResourceStorage Loaded null at path _rest_managed.json using ZooKeeperStorageIO:path=/configs/solrCloudCollectionConfig
   [junit4]   2> 1456179 INFO  (qtp6272479-10145) [n:127.0.0.1:42027_solr c:testcollection s:shard1 r:core_node2 x:testcollection_shard1_replica_n1] o.a.s.h.ReplicationHandler Commits will be reserved for 10000ms.
   [junit4]   2> 1456179 INFO  (qtp6272479-10145) [n:127.0.0.1:42027_solr c:testcollection s:shard1 r:core_node2 x:testcollection_shard1_replica_n1] o.a.s.u.UpdateLog Could not find max version in index or recent updates, using new clock 1588427236804919296
   [junit4]   2> 1456188 INFO  (searcherExecutor-4009-thread-1-processing-n:127.0.0.1:42027_solr x:testcollection_shard1_replica_n1 s:shard1 c:testcollection r:core_node2) [n:127.0.0.1:42027_solr c:testcollection s:shard1 r:core_node2 x:testcollection_shard1_replica_n1] o.a.s.c.SolrCore [testcollection_shard1_replica_n1] Registered new searcher Searcher@1ee38f5[testcollection_shard1_replica_n1] main{ExitableDirectoryReader(UninvertingDirectoryReader())}
   [junit4]   2> 1456277 INFO  (zkCallback-2108-thread-2-processing-n:127.0.0.1:45569_solr) [n:127.0.0.1:45569_solr    ] o.a.s.c.c.ZkStateReader A cluster state change: [WatchedEvent state:SyncConnected type:NodeDataChanged path:/collections/testcollection/state.json] for collection [testcollection] has occurred - updating... (live nodes size: [2])
   [junit4]   2> 1456277 INFO  (zkCallback-2108-thread-1-processing-n:127.0.0.1:45569_solr) [n:127.0.0.1:45569_solr    ] o.a.s.c.c.ZkStateReader A cluster state change: [WatchedEvent state:SyncConnected type:NodeDataChanged path:/collections/testcollection/state.json] for collection [testcollection] has occurred - updating... (live nodes size: [2])
   [junit4]   2> 1456277 INFO  (zkCallback-2106-thread-1-processing-n:127.0.0.1:42027_solr) [n:127.0.0.1:42027_solr    ] o.a.s.c.c.ZkStateReader A cluster state change: [WatchedEvent state:SyncConnected type:NodeDataChanged path:/collections/testcollection/state.json] for collection [testcollection] has occurred - updating... (live nodes size: [2])
   [junit4]   2> 1456656 INFO  (qtp12940565-10140) [n:127.0.0.1:45569_solr c:testcollection s:shard2 r:core_node8 x:testcollection_shard2_replica_n6] o.a.s.c.ShardLeaderElectionContext Enough replicas found to continue.
   [junit4]   2> 1456656 INFO  (qtp12940565-10140) [n:127.0.0.1:45569_solr c:testcollection s:shard2 r:core_node8 x:testcollection_shard2_replica_n6] o.a.s.c.ShardLeaderElectionContext I may be the new leader - try and sync
   [junit4]   2> 1456656 INFO  (qtp12940565-10140) [n:127.0.0.1:45569_solr c:testcollection s:shard2 r:core_node8 x:testcollection_shard2_replica_n6] o.a.s.c.SyncStrategy Sync replicas to http://127.0.0.1:45569/solr/testcollection_shard2_replica_n6/
   [junit4]   2> 1456657 INFO  (qtp12940565-10140) [n:127.0.0.1:45569_solr c:testcollection s:shard2 r:core_node8 x:testcollection_shard2_replica_n6] o.a.s.u.PeerSync PeerSync: core=testcollection_shard2_replica_n6 url=http://127.0.0.1:45569/solr START replicas=[http://127.0.0.1:42027/solr/testcollection_shard2_replica_n4/] nUpdates=100
   [junit4]   2> 1456662 INFO  (qtp6272479-10138) [n:127.0.0.1:42027_solr c:testcollection s:shard2 r:core_node7 x:testcollection_shard2_replica_n4] o.a.s.c.S.Request [testcollection_shard2_replica_n4]  webapp=/solr path=/get params={distrib=false&qt=/get&fingerprint=false&getVersions=100&wt=javabin&version=2} status=0 QTime=1
   [junit4]   2> 1456676 INFO  (qtp12940565-10148) [n:127.0.0.1:45569_solr c:testcollection s:shard1 r:core_node5 x:testcollection_shard1_replica_n3] o.a.s.c.ShardLeaderElectionContext Enough replicas found to continue.
   [junit4]   2> 1456676 INFO  (qtp12940565-10148) [n:127.0.0.1:45569_solr c:testcollection s:shard1 r:core_node5 x:testcollection_shard1_replica_n3] o.a.s.c.ShardLeaderElectionContext I may be the new leader - try and sync
   [junit4]   2> 1456676 INFO  (qtp12940565-10148) [n:127.0.0.1:45569_solr c:testcollection s:shard1 r:core_node5 x:testcollection_shard1_replica_n3] o.a.s.c.SyncStrategy Sync replicas to http://127.0.0.1:45569/solr/testcollection_shard1_replica_n3/
   [junit4]   2> 1456677 INFO  (qtp12940565-10148) [n:127.0.0.1:45569_solr c:testcollection s:shard1 r:core_node5 x:testcollection_shard1_replica_n3] o.a.s.u.PeerSync PeerSync: core=testcollection_shard1_replica_n3 url=http://127.0.0.1:45569/solr START replicas=[http://127.0.0.1:42027/solr/testcollection_shard1_replica_n1/] nUpdates=100
   [junit4]   2> 1456681 INFO  (qtp6272479-10206) [n:127.0.0.1:42027_solr c:testcollection s:shard1 r:core_node2 x:testcollection_shard1_replica_n1] o.a.s.c.S.Request [testcollection_shard1_replica_n1]  webapp=/solr path=/get params={distrib=false&qt=/get&fingerprint=false&getVersions=100&wt=javabin&version=2} status=0 QTime=0
   [junit4]   2> 1456957 INFO  (qtp12940565-10140) [n:127.0.0.1:45569_solr c:testcollection s:shard2 r:core_node8 x:testcollection_shard2_replica_n6] o.a.s.u.PeerSync PeerSync: core=testcollection_shard2_replica_n6 url=http://127.0.0.1:45569/solr DONE.  We have no versions.  sync failed.
   [junit4]   2> 1456957 INFO  (qtp12940565-10140) [n:127.0.0.1:45569_solr c:testcollection s:shard2 r:core_node8 x:testcollection_shard2_replica_n6] o.a.s.c.SyncStrategy Leader's attempt to sync with shard failed, moving to the next candidate
   [junit4]   2> 1456958 INFO  (qtp12940565-10140) [n:127.0.0.1:45569_solr c:testcollection s:shard2 r:core_node8 x:testcollection_shard2_replica_n6] o.a.s.c.ShardLeaderElectionContext We failed sync, but we have no versions - we can't sync in that case - we were active before, so become leader anyway
   [junit4]   2> 1456958 INFO  (qtp12940565-10140) [n:127.0.0.1:45569_solr c:testcollection s:shard2 r:core_node8 x:testcollection_shard2_replica_n6] o.a.s.c.ShardLeaderElectionContext Found all replicas participating in election, clear LIR
   [junit4]   2> 1456961 INFO  (qtp12940565-10140) [n:127.0.0.1:45569_solr c:testcollection s:shard2 r:core_node8 x:testcollection_shard2_replica_n6] o.a.s.c.ShardLeaderElectionContext I am the new leader: http://127.0.0.1:45569/solr/testcollection_shard2_replica_n6/ shard2
   [junit4]   2> 1456977 INFO  (qtp12940565-10148) [n:127.0.0.1:45569_solr c:testcollection s:shard1 r:core_node5 x:testcollection_shard1_replica_n3] o.a.s.u.PeerSync PeerSync: core=testcollection_shard1_replica_n3 url=http://127.0.0.1:45569/solr DONE.  We have no versions.  sync failed.
   [junit4]   2> 1456977 INFO  (qtp12940565-10148) [n:127.0.0.1:45569_solr c:testcollection s:shard1 r:core_node5 x:testcollection_shard1_replica_n3] o.a.s.c.SyncStrategy Leader's attempt to sync with shard failed, moving to the next candidate
   [junit4]   2> 1456978 INFO  (qtp12940565-10148) [n:127.0.0.1:45569_solr c:testcollection s:shard1 r:core_node5 x:testcollection_shard1_replica_n3] o.a.s.c.ShardLeaderElectionContext We failed sync, but we have no versions - we can't sync in that case - we were active before, so become leader anyway
   [junit4]   2> 1456978 INFO  (qtp12940565-10148) [n:127.0.0.1:45569_solr c:testcollection s:shard1 r:core_node5 x:testcollection_shard1_replica_n3] o.a.s.c.ShardLeaderElectionContext Found all replicas participating in election, clear LIR
   [junit4]   2> 1456981 INFO  (qtp12940565-10148) [n:127.0.0.1:45569_solr c:testcollection s:shard1 r:core_node5 x:testcollection_shard1_replica_n3] o.a.s.c.ShardLeaderElectionContext I am the new leader: http://127.0.0.1:45569/solr/testcollection_shard1_replica_n3/ shard1
   [junit4]   2> 1457082 INFO  (zkCallback-2106-thread-1-processing-n:127.0.0.1:42027_solr) [n:127.0.0.1:42027_solr    ] o.a.s.c.c.ZkStateReader A cluster state change: [WatchedEvent state:SyncConnected type:NodeDataChanged path:/collections/testcollection/state.json] for collection [testcollection] has occurred - updating... (live nodes size: [2])
   [junit4]   2> 1457083 INFO  (zkCallback-2108-thread-1-processing-n:127.0.0.1:45569_solr) [n:127.0.0.1:45569_solr    ] o.a.s.c.c.ZkStateReader A cluster state change: [WatchedEvent state:SyncConnected type:NodeDataChanged path:/collections/testcollection/state.json] for collection [testcollection] has occurred - updating... (live nodes size: [2])
   [junit4]   2> 1457083 INFO  (zkCallback-2108-thread-2-processing-n:127.0.0.1:45569_solr) [n:127.0.0.1:45569_solr    ] o.a.s.c.c.ZkStateReader A cluster state change: [WatchedEvent state:SyncConnected type:NodeDataChanged path:/collections/testcollection/state.json] for collection [testcollection] has occurred - updating... (live nodes size: [2])
   [junit4]   2> 1457112 INFO  (qtp12940565-10140) [n:127.0.0.1:45569_solr c:testcollection s:shard2 r:core_node8 x:testcollection_shard2_replica_n6] o.a.s.c.ZkController I am the leader, no recovery necessary
   [junit4]   2> 1457114 INFO  (qtp12940565-10140) [n:127.0.0.1:45569_solr c:testcollection s:shard2 r:core_node8 x:testcollection_shard2_replica_n6] o.a.s.s.HttpSolrCall [admin] webapp=null path=/admin/cores params={qt=/admin/cores&coreNodeName=core_node8&collection.configName=solrCloudCollectionConfig&newCollection=true&name=testcollection_shard2_replica_n6&action=CREATE&numShards=2&collection=testcollection&shard=shard2&wt=javabin&version=2&replicaType=NRT} status=0 QTime=2101
   [junit4]   2> 1457131 INFO  (qtp12940565-10148) [n:127.0.0.1:45569_solr c:testcollection s:shard1 r:core_node5 x:testcollection_shard1_replica_n3] o.a.s.c.ZkController I am the leader, no recovery necessary
   [junit4]   2> 1457134 INFO  (qtp12940565-10148) [n:127.0.0.1:45569_solr c:testcollection s:shard1 r:core_node5 x:testcollection_shard1_replica_n3] o.a.s.s.HttpSolrCall [admin] webapp=null path=/admin/cores params={qt=/admin/cores&coreNodeName=core_node5&collection.configName=solrCloudCollectionConfig&newCollection=true&name=testcollection_shard1_replica_n3&action=CREATE&numShards=2&collection=testcollection&shard=shard1&wt=javabin&version=2&replicaType=NRT} status=0 QTime=2123
   [junit4]   2> 1457173 INFO  (qtp6272479-10137) [n:127.0.0.1:42027_solr c:testcollection s:shard2 r:core_node7 x:testcollection_shard2_replica_n4] o.a.s.s.HttpSolrCall [admin] webapp=null path=/admin/cores params={qt=/admin/cores&coreNodeName=core_node7&collection.configName=solrCloudCollectionConfig&newCollection=true&name=testcollection_shard2_replica_n4&action=CREATE&numShards=2&collection=testcollection&shard=shard2&wt=javabin&version=2&replicaType=NRT} status=0 QTime=2166
   [junit4]   2> 1457184 INFO  (qtp6272479-10145) [n:127.0.0.1:42027_solr c:testcollection s:shard1 r:core_node2 x:testcollection_shard1_replica_n1] o.a.s.s.HttpSolrCall [admin] webapp=null path=/admin/cores params={qt=/admin/cores&coreNodeName=core_node2&collection.configName=solrCloudCollectionConfig&newCollection=true&name=testcollection_shard1_replica_n1&action=CREATE&numShards=2&collection=testcollection&shard=shard1&wt=javabin&version=2&replicaType=NRT} status=0 QTime=2176
   [junit4]   2> 1457190 INFO  (qtp6272479-10141) [n:127.0.0.1:42027_solr    ] o.a.s.h.a.CollectionsHandler Wait for new collection to be active for at most 30 seconds. Check all shard replicas
   [junit4]   2> 1457286 INFO  (zkCallback-2106-thread-1-processing-n:127.0.0.1:42027_solr) [n:127.0.0.1:42027_solr    ] o.a.s.c.c.ZkStateReader A cluster state change: [WatchedEvent state:SyncConnected type:NodeDataChanged path:/collections/testcollection/state.json] for collection [testcollection] has occurred - updating... (live nodes size: [2])
   [junit4]   2> 1457286 INFO  (zkCallback-2108-thread-2-processing-n:127.0.0.1:45569_solr) [n:127.0.0.1:45569_solr    ] o.a.s.c.c.ZkStateReader A cluster state change: [WatchedEvent state:SyncConnected type:NodeDataChanged path:/collections/testcollection/state.json] for collection [testcollection] has occurred - updating... (live nodes size: [2])
   [junit4]   2> 1457286 INFO  (zkCallback-2108-thread-1-processing-n:127.0.0.1:45569_solr) [n:127.0.0.1:45569_solr    ] o.a.s.c.c.ZkStateReader A cluster state change: [WatchedEvent state:SyncConnected type:NodeDataChanged path:/collections/testcollection/state.json] for collection [testcollection] has occurred - updating... (live nodes size: [2])
   [junit4]   2> 1458190 INFO  (qtp6272479-10141) [n:127.0.0.1:42027_solr    ] o.a.s.s.HttpSolrCall [admin] webapp=null path=/admin/collections params={replicationFactor=2&collection.configName=solrCloudCollectionConfig&maxShardsPerNode=2&name=testcollection&nrtReplicas=2&action=CREATE&numShards=2&wt=javabin&version=2} status=0 QTime=3505
   [junit4]   2> 1458191 INFO  (TEST-TestAuthenticationFramework.testBasics-seed#[F70B69DD77D3190E]) [    ] o.a.s.c.AbstractDistribZkTestBase Wait for recoveries to finish - collection: testcollection failOnTimeout:true timeout (sec):330
   [junit4]   1> -
   [junit4]   1> replica:core_node2 rstate:active live:true
   [junit4]   1> replica:core_node5 rstate:active live:true
   [junit4]   1> replica:core_node7 rstate:active live:true
   [junit4]   1> replica:core_node8 rstate:active live:true
   [junit4]   1> no one is recoverying
   [junit4]   2> 1458192 INFO  (TEST-TestAuthenticationFramework.testBasics-seed#[F70B69DD77D3190E]) [    ] o.a.s.c.AbstractDistribZkTestBase Recoveries finished - collection: testcollection
   [junit4]   2> 1458197 INFO  (qtp6272479-10143) [n:127.0.0.1:42027_solr c:testcollection s:shard2 r:core_node7 x:testcollection_shard2_replica_n4] o.a.s.c.S.Request [testcollection_shard2_replica_n4]  webapp=/solr path=/select params={df=text&distrib=false&_stateVer_=testcollection:5&fl=id&fl=score&shards.purpose=4&start=0&fsv=true&shard.url=http://127.0.0.1:42027/solr/testcollection_shard2_replica_n4/|http://127.0.0.1:45569/solr/testcollection_shard2_replica_n6/&rows=10&version=2&q=*:*&NOW=1514842261235&isShard=true&wt=javabin} hits=0 status=0 QTime=0
   [junit4]   2> 1458198 INFO  (qtp6272479-10137) [n:127.0.0.1:42027_solr c:testcollection s:shard1 r:core_node2 x:testcollection_shard1_replica_n1] o.a.s.c.S.Request [testcollection_shard1_replica_n1]  webapp=/solr path=/select params={df=text&distrib=false&_stateVer_=testcollection:5&fl=id&fl=score&shards.purpose=4&start=0&fsv=true&shard.url=http://127.0.0.1:42027/solr/testcollection_shard1_replica_n1/|http://127.0.0.1:45569/solr/testcollection_shard1_replica_n3/&rows=10&version=2&q=*:*&NOW=1514842261235&isShard=true&wt=javabin} hits=0 status=0 QTime=0
   [junit4]   2> 1458199 INFO  (qtp6272479-10135) [n:127.0.0.1:42027_solr c:testcollection s:shard2 r:core_node7 x:testcollection_shard2_replica_n4] o.a.s.c.S.Request [testcollection_shard2_replica_n4]  webapp=/solr path=/select params={q=*:*&_stateVer_=testcollection:5&wt=javabin&version=2} hits=0 status=0 QTime=5
   [junit4]   2> 1458211 INFO  (qtp6272479-10220) [n:127.0.0.1:42027_solr c:testcollection s:shard1 r:core_node2 x:testcollection_shard1_replica_n1] o.a.s.u.p.LogUpdateProcessorFactory [testcollection_shard1_replica_n1]  webapp=/solr path=/update params={update.distrib=FROMLEADER&distrib.from=http://127.0.0.1:45569/solr/testcollection_shard1_replica_n3/&wt=javabin&version=2}{add=[1 (1588427238928285696)]} 0 3
   [junit4]   2> 1458212 INFO  (qtp12940565-10151) [n:127.0.0.1:45569_solr c:testcollection s:shard1 r:core_node5 x:testcollection_shard1_replica_n3] o.a.s.u.p.LogUpdateProcessorFactory [testcollection_shard1_replica_n3]  webapp=/solr path=/update params={_stateVer_=testcollection:5&wt=javabin&version=2}{add=[1 (1588427238928285696)]} 0 8
   [junit4]   2> 1458215 INFO  (qtp6272479-10141) [n:127.0.0.1:42027_solr c:testcollection s:shard1 r:core_node2 x:testcollection_shard1_replica_n1] o.a.s.u.DirectUpdateHandler2 start commit{_version_=1588427238939820032,optimize=false,openSearcher=true,waitSearcher=true,expungeDeletes=false,softCommit=false,prepareCommit=false}
   [junit4]   2> 1458215 INFO  (qtp6272479-10141) [n:127.0.0.1:42027_solr c:testcollection s:shard1 r:core_node2 x:testcollection_shard1_replica_n1] o.a.s.u.SolrIndexWriter Calling setCommitData with IW:org.apache.solr.update.SolrIndexWriter@1fa1914 commitCommandVersion:1588427238939820032
   [junit4]   2> 1458224 INFO  (qtp12940565-10146) [n:127.0.0.1:45569_solr c:testcollection s:shard1 r:core_node5 x:testcollection_shard1_replica_n3] o.a.s.u.DirectUpdateHandler2 start commit{_version_=1588427238949257216,optimize=false,openSearcher=true,waitSearcher=true,expungeDeletes=false,softCommit=false,prepareCommit=false}
   [junit4]   2> 1458224 INFO  (qtp12940565-10150) [n:127.0.0.1:45569_solr c:testcollection s:shard2 r:core_node8 x:testcollection_shard2_replica_n6] o.a.s.u.DirectUpdateHandler2 start commit{_version_=1588427238949257216,optimize=false,openSearcher=true,waitSearcher=true,expungeDeletes=false,softCommit=false,prepareCommit=false}
   [junit4]   2> 1458224 INFO  (qtp12940565-10146) [n:127.0.0.1:45569_solr c:testcollection s:shard1 r:core_node5 x:testcollection_shard1_replica_n3] o.a.s.u.SolrIndexWriter Calling setCommitData with IW:org.apache.solr.update.SolrIndexWriter@14f8b13 commitCommandVersion:1588427238949257216
   [junit4]   2> 1458225 INFO  (qtp6272479-10206) [n:127.0.0.1:42027_solr c:testcollection s:shard2 r:core_node7 x:testcollection_shard2_replica_n4] o.a.s.u.DirectUpdateHandler2 start commit{_version_=1588427238950305792,optimize=false,openSearcher=true,waitSearcher=true,expungeDeletes=false,softCommit=false,prepareCommit=false}
   [junit4]   2> 1458226 INFO  (qtp6272479-10141) [n:127.0.0.1:42027_solr c:testcollection s:shard1 r:core_node2 x:testcollection_shard1_replica_n1] o.a.s.s.SolrIndexSearcher Opening [Searcher@18b5427[testcollection_shard1_replica_n1] main]
   [junit4]   2> 1458227 INFO  (qtp6272479-10141) [n:127.0.0.1:42027_solr c:testcollection s:shard1 r:core_node2 x:testcollection_shard1_replica_n1] o.a.s.u.DirectUpdateHandler2 end_commit_flush
   [junit4]   2> 1458230 INFO  (searcherExecutor-4009-thread-1-processing-n:127.0.0.1:42027_solr x:testcollection_shard1_replica_n1 s:shard1 c:testcollection r:core_node2) [n:127.0.0.1:42027_solr c:testcollection s:shard1 r:core_node2 x:testcollection_shard1_replica_n1] o.a.s.c.SolrCore [testcollection_shard1_replica_n1] Registered new searcher Searcher@18b5427[testcollection_shard1_replica_n1] main{ExitableDirectoryReader(UninvertingDirectoryReader(Uninverting(_0(7.3.0):C1)))}
   [junit4]   2> 1458233 INFO  (qtp12940565-10150) [n:127.0.0.1:45569_solr c:testcollection s:shard2 r:core_node8 x:testcollection_shard2_replica_n6] o.a.s.u.DirectUpdateHandler2 No uncommitted changes. Skipping IW.commit.
   [junit4]   2> 1458234 INFO  (qtp12940565-10150) [n:127.0.0.1:45569_solr c:testcollection s:shard2 r:core_node8 x:testcollection_shard2_replica_n6] o.a.s.u.DirectUpdateHandler2 end_commit_flush
   [junit4]   2> 1458234 INFO  (qtp12940565-10150) [n:127.0.0.1:45569_solr c:testcollection s:shard2 r:core_node8 x:testcollection_shard2_replica_n6] o.a.s.u.p.LogUpdateProcessorFactory [testcollection_shard2_replica_n6]  webapp=/solr path=/update params={update.distrib=FROMLEADER&waitSearcher=true&openSearcher=true&commit=true&softCommit=false&distrib.from=http://127.0.0.1:45569/solr/testcollection_shard1_replica_n3/&commit_end_point=true&wt=javabin&version=2&expungeDeletes=false}{commit=} 0 10
   [junit4]   2> 1458234 INFO  (qtp6272479-10206) [n:127.0.0.1:42027_solr c:testcollection s:shard2 r:core_node7 x:testcollection_shard2_replica_n4] o.a.s.u.DirectUpdateHandler2 No uncommitted changes. Skipping IW.commit.
   [junit4]   2> 1458234 INFO  (qtp6272479-10206) [n:127.0.0.1:42027_solr c:testcollection s:shard2 r:core_node7 x:testcollection_shard2_replica_n4] o.a.s.u.DirectUpdateHandler2 end_commit_flush
   [junit4]   2> 1458235 INFO  (qtp6272479-10206) [n:127.0.0.1:42027_solr c:testcollection s:shard2 r:core_node7 x:testcollection_shard2_replica_n4] o.a.s.u.p.LogUpdateProcessorFactory [testcollection_shard2_replica_n4]  webapp=/solr path=/update params={update.distrib=FROMLEADER&waitSearcher=true&openSearcher=true&commit=true&softCommit=false&distrib.from=http://127.0.0.1:45569/solr/testcollection_shard1_replica_n3/&commit_end_point=true&wt=javabin&version=2&expungeDeletes=false}{commit=} 0 10
   [junit4]   2> 1458235 INFO  (qtp6272479-10141) [n:127.0.0.1:42027_solr c:testcollection s:shard1 r:core_node2 x:testcollection_shard1_replica_n1] o.a.s.u.p.LogUpdateProcessorFactory [testcollection_shard1_replica_n1]  webapp=/solr path=/update params={update.distrib=FROMLEADER&waitSearcher=true&openSearcher=true&commit=true&softCommit=false&distrib.from=http://127.0.0.1:45569/solr/testcollection_shard1_replica_n3/&commit_end_point=true&wt=javabin&version=2&expungeDeletes=false}{commit=} 0 20
   [junit4]   2> 1458238 INFO  (qtp12940565-10146) [n:127.0.0.1:45569_solr c:testcollection s:shard1 r:core_node5 x:testcollection_shard1_replica_n3] o.a.s.s.SolrIndexSearcher Opening [Searcher@1587f98[testcollection_shard1_replica_n3] main]
   [junit4]   2> 1458239 INFO  (qtp12940565-10146) [n:127.0.0.1:45569_solr c:testcollection s:shard1 r:core_node5 x:testcollection_shard1_replica_n3] o.a.s.u.DirectUpdateHandler2 end_commit_flush
   [junit4]   2> 1458241 INFO  (searcherExecutor-4008-thread-1-processing-n:127.0.0.1:45569_solr x:testcollection_shard1_replica_n3 s:shard1 c:testcollection r:core_node5) [n:127.0.0.1:45569_solr c:testcollection s:shard1 r:core_node5 x:testcollection_shard1_replica_n3] o.a.s.c.SolrCore [testcollection_shard1_replica_n3] Registered new searcher Searcher@1587f98[testcollection_shard1_replica_n3] main{ExitableDirectoryReader(UninvertingDirectoryReader(Uninverting(_0(7.3.0):C1)))}
   [junit4]   2> 1458242 INFO  (qtp12940565-10146) [n:127.0.0.1:45569_solr c:testcollection s:shard1 r:core_node5 x:testcollection_shard1_replica_n3] o.a.s.u.p.LogUpdateProcessorFactory [testcollection_shard1_replica_n3]  webapp=/solr path=/update params={update.distrib=FROMLEADER&waitSearcher=true&openSearcher=true&commit=true&softCommit=false&distrib.from=http://127.0.0.1:45569/solr/testcollection_shard1_replica_n3/&commit_end_point=true&wt=javabin&version=2&expungeDeletes=false}{commit=} 0 18
   [junit4]   2> 1458242 INFO  (qtp12940565-10140) [n:127.0.0.1:45569_solr c:testcollection s:shard1 r:core_node5 x:testcollection_shard1_replica_n3] o.a.s.u.p.LogUpdateProcessorFactory [testcollection_shard1_replica_n3]  webapp=/solr path=/update params={_stateVer_=testcollection:5&commit=true&wt=javabin&version=2}{commit=} 0 29
   [junit4]   2> 1458246 INFO  (qtp6272479-10145) [n:127.0.0.1:42027_solr c:testcollection s:shard2 r:core_node7 x:testcollection_shard2_replica_n4] o.a.s.c.S.Request [testcollection_shard2_replica_n4]  webapp=/solr path=/select params={df=text&distrib=false&_stateVer_=testcollection:5&fl=id&fl=score&shards.purpose=4&start=0&fsv=true&shard.url=http://127.0.0.1:42027/solr/testcollection_shard2_replica_n4/|http://127.0.0.1:45569/solr/testcollection_shard2_replica_n6/&rows=10&version=2&q=*:*&NOW=1514842261286&isShard=true&wt=javabin} hits=0 status=0 QTime=0
   [junit4]   2> 1458246 INFO  (qtp6272479-10143) [n:127.0.0.1:42027_solr c:testcollection s:shard1 r:core_node2 x:testcollection_shard1_replica_n1] o.a.s.c.S.Request [testcollection_shard1_replica_n1]  webapp=/solr path=/select params={df=text&distrib=false&_stateVer_=testcollection:5&fl=id&fl=score&shards.purpose=4&start=0&fsv=true&shard.url=http://127.0.0.1:42027/solr/testcollection_shard1_replica_n1/|http://127.0.0.1:45569/solr/testcollection_shard1_replica_n3/&rows=10&version=2&q=*:*&NOW=1514842261286&isShard=true&wt=javabin} hits=1 status=0 QTime=0
   [junit4]   2> 1458248 INFO  (qtp6272479-10135) [n:127.0.0.1:42027_solr c:testcollection s:shard1 r:core_node2 x:testcollection_shard1_replica_n1] o.a.s.c.S.Request [testcollection_shard1_replica_n1]  webapp=/solr path=/select params={q=*:*&df=text&distrib=false&_stateVer_=testcollection:5&shards.purpose=64&NOW=1514842261286&ids=1&isShard=true&shard.url=http://127.0.0.1:42027/solr/testcollection_shard1_replica_n1/|http://127.0.0.1:45569/solr/testcollection_shard1_replica_n3/&wt=javabin&version=2} status=0 QTime=0
   [junit4]   2> 1458249 INFO  (qtp12940565-10148) [n:127.0.0.1:45569_solr c:testcollection s:shard1 r:core_node5 x:testcollection_shard1_replica_n3] o.a.s.c.S.Request [testcollection_shard1_replica_n3]  webapp=/solr path=/select params={q=*:*&_stateVer_=testcollection:5&wt=javabin&version=2} hits=1 status=0 QTime=5
   [junit4]   2> 1458250 INFO  (qtp6272479-10138) [n:127.0.0.1:42027_solr    ] o.a.s.h.a.CollectionsHandler Invoked Collection Action :delete with params name=testcollection&action=DELETE&wt=javabin&version=2 and sendToOCPQueue=true
   [junit4]   2> 1458253 INFO  (OverseerThreadFactory-4001-thread-2-processing-n:127.0.0.1:45569_solr) [n:127.0.0.1:45569_solr    ] o.a.s.c.OverseerCollectionMessageHandler Executing Collection Cmd : action=UNLOAD&deleteInstanceDir=true&deleteDataDir=true
   [junit4]   2> 1458253 INFO  (OverseerCollectionConfigSetProcessor-99276702169563142-127.0.0.1:45569_solr-n_0000000000) [n:127.0.0.1:45569_solr    ] o.a.s.c.OverseerTaskQueue Response ZK path: /overseer/collection-queue-work/qnr-0000000000 doesn't exist.  Requestor may have disconnected from ZooKeeper
   [junit4]   2> 1458254 INFO  (qtp12940565-10142) [n:127.0.0.1:45569_solr    ] o.a.s.m.SolrMetricManager Closing metric reporters for registry=solr.core.testcollection.shard1.replica_n3, tag=null
   [junit4]   2> 1458254 INFO  (qtp6272479-10220) [n:127.0.0.1:42027_solr    ] o.a.s.m.SolrMetricManager Closing metric reporters for registry=solr.core.testcollection.shard1.replica_n1, tag=null
   [junit4]   2> 1458254 INFO  (qtp12940565-10142) [n:127.0.0.1:45569_solr    ] o.a.s.m.r.SolrJmxReporter Closing reporter [org.apache.solr.metrics.reporters.SolrJmxReporter@9cc1bb: rootName = solr_45569, domain = solr.core.testcollection.shard1.replica_n3, service url = null, agent id = null] for registry solr.core.testcollection.shard1.replica_n3 / com.codahale.metrics.MetricRegistry@5e89f1
   [junit4]   2> 1458254 INFO  (qtp6272479-10220) [n:127.0.0.1:42027_solr    ] o.a.s.m.r.SolrJmxReporter Closing reporter [org.apache.solr.metrics.reporters.SolrJmxReporter@1b0e96: rootName = solr_42027, domain = solr.core.testcollection.shard1.replica_n1, service url = null, agent id = null] for registry solr.core.testcollection.shard1.replica_n1 / com.codahale.metrics.MetricRegistry@1a2b145
   [junit4]   2> 1458284 INFO  (qtp12940565-10151) [n:127.0.0.1:45569_solr    ] o.a.s.m.SolrMetricManager Closing metric reporters for registry=solr.core.testcollection.shard2.replica_n6, tag=null
   [junit4]   2> 1458284 INFO  (qtp12940565-10151) [n:127.0.0.1:45569_solr    ] o.a.s.m.r.SolrJmxReporter Closing reporter [org.apache.solr.metrics.reporters.SolrJmxReporter@1239b04: rootName = solr_45569, domain = solr.core.testcollection.shard2.replica_n6, service url = null, agent id = null] for registry solr.core.testcollection.shard2.replica_n6 / com.codahale.metrics.MetricRegistry@1d4d626
   [junit4]   2> 1458285 INFO  (qtp12940565-10142) [n:127.0.0.1:45569_solr    ] o.a.s.c.SolrCore [testcollection_shard1_replica_n3]  CLOSING SolrCore org.apache.solr.core.SolrCore@be1cf8
   [junit4]   2> 1458288 INFO  (qtp6272479-10137) [n:127.0.0.1:42027_solr    ] o.a.s.m.SolrMetricManager Closing metric reporters for registry=solr.core.testcollection.shard2.replica_n4, tag=null
   [junit4]   2> 1458289 INFO  (qtp6272479-10137) [n:127.0.0.1:42027_solr    ] o.a.s.m.r.SolrJmxReporter Closing reporter [org.apache.solr.metrics.reporters.SolrJmxReporter@1624401: rootName = solr_42027, domain = solr.core.testcollection.shard2.replica_n4, service url = null, agent id = null] for registry solr.core.testcollection.shard2.replica_n4 / com.codahale.metrics.MetricRegistry@1df681
   [junit4]   2> 1458289 INFO  (qtp6272479-10220) [n:127.0.0.1:42027_solr    ] o.a.s.c.SolrCore [testcollection_shard1_replica_n1]  CLOSING SolrCore org.apache.solr.core.SolrCore@7a014
   [junit4]   2> 1458302 INFO  (qtp12940565-10142) [n:127.0.0.1:45569_solr    ] o.a.s.m.SolrMetricManager Closing metric reporters for registry=solr.core.testcollection.shard1.replica_n3, tag=12459256
   [junit4]   2> 1458303 INFO  (qtp12940565-10151) [n:127.0.0.1:45569_solr    ] o.a.s.c.SolrCore [testcollection_shard2_replica_n6]  CLOSING SolrCore org.apache.solr.core.SolrCore@70bb21
   [junit4]   2> 1458303 INFO  (qtp12940565-10142) [n:127.0.0.1:45569_solr    ] o.a.s.m.SolrMetricManager Closing metric reporters for registry=solr.collection.testcollection.shard1.leader, tag=12459256
   [junit4]   2> 1458303 INFO  (qtp12940565-10151) [n:127.0.0.1:45569_solr    ] o.a.s.m.SolrMetricManager Closing metric reporters for registry=solr.core.testcollection.shard2.replica_n6, tag=7387937
   [junit4]   2> 1458303 INFO  (qtp12940565-10151) [n:127.0.0.1:45569_solr    ] o.a.s.m.SolrMetricManager Closing metric reporters for registry=solr.collection.testcollection.shard2.leader, tag=7387937
   [junit4]   2> 1458306 WARN  (zkCallback-2106-thread-1-processing-n:127.0.0.1:42027_solr) [n:127.0.0.1:42027_solr    ] o.a.s.c.LeaderElector 
   [junit4]   2> org.apache.solr.common.SolrException: SolrCore not found:testcollection_shard2_replica_n4 in []
   [junit4]   2> 	at org.apache.solr.cloud.ShardLeaderElectionContext.runLeaderProcess(ElectionContext.java:310)
   [junit4]   2> 	at org.apache.solr.cloud.LeaderElector.runIamLeaderProcess(LeaderElector.java:170)
   [junit4]   2> 	at org.apache.solr.cloud.LeaderElector.checkIfIamLeader(LeaderElector.java:135)
   [junit4]   2> 	at org.apache.solr.cloud.LeaderElector.access$200(LeaderElector.java:56)
   [junit4]   2> 	at org.apache.solr.cloud.LeaderElector$ElectionWatcher.process(LeaderElector.java:348)
   [junit4]   2> 	at org.apache.solr.common.cloud.SolrZkClient$1.lambda$process$1(SolrZkClient.java:268)
   [junit4]   2> 	at java.util.concurrent.Executors$RunnableAdapter.call(Executors.java:511)
   [junit4]   2> 	at java.util.concurrent.FutureTask.run(FutureTask.java:266)
   [junit4]   2> 	at org.apache.solr.common.util.ExecutorUtil$MDCAwareThreadPoolExecutor.lambda$execute$0(ExecutorUtil.java:188)
   [junit4]   2> 	at java.util.concurrent.ThreadPoolExecutor.runWorker(ThreadPoolExecutor.java:1149)
   [junit4]   2> 	at java.util.concurrent.ThreadPoolExecutor$Worker.run(ThreadPoolExecutor.java:624)
   [junit4]   2> 	at java.lang.Thread.run(Thread.java:748)
   [junit4]   2> 1458309 WARN  (zkCallback-2106-thread-1-processing-n:127.0.0.1:42027_solr) [n:127.0.0.1:42027_solr    ] o.a.s.c.LeaderElector 
   [junit4]   2> org.apache.solr.common.SolrException: SolrCore not found:testcollection_shard1_replica_n1 in []
   [junit4]   2> 	at org.apache.solr.cloud.ShardLeaderElectionContext.runLeaderProcess(ElectionContext.java:310)
   [junit4]   2> 	at org.apache.solr.cloud.LeaderElector.runIamLeaderProcess(LeaderElector.java:170)
   [junit4]   2> 	at org.apache.solr.cloud.LeaderElector.checkIfIamLeader(LeaderElector.java:135)
   [junit4]   2> 	at org.apache.solr.cloud.LeaderElector.access$200(LeaderElector.java:56)
   [junit4]   2> 	at org.apache.solr.cloud.LeaderElector$ElectionWatcher.process(LeaderElector.java:348)
   [junit4]   2> 	at org.apache.solr.common.cloud.SolrZkClient$1.lambda$process$1(SolrZkClient.java:268)
   [junit4]   2> 	at java.util.concurrent.Executors$RunnableAdapter.call(Executors.java:511)
   [junit4]   2> 	at java.util.concurrent.FutureTask.run(FutureTask.java:266)
   [junit4]   2> 	at org.apache.solr.common.util.ExecutorUtil$MDCAwareThreadPoolExecutor.lambda$execute$0(ExecutorUtil.java:188)
   [junit4]   2> 	at java.util.concurrent.ThreadPoolExecutor.runWorker(ThreadPoolExecutor.java:1149)
   [junit4]   2> 	at java.util.concurrent.ThreadPoolExecutor$Worker.run(ThreadPoolExecutor.java:624)
   [junit4]   2> 	at java.lang.Thread.run(Thread.java:748)
   [junit4]   2> 1458310 INFO  (qtp12940565-10151) [n:127.0.0.1:45569_solr    ] o.a.s.s.HttpSolrCall [admin] webapp=null path=/admin/cores params={deleteInstanceDir=true&core=testcollection_shard2_replica_n6&qt=/admin/cores&deleteDataDir=true&action=UNLOAD&wt=javabin&version=2} status=0 QTime=53
   [junit4]   2> 1458310 INFO  (qtp12940565-10142) [n:127.0.0.1:45569_solr    ] o.a.s.s.HttpSolrCall [admin] webapp=null path=/admin/cores params={deleteInstanceDir=true&core=testcollection_shard1_replica_n3&qt=/admin/cores&deleteDataDir=true&action=UNLOAD&wt=javabin&version=2} status=0 QTime=56
   [junit4]   2> 1458312 INFO  (qtp6272479-10220) [n:127.0.0.1:42027_solr    ] o.a.s.m.SolrMetricManager Closing metric reporters for registry=solr.core.testcollection.shard1.replica_n1, tag=499732
   [junit4]   2> 1458312 INFO  (qtp6272479-10220) [n:127.0.0.1:42027_solr    ] o.a.s.m.SolrMetricManager Closing metric reporters for registry=solr.collection.testcollection.shard1.leader, tag=499732
   [junit4]   2> 1458312 INFO  (qtp6272479-10137) [n:127.0.0.1:42027_solr    ] o.a.s.c.SolrCore [testcollection_shard2_replica_n4]  CLOSING SolrCore org.apache.solr.core.SolrCore@1990937
   [junit4]   2> 1458314 INFO  (qtp6272479-10137) [n:127.0.0.1:42027_solr    ] o.a.s.m.SolrMetricManager Closing metric reporters for registry=solr.core.testcollection.shard2.replica_n4, tag=26806583
   [junit4]   2> 1458314 INFO  (qtp6272479-10137) [n:127.0.0.1:42027_solr    ] o.a.s.m.SolrMetricManager Closing metric reporters for registry=solr.collection.testcollection.shard2.leader, tag=26806583
   [junit4]   2> 1458316 INFO  (qtp6272479-10137) [n:127.0.0.1:42027_solr    ] o.a.s.c.ShardLeaderElectionContextBase No version found for ephemeral leader parent node, won't remove previous leader registration.
   [junit4]   2> 1458316 INFO  (qtp6272479-10220) [n:127.0.0.1:42027_solr    ] o.a.s.c.ShardLeaderElecti

[...truncated too long message...]

sk(ThreadLeakControl.java:817)
   [junit4]   2>         at com.carrotsearch.randomizedtesting.ThreadLeakControl$3.evaluate(ThreadLeakControl.java:468)
   [junit4]   2>         at com.carrotsearch.randomizedtesting.RandomizedRunner.runSingleTest(RandomizedRunner.java:943)
   [junit4]   2>         at com.carrotsearch.randomizedtesting.RandomizedRunner$5.evaluate(RandomizedRunner.java:829)
   [junit4]   2>         at com.carrotsearch.randomizedtesting.RandomizedRunner$6.evaluate(RandomizedRunner.java:879)
   [junit4]   2>         at com.carrotsearch.randomizedtesting.RandomizedRunner$7.evaluate(RandomizedRunner.java:890)
   [junit4]   2>         at com.carrotsearch.randomizedtesting.rules.StatementAdapter.evaluate(StatementAdapter.java:36)
   [junit4]   2>         at com.carrotsearch.randomizedtesting.rules.SystemPropertiesRestoreRule$1.evaluate(SystemPropertiesRestoreRule.java:57)
   [junit4]   2>         at org.apache.lucene.util.AbstractBeforeAfterRule$1.evaluate(AbstractBeforeAfterRule.java:45)
   [junit4]   2>         at com.carrotsearch.randomizedtesting.rules.StatementAdapter.evaluate(StatementAdapter.java:36)
   [junit4]   2>         at org.apache.lucene.util.TestRuleStoreClassName$1.evaluate(TestRuleStoreClassName.java:41)
   [junit4]   2>         at com.carrotsearch.randomizedtesting.rules.NoShadowingOrOverridesOnMethodsRule$1.evaluate(NoShadowingOrOverridesOnMethodsRule.java:40)
   [junit4]   2>         at com.carrotsearch.randomizedtesting.rules.NoShadowingOrOverridesOnMethodsRule$1.evaluate(NoShadowingOrOverridesOnMethodsRule.java:40)
   [junit4]   2>         at com.carrotsearch.randomizedtesting.rules.StatementAdapter.evaluate(StatementAdapter.java:36)
   [junit4]   2>         at com.carrotsearch.randomizedtesting.rules.StatementAdapter.evaluate(StatementAdapter.java:36)
   [junit4]   2>         at com.carrotsearch.randomizedtesting.rules.StatementAdapter.evaluate(StatementAdapter.java:36)
   [junit4]   2>         at org.apache.lucene.util.TestRuleAssertionsRequired$1.evaluate(TestRuleAssertionsRequired.java:53)
   [junit4]   2>         at org.apache.lucene.util.TestRuleMarkFailure$1.evaluate(TestRuleMarkFailure.java:47)
   [junit4]   2>         at org.apache.lucene.util.TestRuleIgnoreAfterMaxFailures$1.evaluate(TestRuleIgnoreAfterMaxFailures.java:64)
   [junit4]   2>         at org.apache.lucene.util.TestRuleIgnoreTestSuites$1.evaluate(TestRuleIgnoreTestSuites.java:54)
   [junit4]   2>         at com.carrotsearch.randomizedtesting.rules.StatementAdapter.evaluate(StatementAdapter.java:36)
   [junit4]   2>         at com.carrotsearch.randomizedtesting.ThreadLeakControl$StatementRunner.run(ThreadLeakControl.java:368)
   [junit4]   2>         at java.lang.Thread.run(Thread.java:748)
   [junit4]   2> Jan 01, 2018 11:47:36 PM com.carrotsearch.randomizedtesting.ThreadLeakControl tryToInterruptAll
   [junit4]   2> INFO: Starting to interrupt leaked threads:
   [junit4]   2>    1) Thread[id=35343, name=TEST-TestGenericDistributedQueue.testDistributedQueue-seed#[F70B69DD77D3190E], state=TIMED_WAITING, group=TGRP-TestGenericDistributedQueue]
   [junit4]   2> 9653436 INFO  (TEST-TestGenericDistributedQueue.testDistributedQueue-seed#[F70B69DD77D3190E]) [    ] o.a.s.SolrTestCaseJ4 ###Ending testDistributedQueue
   [junit4]   2> NOTE: leaving temporary files on disk at: /home/jenkins/workspace/Lucene-Solr-7.x-Linux/solr/build/solr-core/test/J2/temp/solr.cloud.autoscaling.sim.TestGenericDistributedQueue_F70B69DD77D3190E-001
   [junit4]   2> Jan 01, 2018 11:47:36 PM com.carrotsearch.randomizedtesting.ThreadLeakControl tryToInterruptAll
   [junit4]   2> INFO: All leaked threads terminated.
   [junit4]   2> NOTE: test params are: codec=FastCompressingStoredFields(storedFieldsFormat=CompressingStoredFieldsFormat(compressionMode=FAST, chunkSize=1, maxDocsPerChunk=827, blockSize=5), termVectorsFormat=CompressingTermVectorsFormat(compressionMode=FAST, chunkSize=1, blockSize=5)), sim=RandomSimilarity(queryNorm=true): {}, locale=en-PH, timezone=Africa/Timbuktu
   [junit4]   2> NOTE: Linux 4.10.0-40-generic i386/Oracle Corporation 1.8.0_144 (32-bit)/cpus=8,threads=1,free=394743856,total=500170752
   [junit4]   2> NOTE: All tests run in this JVM: [AliasIntegrationTest, HLLSerializationTest, SortByFunctionTest, HdfsBasicDistributedZkTest, TestConfigSetsAPIZkFailure, TestTriggerIntegration, TestPullReplica, DefaultValueUpdateProcessorTest, TestEmbeddedSolrServerConstructors, TestSolrFieldCacheBean, TestNodeLostTrigger, TestPivotHelperCode, SegmentsInfoRequestHandlerTest, ReplicationFactorTest, TestSchemalessBufferedUpdates, TestCharFilters, TestRequestForwarding, CoreAdminHandlerTest, TestFileDictionaryLookup, TestConfigSets, HttpTriggerListenerTest, TestSolrConfigHandlerConcurrent, PreAnalyzedUpdateProcessorTest, TestComputePlanAction, TestCloudPivotFacet, MigrateRouteKeyTest, BJQParserTest, BadComponentTest, ConnectionReuseTest, TestDynamicFieldCollectionResource, TestSolrDeletionPolicy2, TestStressLiveNodes, SimplePostToolTest, TestExtendedDismaxParser, UniqFieldsUpdateProcessorFactoryTest, TestNestedDocsSort, BadCopyFieldTest, TestDistributedMissingSort, TestCoreContainer, BitVectorTest, CdcrUpdateLogTest, DeleteNodeTest, ComputePlanActionTest, TestTrieFacet, NodeMutatorTest, SSLMigrationTest, SpellPossibilityIteratorTest, IndexSchemaTest, TestShardHandlerFactory, TimeZoneUtilsTest, LeaderElectionTest, TriLevelCompositeIdRoutingTest, TestTolerantUpdateProcessorRandomCloud, TestSolrCloudWithSecureImpersonation, TestNumericRangeQuery64, XmlUpdateRequestHandlerTest, TestSegmentSorting, DirectSolrSpellCheckerTest, JvmMetricsTest, TestZkChroot, RequiredFieldsTest, TestSQLHandler, TestRestManager, TestTrie, TestSchemaVersionResource, PKIAuthenticationIntegrationTest, TestFuzzyAnalyzedSuggestions, SpatialHeatmapFacetsTest, HdfsThreadLeakTest, AlternateDirectoryTest, HdfsDirectoryFactoryTest, EchoParamsTest, EnumFieldTest, TestSolrCLIRunExample, SuggesterTest, DistributedFacetPivotLargeTest, TestHdfsCloudBackupRestore, OverseerCollectionConfigSetProcessorTest, TestDistribIDF, V2StandaloneTest, TestCollectionAPIs, TestSolrXml, TestReload, ReturnFieldsTest, TestNoOpRegenerator, TestFieldResource, CollectionReloadTest, TestManagedSchemaThreadSafety, TestJsonRequest, CSVRequestHandlerTest, TestValueSourceCache, TestFunctionQuery, RecoveryAfterSoftCommitTest, TestCollectionsAPIViaSolrCloudCluster, TestLegacyField, OverseerTest, TestDistribDocBasedVersion, QueryElevationComponentTest, TestMaxTokenLenTokenizer, TestRealTimeGet, ChaosMonkeyNothingIsSafeTest, SolrTestCaseJ4Test, TestMinMaxOnMultiValuedField, RuleEngineTest, XsltUpdateRequestHandlerTest, TestComplexPhraseLeadingWildcard, SolrJmxReporterTest, HdfsDirectoryTest, SolrGangliaReporterTest, MoveReplicaHDFSTest, SolrMetricManagerTest, MetricsHandlerTest, DistribJoinFromCollectionTest, TestLRUStatsCache, TestFieldCache, NodeLostTriggerTest, TestHashQParserPlugin, DeleteStatusTest, TestMaxScoreQueryParser, BlockCacheTest, LoggingHandlerTest, TestIndexSearcher, TestPartialUpdateDeduplication, OverseerStatusTest, BasicDistributedZkTest, BasicDistributedZk2Test, UnloadDistributedZkTest, OpenCloseCoreStressTest, ShardRoutingTest, RecoveryZkTest, FullSolrCloudDistribCmdsTest, TestRandomDVFaceting, TestDistributedGrouping, TestRecovery, TestHashPartitioner, DistributedSpellCheckComponentTest, TermVectorComponentDistributedTest, TestJoin, TestSolr4Spatial, SolrCoreTest, StatsComponentTest, SolrCmdDistributorTest, PeerSyncTest, BasicFunctionalityTest, TestLazyCores, HighlighterTest, ShowFileRequestHandlerTest, SolrIndexSplitterTest, TestCoreDiscovery, SolrRequestParserTest, TestCSVLoader, WordBreakSolrSpellCheckerTest, SolrCoreCheckLockOnStartupTest, TestUpdate, TestAtomicUpdateErrorCases, TestSolrDeletionPolicy1, SolrInfoBeanTest, IndexBasedSpellCheckerTest, DisMaxRequestHandlerTest, TestQueryUtils, PrimitiveFieldTypeTest, FileBasedSpellCheckerTest, RequestHandlersTest, MoreLikeThisHandlerTest, TestSolrQueryParser, RegexBoostProcessorTest, QueryParsingTest, TestComponentsName, TestLFUCache, TestMergePolicyConfig, MultiTermTest, TestDocSet, TestBinaryField, TestSearchPerf, TestElisionMultitermQuery, OutputWriterTest, TestSolrCoreProperties, TestPostingsSolrHighlighter, NotRequiredUniqueKeyTest, TestCodecSupport, TestLMJelinekMercerSimilarityFactory, ScriptEngineTest, PluginInfoTest, PreAnalyzedFieldTest, ClusterStateTest, TestLRUCache, TestDocumentBuilder, UUIDFieldTest, TestRTGBase, CursorPagingTest, TestCrossCoreJoin, TestCursorMarkWithoutUniqueKey, TestTolerantSearch, TestEmbeddedSolrServerAdminHandler, TestEmbeddedSolrServerSchemaAPI, ActionThrottleTest, AsyncCallRequestStatusResponseTest, CleanupOldIndexTest, CloudExitableDirectoryReaderTest, CollectionTooManyReplicasTest, CollectionsAPISolrJTest, DeleteInactiveReplicaTest, DeleteShardTest, DocValuesNotIndexedTest, ForceLeaderTest, LegacyCloudClusterPropTest, OutOfBoxZkACLAndCredentialsProvidersTest, OverriddenZkACLAndCredentialsProvidersTest, RollingRestartTest, TestCloudDeleteByQuery, TestCloudPseudoReturnFields, TestCollectionAPI, TestCryptoKeys, TestLeaderInitiatedRecoveryThread, TestOnReconnectListenerSupport, TestPullReplicaErrorHandling, TestStressCloudBlindAtomicUpdates, AutoScalingHandlerTest, ExecutePlanActionTest, SearchRateTriggerTest, TestClusterStateProvider, TestDistribStateManager, TestGenericDistributedQueue]
   [junit4]   2> NOTE: reproduce with: ant test  -Dtestcase=TestGenericDistributedQueue -Dtests.seed=F70B69DD77D3190E -Dtests.multiplier=3 -Dtests.slow=true -Dtests.locale=en-PH -Dtests.timezone=Africa/Timbuktu -Dtests.asserts=true -Dtests.file.encoding=UTF-8
   [junit4] ERROR   0.00s J2 | TestGenericDistributedQueue (suite) <<<
   [junit4]    > Throwable #1: java.lang.Exception: Suite timeout exceeded (>= 7200000 msec).
   [junit4]    > 	at __randomizedtesting.SeedInfo.seed([F70B69DD77D3190E]:0)
   [junit4] Completed [764/764 (4!)] on J2 in 7220.17s, 4 tests, 2 errors <<< FAILURES!

[...truncated 43887 lines...]

Mime
View raw message