lucene-dev mailing list archives

Site index · List index
Message view « Date » · « Thread »
Top « Date » · « Thread »
From Policeman Jenkins Server <jenk...@thetaphi.de>
Subject [JENKINS] Lucene-Solr-master-MacOSX (64bit/jdk1.8.0) - Build # 4388 - Still Unstable!
Date Tue, 16 Jan 2018 03:51:33 GMT
Build: https://jenkins.thetaphi.de/job/Lucene-Solr-master-MacOSX/4388/
Java: 64bit/jdk1.8.0 -XX:+UseCompressedOops -XX:+UseSerialGC

1 tests failed.
FAILED:  org.apache.solr.cloud.FullSolrCloudDistribCmdsTest.test

Error Message:
Could not find collection:collection2

Stack Trace:
java.lang.AssertionError: Could not find collection:collection2
	at __randomizedtesting.SeedInfo.seed([5FCF99FE871EC427:D79BA62429E2A9DF]:0)
	at org.junit.Assert.fail(Assert.java:93)
	at org.junit.Assert.assertTrue(Assert.java:43)
	at org.junit.Assert.assertNotNull(Assert.java:526)
	at org.apache.solr.cloud.AbstractDistribZkTestBase.waitForRecoveriesToFinish(AbstractDistribZkTestBase.java:155)
	at org.apache.solr.cloud.AbstractDistribZkTestBase.waitForRecoveriesToFinish(AbstractDistribZkTestBase.java:140)
	at org.apache.solr.cloud.AbstractDistribZkTestBase.waitForRecoveriesToFinish(AbstractDistribZkTestBase.java:135)
	at org.apache.solr.cloud.AbstractFullDistribZkTestBase.waitForRecoveriesToFinish(AbstractFullDistribZkTestBase.java:913)
	at org.apache.solr.cloud.FullSolrCloudDistribCmdsTest.testIndexingBatchPerRequestWithHttpSolrClient(FullSolrCloudDistribCmdsTest.java:612)
	at org.apache.solr.cloud.FullSolrCloudDistribCmdsTest.test(FullSolrCloudDistribCmdsTest.java:152)
	at sun.reflect.NativeMethodAccessorImpl.invoke0(Native Method)
	at sun.reflect.NativeMethodAccessorImpl.invoke(NativeMethodAccessorImpl.java:62)
	at sun.reflect.DelegatingMethodAccessorImpl.invoke(DelegatingMethodAccessorImpl.java:43)
	at java.lang.reflect.Method.invoke(Method.java:498)
	at com.carrotsearch.randomizedtesting.RandomizedRunner.invoke(RandomizedRunner.java:1737)
	at com.carrotsearch.randomizedtesting.RandomizedRunner$8.evaluate(RandomizedRunner.java:934)
	at com.carrotsearch.randomizedtesting.RandomizedRunner$9.evaluate(RandomizedRunner.java:970)
	at com.carrotsearch.randomizedtesting.RandomizedRunner$10.evaluate(RandomizedRunner.java:984)
	at org.apache.solr.BaseDistributedSearchTestCase$ShardsRepeatRule$ShardsFixedStatement.callStatement(BaseDistributedSearchTestCase.java:993)
	at org.apache.solr.BaseDistributedSearchTestCase$ShardsRepeatRule$ShardsStatement.evaluate(BaseDistributedSearchTestCase.java:968)
	at com.carrotsearch.randomizedtesting.rules.SystemPropertiesRestoreRule$1.evaluate(SystemPropertiesRestoreRule.java:57)
	at org.apache.lucene.util.TestRuleSetupTeardownChained$1.evaluate(TestRuleSetupTeardownChained.java:49)
	at org.apache.lucene.util.AbstractBeforeAfterRule$1.evaluate(AbstractBeforeAfterRule.java:45)
	at org.apache.lucene.util.TestRuleThreadAndTestName$1.evaluate(TestRuleThreadAndTestName.java:48)
	at org.apache.lucene.util.TestRuleIgnoreAfterMaxFailures$1.evaluate(TestRuleIgnoreAfterMaxFailures.java:64)
	at org.apache.lucene.util.TestRuleMarkFailure$1.evaluate(TestRuleMarkFailure.java:47)
	at com.carrotsearch.randomizedtesting.rules.StatementAdapter.evaluate(StatementAdapter.java:36)
	at com.carrotsearch.randomizedtesting.ThreadLeakControl$StatementRunner.run(ThreadLeakControl.java:368)
	at com.carrotsearch.randomizedtesting.ThreadLeakControl.forkTimeoutingTask(ThreadLeakControl.java:817)
	at com.carrotsearch.randomizedtesting.ThreadLeakControl$3.evaluate(ThreadLeakControl.java:468)
	at com.carrotsearch.randomizedtesting.RandomizedRunner.runSingleTest(RandomizedRunner.java:943)
	at com.carrotsearch.randomizedtesting.RandomizedRunner$5.evaluate(RandomizedRunner.java:829)
	at com.carrotsearch.randomizedtesting.RandomizedRunner$6.evaluate(RandomizedRunner.java:879)
	at com.carrotsearch.randomizedtesting.RandomizedRunner$7.evaluate(RandomizedRunner.java:890)
	at com.carrotsearch.randomizedtesting.rules.StatementAdapter.evaluate(StatementAdapter.java:36)
	at com.carrotsearch.randomizedtesting.rules.SystemPropertiesRestoreRule$1.evaluate(SystemPropertiesRestoreRule.java:57)
	at org.apache.lucene.util.AbstractBeforeAfterRule$1.evaluate(AbstractBeforeAfterRule.java:45)
	at com.carrotsearch.randomizedtesting.rules.StatementAdapter.evaluate(StatementAdapter.java:36)
	at org.apache.lucene.util.TestRuleStoreClassName$1.evaluate(TestRuleStoreClassName.java:41)
	at com.carrotsearch.randomizedtesting.rules.NoShadowingOrOverridesOnMethodsRule$1.evaluate(NoShadowingOrOverridesOnMethodsRule.java:40)
	at com.carrotsearch.randomizedtesting.rules.NoShadowingOrOverridesOnMethodsRule$1.evaluate(NoShadowingOrOverridesOnMethodsRule.java:40)
	at com.carrotsearch.randomizedtesting.rules.StatementAdapter.evaluate(StatementAdapter.java:36)
	at com.carrotsearch.randomizedtesting.rules.StatementAdapter.evaluate(StatementAdapter.java:36)
	at com.carrotsearch.randomizedtesting.rules.StatementAdapter.evaluate(StatementAdapter.java:36)
	at org.apache.lucene.util.TestRuleAssertionsRequired$1.evaluate(TestRuleAssertionsRequired.java:53)
	at org.apache.lucene.util.TestRuleMarkFailure$1.evaluate(TestRuleMarkFailure.java:47)
	at org.apache.lucene.util.TestRuleIgnoreAfterMaxFailures$1.evaluate(TestRuleIgnoreAfterMaxFailures.java:64)
	at org.apache.lucene.util.TestRuleIgnoreTestSuites$1.evaluate(TestRuleIgnoreTestSuites.java:54)
	at com.carrotsearch.randomizedtesting.rules.StatementAdapter.evaluate(StatementAdapter.java:36)
	at com.carrotsearch.randomizedtesting.ThreadLeakControl$StatementRunner.run(ThreadLeakControl.java:368)
	at java.lang.Thread.run(Thread.java:748)




Build Log:
[...truncated 12876 lines...]
   [junit4] Suite: org.apache.solr.cloud.FullSolrCloudDistribCmdsTest
   [junit4]   2> 2059258 INFO  (SUITE-FullSolrCloudDistribCmdsTest-seed#[5FCF99FE871EC427]-worker) [    ] o.a.s.SolrTestCaseJ4 SecureRandom sanity checks: test.solr.allowed.securerandom=null & java.security.egd=file:/dev/./urandom
   [junit4]   2> Creating dataDir: /Users/jenkins/workspace/Lucene-Solr-master-MacOSX/solr/build/solr-core/test/J0/temp/solr.cloud.FullSolrCloudDistribCmdsTest_5FCF99FE871EC427-001/init-core-data-001
   [junit4]   2> 2059258 WARN  (SUITE-FullSolrCloudDistribCmdsTest-seed#[5FCF99FE871EC427]-worker) [    ] o.a.s.SolrTestCaseJ4 startTrackingSearchers: numOpens=88 numCloses=88
   [junit4]   2> 2059259 INFO  (SUITE-FullSolrCloudDistribCmdsTest-seed#[5FCF99FE871EC427]-worker) [    ] o.a.s.SolrTestCaseJ4 Using PointFields (NUMERIC_POINTS_SYSPROP=true) w/NUMERIC_DOCVALUES_SYSPROP=false
   [junit4]   2> 2059261 INFO  (SUITE-FullSolrCloudDistribCmdsTest-seed#[5FCF99FE871EC427]-worker) [    ] o.a.s.SolrTestCaseJ4 Randomized ssl (false) and clientAuth (false) via: @org.apache.solr.SolrTestCaseJ4$SuppressSSL(bugUrl=https://issues.apache.org/jira/browse/SOLR-5776) w/ MAC_OS_X supressed clientAuth
   [junit4]   2> 2059262 INFO  (SUITE-FullSolrCloudDistribCmdsTest-seed#[5FCF99FE871EC427]-worker) [    ] o.a.s.BaseDistributedSearchTestCase Setting hostContext system property: /
   [junit4]   2> 2059263 INFO  (TEST-FullSolrCloudDistribCmdsTest.test-seed#[5FCF99FE871EC427]) [    ] o.a.s.c.ZkTestServer STARTING ZK TEST SERVER
   [junit4]   2> 2059263 INFO  (Thread-3346) [    ] o.a.s.c.ZkTestServer client port:0.0.0.0/0.0.0.0:0
   [junit4]   2> 2059263 INFO  (Thread-3346) [    ] o.a.s.c.ZkTestServer Starting server
   [junit4]   2> 2059266 ERROR (Thread-3346) [    ] o.a.z.s.ZooKeeperServer ZKShutdownHandler is not registered, so ZooKeeper server won't take any action on ERROR or SHUTDOWN server state changes
   [junit4]   2> 2059373 INFO  (TEST-FullSolrCloudDistribCmdsTest.test-seed#[5FCF99FE871EC427]) [    ] o.a.s.c.ZkTestServer start zk server on port:65484
   [junit4]   2> 2059395 INFO  (zkConnectionManagerCallback-5219-thread-1) [    ] o.a.s.c.c.ConnectionManager zkClient has connected
   [junit4]   2> 2059399 INFO  (zkConnectionManagerCallback-5221-thread-1) [    ] o.a.s.c.c.ConnectionManager zkClient has connected
   [junit4]   2> 2059407 INFO  (TEST-FullSolrCloudDistribCmdsTest.test-seed#[5FCF99FE871EC427]) [    ] o.a.s.c.AbstractZkTestCase put /Users/jenkins/workspace/Lucene-Solr-master-MacOSX/solr/core/src/test-files/solr/collection1/conf/solrconfig-tlog.xml to /configs/conf1/solrconfig.xml
   [junit4]   2> 2059410 INFO  (TEST-FullSolrCloudDistribCmdsTest.test-seed#[5FCF99FE871EC427]) [    ] o.a.s.c.AbstractZkTestCase put /Users/jenkins/workspace/Lucene-Solr-master-MacOSX/solr/core/src/test-files/solr/collection1/conf/schema15.xml to /configs/conf1/schema.xml
   [junit4]   2> 2059412 INFO  (TEST-FullSolrCloudDistribCmdsTest.test-seed#[5FCF99FE871EC427]) [    ] o.a.s.c.AbstractZkTestCase put /Users/jenkins/workspace/Lucene-Solr-master-MacOSX/solr/core/src/test-files/solr/collection1/conf/solrconfig.snippet.randomindexconfig.xml to /configs/conf1/solrconfig.snippet.randomindexconfig.xml
   [junit4]   2> 2059414 INFO  (TEST-FullSolrCloudDistribCmdsTest.test-seed#[5FCF99FE871EC427]) [    ] o.a.s.c.AbstractZkTestCase put /Users/jenkins/workspace/Lucene-Solr-master-MacOSX/solr/core/src/test-files/solr/collection1/conf/stopwords.txt to /configs/conf1/stopwords.txt
   [junit4]   2> 2059416 INFO  (TEST-FullSolrCloudDistribCmdsTest.test-seed#[5FCF99FE871EC427]) [    ] o.a.s.c.AbstractZkTestCase put /Users/jenkins/workspace/Lucene-Solr-master-MacOSX/solr/core/src/test-files/solr/collection1/conf/protwords.txt to /configs/conf1/protwords.txt
   [junit4]   2> 2059418 INFO  (TEST-FullSolrCloudDistribCmdsTest.test-seed#[5FCF99FE871EC427]) [    ] o.a.s.c.AbstractZkTestCase put /Users/jenkins/workspace/Lucene-Solr-master-MacOSX/solr/core/src/test-files/solr/collection1/conf/currency.xml to /configs/conf1/currency.xml
   [junit4]   2> 2059420 INFO  (TEST-FullSolrCloudDistribCmdsTest.test-seed#[5FCF99FE871EC427]) [    ] o.a.s.c.AbstractZkTestCase put /Users/jenkins/workspace/Lucene-Solr-master-MacOSX/solr/core/src/test-files/solr/collection1/conf/enumsConfig.xml to /configs/conf1/enumsConfig.xml
   [junit4]   2> 2059422 INFO  (TEST-FullSolrCloudDistribCmdsTest.test-seed#[5FCF99FE871EC427]) [    ] o.a.s.c.AbstractZkTestCase put /Users/jenkins/workspace/Lucene-Solr-master-MacOSX/solr/core/src/test-files/solr/collection1/conf/open-exchange-rates.json to /configs/conf1/open-exchange-rates.json
   [junit4]   2> 2059423 INFO  (TEST-FullSolrCloudDistribCmdsTest.test-seed#[5FCF99FE871EC427]) [    ] o.a.s.c.AbstractZkTestCase put /Users/jenkins/workspace/Lucene-Solr-master-MacOSX/solr/core/src/test-files/solr/collection1/conf/mapping-ISOLatin1Accent.txt to /configs/conf1/mapping-ISOLatin1Accent.txt
   [junit4]   2> 2059425 INFO  (TEST-FullSolrCloudDistribCmdsTest.test-seed#[5FCF99FE871EC427]) [    ] o.a.s.c.AbstractZkTestCase put /Users/jenkins/workspace/Lucene-Solr-master-MacOSX/solr/core/src/test-files/solr/collection1/conf/old_synonyms.txt to /configs/conf1/old_synonyms.txt
   [junit4]   2> 2059427 INFO  (TEST-FullSolrCloudDistribCmdsTest.test-seed#[5FCF99FE871EC427]) [    ] o.a.s.c.AbstractZkTestCase put /Users/jenkins/workspace/Lucene-Solr-master-MacOSX/solr/core/src/test-files/solr/collection1/conf/synonyms.txt to /configs/conf1/synonyms.txt
   [junit4]   2> 2059430 INFO  (TEST-FullSolrCloudDistribCmdsTest.test-seed#[5FCF99FE871EC427]) [    ] o.a.s.c.AbstractFullDistribZkTestBase Will use NRT replicas unless explicitly asked otherwise
   [junit4]   2> 2059699 INFO  (TEST-FullSolrCloudDistribCmdsTest.test-seed#[5FCF99FE871EC427]) [    ] o.e.j.s.Server jetty-9.3.20.v20170531
   [junit4]   2> 2059701 INFO  (TEST-FullSolrCloudDistribCmdsTest.test-seed#[5FCF99FE871EC427]) [    ] o.e.j.s.h.ContextHandler Started o.e.j.s.ServletContextHandler@1e56d5c1{/,null,AVAILABLE}
   [junit4]   2> 2059702 INFO  (TEST-FullSolrCloudDistribCmdsTest.test-seed#[5FCF99FE871EC427]) [    ] o.e.j.s.AbstractConnector Started ServerConnector@597c7ccc{HTTP/1.1,[http/1.1]}{127.0.0.1:65487}
   [junit4]   2> 2059702 INFO  (TEST-FullSolrCloudDistribCmdsTest.test-seed#[5FCF99FE871EC427]) [    ] o.e.j.s.Server Started @2063758ms
   [junit4]   2> 2059702 INFO  (TEST-FullSolrCloudDistribCmdsTest.test-seed#[5FCF99FE871EC427]) [    ] o.a.s.c.s.e.JettySolrRunner Jetty properties: {solr.data.dir=/Users/jenkins/workspace/Lucene-Solr-master-MacOSX/solr/build/solr-core/test/J0/temp/solr.cloud.FullSolrCloudDistribCmdsTest_5FCF99FE871EC427-001/tempDir-001/control/data, hostContext=/, hostPort=65487, coreRootDirectory=/Users/jenkins/workspace/Lucene-Solr-master-MacOSX/solr/build/solr-core/test/J0/../../../../../../../../../Users/jenkins/workspace/Lucene-Solr-master-MacOSX/solr/build/solr-core/test/J0/temp/solr.cloud.FullSolrCloudDistribCmdsTest_5FCF99FE871EC427-001/control-001/cores}
   [junit4]   2> 2059702 ERROR (TEST-FullSolrCloudDistribCmdsTest.test-seed#[5FCF99FE871EC427]) [    ] o.a.s.u.StartupLoggingUtils Missing Java Option solr.log.dir. Logging may be missing or incomplete.
   [junit4]   2> 2059702 INFO  (TEST-FullSolrCloudDistribCmdsTest.test-seed#[5FCF99FE871EC427]) [    ] o.a.s.s.SolrDispatchFilter  ___      _       Welcome to Apache Solr™ version 8.0.0
   [junit4]   2> 2059702 INFO  (TEST-FullSolrCloudDistribCmdsTest.test-seed#[5FCF99FE871EC427]) [    ] o.a.s.s.SolrDispatchFilter / __| ___| |_ _   Starting in cloud mode on port null
   [junit4]   2> 2059702 INFO  (TEST-FullSolrCloudDistribCmdsTest.test-seed#[5FCF99FE871EC427]) [    ] o.a.s.s.SolrDispatchFilter \__ \/ _ \ | '_|  Install dir: null
   [junit4]   2> 2059702 INFO  (TEST-FullSolrCloudDistribCmdsTest.test-seed#[5FCF99FE871EC427]) [    ] o.a.s.s.SolrDispatchFilter |___/\___/_|_|    Start time: 2018-01-16T02:57:30.845Z
   [junit4]   2> 2059704 INFO  (zkConnectionManagerCallback-5223-thread-1) [    ] o.a.s.c.c.ConnectionManager zkClient has connected
   [junit4]   2> 2059705 INFO  (TEST-FullSolrCloudDistribCmdsTest.test-seed#[5FCF99FE871EC427]) [    ] o.a.s.s.SolrDispatchFilter Loading solr.xml from SolrHome (not found in ZooKeeper)
   [junit4]   2> 2059705 INFO  (TEST-FullSolrCloudDistribCmdsTest.test-seed#[5FCF99FE871EC427]) [    ] o.a.s.c.SolrXmlConfig Loading container configuration from /Users/jenkins/workspace/Lucene-Solr-master-MacOSX/solr/build/solr-core/test/J0/temp/solr.cloud.FullSolrCloudDistribCmdsTest_5FCF99FE871EC427-001/control-001/solr.xml
   [junit4]   2> 2059709 INFO  (TEST-FullSolrCloudDistribCmdsTest.test-seed#[5FCF99FE871EC427]) [    ] o.a.s.c.SolrXmlConfig Configuration parameter autoReplicaFailoverWorkLoopDelay is ignored
   [junit4]   2> 2059710 INFO  (TEST-FullSolrCloudDistribCmdsTest.test-seed#[5FCF99FE871EC427]) [    ] o.a.s.c.SolrXmlConfig Configuration parameter autoReplicaFailoverBadNodeExpiration is ignored
   [junit4]   2> 2059710 INFO  (TEST-FullSolrCloudDistribCmdsTest.test-seed#[5FCF99FE871EC427]) [    ] o.a.s.c.SolrXmlConfig MBean server found: com.sun.jmx.mbeanserver.JmxMBeanServer@53862e8e, but no JMX reporters were configured - adding default JMX reporter.
   [junit4]   2> 2059713 INFO  (TEST-FullSolrCloudDistribCmdsTest.test-seed#[5FCF99FE871EC427]) [    ] o.a.s.c.ZkContainer Zookeeper client=127.0.0.1:65484/solr
   [junit4]   2> 2059715 INFO  (zkConnectionManagerCallback-5227-thread-1) [    ] o.a.s.c.c.ConnectionManager zkClient has connected
   [junit4]   2> 2059717 INFO  (zkConnectionManagerCallback-5229-thread-1-processing-n:127.0.0.1:65487_) [n:127.0.0.1:65487_    ] o.a.s.c.c.ConnectionManager zkClient has connected
   [junit4]   2> 2059856 INFO  (TEST-FullSolrCloudDistribCmdsTest.test-seed#[5FCF99FE871EC427]) [n:127.0.0.1:65487_    ] o.a.s.c.Overseer Overseer (id=null) closing
   [junit4]   2> 2059857 INFO  (TEST-FullSolrCloudDistribCmdsTest.test-seed#[5FCF99FE871EC427]) [n:127.0.0.1:65487_    ] o.a.s.c.OverseerElectionContext I am going to be the leader 127.0.0.1:65487_
   [junit4]   2> 2059858 INFO  (TEST-FullSolrCloudDistribCmdsTest.test-seed#[5FCF99FE871EC427]) [n:127.0.0.1:65487_    ] o.a.s.c.Overseer Overseer (id=99357258573938692-127.0.0.1:65487_-n_0000000000) starting
   [junit4]   2> 2059868 INFO  (TEST-FullSolrCloudDistribCmdsTest.test-seed#[5FCF99FE871EC427]) [n:127.0.0.1:65487_    ] o.a.s.c.ZkController Register node as live in ZooKeeper:/live_nodes/127.0.0.1:65487_
   [junit4]   2> 2059870 INFO  (OverseerStateUpdate-99357258573938692-127.0.0.1:65487_-n_0000000000) [n:127.0.0.1:65487_    ] o.a.s.c.c.ZkStateReader Updated live nodes from ZooKeeper... (0) -> (1)
   [junit4]   2> 2059935 INFO  (TEST-FullSolrCloudDistribCmdsTest.test-seed#[5FCF99FE871EC427]) [n:127.0.0.1:65487_    ] o.a.s.m.r.SolrJmxReporter JMX monitoring for 'solr.node' (registry 'solr.node') enabled at server: com.sun.jmx.mbeanserver.JmxMBeanServer@53862e8e
   [junit4]   2> 2059943 INFO  (TEST-FullSolrCloudDistribCmdsTest.test-seed#[5FCF99FE871EC427]) [n:127.0.0.1:65487_    ] o.a.s.m.r.SolrJmxReporter JMX monitoring for 'solr.jvm' (registry 'solr.jvm') enabled at server: com.sun.jmx.mbeanserver.JmxMBeanServer@53862e8e
   [junit4]   2> 2059944 INFO  (TEST-FullSolrCloudDistribCmdsTest.test-seed#[5FCF99FE871EC427]) [n:127.0.0.1:65487_    ] o.a.s.m.r.SolrJmxReporter JMX monitoring for 'solr.jetty' (registry 'solr.jetty') enabled at server: com.sun.jmx.mbeanserver.JmxMBeanServer@53862e8e
   [junit4]   2> 2059945 INFO  (TEST-FullSolrCloudDistribCmdsTest.test-seed#[5FCF99FE871EC427]) [n:127.0.0.1:65487_    ] o.a.s.c.CorePropertiesLocator Found 0 core definitions underneath /Users/jenkins/workspace/Lucene-Solr-master-MacOSX/solr/build/solr-core/test/J0/../../../../../../../../../Users/jenkins/workspace/Lucene-Solr-master-MacOSX/solr/build/solr-core/test/J0/temp/solr.cloud.FullSolrCloudDistribCmdsTest_5FCF99FE871EC427-001/control-001/cores
   [junit4]   2> 2059971 INFO  (zkConnectionManagerCallback-5235-thread-1) [    ] o.a.s.c.c.ConnectionManager zkClient has connected
   [junit4]   2> 2059972 INFO  (TEST-FullSolrCloudDistribCmdsTest.test-seed#[5FCF99FE871EC427]) [    ] o.a.s.c.c.ZkStateReader Updated live nodes from ZooKeeper... (0) -> (1)
   [junit4]   2> 2059974 INFO  (TEST-FullSolrCloudDistribCmdsTest.test-seed#[5FCF99FE871EC427]) [    ] o.a.s.c.s.i.ZkClientClusterStateProvider Cluster at 127.0.0.1:65484/solr ready
   [junit4]   2> 2059976 INFO  (qtp92634993-19569) [n:127.0.0.1:65487_    ] o.a.s.h.a.CollectionsHandler Invoked Collection Action :create with params replicationFactor=1&collection.configName=conf1&name=control_collection&nrtReplicas=1&action=CREATE&numShards=1&createNodeSet=127.0.0.1:65487_&wt=javabin&version=2 and sendToOCPQueue=true
   [junit4]   2> 2059979 INFO  (OverseerThreadFactory-7464-thread-1-processing-n:127.0.0.1:65487_) [n:127.0.0.1:65487_    ] o.a.s.c.CreateCollectionCmd Create collection control_collection
   [junit4]   2> 2060090 INFO  (qtp92634993-19571) [n:127.0.0.1:65487_    ] o.a.s.h.a.CoreAdminOperation core create command qt=/admin/cores&collection.configName=conf1&newCollection=true&name=control_collection_shard1_replica_n1&action=CREATE&numShards=1&collection=control_collection&shard=shard1&wt=javabin&version=2&replicaType=NRT
   [junit4]   2> 2060091 INFO  (qtp92634993-19571) [n:127.0.0.1:65487_    ] o.a.s.c.TransientSolrCoreCacheDefault Allocating transient cache for 4 transient cores
   [junit4]   2> 2060206 INFO  (zkCallback-5228-thread-1-processing-n:127.0.0.1:65487_) [n:127.0.0.1:65487_    ] o.a.s.c.c.ZkStateReader A cluster state change: [WatchedEvent state:SyncConnected type:NodeDataChanged path:/collections/control_collection/state.json] for collection [control_collection] has occurred - updating... (live nodes size: [1])
   [junit4]   2> 2061114 INFO  (qtp92634993-19571) [n:127.0.0.1:65487_ c:control_collection s:shard1  x:control_collection_shard1_replica_n1] o.a.s.c.SolrConfig Using Lucene MatchVersion: 8.0.0
   [junit4]   2> 2061133 INFO  (qtp92634993-19571) [n:127.0.0.1:65487_ c:control_collection s:shard1  x:control_collection_shard1_replica_n1] o.a.s.s.IndexSchema [control_collection_shard1_replica_n1] Schema name=test
   [junit4]   2> 2061186 INFO  (qtp92634993-19571) [n:127.0.0.1:65487_ c:control_collection s:shard1  x:control_collection_shard1_replica_n1] o.a.s.s.IndexSchema Loaded schema test/1.6 with uniqueid field id
   [junit4]   2> 2061206 INFO  (qtp92634993-19571) [n:127.0.0.1:65487_ c:control_collection s:shard1  x:control_collection_shard1_replica_n1] o.a.s.c.CoreContainer Creating SolrCore 'control_collection_shard1_replica_n1' using configuration from collection control_collection, trusted=true
   [junit4]   2> 2061207 INFO  (qtp92634993-19571) [n:127.0.0.1:65487_ c:control_collection s:shard1  x:control_collection_shard1_replica_n1] o.a.s.m.r.SolrJmxReporter JMX monitoring for 'solr.core.control_collection.shard1.replica_n1' (registry 'solr.core.control_collection.shard1.replica_n1') enabled at server: com.sun.jmx.mbeanserver.JmxMBeanServer@53862e8e
   [junit4]   2> 2061207 INFO  (qtp92634993-19571) [n:127.0.0.1:65487_ c:control_collection s:shard1  x:control_collection_shard1_replica_n1] o.a.s.c.SolrCore solr.RecoveryStrategy.Builder
   [junit4]   2> 2061207 INFO  (qtp92634993-19571) [n:127.0.0.1:65487_ c:control_collection s:shard1  x:control_collection_shard1_replica_n1] o.a.s.c.SolrCore [[control_collection_shard1_replica_n1] ] Opening new SolrCore at [/Users/jenkins/workspace/Lucene-Solr-master-MacOSX/solr/build/solr-core/test/J0/temp/solr.cloud.FullSolrCloudDistribCmdsTest_5FCF99FE871EC427-001/control-001/cores/control_collection_shard1_replica_n1], dataDir=[/Users/jenkins/workspace/Lucene-Solr-master-MacOSX/solr/build/solr-core/test/J0/../../../../../../../../../Users/jenkins/workspace/Lucene-Solr-master-MacOSX/solr/build/solr-core/test/J0/temp/solr.cloud.FullSolrCloudDistribCmdsTest_5FCF99FE871EC427-001/control-001/cores/control_collection_shard1_replica_n1/data/]
   [junit4]   2> 2061209 INFO  (qtp92634993-19571) [n:127.0.0.1:65487_ c:control_collection s:shard1  x:control_collection_shard1_replica_n1] o.a.s.u.RandomMergePolicy RandomMergePolicy wrapping class org.apache.lucene.index.TieredMergePolicy: [TieredMergePolicy: maxMergeAtOnce=29, maxMergeAtOnceExplicit=35, maxMergedSegmentMB=48.6142578125, floorSegmentMB=0.44921875, forceMergeDeletesPctAllowed=12.059525875173682, segmentsPerTier=16.0, maxCFSSegmentSizeMB=8.796093022207999E12, noCFSRatio=0.4598697490875375
   [junit4]   2> 2061211 WARN  (qtp92634993-19571) [n:127.0.0.1:65487_ c:control_collection s:shard1  x:control_collection_shard1_replica_n1] o.a.s.c.RequestHandlers INVALID paramSet a in requestHandler {type = requestHandler,name = /dump,class = DumpRequestHandler,attributes = {initParams=a, name=/dump, class=DumpRequestHandler},args = {defaults={a=A,b=B}}}
   [junit4]   2> 2061253 INFO  (qtp92634993-19571) [n:127.0.0.1:65487_ c:control_collection s:shard1  x:control_collection_shard1_replica_n1] o.a.s.u.UpdateHandler Using UpdateLog implementation: org.apache.solr.update.UpdateLog
   [junit4]   2> 2061253 INFO  (qtp92634993-19571) [n:127.0.0.1:65487_ c:control_collection s:shard1  x:control_collection_shard1_replica_n1] o.a.s.u.UpdateLog Initializing UpdateLog: dataDir= defaultSyncLevel=FLUSH numRecordsToKeep=100 maxNumLogsToKeep=10 numVersionBuckets=65536
   [junit4]   2> 2061254 INFO  (qtp92634993-19571) [n:127.0.0.1:65487_ c:control_collection s:shard1  x:control_collection_shard1_replica_n1] o.a.s.u.CommitTracker Hard AutoCommit: disabled
   [junit4]   2> 2061254 INFO  (qtp92634993-19571) [n:127.0.0.1:65487_ c:control_collection s:shard1  x:control_collection_shard1_replica_n1] o.a.s.u.CommitTracker Soft AutoCommit: disabled
   [junit4]   2> 2061254 INFO  (qtp92634993-19571) [n:127.0.0.1:65487_ c:control_collection s:shard1  x:control_collection_shard1_replica_n1] o.a.s.u.RandomMergePolicy RandomMergePolicy wrapping class org.apache.lucene.index.TieredMergePolicy: [TieredMergePolicy: maxMergeAtOnce=39, maxMergeAtOnceExplicit=46, maxMergedSegmentMB=48.9775390625, floorSegmentMB=0.234375, forceMergeDeletesPctAllowed=9.512652682163388, segmentsPerTier=11.0, maxCFSSegmentSizeMB=8.796093022207999E12, noCFSRatio=0.8175206040097754
   [junit4]   2> 2061255 INFO  (qtp92634993-19571) [n:127.0.0.1:65487_ c:control_collection s:shard1  x:control_collection_shard1_replica_n1] o.a.s.s.SolrIndexSearcher Opening [Searcher@6a4dc70[control_collection_shard1_replica_n1] main]
   [junit4]   2> 2061256 INFO  (qtp92634993-19571) [n:127.0.0.1:65487_ c:control_collection s:shard1  x:control_collection_shard1_replica_n1] o.a.s.r.ManagedResourceStorage Configured ZooKeeperStorageIO with znodeBase: /configs/conf1
   [junit4]   2> 2061257 INFO  (qtp92634993-19571) [n:127.0.0.1:65487_ c:control_collection s:shard1  x:control_collection_shard1_replica_n1] o.a.s.r.ManagedResourceStorage Loaded null at path _rest_managed.json using ZooKeeperStorageIO:path=/configs/conf1
   [junit4]   2> 2061257 INFO  (qtp92634993-19571) [n:127.0.0.1:65487_ c:control_collection s:shard1  x:control_collection_shard1_replica_n1] o.a.s.h.ReplicationHandler Commits will be reserved for 10000ms.
   [junit4]   2> 2061257 INFO  (qtp92634993-19571) [n:127.0.0.1:65487_ c:control_collection s:shard1  x:control_collection_shard1_replica_n1] o.a.s.u.UpdateLog Could not find max version in index or recent updates, using new clock 1589716139271782400
   [junit4]   2> 2061258 INFO  (searcherExecutor-7467-thread-1-processing-n:127.0.0.1:65487_ x:control_collection_shard1_replica_n1 s:shard1 c:control_collection) [n:127.0.0.1:65487_ c:control_collection s:shard1  x:control_collection_shard1_replica_n1] o.a.s.c.SolrCore [control_collection_shard1_replica_n1] Registered new searcher Searcher@6a4dc70[control_collection_shard1_replica_n1] main{ExitableDirectoryReader(UninvertingDirectoryReader())}
   [junit4]   2> 2061263 INFO  (qtp92634993-19571) [n:127.0.0.1:65487_ c:control_collection s:shard1  x:control_collection_shard1_replica_n1] o.a.s.c.ShardLeaderElectionContext Enough replicas found to continue.
   [junit4]   2> 2061263 INFO  (qtp92634993-19571) [n:127.0.0.1:65487_ c:control_collection s:shard1  x:control_collection_shard1_replica_n1] o.a.s.c.ShardLeaderElectionContext I may be the new leader - try and sync
   [junit4]   2> 2061263 INFO  (qtp92634993-19571) [n:127.0.0.1:65487_ c:control_collection s:shard1  x:control_collection_shard1_replica_n1] o.a.s.c.SyncStrategy Sync replicas to http://127.0.0.1:65487/control_collection_shard1_replica_n1/
   [junit4]   2> 2061263 INFO  (qtp92634993-19571) [n:127.0.0.1:65487_ c:control_collection s:shard1  x:control_collection_shard1_replica_n1] o.a.s.c.SyncStrategy Sync Success - now sync replicas to me
   [junit4]   2> 2061263 INFO  (qtp92634993-19571) [n:127.0.0.1:65487_ c:control_collection s:shard1  x:control_collection_shard1_replica_n1] o.a.s.c.SyncStrategy http://127.0.0.1:65487/control_collection_shard1_replica_n1/ has no replicas
   [junit4]   2> 2061263 INFO  (qtp92634993-19571) [n:127.0.0.1:65487_ c:control_collection s:shard1  x:control_collection_shard1_replica_n1] o.a.s.c.ShardLeaderElectionContext Found all replicas participating in election, clear LIR
   [junit4]   2> 2061269 INFO  (qtp92634993-19571) [n:127.0.0.1:65487_ c:control_collection s:shard1  x:control_collection_shard1_replica_n1] o.a.s.c.ShardLeaderElectionContext I am the new leader: http://127.0.0.1:65487/control_collection_shard1_replica_n1/ shard1
   [junit4]   2> 2061380 INFO  (zkCallback-5228-thread-2-processing-n:127.0.0.1:65487_) [n:127.0.0.1:65487_    ] o.a.s.c.c.ZkStateReader A cluster state change: [WatchedEvent state:SyncConnected type:NodeDataChanged path:/collections/control_collection/state.json] for collection [control_collection] has occurred - updating... (live nodes size: [1])
   [junit4]   2> 2061432 INFO  (qtp92634993-19571) [n:127.0.0.1:65487_ c:control_collection s:shard1  x:control_collection_shard1_replica_n1] o.a.s.c.ZkController I am the leader, no recovery necessary
   [junit4]   2> 2061433 INFO  (qtp92634993-19571) [n:127.0.0.1:65487_ c:control_collection s:shard1  x:control_collection_shard1_replica_n1] o.a.s.s.HttpSolrCall [admin] webapp=null path=/admin/cores params={qt=/admin/cores&collection.configName=conf1&newCollection=true&name=control_collection_shard1_replica_n1&action=CREATE&numShards=1&collection=control_collection&shard=shard1&wt=javabin&version=2&replicaType=NRT} status=0 QTime=1343
   [junit4]   2> 2061442 INFO  (qtp92634993-19569) [n:127.0.0.1:65487_    ] o.a.s.h.a.CollectionsHandler Wait for new collection to be active for at most 30 seconds. Check all shard replicas
   [junit4]   2> 2061537 INFO  (zkCallback-5228-thread-2-processing-n:127.0.0.1:65487_) [n:127.0.0.1:65487_    ] o.a.s.c.c.ZkStateReader A cluster state change: [WatchedEvent state:SyncConnected type:NodeDataChanged path:/collections/control_collection/state.json] for collection [control_collection] has occurred - updating... (live nodes size: [1])
   [junit4]   2> 2061992 INFO  (OverseerCollectionConfigSetProcessor-99357258573938692-127.0.0.1:65487_-n_0000000000) [n:127.0.0.1:65487_    ] o.a.s.c.OverseerTaskQueue Response ZK path: /overseer/collection-queue-work/qnr-0000000000 doesn't exist.  Requestor may have disconnected from ZooKeeper
   [junit4]   2> 2062447 INFO  (qtp92634993-19569) [n:127.0.0.1:65487_    ] o.a.s.s.HttpSolrCall [admin] webapp=null path=/admin/collections params={replicationFactor=1&collection.configName=conf1&name=control_collection&nrtReplicas=1&action=CREATE&numShards=1&createNodeSet=127.0.0.1:65487_&wt=javabin&version=2} status=0 QTime=2471
   [junit4]   2> 2062454 INFO  (zkConnectionManagerCallback-5239-thread-1) [    ] o.a.s.c.c.ConnectionManager zkClient has connected
   [junit4]   2> 2062455 INFO  (TEST-FullSolrCloudDistribCmdsTest.test-seed#[5FCF99FE871EC427]) [    ] o.a.s.c.c.ZkStateReader Updated live nodes from ZooKeeper... (0) -> (1)
   [junit4]   2> 2062457 INFO  (TEST-FullSolrCloudDistribCmdsTest.test-seed#[5FCF99FE871EC427]) [    ] o.a.s.c.s.i.ZkClientClusterStateProvider Cluster at 127.0.0.1:65484/solr ready
   [junit4]   2> 2062457 INFO  (TEST-FullSolrCloudDistribCmdsTest.test-seed#[5FCF99FE871EC427]) [    ] o.a.s.c.ChaosMonkey monkey: init - expire sessions:false cause connection loss:false
   [junit4]   2> 2062458 INFO  (qtp92634993-19574) [n:127.0.0.1:65487_    ] o.a.s.h.a.CollectionsHandler Invoked Collection Action :create with params replicationFactor=1&collection.configName=conf1&name=collection1&nrtReplicas=1&action=CREATE&numShards=3&createNodeSet=&stateFormat=2&wt=javabin&version=2 and sendToOCPQueue=true
   [junit4]   2> 2062462 INFO  (OverseerThreadFactory-7464-thread-2-processing-n:127.0.0.1:65487_) [n:127.0.0.1:65487_    ] o.a.s.c.CreateCollectionCmd Create collection collection1
   [junit4]   2> 2062464 WARN  (OverseerThreadFactory-7464-thread-2-processing-n:127.0.0.1:65487_) [n:127.0.0.1:65487_    ] o.a.s.c.CreateCollectionCmd It is unusual to create a collection (collection1) without cores.
   [junit4]   2> 2062674 INFO  (qtp92634993-19574) [n:127.0.0.1:65487_    ] o.a.s.h.a.CollectionsHandler Wait for new collection to be active for at most 30 seconds. Check all shard replicas
   [junit4]   2> 2062675 INFO  (qtp92634993-19574) [n:127.0.0.1:65487_    ] o.a.s.s.HttpSolrCall [admin] webapp=null path=/admin/collections params={replicationFactor=1&collection.configName=conf1&name=collection1&nrtReplicas=1&action=CREATE&numShards=3&createNodeSet=&stateFormat=2&wt=javabin&version=2} status=0 QTime=216
   [junit4]   2> 2062969 INFO  (TEST-FullSolrCloudDistribCmdsTest.test-seed#[5FCF99FE871EC427]) [    ] o.a.s.c.AbstractFullDistribZkTestBase create jetty 1 in directory /Users/jenkins/workspace/Lucene-Solr-master-MacOSX/solr/build/solr-core/test/J0/temp/solr.cloud.FullSolrCloudDistribCmdsTest_5FCF99FE871EC427-001/shard-1-001 of type NRT
   [junit4]   2> 2062969 INFO  (TEST-FullSolrCloudDistribCmdsTest.test-seed#[5FCF99FE871EC427]) [    ] o.e.j.s.Server jetty-9.3.20.v20170531
   [junit4]   2> 2062970 INFO  (TEST-FullSolrCloudDistribCmdsTest.test-seed#[5FCF99FE871EC427]) [    ] o.e.j.s.h.ContextHandler Started o.e.j.s.ServletContextHandler@6fcacc0d{/,null,AVAILABLE}
   [junit4]   2> 2062971 INFO  (TEST-FullSolrCloudDistribCmdsTest.test-seed#[5FCF99FE871EC427]) [    ] o.e.j.s.AbstractConnector Started ServerConnector@227f2ade{HTTP/1.1,[http/1.1]}{127.0.0.1:65502}
   [junit4]   2> 2062971 INFO  (TEST-FullSolrCloudDistribCmdsTest.test-seed#[5FCF99FE871EC427]) [    ] o.e.j.s.Server Started @2067027ms
   [junit4]   2> 2062971 INFO  (TEST-FullSolrCloudDistribCmdsTest.test-seed#[5FCF99FE871EC427]) [    ] o.a.s.c.s.e.JettySolrRunner Jetty properties: {solr.data.dir=/Users/jenkins/workspace/Lucene-Solr-master-MacOSX/solr/build/solr-core/test/J0/temp/solr.cloud.FullSolrCloudDistribCmdsTest_5FCF99FE871EC427-001/tempDir-001/jetty1, solrconfig=solrconfig.xml, hostContext=/, hostPort=65502, coreRootDirectory=/Users/jenkins/workspace/Lucene-Solr-master-MacOSX/solr/build/solr-core/test/J0/../../../../../../../../../Users/jenkins/workspace/Lucene-Solr-master-MacOSX/solr/build/solr-core/test/J0/temp/solr.cloud.FullSolrCloudDistribCmdsTest_5FCF99FE871EC427-001/shard-1-001/cores}
   [junit4]   2> 2062971 ERROR (TEST-FullSolrCloudDistribCmdsTest.test-seed#[5FCF99FE871EC427]) [    ] o.a.s.u.StartupLoggingUtils Missing Java Option solr.log.dir. Logging may be missing or incomplete.
   [junit4]   2> 2062971 INFO  (TEST-FullSolrCloudDistribCmdsTest.test-seed#[5FCF99FE871EC427]) [    ] o.a.s.s.SolrDispatchFilter  ___      _       Welcome to Apache Solr™ version 8.0.0
   [junit4]   2> 2062972 INFO  (TEST-FullSolrCloudDistribCmdsTest.test-seed#[5FCF99FE871EC427]) [    ] o.a.s.s.SolrDispatchFilter / __| ___| |_ _   Starting in cloud mode on port null
   [junit4]   2> 2062972 INFO  (TEST-FullSolrCloudDistribCmdsTest.test-seed#[5FCF99FE871EC427]) [    ] o.a.s.s.SolrDispatchFilter \__ \/ _ \ | '_|  Install dir: null
   [junit4]   2> 2062972 INFO  (TEST-FullSolrCloudDistribCmdsTest.test-seed#[5FCF99FE871EC427]) [    ] o.a.s.s.SolrDispatchFilter |___/\___/_|_|    Start time: 2018-01-16T02:57:34.115Z
   [junit4]   2> 2062973 INFO  (zkConnectionManagerCallback-5241-thread-1) [    ] o.a.s.c.c.ConnectionManager zkClient has connected
   [junit4]   2> 2062975 INFO  (TEST-FullSolrCloudDistribCmdsTest.test-seed#[5FCF99FE871EC427]) [    ] o.a.s.s.SolrDispatchFilter Loading solr.xml from SolrHome (not found in ZooKeeper)
   [junit4]   2> 2062975 INFO  (TEST-FullSolrCloudDistribCmdsTest.test-seed#[5FCF99FE871EC427]) [    ] o.a.s.c.SolrXmlConfig Loading container configuration from /Users/jenkins/workspace/Lucene-Solr-master-MacOSX/solr/build/solr-core/test/J0/temp/solr.cloud.FullSolrCloudDistribCmdsTest_5FCF99FE871EC427-001/shard-1-001/solr.xml
   [junit4]   2> 2062980 INFO  (TEST-FullSolrCloudDistribCmdsTest.test-seed#[5FCF99FE871EC427]) [    ] o.a.s.c.SolrXmlConfig Configuration parameter autoReplicaFailoverWorkLoopDelay is ignored
   [junit4]   2> 2062980 INFO  (TEST-FullSolrCloudDistribCmdsTest.test-seed#[5FCF99FE871EC427]) [    ] o.a.s.c.SolrXmlConfig Configuration parameter autoReplicaFailoverBadNodeExpiration is ignored
   [junit4]   2> 2062980 INFO  (TEST-FullSolrCloudDistribCmdsTest.test-seed#[5FCF99FE871EC427]) [    ] o.a.s.c.SolrXmlConfig MBean server found: com.sun.jmx.mbeanserver.JmxMBeanServer@53862e8e, but no JMX reporters were configured - adding default JMX reporter.
   [junit4]   2> 2062983 INFO  (TEST-FullSolrCloudDistribCmdsTest.test-seed#[5FCF99FE871EC427]) [    ] o.a.s.c.ZkContainer Zookeeper client=127.0.0.1:65484/solr
   [junit4]   2> 2062985 INFO  (zkConnectionManagerCallback-5245-thread-1) [    ] o.a.s.c.c.ConnectionManager zkClient has connected
   [junit4]   2> 2062988 INFO  (zkConnectionManagerCallback-5247-thread-1-processing-n:127.0.0.1:65502_) [n:127.0.0.1:65502_    ] o.a.s.c.c.ConnectionManager zkClient has connected
   [junit4]   2> 2062998 INFO  (TEST-FullSolrCloudDistribCmdsTest.test-seed#[5FCF99FE871EC427]) [n:127.0.0.1:65502_    ] o.a.s.c.c.ZkStateReader Updated live nodes from ZooKeeper... (0) -> (1)
   [junit4]   2> 2063002 INFO  (TEST-FullSolrCloudDistribCmdsTest.test-seed#[5FCF99FE871EC427]) [n:127.0.0.1:65502_    ] o.a.s.c.Overseer Overseer (id=null) closing
   [junit4]   2> 2063005 INFO  (TEST-FullSolrCloudDistribCmdsTest.test-seed#[5FCF99FE871EC427]) [n:127.0.0.1:65502_    ] o.a.s.c.ZkController Register node as live in ZooKeeper:/live_nodes/127.0.0.1:65502_
   [junit4]   2> 2063006 INFO  (zkCallback-5228-thread-2-processing-n:127.0.0.1:65487_) [n:127.0.0.1:65487_    ] o.a.s.c.c.ZkStateReader Updated live nodes from ZooKeeper... (1) -> (2)
   [junit4]   2> 2063007 INFO  (zkCallback-5246-thread-1-processing-n:127.0.0.1:65502_) [n:127.0.0.1:65502_    ] o.a.s.c.c.ZkStateReader Updated live nodes from ZooKeeper... (1) -> (2)
   [junit4]   2> 2063007 INFO  (zkCallback-5238-thread-1) [    ] o.a.s.c.c.ZkStateReader Updated live nodes from ZooKeeper... (1) -> (2)
   [junit4]   2> 2063084 INFO  (TEST-FullSolrCloudDistribCmdsTest.test-seed#[5FCF99FE871EC427]) [n:127.0.0.1:65502_    ] o.a.s.m.r.SolrJmxReporter JMX monitoring for 'solr.node' (registry 'solr.node') enabled at server: com.sun.jmx.mbeanserver.JmxMBeanServer@53862e8e
   [junit4]   2> 2063093 INFO  (TEST-FullSolrCloudDistribCmdsTest.test-seed#[5FCF99FE871EC427]) [n:127.0.0.1:65502_    ] o.a.s.m.r.SolrJmxReporter JMX monitoring for 'solr.jvm' (registry 'solr.jvm') enabled at server: com.sun.jmx.mbeanserver.JmxMBeanServer@53862e8e
   [junit4]   2> 2063093 INFO  (TEST-FullSolrCloudDistribCmdsTest.test-seed#[5FCF99FE871EC427]) [n:127.0.0.1:65502_    ] o.a.s.m.r.SolrJmxReporter JMX monitoring for 'solr.jetty' (registry 'solr.jetty') enabled at server: com.sun.jmx.mbeanserver.JmxMBeanServer@53862e8e
   [junit4]   2> 2063094 INFO  (TEST-FullSolrCloudDistribCmdsTest.test-seed#[5FCF99FE871EC427]) [n:127.0.0.1:65502_    ] o.a.s.c.CorePropertiesLocator Found 0 core definitions underneath /Users/jenkins/workspace/Lucene-Solr-master-MacOSX/solr/build/solr-core/test/J0/../../../../../../../../../Users/jenkins/workspace/Lucene-Solr-master-MacOSX/solr/build/solr-core/test/J0/temp/solr.cloud.FullSolrCloudDistribCmdsTest_5FCF99FE871EC427-001/shard-1-001/cores
   [junit4]   2> 2063121 INFO  (qtp92634993-19567) [n:127.0.0.1:65487_    ] o.a.s.h.a.CollectionsHandler Invoked Collection Action :addreplica with params node=127.0.0.1:65502_&action=ADDREPLICA&collection=collection1&shard=shard2&type=NRT&wt=javabin&version=2 and sendToOCPQueue=true
   [junit4]   2> 2063125 INFO  (OverseerCollectionConfigSetProcessor-99357258573938692-127.0.0.1:65487_-n_0000000000) [n:127.0.0.1:65487_    ] o.a.s.c.OverseerTaskQueue Response ZK path: /overseer/collection-queue-work/qnr-0000000002 doesn't exist.  Requestor may have disconnected from ZooKeeper
   [junit4]   2> 2063126 INFO  (OverseerThreadFactory-7464-thread-3-processing-n:127.0.0.1:65487_) [n:127.0.0.1:65487_    ] o.a.s.c.AddReplicaCmd Node Identified 127.0.0.1:65502_ for creating new replica
   [junit4]   2> 2063130 INFO  (qtp962787781-19617) [n:127.0.0.1:65502_    ] o.a.s.h.a.CoreAdminOperation core create command qt=/admin/cores&collection.configName=conf1&name=collection1_shard2_replica_n61&action=CREATE&collection=collection1&shard=shard2&wt=javabin&version=2&replicaType=NRT
   [junit4]   2> 2063131 INFO  (qtp962787781-19617) [n:127.0.0.1:65502_    ] o.a.s.c.TransientSolrCoreCacheDefault Allocating transient cache for 4 transient cores
   [junit4]   2> 2063237 INFO  (zkCallback-5246-thread-1-processing-n:127.0.0.1:65502_) [n:127.0.0.1:65502_    ] o.a.s.c.c.ZkStateReader A cluster state change: [WatchedEvent state:SyncConnected type:NodeDataChanged path:/collections/collection1/state.json] for collection [collection1] has occurred - updating... (live nodes size: [2])
   [junit4]   2> 2064149 INFO  (qtp962787781-19617) [n:127.0.0.1:65502_ c:collection1 s:shard2  x:collection1_shard2_replica_n61] o.a.s.c.SolrConfig Using Lucene MatchVersion: 8.0.0
   [junit4]   2> 2064173 INFO  (qtp962787781-19617) [n:127.0.0.1:65502_ c:collection1 s:shard2  x:collection1_shard2_replica_n61] o.a.s.s.IndexSchema [collection1_shard2_replica_n61] Schema name=test
   [junit4]   2> 2064233 INFO  (qtp962787781-19617) [n:127.0.0.1:65502_ c:collection1 s:shard2  x:collection1_shard2_replica_n61] o.a.s.s.IndexSchema Loaded schema test/1.6 with uniqueid field id
   [junit4]   2> 2064254 INFO  (qtp962787781-19617) [n:127.0.0.1:65502_ c:collection1 s:shard2  x:collection1_shard2_replica_n61] o.a.s.c.CoreContainer Creating SolrCore 'collection1_shard2_replica_n61' using configuration from collection collection1, trusted=true
   [junit4]   2> 2064254 INFO  (qtp962787781-19617) [n:127.0.0.1:65502_ c:collection1 s:shard2  x:collection1_shard2_replica_n61] o.a.s.m.r.SolrJmxReporter JMX monitoring for 'solr.core.collection1.shard2.replica_n61' (registry 'solr.core.collection1.shard2.replica_n61') enabled at server: com.sun.jmx.mbeanserver.JmxMBeanServer@53862e8e
   [junit4]   2> 2064255 INFO  (qtp962787781-19617) [n:127.0.0.1:65502_ c:collection1 s:shard2  x:collection1_shard2_replica_n61] o.a.s.c.SolrCore solr.RecoveryStrategy.Builder
   [junit4]   2> 2064255 INFO  (qtp962787781-19617) [n:127.0.0.1:65502_ c:collection1 s:shard2  x:collection1_shard2_replica_n61] o.a.s.c.SolrCore [[collection1_shard2_replica_n61] ] Opening new SolrCore at [/Users/jenkins/workspace/Lucene-Solr-master-MacOSX/solr/build/solr-core/test/J0/temp/solr.cloud.FullSolrCloudDistribCmdsTest_5FCF99FE871EC427-001/shard-1-001/cores/collection1_shard2_replica_n61], dataDir=[/Users/jenkins/workspace/Lucene-Solr-master-MacOSX/solr/build/solr-core/test/J0/../../../../../../../../../Users/jenkins/workspace/Lucene-Solr-master-MacOSX/solr/build/solr-core/test/J0/temp/solr.cloud.FullSolrCloudDistribCmdsTest_5FCF99FE871EC427-001/shard-1-001/cores/collection1_shard2_replica_n61/data/]
   [junit4]   2> 2064256 INFO  (qtp962787781-19617) [n:127.0.0.1:65502_ c:collection1 s:shard2  x:collection1_shard2_replica_n61] o.a.s.u.RandomMergePolicy RandomMergePolicy wrapping class org.apache.lucene.index.TieredMergePolicy: [TieredMergePolicy: maxMergeAtOnce=29, maxMergeAtOnceExplicit=35, maxMergedSegmentMB=48.6142578125, floorSegmentMB=0.44921875, forceMergeDeletesPctAllowed=12.059525875173682, segmentsPerTier=16.0, maxCFSSegmentSizeMB=8.796093022207999E12, noCFSRatio=0.4598697490875375
   [junit4]   2> 2064258 WARN  (qtp962787781-19617) [n:127.0.0.1:65502_ c:collection1 s:shard2  x:collection1_shard2_replica_n61] o.a.s.c.RequestHandlers INVALID paramSet a in requestHandler {type = requestHandler,name = /dump,class = DumpRequestHandler,attributes = {initParams=a, name=/dump, class=DumpRequestHandler},args = {defaults={a=A,b=B}}}
   [junit4]   2> 2064301 INFO  (qtp962787781-19617) [n:127.0.0.1:65502_ c:collection1 s:shard2  x:collection1_shard2_replica_n61] o.a.s.u.UpdateHandler Using UpdateLog implementation: org.apache.solr.update.UpdateLog
   [junit4]   2> 2064301 INFO  (qtp962787781-19617) [n:127.0.0.1:65502_ c:collection1 s:shard2  x:collection1_shard2_replica_n61] o.a.s.u.UpdateLog Initializing UpdateLog: dataDir= defaultSyncLevel=FLUSH numRecordsToKeep=100 maxNumLogsToKeep=10 numVersionBuckets=65536
   [junit4]   2> 2064303 INFO  (qtp962787781-19617) [n:127.0.0.1:65502_ c:collection1 s:shard2  x:collection1_shard2_replica_n61] o.a.s.u.CommitTracker Hard AutoCommit: disabled
   [junit4]   2> 2064303 INFO  (qtp962787781-19617) [n:127.0.0.1:65502_ c:collection1 s:shard2  x:collection1_shard2_replica_n61] o.a.s.u.CommitTracker Soft AutoCommit: disabled
   [junit4]   2> 2064304 INFO  (qtp962787781-19617) [n:127.0.0.1:65502_ c:collection1 s:shard2  x:collection1_shard2_replica_n61] o.a.s.u.RandomMergePolicy RandomMergePolicy wrapping class org.apache.lucene.index.TieredMergePolicy: [TieredMergePolicy: maxMergeAtOnce=39, maxMergeAtOnceExplicit=46, maxMergedSegmentMB=48.9775390625, floorSegmentMB=0.234375, forceMergeDeletesPctAllowed=9.512652682163388, segmentsPerTier=11.0, maxCFSSegmentSizeMB=8.796093022207999E12, noCFSRatio=0.8175206040097754
   [junit4]   2> 2064304 INFO  (qtp962787781-19617) [n:127.0.0.1:65502_ c:collection1 s:shard2  x:collection1_shard2_replica_n61] o.a.s.s.SolrIndexSearcher Opening [Searcher@72f04efd[collection1_shard2_replica_n61] main]
   [junit4]   2> 2064305 INFO  (qtp962787781-19617) [n:127.0.0.1:65502_ c:collection1 s:shard2  x:collection1_shard2_replica_n61] o.a.s.r.ManagedResourceStorage Configured ZooKeeperStorageIO with znodeBase: /configs/conf1
   [junit4]   2> 2064306 INFO  (qtp962787781-19617) [n:127.0.0.1:65502_ c:collection1 s:shard2  x:collection1_shard2_replica_n61] o.a.s.r.ManagedResourceStorage Loaded null at path _rest_managed.json using ZooKeeperStorageIO:path=/configs/conf1
   [junit4]   2> 2064306 INFO  (qtp962787781-19617) [n:127.0.0.1:65502_ c:collection1 s:shard2  x:collection1_shard2_replica_n61] o.a.s.h.ReplicationHandler Commits will be reserved for 10000ms.
   [junit4]   2> 2064306 INFO  (qtp962787781-19617) [n:127.0.0.1:65502_ c:collection1 s:shard2  x:collection1_shard2_replica_n61] o.a.s.u.UpdateLog Could not find max version in index or recent updates, using new clock 1589716142468890624
   [junit4]   2> 2064307 INFO  (searcherExecutor-7478-thread-1-processing-n:127.0.0.1:65502_ x:collection1_shard2_replica_n61 s:shard2 c:collection1) [n:127.0.0.1:65502_ c:collection1 s:shard2  x:collection1_shard2_replica_n61] o.a.s.c.SolrCore [collection1_shard2_replica_n61] Registered new searcher Searcher@72f04efd[collection1_shard2_replica_n61] main{ExitableDirectoryReader(UninvertingDirectoryReader())}
   [junit4]   2> 2064312 INFO  (qtp962787781-19617) [n:127.0.0.1:65502_ c:collection1 s:shard2  x:collection1_shard2_replica_n61] o.a.s.c.ShardLeaderElectionContext Enough replicas found to continue.
   [junit4]   2> 2064312 INFO  (qtp962787781-19617) [n:127.0.0.1:65502_ c:collection1 s:shard2  x:collection1_shard2_replica_n61] o.a.s.c.ShardLeaderElectionContext I may be the new leader - try and sync
   [junit4]   2> 2064313 INFO  (qtp962787781-19617) [n:127.0.0.1:65502_ c:collection1 s:shard2  x:collection1_shard2_replica_n61] o.a.s.c.SyncStrategy Sync replicas to http://127.0.0.1:65502/collection1_shard2_replica_n61/
   [junit4]   2> 2064313 INFO  (qtp962787781-19617) [n:127.0.0.1:65502_ c:collection1 s:shard2  x:collection1_shard2_replica_n61] o.a.s.c.SyncStrategy Sync Success - now sync replicas to me
   [junit4]   2> 2064313 INFO  (qtp962787781-19617) [n:127.0.0.1:65502_ c:collection1 s:shard2  x:collection1_shard2_replica_n61] o.a.s.c.SyncStrategy http://127.0.0.1:65502/collection1_shard2_replica_n61/ has no replicas
   [junit4]   2> 2064313 INFO  (qtp962787781-19617) [n:127.0.0.1:65502_ c:collection1 s:shard2  x:collection1_shard2_replica_n61] o.a.s.c.ShardLeaderElectionContext Found all replicas participating in election, clear LIR
   [junit4]   2> 2064318 INFO  (qtp962787781-19617) [n:127.0.0.1:65502_ c:collection1 s:shard2  x:collection1_shard2_replica_n61] o.a.s.c.ShardLeaderElectionContext I am the new leader: http://127.0.0.1:65502/collection1_shard2_replica_n61/ shard2
   [junit4]   2> 2064422 INFO  (zkCallback-5246-thread-1-processing-n:127.0.0.1:65502_) [n:127.0.0.1:65502_    ] o.a.s.c.c.ZkStateReader A cluster state change: [WatchedEvent state:SyncConnected type:NodeDataChanged path:/collections/collection1/state.json] for collection [collection1] has occurred - updating... (live nodes size: [2])
   [junit4]   2> 2064431 INFO  (qtp962787781-19617) [n:127.0.0.1:65502_ c:collection1 s:shard2  x:collection1_shard2_replica_n61] o.a.s.c.ZkController I am the leader, no recovery necessary
   [junit4]   2> 2064433 INFO  (qtp962787781-19617) [n:127.0.0.1:65502_ c:collection1 s:shard2  x:collection1_shard2_replica_n61] o.a.s.s.HttpSolrCall [admin] webapp=null path=/admin/cores params={qt=/admin/cores&collection.configName=conf1&name=collection1_shard2_replica_n61&action=CREATE&collection=collection1&shard=shard2&wt=javabin&version=2&replicaType=NRT} status=0 QTime=1302
   [junit4]   2> 2064436 INFO  (qtp92634993-19567) [n:127.0.0.1:65487_    ] o.a.s.s.HttpSolrCall [admin] webapp=null path=/admin/collections params={node=127.0.0.1:65502_&action=ADDREPLICA&collection=collection1&shard=shard2&type=NRT&wt=javabin&version=2} status=0 QTime=1314
   [junit4]   2> 2064534 INFO  (zkCallback-5246-thread-1-processing-n:127.0.0.1:65502_) [n:127.0.0.1:65502_    ] o.a.s.c.c.ZkStateReader A cluster state change: [WatchedEvent state:SyncConnected type:NodeDataChanged path:/collections/collection1/state.json] for collection [collection1] has occurred - updating... (live nodes size: [2])
   [junit4]   2> 2064704 INFO  (TEST-FullSolrCloudDistribCmdsTest.test-seed#[5FCF99FE871EC427]) [    ] o.a.s.c.AbstractFullDistribZkTestBase create jetty 2 in directory /Users/jenkins/workspace/Lucene-Solr-master-MacOSX/solr/build/solr-core/test/J0/temp/solr.cloud.FullSolrCloudDistribCmdsTest_5FCF99FE871EC427-001/shard-2-001 of type NRT
   [junit4]   2> 2064705 INFO  (TEST-FullSolrCloudDistribCmdsTest.test-seed#[5FCF99FE871EC427]) [    ] o.e.j.s.Server jetty-9.3.20.v20170531
   [junit4]   2> 2064706 INFO  (TEST-FullSolrCloudDistribCmdsTest.test-seed#[5FCF99FE871EC427]) [    ] o.e.j.s.h.ContextHandler Started o.e.j.s.ServletContextHandler@6f6cec49{/,null,AVAILABLE}
   [junit4]   2> 2064706 INFO  (TEST-FullSolrCloudDistribCmdsTest.test-seed#[5FCF99FE871EC427]) [    ] o.e.j.s.AbstractConnector Started ServerConnector@c186df4{HTTP/1.1,[http/1.1]}{127.0.0.1:65507}
   [junit4]   2> 2064706 INFO  (TEST-FullSolrCloudDistribCmdsTest.test-seed#[5FCF99FE871EC427]) [    ] o.e.j.s.Server Started @2068763ms
   [junit4]   2> 2064706 INFO  (TEST-FullSolrCloudDistribCmdsTest.test-seed#[5FCF99FE871EC427]) [    ] o.a.s.c.s.e.JettySolrRunner Jetty properties: {solr.data.dir=/Users/jenkins/workspace/Lucene-Solr-master-MacOSX/solr/build/solr-core/test/J0/temp/solr.cloud.FullSolrCloudDistribCmdsTest_5FCF99FE871EC427-001/tempDir-001/jetty2, solrconfig=solrconfig.xml, hostContext=/, hostPort=65507, coreRootDirectory=/Users/jenkins/workspace/Lucene-Solr-master-MacOSX/solr/build/solr-core/test/J0/temp/solr.cloud.FullSolrCloudDistribCmdsTest_5FCF99FE871EC427-001/shard-2-001/cores}
   [junit4]   2> 2064707 ERROR (TEST-FullSolrCloudDistribCmdsTest.test-seed#[5FCF99FE871EC427]) [    ] o.a.s.u.StartupLoggingUtils Missing Java Option solr.log.dir. Logging may be missing or incomplete.
   [junit4]   2> 2064707 INFO  (TEST-FullSolrCloudDistribCmdsTest.test-seed#[5FCF99FE871EC427]) [    ] o.a.s.s.SolrDispatchFilter  ___      _       Welcome to Apache Solr™ version 8.0.0
   [junit4]   2> 2064707 INFO  (TEST-FullSolrCloudDistribCmdsTest.test-seed#[5FCF99FE871EC427]) [    ] o.a.s.s.SolrDispatchFilter / __| ___| |_ _   Starting in cloud mode on port null
   [junit4]   2> 2064707 INFO  (TEST-FullSolrCloudDistribCmdsTest.test-seed#[5FCF99FE871EC427]) [    ] o.a.s.s.SolrDispatchFilter \__ \/ _ \ | '_|  Install dir: null
   [junit4]   2> 2064707 INFO  (TEST-FullSolrCloudDistribCmdsTest.test-seed#[5FCF99FE871EC427]) [    ] o.a.s.s.SolrDispatchFilter |___/\___/_|_|    Start time: 2018-01-16T02:57:35.850Z
   [junit4]   2> 2064709 INFO  (zkConnectionManagerCallback-5251-thread-1) [    ] o.a.s.c.c.ConnectionManager zkClient has connected
   [junit4]   2> 2064710 INFO  (TEST-FullSolrCloudDistribCmdsTest.test-seed#[5FCF99FE871EC427]) [    ] o.a.s.s.SolrDispatchFilter Loading solr.xml from SolrHome (not found in ZooKeeper)
   [junit4]   2> 2064710 INFO  (TEST-FullSolrCloudDistribCmdsTest.test-seed#[5FCF99FE871EC427]) [    ] o.a.s.c.SolrXmlConfig Loading container configuration from /Users/jenkins/workspace/Lucene-Solr-master-MacOSX/solr/build/solr-core/test/J0/temp/solr.cloud.FullSolrCloudDistribCmdsTest_5FCF99FE871EC427-001/shard-2-001/solr.xml
   [junit4]   2> 2064715 INFO  (TEST-FullSolrCloudDistribCmdsTest.test-seed#[5FCF99FE871EC427]) [    ] o.a.s.c.SolrXmlConfig Configuration parameter autoReplicaFailoverWorkLoopDelay is ignored
   [junit4]   2> 2064715 INFO  (TEST-FullSolrCloudDistribCmdsTest.test-seed#[5FCF99FE871EC427]) [    ] o.a.s.c.SolrXmlConfig Configuration parameter autoReplicaFailoverBadNodeExpiration is ignored
   [junit4]   2> 2064715 INFO  (TEST-FullSolrCloudDistribCmdsTest.test-seed#[5FCF99FE871EC427]) [    ] o.a.s.c.SolrXmlConfig MBean server found: com.sun.jmx.mbeanserver.JmxMBeanServer@53862e8e, but no JMX reporters were configured - adding default JMX reporter.
   [junit4]   2> 2064719 INFO  (TEST-FullSolrCloudDistribCmdsTest.test-seed#[5FCF99FE871EC427]) [    ] o.a.s.c.ZkContainer Zookeeper client=127.0.0.1:65484/solr
   [junit4]   2> 2064720 INFO  (zkConnectionManagerCallback-5255-thread-1) [    ] o.a.s.c.c.ConnectionManager zkClient has connected
   [junit4]   2> 2064723 INFO  (zkConnectionManagerCallback-5257-thread-1-processing-n:127.0.0.1:65507_) [n:127.0.0.1:65507_    ] o.a.s.c.c.ConnectionManager zkClient has connected
   [junit4]   2> 2064733 INFO  (TEST-FullSolrCloudDistribCmdsTest.test-seed#[5FCF99FE871EC427]) [n:127.0.0.1:65507_    ] o.a.s.c.c.ZkStateReader Updated live nodes from ZooKeeper... (0) -> (2)
   [junit4]   2> 2064736 INFO  (TEST-FullSolrCloudDistribCmdsTest.test-seed#[5FCF99FE871EC427]) [n:127.0.0.1:65507_    ] o.a.s.c.Overseer Overseer (id=null) closing
   [junit4]   2> 2064739 INFO  (TEST-FullSolrCloudDistribCmdsTest.test-seed#[5FCF99FE871EC427]) [n:127.0.0.1:65507_    ] o.a.s.c.ZkController Register node as live in ZooKeeper:/live_nodes/127.0.0.1:65507_
   [junit4]   2> 2064741 INFO  (zkCallback-5238-thread-1) [    ] o.a.s.c.c.ZkStateReader Updated live nodes from ZooKeeper... (2) -> (3)
   [junit4]   2> 2064741 INFO  (zkCallback-5228-thread-2-processing-n:127.0.0.1:65487_) [n:127.0.0.1:65487_    ] o.a.s.c.c.ZkStateReader Updated live nodes from ZooKeeper... (2) -> (3)
   [junit4]   2> 2064741 INFO  (zkCallback-5246-thread-1-processing-n:127.0.0.1:65502_) [n:127.0.0.1:65502_    ] o.a.s.c.c.ZkStateReader Updated live nodes from ZooKeeper... (2) -> (3)
   [junit4]   2> 2064741 INFO  (zkCallback-5256-thread-1-processing-n:127.0.0.1:65507_) [n:127.0.0.1:65507_    ] o.a.s.c.c.ZkStateReader Updated live nodes from ZooKeeper... (2) -> (3)
   [junit4]   2> 2064813 INFO  (TEST-FullSolrCloudDistribCmdsTest.test-seed#[5FCF99FE871EC427]) [n:127.0.0.1:65507_    ] o.a.s.m.r.SolrJmxReporter JMX monitoring for 'solr.node' (registry 'solr.node') enabled at server: com.sun.jmx.mbeanserver.JmxMBeanServer@53862e8e
   [junit4]   2> 2064821 INFO  (TEST-FullSolrCloudDistribCmdsTest.test-seed#[5FCF99FE871EC427]) [n:127.0.0.1:65507_    ] o.a.s.m.r.SolrJmxReporter JMX monitoring for 'solr.jvm' (registry 'solr.jvm') enabled at server: com.sun.jmx.mbeanserver.JmxMBeanServer@53862e8e
   [junit4]   2> 2064822 INFO  (TEST-FullSolrCloudDistribCmdsTest.test-seed#[5FCF99FE871EC427]) [n:127.0.0.1:65507_    ] o.a.s.m.r.SolrJmxReporter JMX monitoring for 'solr.jetty' (registry 'solr.jetty') enabled at server: com.sun.jmx.mbeanserver.JmxMBeanServer@53862e8e
   [junit4]   2> 2064823 INFO  (TEST-FullSolrCloudDistribCmdsTest.test-seed#[5FCF99FE871EC427]) [n:127.0.0.1:65507_    ] o.a.s.c.CorePropertiesLocator Found 0 core definitions underneath /Users/jenkins/workspace/Lucene-Solr-master-MacOSX/solr/build/solr-core/test/J0/temp/solr.cloud.FullSolrCloudDistribCmdsTest_5FCF99FE871EC427-001/shard-2-001/cores
   [junit4]   2> 2064856 INFO  (qtp92634993-19570) [n:127.0.0.1:65487_    ] o.a.s.h.a.CollectionsHandler Invoked Collection Action :addreplica with params node=127.0.0.1:65507_&action=ADDREPLICA&collection=collection1&shard=shard3&type=NRT&wt=javabin&version=2 and sendToOCPQueue=true
   [junit4]   2> 2064859 INFO  (OverseerCollectionConfigSetProcessor-99357258573938692-127.0.0.1:65487_-n_0000000000) [n:127.0.0.1:65487_    ] o.a.s.c.OverseerTaskQueue Response ZK path: /overseer/collection-queue-work/qnr-0000000004 doesn't exist.  Requestor may have disconnected from ZooKeeper
   [junit4]   2> 2064860 INFO  (OverseerThreadFactory-7464-thread-4-processing-n:127.0.0.1:65487_) [n:127.0.0.1:65487_    ] o.a.s.c.AddReplicaCmd Node Identified 127.0.0.1:65507_ for creating new replica
   [junit4]   2> 2064864 INFO  (qtp2079438969-19649) [n:127.0.0.1:65507_    ] o.a.s.h.a.CoreAdminOperation core create command qt=/admin/cores&collection.configName=conf1&name=collection1_shard3_replica_n63&action=CREATE&collection=collection1&shard=shard3&wt=javabin&version=2&replicaType=NRT
   [junit4]   2> 2064865 INFO  (qtp2079438969-19649) [n:127.0.0.1:65507_    ] o.a.s.c.TransientSolrCoreCacheDefault Allocating transient cache for 4 transient cores
   [junit4]   2> 2064981 INFO  (zkCallback-5246-thread-1-processing-n:127.0.0.1:65502_) [n:127.0.0.1:65502_    ] o.a.s.c.c.ZkStateReader A cluster state change: [WatchedEvent state:SyncConnected type:NodeDataChanged path:/collections/collection1/state.json] for collection [collection1] has occurred - updating... (live nodes size: [3])
   [junit4]   2> 2064981 INFO  (zkCallback-5256-thread-1-processing-n:127.0.0.1:65507_) [n:127.0.0.1:65507_    ] o.a.s.c.c.ZkStateReader A cluster state change: [WatchedEvent state:SyncConnected type:NodeDataChanged path:/collections/collection1/state.json] for collection [collection1] has occurred - updating... (live nodes size: [3])
   [junit4]   2> 2065889 INFO  (qtp2079438969-19649) [n:127.0.0.1:65507_ c:collection1 s:shard3  x:collection1_shard3_replica_n63] o.a.s.c.SolrConfig Using Lucene MatchVersion: 8.0.0
   [junit4]   2> 2065915 INFO  (qtp2079438969-19649) [n:127.0.0.1:65507_ c:collection1 s:shard3  x:collection1_shard3_replica_n63] o.a.s.s.IndexSchema [collection1_shard3_replica_n63] Schema name=test
   [junit4]   2> 2065981 INFO  (qtp2079438969-19649) [n:127.0.0.1:65507_ c:collection1 s:shard3  x:collection1_shard3_replica_n63] o.a.s.s.IndexSchema Loaded schema test/1.6 with uniqueid field id
   [junit4]   2> 2066003 INFO  (qtp2079438969-19649) [n:127.0.0.1:65507_ c:collection1 s:shard3  x:collection1_shard3_replica_n63] o.a.s.c.CoreContainer Creating SolrCore 'collection1_shard3_replica_n63' using configuration from collection collection1, trusted=true
   [junit4]   2> 2066003 INFO  (qtp2079438969-19649) [n:127.0.0.1:65507_ c:collection1 s:shard3  x:collection1_shard3_replica_n63] o.a.s.m.r.SolrJmxReporter JMX monitoring for 'solr.core.collection1.shard3.replica_n63' (registry 'solr.core.collection1.shard3.replica_n63') enabled at server: com.sun.jmx.mbeanserver.JmxMBeanServer@53862e8e
   [junit4]   2> 2066003 INFO  (qtp2079438969-19649) [n:127.0.0.1:65507_ c:collection1 s:shard3  x:collection1_shard3_replica_n63] o.a.s.c.SolrCore solr.RecoveryStrategy.Builder
   [junit4]   2> 2066003 INFO  (qtp2079438969-19649) [n:127.0.0.1:65507_ c:collection1 s:shard3  x:collection1_shard3_replica_n63] o.a.s.c.SolrCore [[collection1_shard3_replica_n63] ] Opening new SolrCore at [/Users/jenkins/workspace/Lucene-Solr-master-MacOSX/solr/build/solr-core/test/J0/temp/solr.cloud.FullSolrCloudDistribCmdsTest_5FCF99FE871EC427-001/shard-2-001/cores/collection1_shard3_replica_n63], dataDir=[/Users/jenkins/workspace/Lucene-Solr-master-MacOSX/solr/build/solr-core/test/J0/temp/solr.cloud.FullSolrCloudDistribCmdsTest_5FCF99FE871EC427-001/shard-2-001/cores/collection1_shard3_replica_n63/data/]
   [junit4]   2> 2066005 INFO  (qtp2079438969-19649) [n:127.0.0.1:65507_ c:collection1 s:shard3  x:collection1_shard3_replica_n63] o.a.s.u.RandomMergePolicy RandomMergePolicy wrapping class org.apache.lucene.index.TieredMergePolicy: [TieredMergePolicy: maxMergeAtOnce=29, maxMergeAtOnceExplicit=35, maxMergedSegmentMB=48.6142578125, floorSegmentMB=0.44921875, forceMergeDeletesPctAllowed=12.059525875173682, segmentsPerTier=16.0, maxCFSSegmentSizeMB=8.796093022207999E12, noCFSRatio=0.4598697490875375
   [junit4]   2> 2066007 WARN  (qtp2079438969-19649) [n:127.0.0.1:65507_ c:collection1 s:shard3  x:collection1_shard3_replica_n63] o.a.s.c.RequestHandlers INVALID paramSet a in requestHandler {type = requestHandler,name = /dump,class = DumpRequestHandler,attributes = {initParams=a, name=/dump, class=DumpRequestHandler},args = {defaults={a=A,b=B}}}
   [junit4]   2> 2066054 INFO  (qtp2079438969-19649) [n:127.0.0.1:65507_ c:collection1 s:shard3  x:collection1_shard3_replica_n63] o.a.s.u.UpdateHandler Using UpdateLog implementation: org.apache.solr.update.UpdateLog
   [junit4]   2> 2066054 INFO  (qtp2079438969-19649) [n:127.0.0.1:65507_ c:collection1 s:shard3  x:collection1_shard3_replica_n63] o.a.s.u.UpdateLog Initializing UpdateLog: dataDir= defaultSyncLevel=FLUSH numRecordsToKeep=100 maxNumLogsToKeep=10 numVersionBuckets=65536
   [junit4]   2> 2066055 INFO  (qtp2079438969-19649) [n:127.0.0.1:65507_ c:collection1 s:shard3  x:collection1_shard3_replica_n63] o.a.s.u.CommitTracker Hard AutoCommit: disabled
   [junit4]   2> 2066055 INFO  (qtp2079438969-19649) [n:127.0.0.1:65507_ c:collection1 s:shard3  x:collection1_shard3_replica_n63] o.a.s.u.CommitTracker Soft AutoCommit: disabled
   [junit4]   2> 2066056 INFO  (qtp2079438969-19649) [n:127.0.0.1:65507_ c:collection1 s:shard3  x:collection1_shard3_replica_n63] o.a.s.u.RandomMergePolicy RandomMergePolicy wrapping class org.apache.lucene.index.TieredMergePolicy: [TieredMergePolicy: maxMergeAtOnce=39, maxMergeAtOnceExplicit=46, maxMergedSegmentMB=48.9775390625, floorSegmentMB=0.234375, forceMergeDeletesPctAllowed=9.512652682163388, segmentsPerTier=11.0, maxCFSSegmentSizeMB=8.796093022207999E12, noCFSRatio=0.8175206040097754
   [junit4]   2> 2066056 INFO  (qtp2079438969-19649) [n:127.0.0.1:65507_ c:collection1 s:shard3  x:collection1_shard3_replica_n63] o.a.s.s.SolrIndexSearcher Opening [Searcher@386039f6[collection1_shard3_replica_n63] main]
   [junit4]   2> 2066057 INFO  (qtp2079438969-19649) [n:127.0.0.1:65507_ c:collection1 s:shard3  x:collection1_shard3_replica_n63] o.a.s.r.ManagedResourceStorage Configured ZooKeeperStorageIO with znodeBase: /configs/conf1
   [junit4]   2> 2066058 INFO  (qtp2079438969-19649) [n:127.0.0.1:65507_ c:collection1 s:shard3  x:collection1_shard3_replica_n63] o.a.s.r.ManagedResourceStorage Loaded null at path _rest_managed.json using ZooKeeperStorageIO:path=/configs/conf1
   [junit4]   2> 2066058 INFO  (qtp2079438969-19649) [n:127.0.0.1:65507_ c:collection1 s:shard3  x:collection1_shard3_replica_n63] o.a.s.h.ReplicationHandler Commits will be reserved for 10000ms.
   [junit4]   2> 2066058 INFO  (qtp2079438969-19649) [n:127.0.0.1:65507_ c:collection1 s:shard3  x:collection1_shard3_replica_n63] o.a.s.u.UpdateLog Could not find max version in index or recent updates, using new clock 1589716144305995776
   [junit4]   2> 2066059 INFO  (searcherExecutor-7489-thread-1-processing-n:127.0.0.1:65507_ x:collection1_shard3_replica_n63 s:shard3 c:collection1) [n:127.0.0.1:65507_ c:collection1 s:shard3  x:collection1_shard3_replica_n63] o.a.s.c.SolrCore [collection1_shard3_replica_n63] Registered new searcher Searcher@386039f6[collection1_shard3_replica_n63] main{ExitableDirectoryReader(UninvertingDirectoryReader())}
   [junit4]   2> 2066064 INFO  (qtp2079438969-19649) [n:127.0.0.1:65507_ c:collection1 s:shard3  x:collection1_shard3_replica_n63] o.a.s.c.ShardLeaderElectionContext Enough replicas found to continue.
   [junit4]   2> 2066064 INFO  (qtp2079438969-19649) [n:127.0.0.1:65507_ c:collection1 s:shard3  x:collection1_shard3_replica_n63] o.a.s.c.ShardLeaderElectionContext I may be the new leader - try and sync
   [junit4]   2> 2066064 INFO  (qtp2079438969-19649) [n:127.0.0.1:65507_ c:collection1 s:shard3  x:collection1_shard3_replica_n63] o.a.s.c.SyncStrategy Sync replicas to http://127.0.0.1:65507/collection1_shard3_replica_n63/
   [junit4]   2> 2066065 INFO  (qtp2079438969-19649) [n:127.0.0.1:65507_ c:collection1 s:shard3  x:collection1_shard3_replica_n63] o.a.s.c.SyncStrategy Sync Success - now sync replicas to me
   [junit4]   2> 2066065 INFO  (qtp2079438969-19649) [n:127.0.0.1:65507_ c:collection1 s:shard3  x:collection1_shard3_replica_n63] o.a.s.c.SyncStrategy http://127.0.0.1:65507/collection1_shard3_replica_n63/ has no replicas
   [junit4]   2> 2066065 INFO  (qtp2079438969-19649) [n:127.0.0.1:65507_ c:collection1 s:shard3  x:collection1_shard3_replica_n63] o.a.s.c.ShardLeaderElectionContext Found all replicas participating in election, clear LIR
   [junit4]   2> 2066069 INFO  (qtp2079438969-19649) [n:127.0.0.1:65507_ c:collection1 s:shard3  x:collection1_shard3_replica_n63] o.a.s.c.ShardLeaderElectionContext I am the new leader: http://127.0.0.1:65507/collection1_shard3_replica_n63/ shard3
   [junit4]   2> 2066172 INFO  (zkCallback-5256-thread-1-processing-n:127.0.0.1:65507_) [n:127.0.0.1:65507_    ] o.a.s.c.c.ZkStateReader A cluster state change: [WatchedEvent state:SyncConnected type:NodeDataChanged path:/collections/collection1/state.json] for collection [collection1] has occurred - updating... (live nodes size: [3])
   [junit4]   2> 2066172 INFO  (zkCallback-5246-thread-1-processing-n:127.0.0.1:65502_) [n:127.0.0.1:65502_    ] o.a.s.c.c.ZkStateReader A cluster state change: [WatchedEvent state:SyncConnected type:NodeDataChanged path:/collections/collection1/state.json] for collection [collection1] has occurred - updating... (live nodes size: [3])
   [junit4]   2> 2066187 INFO  (qtp2079438969-19649) [n:127.0.0.1:65507_ c:collection1 s:shard3  x:collection1_shard3_replica_n63] o.a.s.c.ZkController I am the leader, no recovery necessary
   [junit4]   2> 2066189 INFO  (qtp2079438969-19649) [n:127.0.0.1:65507_ c:collection1 s:shard3  x:collection1_shard3_replica_n63] o.a.s.s.HttpSolrCall [admin] webapp=null path=/admin/cores params={qt=/admin/cores&collection.configName=conf1&name=collection1_shard3_replica_n63&action=CREATE&collection=collection1&shard=shard3&wt=javabin&version=2&replicaType=NRT} status=0 QTime=1324
   [junit4]   2> 2066192 INFO  (qtp92634993-19570) [n:127.0.0.1:65487_    ] o.a.s.s.HttpSolrCall [admin] webapp=null path=/admin/collections params={node=127.0.0.1:65507_&action=ADDREPLICA&collection=collection1&shard=shard3&type=NRT&wt=javabin&version=2} status=0 QTime=1336
   [junit4]   2> 2066291 INFO  (zkCallback-5246-thread-1-processing-n:127.0.0.1:65502_) [n:127.0.0.1:65502_    ] o.a.s.c.c.ZkStateReader A cluster state change: [WatchedEvent state:SyncConnected type:NodeDataChanged path:/collections/collection1/state.json] for collection [collection1] has occurred - updating... (live nodes size: [3])
   [junit4]   2> 2066291 INFO  (zkCallback-5256-thread-1-processing-n:127.0.0.1:65507_) [n:127.0.0.1:65507_    ] o.a.s.c.c.ZkStateReader A cluster state change: [WatchedEvent state:SyncConnected type:NodeDataChanged path:/collections/collection1/state.json] for collection [collection1] has occurred - updating... (live nodes size: [3])
   [junit4]   2> 2066447 INFO  (TEST-FullSolrCloudDistribCmdsTest.test-seed#[5FCF99FE871EC427]) [    ] o.a.s.c.AbstractFullDistribZkTestBase create jetty 3 in directory /Users/jenkins/workspace/Lucene-Solr-master-MacOSX/solr/build/solr-core/test/J0/temp/solr.cloud.FullSolrCloudDistribCmdsTest_5FCF99FE871EC427-001/shard-3-001 of type NRT
   [junit4]   2> 2066447 INFO  (TEST-FullSolrCloudDistribCmdsTest.test-seed#[5FCF99FE871EC427]) [    ] o.e.j.s.Server jetty-9.3.20.v20170531
   [junit4]   2> 2066449 INFO  (TEST-FullSolrCloudDistribCmdsTest.test-seed#[5FCF99FE871EC427]) [    ] o.e.j.s.h.ContextHandler Started o.e.j.s.ServletContextHandler@228f4594{/,null,AVAILABLE}
   [junit4]   2> 2066449 INFO  (TEST-FullSolrCloudDistribCmdsTest.test-seed#[5FCF99FE871EC427]) [    ] o.e.j.s.AbstractConnector Started ServerConnector@69f01fe4{HTTP/1.1,[http/1.1]}{127.0.0.1:65512}
   [junit4]   2> 2066449 INFO  (TEST-FullSolrCloudDistribCmdsTest.test-seed#[5FCF99FE871EC427]) [    ] o.e.j.s.Server Started @2070505ms
   [junit4]   2> 2066450 INFO  (TEST-FullSolrCloudDistribCmdsTest.test-seed#[5FCF99FE871EC427]) [    ] o.a.s.c.s.e.JettySolrRunner Jetty properties: {solr.data.dir=/Users/jenkins/workspace/Lucene-Solr-master-MacOSX/solr/build/solr-core/test/J0/temp/solr.cloud.FullSolrCloudDistribCmdsTest_5FCF99FE871EC427-001/tempDir-001/jetty3, replicaType=NRT, solrconfig=solrconfig.xml, hostContext=/, hostPort=65512, coreRootDirectory=/Users/jenkins/workspace/Lucene-Solr-master-MacOSX/solr/build/solr-core/test/J0/temp/solr.cloud.FullSolrCloudDistribCmdsTest_5FCF99FE871EC427-001/shard-3-001/cores}
   [junit4]   2> 2066450 ERROR (TEST-FullSolrCloudDistribCmdsTest.test-seed#[5FCF99FE871EC427]) [    ] o.a.s.u.StartupLoggingUtils Missing Java Option solr.log.dir. Logging may be missing or incomplete.
   [junit4]   2> 2066450 INFO  (TEST-FullSolrCloudDistribCmdsTest.test-seed#[5FCF99FE871EC427]) [    ] o.a.s.s.SolrDispatchFilter  ___      _       Welcome to Apache Solr™ version 8.0.0
   [junit4]   2> 2066450 INFO  (TEST-FullSolrCloudDistribCmdsTest.test-seed#[5FCF99FE871EC427]) [    ] o.a.s.s.SolrDispatchFilter / __| ___| |_ _   Starting in cloud mode on port null
   [junit4]   2> 2066450 INFO  (TEST-FullSolrCloudDistribCmdsTest.test-seed#[5FCF99FE871EC427]) [    ] o.a.s.s.SolrDispatchFilter \__ \/ _ \ | '_|  Install dir: null
   [junit4]   2> 2066450 INFO  (TEST-FullSolrCloudDistribCmdsTest.test-seed#[5FCF99FE871EC427]) [    ] o.a.s.s.SolrDispatchFilter |___/\___/_|_|    Start time: 2018-01-16T02:57:37.593Z
   [junit4]   2> 2066452 INFO  (zkConnectionManagerCallback-5261-thread-1) [    ] o.a.s.c.c.ConnectionManager zkClient has connected
   [junit4]   2> 2066453 INFO  (TEST-FullSolrCloudDistribCmdsTest.test-seed#[5FCF99FE871EC427]) [    ] o.a.s.s.SolrDispatchFilter Loading solr.xml from SolrHome (not found in ZooKeeper)
   [junit4]   2> 2066453 INFO  (TEST-FullSolrCloudDistribCmdsTest.test-seed#[5FCF99FE871EC427]) [    ] o.a.s.c.SolrXmlConfig Loading container configuration from /Users/jenkins/workspace/Lucene-Solr-master-MacOSX/solr/build/solr-core/test/J0/temp/solr.cloud.FullSolrCloudDistribCmdsTest_5FCF99FE871EC427-001/shard-3-001/solr.xml
   [junit4]   2> 2066457 INFO  (TEST-FullSolrCloudDistribCmdsTest.test-seed#[5FCF99FE871EC427]) [    ] o.a.s.c.SolrXmlConfig Configuration parameter autoReplicaFailoverWorkLoopDelay is ignored
   [junit4]   2> 2066457 INFO  (TEST-FullSolrCloudDistribCmdsTest.test-seed#[5FCF99FE871EC427]) [    ] o.a.s.c.SolrXmlConfig Configuration parameter autoReplicaFailoverBadNodeExpiration is ignored
   [junit4]   2> 2066458 INFO  (TEST-FullSolrCloudDistribCmdsTest.test-seed#[5FCF99FE871EC427]) [    ] o.a.s.c.SolrXmlConfig MBean server found: com.sun.jmx.mbeanserver.JmxMBeanServer@53862e8e, but no JMX reporters were configured - adding default JMX reporter.
   [junit4]   2> 2066461 INFO  (TEST-FullSolrCloudDistribCmdsTest.test-seed#[5FCF99FE871EC427]) [    ] o.a.s.c.ZkContainer Zookeeper client=127.0.0.1:65484/solr
   [junit4]   2> 2066463 INFO  (zkConnectionManagerCallback-5265-thread-1) [    ] o.a.s.c.c.ConnectionManager zkClient has connected
   [junit4]   2> 2066465 INFO  (zkConnectionManagerCallback-5267-thread-1-processing-n:127.0.0.1:65512_) [n:127.0.0.1:65512_    ] o.a.s.c.c.ConnectionManager zkClient has connected
   [junit4]   2> 2066476 INFO  (TEST-FullSolrCloudDistribCmdsTest.test-seed#[5FCF99FE871EC427]) [n:127.0.0.1:65512_    ] o.a.s.c.c.ZkStateReader Updated live nodes from ZooKeeper... (0) -> (3)
   [junit4]   2> 2066479 INFO  (TEST-FullSolrCloudDistribCmdsTest.test-seed#[5FCF99FE871EC427]) [n:127.0.0.1:65512_    ] o.a.s.c.Overseer Overseer (id=null) closing
   [junit4]   2> 2066482 INFO  (TEST-FullSolrCloudDistribCmdsTest.test-seed#[5FCF99FE871EC427]) [n:127.0.0.1:65512_    ] o.a.s.c.ZkController Register node as live in ZooKeeper:/live_nodes/127.0.0.1:65512_
   [junit4]   2> 2066484 INFO  (zkCallback-5238-thread-1) [    ] o.a.s.c.c.ZkStateReader Updated live nodes from ZooKeeper... (3) -> (4)
   [junit4]   2> 2066484 INFO  (zkCallback-5256-thread-1-processing-n:127.0.0.1:65507_) [n:127.0.0.1:65507_    ] o.a.s.c.c.ZkStateReader Updated live nodes from ZooKeeper... (3) -> (4)
   [junit4]   2> 2066484 INFO  (zkCallback-5228-thread-2-processing-n:127.0.0.1:65487_) [n:127.0.0.1:65487_    ] o.a.s.c.c.ZkStateReader Updated live nodes from ZooKeeper... (3) -> (4)
   [junit4]   2> 2066484 INFO  (zkCallback-5246-thread-1-processing-n:127.0.0.1:65502_) [n:127.0.0.1:65502_    ] o.a.s.c.c.ZkStateReader Updated live nodes from ZooKeeper... (3) -> (4)
   [junit4]   2> 2066484 INFO  (zkCallback-5266-thread-1-processing-n:127.0.0.1:65512_) [n:127.0.0.1:65512_    ] o.a.s.c.c.ZkStateReader Updated live nodes from ZooKeeper... (3) -> (4)
   [junit4]   2> 2066538 INFO  (TEST-FullSolrCloudDistribCmdsTest.test-seed#[5FCF99FE871EC427]) [n:127.0.0.1:65512_    ] o.a.s.m.r.SolrJmxReporter JMX monitoring for 'solr.node' (registry 'solr.node') enabled at server: com.sun.jmx.mbeanserver.JmxMBeanServer@53862e8e
   [junit4]   2> 2066546 INFO  (TEST-FullSolrCloudDistribCmdsTest.test-seed#[5FCF99FE871EC427]) [n:127.0.0.1:65512_    ] o.a.s.m.r.SolrJmxReporter JMX monitoring for 'solr.jvm' (registry 'solr.jvm') enabled at server: com.sun.jmx.mbeanserver.JmxMBeanServer@53862e8e
   [junit4]   2> 2066546 INFO  (TEST-FullSolrCloudDistribCmdsTest.test-seed#[5FCF99FE871EC427]) [n:127.0.0.1:65512_    ] o.a.s.m.r.SolrJmxReporter JMX monitoring for 'solr.jetty' (registry 'solr.jetty') enabled at server: com.sun.jmx.mbeanserver.JmxMBeanServer@53862e8e
   [junit4]   2> 2066547 INFO  (TEST-FullSolrCloudDistribCmdsTest.test-seed#[5FCF99FE871EC427]) [n:127.0.0.1:65512_    ] o.a.s.c.CorePropertiesLocator Found 0 core definitions underneath /Users/jenkins/workspace/Lucene-Solr-master-MacOSX/solr/build/solr-core/test/J0/temp/solr.cloud.FullSolrCloudDistribCmdsTest_5FCF99FE871EC427-001/shard-3-001/cores
   [junit4]   2> 2066588 INFO  (qtp92634993-19571) [n:127.0.0.1:65487_    ] o.a.s.h.a.CollectionsHandler Invoked Collection Action :addreplica with params node=127.0.0.1:65512_&action=ADDREPLICA&collection=collection1&shard=shard1&type=NRT&wt=javabin&version=2 and sendToOCPQueue=true
   [junit4]   2> 2066591 INFO  (OverseerCollectionConfigSetProcessor-99357258573938692-127.0.0.1:65487_-n_0000000000) [n:127.0.0.1:65487_    ] o.a.s.c.OverseerTaskQueue Response ZK path: /overseer/collection-queue-work/qnr-0000000006 doesn't exist.  Requestor may have disconnected from ZooKeeper
   [junit4]   2> 2066592 INFO  (OverseerThreadFactory-7464-thread-5-processing-n:127.0.0.1:65487_) [n:127.0.0.1:65487_    ] o.a.s.c.AddReplicaCmd Node Identified 127.0.0.1:65512_ for creating new replica
   [junit4]   2> 2066598 INFO  (qtp1509247103-19680) [n:127.0.0.1:65512_    ] o.a.s.h.a.CoreAdminOperation core create command qt=/admin/cores&collection.configName=conf1&name=collection1_shard1_replica_n65&action=CREATE&collection=collection1&shard=shard1&wt=javabin&version=2&replicaType=NRT
   [junit4]   2> 2066598 INFO  (qtp1509247103-19680) [n:127.0.0.1:65512_    ] o.a.s.c.TransientSolrCoreCacheDefault Allocating transient cache for 4 transient cores
   [junit4]   2> 2066711 INFO  (zkCallback-5266-thread-1-processing-n:127.0.0.1:65512_) [n:127.0.0.1:65512_    ] o.a.s.c.c.ZkStateReader A cluster state change: [WatchedEvent state:SyncConnected type:NodeDataChanged path:/collections/collection1/state.json] for collection [collection1] has occurred - updating... (live nodes size: [4])
   [junit4]   2> 2066711 INFO  (zkCallback-5246-thread-1-processing-n:127.0.0.1:65502_) [n:127.0.0.1:65502_    ] o.a.s.c.c.ZkStateReader A cluster state change: [WatchedEvent state:SyncConnected type:NodeDataChanged path:/collections/collection1/state.json] for collection [collection1] has occurred - updating... (live nodes size: [4])
   [junit4]   2> 2066711 INFO  (zkCallback-5256-thread-1-processing-n:127.0.0.1:65507_) [n:127.0.0.1:65507_    ] o.a.s.c.c.ZkStateReader A cluster state change: [WatchedEvent state:SyncConnected type:NodeDataChanged path:/collections/collection1/state.json] for collection [collection1] has occurred - updating... (live nodes size: [4])
   [junit4]   2> 2067621 INFO  (qtp1509247103-19680) [n:127.0.0.1:65512_ c:collection1 s:shard1  x:collection1_shard1_replica_n65] o.a.s.c.SolrConfig Using Lucene MatchVersion: 8.0.0
   [junit4]   2> 2067645 INFO  (qtp1509247103-19680) [n:127.0.0.1:65512_ c:collection1 s:shard1  x:collection1_shard1_replica_n65] o.a.s.s.IndexSchema [collection1_shard1_replica_n65] Schema name=test
   [junit4]   2> 2067702 INFO  (qtp1509247103-19680) [n:127.0.0.1:65512_ c:collection1 s:shard1  x:collection1_shard1_replica_n65] o.a.s.s.IndexSchema Loaded schema test/1.6 with uniqueid field id
   [junit4]   2> 2067722 INFO  (qtp1509247103-19680) [n:127.0.0.1:65512_ c:collection1 s:shard1  x:collection1_shard1_replica_n65] o.a.s.c.CoreContainer Creating SolrCore 'collection1_shard1_replica_n65' using configuration from collection collection1, trusted=true
   [junit4]   2> 2067722 INFO  (qtp1509247103-19680) [n:127.0.0.1:65512_ c:collection1 s:shard1  x:collection1_shard1_replica_n65] o.a.s.m.r.SolrJmxReporter JMX monitoring for 'solr.core.collection1.shard1.replica_n65' (registry 'solr.core.collection1.shard1.replica_n65') enabled at server: com.sun.jmx.mbeanserver.JmxMBeanServer@53862e8e
   [junit4]   2> 2067722 INFO  (qtp1509247103-19680) [n:127.0.0.1:65512_ c:collection1 s:shard1  x:collection1_shard1_replica_n65] o.a.s.c.SolrCore solr.RecoveryStrategy.Builder
   [junit4]   2> 2067722 INFO  (qtp1509247103-19680) [n:127.0.0.1:65512_ c:collection1 s:shard1  x:collection1_shard1_replica_n65] o.a.s.c.SolrCore [[collection1_shard1_replica_n65] ] Opening new SolrCore at [/Users/jenkins/workspace/Lucene-Solr-master-MacOSX/solr/build/solr-core/test/J0/temp/solr.cloud.FullSolrCloudDistribCmdsTest_5FCF99FE871EC427-001/shard-3-001/cores/collection1_shard1_replica_n65], dataDir=[/Users/jenkins/workspace/Lucene-Solr-master-MacOSX/solr/build/solr-core/test/J0/temp/solr.cloud.FullSolrCloudDistribCmdsTest_5FCF99FE871EC427-001/shard-3-001/cores/collection1_shard1_replica_n65/data/]
   [junit4]   2> 2067724 INFO  (qtp1509247103-19680) [n:127.0.0.1:65512_ c:collection1 s:shard1  x:collection1_shard1_replica_n65] o.a.s.u.RandomMergePolicy RandomMergePolicy wrapping class org.apache.lucene.index.TieredMergePolicy: [TieredMergePolicy: maxMergeAtOnce=29, maxMergeAtOnceExplicit=35, maxMergedSegmentMB=48.6142578125, floorSegmentMB=0.44921875, forceMergeDeletesPctAllowed=12.059525875173682, segmentsPerTier=16.0, maxCFSSegmentSizeMB=8.796093022207999E12, noCFSRatio=0.4598697490875375
   [junit4]   2> 2067726 WARN  (qtp1509247103-19680) [n:127.0.0.1:65512_ c:collection1 s:shard1  x:collection1_shard1_replica_n65] o.a.s.c.RequestHandlers INVALID paramSet a in requestHandler {type = requestHandler,name = /dump,class = DumpRequestHandler,attributes = {initParams=a, name=/dump, class=DumpRequestHandler},args = {defaults={a=A,b=B}}}
   [junit4]   2> 2067768 INFO  (qtp1509247103-19680) [n:127.0.0.1:65512_ c:collection1 s:shard1  x:collection1_shard1_replica_n65] o.a.s.u.UpdateHandler Using UpdateLog implementation: org.apache.solr.update.UpdateLog
   [junit4]   2> 2067768 INFO  (qtp1509247103-19680) [n:127.0.0.1:65512_ c:collection1 s:shard1  x:collection1_shard1_replica_n65] o.a.s.u.UpdateLog Initializing UpdateLog: dataDir= defaultSyncLevel=FLUSH numRecordsToKeep=100 maxNumLogsToKeep=10 numVersionBuckets=65536
   [junit4]   2> 2067769 INFO  (qtp1509247103-19680) [n:127.0.0.1:65512_ c:collection1 s:shard1  x:collection1_shard1_replica_n65] o.a.s.u.CommitTracker Hard AutoCommit: disabled
   [junit4]   2> 2067769 INFO  (qtp1509247103-19680) [n:127.0.0.1:65512_ c:collection1 s:shard1  x:collection1_shard1_replica_n65] o.a.s.u.CommitTracker Soft AutoCommit: disabled
   [junit4]   2> 2067770 INFO  (qtp1509247103-19680) [n:127.0.0.1:65512_ c:collection1 s:shard1  x:collection1_shard1_replica_n65] o.a.s.u.RandomMergePolicy RandomMergePolicy wrapping class org.apache.lucene.index.TieredMergePolicy: [TieredMergePolicy: maxMergeAtOnce=39, maxMergeAtOnceExplicit=46, maxMergedSegmentMB=48.9775390625, floorSegmentMB=0.234375, forceMergeDeletesPctAllowed=9.512652682163388, segmentsPerTier=11.0, maxCFSSegmentSizeMB=8.796093022207999E12, noCFSRatio=0.8175206040097754
   [junit4]   2> 2067770 INFO  (qtp1509247103-19680) [n:127.0.0.1:65512_ c:collection1 s:shard1  x:collection1_shard1_replica_n65] o.a.s.s.SolrIndexSearcher Opening [Searcher@5c49f146[collection1_shard1_replica_n65] main]
   [junit4]   2> 2067771 INFO  (qtp1509247103-19680) [n:127.0.0.1:65512_ c:collection1 s:shard1  x:collection1_shard1_replica_n65] o.a.s.r.ManagedResourceStorage Configured ZooKeeperStorageIO with znodeBase: /configs/conf1
   [junit4]   2> 2067772 INFO  (qtp1509247103-19680) [n:127.0.0.1:65512_ c:collection1 s:shard1  x:collection1_shard1_replica_n65] o.a.s.r.ManagedResourceStorage Loaded null at path _rest_managed.json using ZooKeeperStorageIO:path=/configs/conf1
   [junit4]   2> 2067772 INFO  (qtp1509247103-19680) [n:127.0.0.1:65512_ c:collection1 s:shard1  x:collection1_shard1_replica_n65] o.a.s.h.ReplicationHandler Commits will be reserved for 10000ms.
   [junit4]   2> 2067772 INFO  (qtp1509247103-19680) [n:127.0.0.1:65512_ c:collection1 s:shard1  x:collection1_shard1_replica_n65] o.a.s.u.UpdateLog Could not find max version in index or recent updates, using new clock 1589716146103255040
   [junit4]   2> 2067773 INFO  (searcherExecutor-7500-thread-1-processing-n:127.0.0.1:65512_ x:collection1_shard1_replica_n65 s:shard1 c:collection1) [n:127.0.0.1:65512_ c:collection1 s:shard1  x:collection1_shard1_replica_n65] o.a.s.c.SolrCore [collection1_shard1_replica_n65] Registered new searcher Searcher@5c49f146[collection1_shard1_replica_n65] main{ExitableDirectoryReader(UninvertingDirectoryReader())}
   [junit4]   2> 2067778 INFO  (qtp1509247103-19680) [n:127.0.0.1:65512_ c:collection1 s:shard1  x:collection1_shard1_replica_n65] o.a.s.c.ShardLeaderElectionContext Enough replicas found to continue.
   [junit4]   2> 2067778 INFO  (qtp1509247103-19680) [n:127.0.0.1:65512_ c:collection1 s:shard1  x:collection1_shard1_replica_n65] o.a.s.c.ShardLeaderElectionContext I may be the new leader - try and sync
   [junit4]   2> 2067778 INFO  (qtp1509247103-19680) [n:127.0.0.1:65512_ c:collection1 s:shard1  x:collection1_shard1_replica_n65] o.a.s.c.SyncStrategy Sync replicas to http://127.0.0.1:65512/collection1_shard1_replica_n65/
   [junit4]   2> 2067778 INFO  (qtp1509247103-19680) [n:127.0.0.1:65512_ c:collection1 s:shard1  x:collection1_shard1_replica_n65] o.a.s.c.SyncStrategy Sync Success - now sync replicas to me
   [junit4]   2> 2067778 INFO  (qtp1509247103-19680) [n:127.0.0.1:65512_ c:collection1 s:shard1  x:collection1_shard1_replica_n65] o.a.s.c.SyncStrategy http://127.0.0.1:65512/collection1_shard1_replica_n65/ has no replicas
   [junit4]   2> 2067778 INFO  (qtp1509247103-19680) [n:127.0.0.1:65512_ c:collection1 s:shard1  x:collection1_shard1_replica_n65] o.a.s.c.ShardLeaderElectionContext Found all replicas participating in election, clear LIR
   [junit4]   2> 2067783 INFO  (qtp1509247103-19680) [n:127.0.0.1:65512_ c:collection1 s:shard1  x:collection1_shard1_replica_n65] o.a.s.c.ShardLeaderElectionContext I am the new leader: http://127.0.0.1:65512/collection1_shard1_replica_n65/ shard1
   [junit4]   2> 2067891 INFO  (zkCallback-5266-thread-1-processing-n:127.0.0.1:65512_) [n:127.0.0.1:65512_    ] o.a.s.c.c.ZkStateReader A cluster state change: [WatchedEvent state:SyncConnected type:NodeDataChanged path:/collections/collection1/state.json] for collection [collection1] has occurred - updating... (live nodes size: [4])
   [junit4]   2> 2067891 INFO  (zkCallback-5256-thread-1-processing-n:127.0.0.1:65507_) [n:127.0.0.1:65507_    ] o.a.s.c.c.ZkStateReader A cluster state change: [WatchedEvent state:SyncConnected type:NodeDataChanged path:/collections/collection1/state.json] for collection [collection1] has occurred - updating... (live nodes size: [4])
   [junit4]   2> 2067891 INFO  (zkCallback-5246-thread-1-processing-n:127.0.0.1:65502_) [n:127.0.0.1:65502_    ] o.a.s.c.c.ZkStateReader A cluster state change: [WatchedEvent state:SyncConnected type:NodeDataChanged path:/collections/collection1/state.json] for collection [collection1] has occurred - updating... (live nodes size: [4])
   [junit4]   2> 2067942 INFO  (qtp1509247103-19680) [n:127.0.0.1:65512_ c:collection1 s:shard1  x:collection1_shard1_replica_n65] o.a.s.c.ZkController I am the leader, no recovery necessary
   [junit4]   2> 2067944 INFO  (qtp1509247103-19680) [n:127.0.0.1:65512_ c:collection1 s:shard1  x:collection1_shard1_replica_n65] o.a.s.s.HttpSolrCall [admin] webapp=null path=/admin/cores params={qt=/admin/cores&collection.configName=conf1&name=collection1_shard1_replica_n65&action=CREATE&collection=collection1&shard=shard1&wt=javabin&version=2&replicaType=NRT} status=0 QTime=1346
   [junit4]   2> 2067947 INFO  (qtp92634993-19571) [n:127.0.0.1:65487_    ] o.a.s.s.HttpSolrCall [admin] webapp=null path=/admin/collections params={node=127.0.0.1:65512_&action=ADDREPLICA&collection=collection1&shard=shard1&type=NRT&wt=javabin&version=2} status=0 QTime=1359
   [junit4]   2> 2068048 INFO  (zkCallback-5246-thread-1-processing-n:127.0.0.1:65502_) [n:127.0.0.1:65502_    ] o.a.s.c.c.ZkStateReader A cluster state change: [WatchedEvent state:SyncConnected type:NodeDataChanged path:/collections/collection1/state.json] for collection [collection1] has occurred - updating... (live nodes size: [4])
   [junit4]   2> 2068048 INFO  (zkCallback-5266-thread-1-processing-n:127.0.0.1:65512_) [n:127.0.0.1:65512_    ] o.a.s.c.c.ZkStateReader A cluster state change: [WatchedEvent state:SyncConnected type:NodeDataChanged path:/collections/collection1/state.json] for collection [collection1] has occurred - updating... (live nodes size: [4])
   [junit4]   2> 2068048 INFO  (zkCallback-5256-thread-1-processing-n:127.0.0.1:65507_) [n:127.0.0.1:65507_    ] o.a.s.c.c.ZkStateReader A cluster state change: [WatchedEvent state:SyncConnected type:NodeDataChanged path:/collections/collection1/state.json] for collection [collection1] has occurred - updating... (live nodes size: [4])
   [junit4]   2> 2068223 INFO  (TEST-FullSolrCloudDistribCmdsTest.test-seed#[5FCF99FE871EC427]) [    ] o.a.s.c.AbstractFullDistribZkTestBase create jetty 4 in directory /Users/jenkins/workspace/Lucene-Solr-master-MacOSX/solr/build/solr-core/test/J0/temp/solr.cloud.FullSolrCloudDistribCmdsTest_5FCF99FE871EC427-001/shard-4-001 of type NRT
   [junit4]   2> 2068223 INFO  (TEST-FullSolrCloudDistribCmdsTest.test-seed#[5FCF99FE871EC427]) [    ] o.e.j.s.Server jetty-9.3.20.v20170531
   [junit4]   2> 2068224 INFO  (TEST-FullSolrCloudDistribCmdsTest.test-seed#[5FCF99FE871EC427]) [    ] o.e.j.s.h.ContextHandler Started o.e.j.s.ServletContextHandler@4eba4d21{/,null,AVAILABLE}
   [junit4]   2> 2068225 INFO  (TEST-FullSolrCloudDistribCmdsTest.test-seed#[5FCF99FE871EC427]) [    ] o.e.j.s.AbstractConnector Started ServerConnector@7558c3be{HTTP/1.1,[http/1.1]}{127.0.0.1:65517}
   [junit4]   2> 2068225 INFO  (TEST-FullSolrCloudDistribCmdsTest.test-seed#[5FCF99FE871EC427]) [    ] o.e.j.s.Server Started @2072281ms
   [junit4]   2> 2068225 INFO  (TEST-FullSolrCloudDistribCmdsTest.test-seed#[5FCF99FE871EC427]) [    ] o.a.s.c.s.e.JettySolrRunner Jetty properties: {solr.data.dir=/Users/jenkins/workspace/Lucene-Solr-master-MacOSX/solr/build/solr-core/test/J0/temp/solr.cloud.FullSolrCloudDistribCmdsTest_5FCF99FE871EC427-001/tempDir-001/jetty4, replicaType=NRT, solrconfig=solrconfig.xml, hostContext=/, hostPort=65517, coreRootDirectory=/Users/jenkins/workspace/Lucene-Solr-master-MacOSX/solr/build/solr-core/test/J0/temp/solr.cloud.FullSolrCloudDistribCmdsTest_5FCF99FE871EC427-001/shard-4-001/cores}
   [junit4]   2> 2068225 ERROR (TEST-FullSolrCloudDistribCmdsTest.test-seed#[5FCF99FE871EC427]) [    ] o.a.s.u.StartupLoggingUtils Missing Java Option solr.log.dir. Logging may be missing or incomplete.
   [junit4]   2> 2068226 INFO  (TEST-FullSolrCloudDistribCmdsTest.test-seed#[5FCF99FE871EC427]) [    ] o.a.s.s.SolrDispatchFilter  ___      _       Welcome to Apache Solr™ version 8.0.0
   [junit4]   2> 2068226 INFO  (TEST-FullSolrCloudDistribCmdsTest.test-seed#[5FCF99FE871EC427]) [    ] o.a.s.s.SolrDispatchFilter / __| ___| |_ _   Starting in cloud mode on port null
   [junit4]   2> 2068226 INFO  (TEST-FullSolrCloudDistribCmdsTest.test-seed#[5FCF99FE871EC427]) [    ] o.a.s.s.SolrDispatchFilter \__ \/ _ \ | '_|  Install dir: null
   [junit4]   2> 2068226 INFO  (TEST-FullSolrCloudDistribCmdsTest.test-seed#[5FCF99FE871EC427]) [    ] o.a.s.s.SolrDispatchFilter |___/\___/_|_|    Start time: 2018-01-16T02:57:39.369Z
   [junit4]   2> 2068228 INFO  (zkConnectionManagerCallback-5271-thread-1) [    ] o.a.s.c.c.ConnectionManager zkClient has connected
   [junit4]   2> 2068229 INFO  (TEST-FullSolrCloudDistribCmdsTest.test-seed#[5FCF99FE871EC427]) [    ] o.a.s.s.SolrDispatchFilter Loading solr.xml from SolrHome (not found in ZooKeeper)
   [junit4]   2> 2068229 INFO  (TEST-FullSolrCloudDistribCmdsTest.test-seed#[5FCF99FE871EC427]) [    ] o.a.s.c.SolrXmlConfig Loading container configuration from /Users/jenkins/workspace/Lucene-Solr-master-MacOSX/solr/build/solr-core/test/J0/temp/solr.cloud.FullSolrCloudDistribCmdsTest_5FCF99FE871EC427-001/shard-4-001/solr.xml
   [junit4]   2> 2068234 INFO  (TEST-FullSolrCloudDistribCmdsTest.test-seed#[5FCF99FE871EC427]) [    ] o.a.s.c.SolrXmlConfig Configuration parameter autoReplicaFailoverWorkLoopDelay is ignored
   [junit4]   2> 2068234 INFO  (TEST-FullSolrCloudDistribCmdsTest.test-seed#[5FCF99FE871EC427]) [    ] o.a.s.c.SolrXmlConfig Configuration parameter autoReplicaFailoverBadNodeExpiration is ignored
   [junit4]   2> 2068235 INFO  (TEST-FullSolrCloudDistribCmdsTest.test-seed#[5FCF99FE871EC427]) [    ] o.a.s.c.SolrXmlConfig MBean server found: com.sun.jmx.mbeanserver.JmxMBeanServer@53862e8e, but no JMX reporters were configured - adding default JMX reporter.
   [junit4]   2> 2068238 INFO  (TEST-FullSolrCloudDistribCmdsTest.test-seed#[5FCF99FE871EC427]) [    ] o.a.s.c.ZkContainer Zookeeper client=127.0.0.1:65484/solr
   [junit4]   2> 2068239 INFO  (zkConnectionManagerCallback-5275-thread-1) [    ] o.a.s.c.c.ConnectionManager zkClient has connected
   [junit4]   2> 2068242 INFO  (zkConnectionManagerCallback-5277-thread-1-processing-n:127.0.0.1:65517_) [n:127.0.0.1:65517_    ] o.a.s.c.c.ConnectionManager zkClient has connected
   [junit4]   2> 2068252 INFO  (TEST-FullSolrCloudDistribCmdsTest.test-seed#[5FCF99FE871EC427]) [n:127.0.0.1:65517_    ] o.a.s.c.c.ZkStateReader Updated live nodes from ZooKeeper... (0) -> (4)
   [junit4]   2> 2068256 INFO  (TEST-FullSolrCloudDistrib

[...truncated too long message...]

va:748)
   [junit4]   2> 2121646 WARN  (OverseerAutoScalingTriggerThread-99357258573938709-127.0.0.1:65523_-n_0000000005) [n:127.0.0.1:65523_    ] o.a.s.c.a.OverseerTriggerThread OverseerTriggerThread has been closed, exiting.
   [junit4]   2> 2121647 INFO  (TEST-FullSolrCloudDistribCmdsTest.test-seed#[5FCF99FE871EC427]) [    ] o.e.j.s.AbstractConnector Stopped ServerConnector@d33f1db{HTTP/1.1,[http/1.1]}{127.0.0.1:0}
   [junit4]   2> 2121648 INFO  (TEST-FullSolrCloudDistribCmdsTest.test-seed#[5FCF99FE871EC427]) [    ] o.e.j.s.h.ContextHandler Stopped o.e.j.s.ServletContextHandler@5633d4a7{/,null,UNAVAILABLE}
   [junit4]   2> 2121648 INFO  (TEST-FullSolrCloudDistribCmdsTest.test-seed#[5FCF99FE871EC427]) [    ] o.a.s.c.ChaosMonkey monkey: stop jetty! 65530
   [junit4]   2> 2121649 ERROR (TEST-FullSolrCloudDistribCmdsTest.test-seed#[5FCF99FE871EC427]) [    ] o.a.z.s.ZooKeeperServer ZKShutdownHandler is not registered, so ZooKeeper server won't take any action on ERROR or SHUTDOWN server state changes
   [junit4]   2> 2121649 INFO  (TEST-FullSolrCloudDistribCmdsTest.test-seed#[5FCF99FE871EC427]) [    ] o.a.s.c.ZkTestServer connecting to 127.0.0.1:65484 65484
   [junit4]   2> 2121664 INFO  (Thread-3346) [    ] o.a.s.c.ZkTestServer connecting to 127.0.0.1:65484 65484
   [junit4]   2> 2122653 WARN  (Thread-3346) [    ] o.a.s.c.ZkTestServer Watch limit violations: 
   [junit4]   2> Maximum concurrent create/delete watches above limit:
   [junit4]   2> 
   [junit4]   2> 	15	/solr/aliases.json
   [junit4]   2> 	11	/solr/configs/conf1
   [junit4]   2> 	7	/solr/security.json
   [junit4]   2> 
   [junit4]   2> Maximum concurrent data watches above limit:
   [junit4]   2> 
   [junit4]   2> 	15	/solr/clusterprops.json
   [junit4]   2> 	15	/solr/clusterstate.json
   [junit4]   2> 	6	/solr/collections/collection1/state.json
   [junit4]   2> 	5	/solr/collections/collection2/state.json
   [junit4]   2> 	3	/solr/autoscaling.json
   [junit4]   2> 	2	/solr/collections/collection2/leader_elect/shard1/election/99357258573938692-core_node5-n_0000000000
   [junit4]   2> 	2	/solr/collections/collection2/leader_elect/shard6/election/99357258573938709-core_node38-n_0000000000
   [junit4]   2> 	2	/solr/collections/collection2/leader_elect/shard2/election/99357258573938706-core_node12-n_0000000000
   [junit4]   2> 	2	/solr/collections/collection2/leader_elect/shard4/election/99357258573938692-core_node28-n_0000000000
   [junit4]   2> 	2	/solr/overseer_elect/election/99357258573938700-127.0.0.1:65507_-n_0000000002
   [junit4]   2> 
   [junit4]   2> Maximum concurrent children watches above limit:
   [junit4]   2> 
   [junit4]   2> 	15	/solr/live_nodes
   [junit4]   2> 	15	/solr/collections
   [junit4]   2> 	2	/solr/overseer/queue
   [junit4]   2> 	2	/solr/overseer/collection-queue-work
   [junit4]   2> 	2	/solr/overseer/queue-work
   [junit4]   2> 
   [junit4]   2> NOTE: reproduce with: ant test  -Dtestcase=FullSolrCloudDistribCmdsTest -Dtests.method=test -Dtests.seed=5FCF99FE871EC427 -Dtests.slow=true -Dtests.locale=he -Dtests.timezone=America/Anchorage -Dtests.asserts=true -Dtests.file.encoding=UTF-8
   [junit4] FAILURE 63.4s J0 | FullSolrCloudDistribCmdsTest.test <<<
   [junit4]    > Throwable #1: java.lang.AssertionError: Could not find collection:collection2
   [junit4]    > 	at __randomizedtesting.SeedInfo.seed([5FCF99FE871EC427:D79BA62429E2A9DF]:0)
   [junit4]    > 	at org.apache.solr.cloud.AbstractDistribZkTestBase.waitForRecoveriesToFinish(AbstractDistribZkTestBase.java:155)
   [junit4]    > 	at org.apache.solr.cloud.AbstractDistribZkTestBase.waitForRecoveriesToFinish(AbstractDistribZkTestBase.java:140)
   [junit4]    > 	at org.apache.solr.cloud.AbstractDistribZkTestBase.waitForRecoveriesToFinish(AbstractDistribZkTestBase.java:135)
   [junit4]    > 	at org.apache.solr.cloud.AbstractFullDistribZkTestBase.waitForRecoveriesToFinish(AbstractFullDistribZkTestBase.java:913)
   [junit4]    > 	at org.apache.solr.cloud.FullSolrCloudDistribCmdsTest.testIndexingBatchPerRequestWithHttpSolrClient(FullSolrCloudDistribCmdsTest.java:612)
   [junit4]    > 	at org.apache.solr.cloud.FullSolrCloudDistribCmdsTest.test(FullSolrCloudDistribCmdsTest.java:152)
   [junit4]    > 	at org.apache.solr.BaseDistributedSearchTestCase$ShardsRepeatRule$ShardsFixedStatement.callStatement(BaseDistributedSearchTestCase.java:993)
   [junit4]    > 	at org.apache.solr.BaseDistributedSearchTestCase$ShardsRepeatRule$ShardsStatement.evaluate(BaseDistributedSearchTestCase.java:968)
   [junit4]    > 	at java.lang.Thread.run(Thread.java:748)
   [junit4]   2> NOTE: leaving temporary files on disk at: /Users/jenkins/workspace/Lucene-Solr-master-MacOSX/solr/build/solr-core/test/J0/temp/solr.cloud.FullSolrCloudDistribCmdsTest_5FCF99FE871EC427-001
   [junit4]   2> NOTE: test params are: codec=Asserting(Lucene70), sim=Asserting(org.apache.lucene.search.similarities.AssertingSimilarity@517c0043), locale=he, timezone=America/Anchorage
   [junit4]   2> NOTE: Mac OS X 10.11.6 x86_64/Oracle Corporation 1.8.0_144 (64-bit)/cpus=3,threads=1,free=61066080,total=432832512
   [junit4]   2> NOTE: All tests run in this JVM: [SpellCheckComponentTest, TestApiFramework, MoveReplicaHDFSTest, RecoveryZkTest, DistributedSpellCheckComponentTest, TestOmitPositions, SolrTestCaseJ4Test, TestRangeQuery, AnalysisErrorHandlingTest, TestSearcherReuse, CurrencyRangeFacetCloudTest, TestPushWriter, TestConfigsApi, TestShortCircuitedRequests, TestQueryWrapperFilter, DisMaxRequestHandlerTest, TestIntervalFaceting, TestSolrConfigHandlerConcurrent, TestConfigOverlay, MetricUtilsTest, ZkStateWriterTest, SolrJmxReporterCloudTest, TestIndexingPerformance, WordBreakSolrSpellCheckerTest, AssignBackwardCompatibilityTest, ComputePlanActionTest, TestTrieFacet, FastVectorHighlighterTest, CdcrReplicationHandlerTest, UninvertDocValuesMergePolicyTest, ReturnFieldsTest, TestInfoStreamLogging, TestIBSimilarityFactory, ResponseLogComponentTest, TestUnifiedSolrHighlighter, TestAddFieldRealTimeGet, OverseerTest, NoCacheHeaderTest, JvmMetricsTest, DistributedFacetPivotLargeTest, TestMissingGroups, AutoscalingHistoryHandlerTest, CdcrBootstrapTest, ChaosMonkeySafeLeaderWithPullReplicasTest, HdfsWriteToMultipleCollectionsTest, TestLockTree, MinimalSchemaTest, TriLevelCompositeIdRoutingTest, TestSolrQueryResponse, RequestHandlersTest, FullHLLTest, TestLeaderInitiatedRecoveryThread, TestWriterPerf, IgnoreCommitOptimizeUpdateProcessorFactoryTest, HLLUtilTest, TestLeaderElectionWithEmptyReplica, BaseCdcrDistributedZkTest, NumberUtilsTest, PreAnalyzedUpdateProcessorTest, HighlighterConfigTest, TestSolrDeletionPolicy2, CloneFieldUpdateProcessorFactoryTest, DocValuesMissingTest, TestManagedSchema, TestNRTOpen, AsyncCallRequestStatusResponseTest, TestRandomDVFaceting, DistribCursorPagingTest, TestSweetSpotSimilarityFactory, TestFieldCacheReopen, TestFileDictionaryLookup, ForceLeaderTest, TestBulkSchemaAPI, TestPseudoReturnFields, RequestLoggingTest, TestStressRecovery, DistributedQueryElevationComponentTest, TestReplicationHandlerBackup, TestSolrCloudWithKerberosAlt, TestJmxIntegration, TestDynamicFieldCollectionResource, DirectUpdateHandlerOptimizeTest, TestPivotHelperCode, TestHighFrequencyDictionaryFactory, BadIndexSchemaTest, TestShardHandlerFactory, TestFilteredDocIdSet, TestExportWriter, BinaryUpdateRequestHandlerTest, TestConfigSetProperties, UniqFieldsUpdateProcessorFactoryTest, TestRestoreCore, NotRequiredUniqueKeyTest, TestFieldTypeCollectionResource, TestDistributedSearch, SolrCoreMetricManagerTest, DistributedFacetPivotSmallAdvancedTest, TestPayloadCheckQParserPlugin, SolrCmdDistributorTest, TestSolrCoreProperties, SegmentsInfoRequestHandlerTest, SliceStateTest, TestSSLRandomization, TestPhraseSuggestions, TestBinaryResponseWriter, TestRebalanceLeaders, TestInPlaceUpdatesDistrib, SolrGangliaReporterTest, TestFiltering, SpatialRPTFieldTypeTest, TestFieldCacheSortRandom, SystemLogListenerTest, SignatureUpdateProcessorFactoryTest, TestTolerantSearch, TestExceedMaxTermLength, TestSubQueryTransformer, TestManagedStopFilterFactory, TestSchemaNameResource, ZkCLITest, TestSolrCloudSnapshots, DistribJoinFromCollectionTest, TestCSVResponseWriter, TestXmlQParserPlugin, LargeFieldTest, CoreSorterTest, SolrRequestParserTest, BlobRepositoryCloudTest, AtomicUpdatesTest, TestStressLiveNodes, ReplaceNodeTest, DirectSolrConnectionTest, TestMacroExpander, TestRuleBasedAuthorizationPlugin, UUIDUpdateProcessorFallbackTest, ConfigSetsAPITest, TestCloudRecovery, PrimUtilsTest, TestCloudInspectUtil, DataDrivenBlockJoinTest, ConvertedLegacyTest, TestLFUCache, DistributedFacetPivotWhiteBoxTest, FacetPivotSmallTest, DirectUpdateHandlerTest, TestSolr4Spatial, TestCollationFieldDocValues, TestSortByMinMaxFunction, TestJsonRequest, SuggesterTest, TestDefaultStatsCache, FieldAnalysisRequestHandlerTest, ChaosMonkeyNothingIsSafeTest, TestExpandComponent, SyncSliceTest, TestRecovery, TestSchemaSimilarityResource, CSVRequestHandlerTest, TestQuerySenderListener, SchemaApiFailureTest, DistributedTermsComponentTest, DefaultValueUpdateProcessorTest, ManagedSchemaRoundRobinCloudTest, TestFieldCollectionResource, ShowFileRequestHandlerTest, CoreAdminRequestStatusTest, SortByFunctionTest, HttpSolrCallGetCoreTest, IndexSchemaTest, TestNumericTerms32, TriggerIntegrationTest, TestUtilizeNode, TestHighlightDedupGrouping, TestDFRSimilarityFactory, TestLegacyTerms, TestSkipOverseerOperations, MissingSegmentRecoveryTest, CursorPagingTest, BlockJoinFacetDistribTest, SuggesterWFSTTest, XsltUpdateRequestHandlerTest, ConnectionReuseTest, ExitableDirectoryReaderTest, TestObjectReleaseTracker, SolrInfoBeanTest, DeleteInactiveReplicaTest, MultiTermTest, HdfsTlogReplayBufferedWhileIndexingTest, TestBlobHandler, JSONWriterTest, JavabinLoaderTest, ChaosMonkeySafeLeaderTest, BasicDistributedZk2Test, LeaderElectionIntegrationTest, ShardRoutingTest, FullSolrCloudDistribCmdsTest]
   [junit4] Completed [394/768 (1!)] on J0 in 63.41s, 1 test, 1 failure <<< FAILURES!

[...truncated 49363 lines...]

Mime
View raw message