lucene-dev mailing list archives

Site index · List index
Message view « Date » · « Thread »
Top « Date » · « Thread »
From Policeman Jenkins Server <jenk...@thetaphi.de>
Subject [JENKINS] Lucene-Solr-master-MacOSX (64bit/jdk-9) - Build # 4377 - Still Unstable!
Date Wed, 10 Jan 2018 04:33:08 GMT
Build: https://jenkins.thetaphi.de/job/Lucene-Solr-master-MacOSX/4377/
Java: 64bit/jdk-9 -XX:+UseCompressedOops -XX:+UseG1GC

1 tests failed.
FAILED:  org.apache.solr.update.processor.TimeRoutedAliasUpdateProcessorTest.testParse

Error Message:
Error from server at http://127.0.0.1:60938/solr: Collection : myalias_2017-10-24 is part of alias myalias remove or modify the alias before removing this collection.

Stack Trace:
org.apache.solr.client.solrj.impl.HttpSolrClient$RemoteSolrException: Error from server at http://127.0.0.1:60938/solr: Collection : myalias_2017-10-24 is part of alias myalias remove or modify the alias before removing this collection.
	at __randomizedtesting.SeedInfo.seed([D97077C91C5E3F5E:B6F53C91A0280CB1]:0)
	at org.apache.solr.client.solrj.impl.HttpSolrClient.executeMethod(HttpSolrClient.java:643)
	at org.apache.solr.client.solrj.impl.HttpSolrClient.request(HttpSolrClient.java:255)
	at org.apache.solr.client.solrj.impl.HttpSolrClient.request(HttpSolrClient.java:244)
	at org.apache.solr.client.solrj.impl.LBHttpSolrClient.doRequest(LBHttpSolrClient.java:483)
	at org.apache.solr.client.solrj.impl.LBHttpSolrClient.request(LBHttpSolrClient.java:413)
	at org.apache.solr.client.solrj.impl.CloudSolrClient.sendRequest(CloudSolrClient.java:1104)
	at org.apache.solr.client.solrj.impl.CloudSolrClient.requestWithRetryOnStaleState(CloudSolrClient.java:884)
	at org.apache.solr.client.solrj.impl.CloudSolrClient.request(CloudSolrClient.java:817)
	at org.apache.solr.client.solrj.SolrRequest.process(SolrRequest.java:194)
	at org.apache.solr.client.solrj.SolrRequest.process(SolrRequest.java:211)
	at org.apache.solr.update.processor.TimeRoutedAliasUpdateProcessorTest.doBefore(TimeRoutedAliasUpdateProcessorTest.java:84)
	at java.base/jdk.internal.reflect.NativeMethodAccessorImpl.invoke0(Native Method)
	at java.base/jdk.internal.reflect.NativeMethodAccessorImpl.invoke(NativeMethodAccessorImpl.java:62)
	at java.base/jdk.internal.reflect.DelegatingMethodAccessorImpl.invoke(DelegatingMethodAccessorImpl.java:43)
	at java.base/java.lang.reflect.Method.invoke(Method.java:564)
	at com.carrotsearch.randomizedtesting.RandomizedRunner.invoke(RandomizedRunner.java:1737)
	at com.carrotsearch.randomizedtesting.RandomizedRunner$9.evaluate(RandomizedRunner.java:968)
	at com.carrotsearch.randomizedtesting.RandomizedRunner$10.evaluate(RandomizedRunner.java:984)
	at com.carrotsearch.randomizedtesting.rules.SystemPropertiesRestoreRule$1.evaluate(SystemPropertiesRestoreRule.java:57)
	at org.apache.lucene.util.TestRuleSetupTeardownChained$1.evaluate(TestRuleSetupTeardownChained.java:49)
	at org.apache.lucene.util.AbstractBeforeAfterRule$1.evaluate(AbstractBeforeAfterRule.java:45)
	at org.apache.lucene.util.TestRuleThreadAndTestName$1.evaluate(TestRuleThreadAndTestName.java:48)
	at org.apache.lucene.util.TestRuleIgnoreAfterMaxFailures$1.evaluate(TestRuleIgnoreAfterMaxFailures.java:64)
	at org.apache.lucene.util.TestRuleMarkFailure$1.evaluate(TestRuleMarkFailure.java:47)
	at com.carrotsearch.randomizedtesting.rules.StatementAdapter.evaluate(StatementAdapter.java:36)
	at com.carrotsearch.randomizedtesting.ThreadLeakControl$StatementRunner.run(ThreadLeakControl.java:368)
	at com.carrotsearch.randomizedtesting.ThreadLeakControl.forkTimeoutingTask(ThreadLeakControl.java:817)
	at com.carrotsearch.randomizedtesting.ThreadLeakControl$3.evaluate(ThreadLeakControl.java:468)
	at com.carrotsearch.randomizedtesting.RandomizedRunner.runSingleTest(RandomizedRunner.java:943)
	at com.carrotsearch.randomizedtesting.RandomizedRunner$5.evaluate(RandomizedRunner.java:829)
	at com.carrotsearch.randomizedtesting.RandomizedRunner$6.evaluate(RandomizedRunner.java:879)
	at com.carrotsearch.randomizedtesting.RandomizedRunner$7.evaluate(RandomizedRunner.java:890)
	at com.carrotsearch.randomizedtesting.rules.StatementAdapter.evaluate(StatementAdapter.java:36)
	at com.carrotsearch.randomizedtesting.rules.SystemPropertiesRestoreRule$1.evaluate(SystemPropertiesRestoreRule.java:57)
	at org.apache.lucene.util.AbstractBeforeAfterRule$1.evaluate(AbstractBeforeAfterRule.java:45)
	at com.carrotsearch.randomizedtesting.rules.StatementAdapter.evaluate(StatementAdapter.java:36)
	at org.apache.lucene.util.TestRuleStoreClassName$1.evaluate(TestRuleStoreClassName.java:41)
	at com.carrotsearch.randomizedtesting.rules.NoShadowingOrOverridesOnMethodsRule$1.evaluate(NoShadowingOrOverridesOnMethodsRule.java:40)
	at com.carrotsearch.randomizedtesting.rules.NoShadowingOrOverridesOnMethodsRule$1.evaluate(NoShadowingOrOverridesOnMethodsRule.java:40)
	at com.carrotsearch.randomizedtesting.rules.StatementAdapter.evaluate(StatementAdapter.java:36)
	at com.carrotsearch.randomizedtesting.rules.StatementAdapter.evaluate(StatementAdapter.java:36)
	at org.apache.lucene.util.TestRuleAssertionsRequired$1.evaluate(TestRuleAssertionsRequired.java:53)
	at org.apache.lucene.util.TestRuleMarkFailure$1.evaluate(TestRuleMarkFailure.java:47)
	at org.apache.lucene.util.TestRuleIgnoreAfterMaxFailures$1.evaluate(TestRuleIgnoreAfterMaxFailures.java:64)
	at org.apache.lucene.util.TestRuleIgnoreTestSuites$1.evaluate(TestRuleIgnoreTestSuites.java:54)
	at com.carrotsearch.randomizedtesting.rules.StatementAdapter.evaluate(StatementAdapter.java:36)
	at com.carrotsearch.randomizedtesting.ThreadLeakControl$StatementRunner.run(ThreadLeakControl.java:368)
	at java.base/java.lang.Thread.run(Thread.java:844)




Build Log:
[...truncated 14120 lines...]
   [junit4] Suite: org.apache.solr.update.processor.TimeRoutedAliasUpdateProcessorTest
   [junit4]   2> Creating dataDir: /Users/jenkins/workspace/Lucene-Solr-master-MacOSX/solr/build/solr-core/test/J1/temp/solr.update.processor.TimeRoutedAliasUpdateProcessorTest_D97077C91C5E3F5E-001/init-core-data-001
   [junit4]   2> 3601802 WARN  (SUITE-TimeRoutedAliasUpdateProcessorTest-seed#[D97077C91C5E3F5E]-worker) [    ] o.a.s.SolrTestCaseJ4 startTrackingSearchers: numOpens=2 numCloses=2
   [junit4]   2> 3601803 INFO  (SUITE-TimeRoutedAliasUpdateProcessorTest-seed#[D97077C91C5E3F5E]-worker) [    ] o.a.s.SolrTestCaseJ4 Using PointFields (NUMERIC_POINTS_SYSPROP=true) w/NUMERIC_DOCVALUES_SYSPROP=false
   [junit4]   2> 3601803 INFO  (SUITE-TimeRoutedAliasUpdateProcessorTest-seed#[D97077C91C5E3F5E]-worker) [    ] o.a.s.SolrTestCaseJ4 Randomized ssl (false) and clientAuth (false) via: @org.apache.solr.util.RandomizeSSL(reason="", value=0.0/0.0, ssl=0.0/0.0, clientAuth=0.0/0.0) w/ MAC_OS_X supressed clientAuth
   [junit4]   2> 3601803 INFO  (SUITE-TimeRoutedAliasUpdateProcessorTest-seed#[D97077C91C5E3F5E]-worker) [    ] o.a.s.SolrTestCaseJ4 SecureRandom sanity checks: test.solr.allowed.securerandom=null & java.security.egd=file:/dev/./urandom
   [junit4]   2> 3601804 INFO  (SUITE-TimeRoutedAliasUpdateProcessorTest-seed#[D97077C91C5E3F5E]-worker) [    ] o.a.s.c.MiniSolrCloudCluster Starting cluster of 2 servers in /Users/jenkins/workspace/Lucene-Solr-master-MacOSX/solr/build/solr-core/test/J1/temp/solr.update.processor.TimeRoutedAliasUpdateProcessorTest_D97077C91C5E3F5E-001/tempDir-001
   [junit4]   2> 3601804 INFO  (SUITE-TimeRoutedAliasUpdateProcessorTest-seed#[D97077C91C5E3F5E]-worker) [    ] o.a.s.c.ZkTestServer STARTING ZK TEST SERVER
   [junit4]   2> 3601804 INFO  (Thread-5256) [    ] o.a.s.c.ZkTestServer client port:0.0.0.0/0.0.0.0:0
   [junit4]   2> 3601804 INFO  (Thread-5256) [    ] o.a.s.c.ZkTestServer Starting server
   [junit4]   2> 3601808 ERROR (Thread-5256) [    ] o.a.z.s.ZooKeeperServer ZKShutdownHandler is not registered, so ZooKeeper server won't take any action on ERROR or SHUTDOWN server state changes
   [junit4]   2> 3601914 INFO  (SUITE-TimeRoutedAliasUpdateProcessorTest-seed#[D97077C91C5E3F5E]-worker) [    ] o.a.s.c.ZkTestServer start zk server on port:60935
   [junit4]   2> 3601928 INFO  (zkConnectionManagerCallback-8660-thread-1) [    ] o.a.s.c.c.ConnectionManager zkClient has connected
   [junit4]   2> 3601933 INFO  (jetty-launcher-8657-thread-2) [    ] o.e.j.s.Server jetty-9.3.20.v20170531
   [junit4]   2> 3601933 INFO  (jetty-launcher-8657-thread-1) [    ] o.e.j.s.Server jetty-9.3.20.v20170531
   [junit4]   2> 3601935 INFO  (jetty-launcher-8657-thread-2) [    ] o.e.j.s.h.ContextHandler Started o.e.j.s.ServletContextHandler@777fcff1{/solr,null,AVAILABLE}
   [junit4]   2> 3601935 INFO  (jetty-launcher-8657-thread-1) [    ] o.e.j.s.h.ContextHandler Started o.e.j.s.ServletContextHandler@40854881{/solr,null,AVAILABLE}
   [junit4]   2> 3601936 INFO  (jetty-launcher-8657-thread-1) [    ] o.e.j.s.AbstractConnector Started ServerConnector@44d11ba1{HTTP/1.1,[http/1.1]}{127.0.0.1:60938}
   [junit4]   2> 3601936 INFO  (jetty-launcher-8657-thread-2) [    ] o.e.j.s.AbstractConnector Started ServerConnector@2d51e75e{HTTP/1.1,[http/1.1]}{127.0.0.1:60937}
   [junit4]   2> 3601936 INFO  (jetty-launcher-8657-thread-2) [    ] o.e.j.s.Server Started @3603929ms
   [junit4]   2> 3601937 INFO  (jetty-launcher-8657-thread-2) [    ] o.a.s.c.s.e.JettySolrRunner Jetty properties: {hostContext=/solr, hostPort=60937}
   [junit4]   2> 3601936 INFO  (jetty-launcher-8657-thread-1) [    ] o.e.j.s.Server Started @3603929ms
   [junit4]   2> 3601937 INFO  (jetty-launcher-8657-thread-1) [    ] o.a.s.c.s.e.JettySolrRunner Jetty properties: {hostContext=/solr, hostPort=60938}
   [junit4]   2> 3601937 ERROR (jetty-launcher-8657-thread-2) [    ] o.a.s.u.StartupLoggingUtils Missing Java Option solr.log.dir. Logging may be missing or incomplete.
   [junit4]   2> 3601937 ERROR (jetty-launcher-8657-thread-1) [    ] o.a.s.u.StartupLoggingUtils Missing Java Option solr.log.dir. Logging may be missing or incomplete.
   [junit4]   2> 3601937 INFO  (jetty-launcher-8657-thread-2) [    ] o.a.s.s.SolrDispatchFilter  ___      _       Welcome to Apache Solr™ version 8.0.0
   [junit4]   2> 3601937 INFO  (jetty-launcher-8657-thread-2) [    ] o.a.s.s.SolrDispatchFilter / __| ___| |_ _   Starting in cloud mode on port null
   [junit4]   2> 3601937 INFO  (jetty-launcher-8657-thread-2) [    ] o.a.s.s.SolrDispatchFilter \__ \/ _ \ | '_|  Install dir: null
   [junit4]   2> 3601937 INFO  (jetty-launcher-8657-thread-2) [    ] o.a.s.s.SolrDispatchFilter |___/\___/_|_|    Start time: 2018-01-10T04:17:50.367647Z
   [junit4]   2> 3601937 INFO  (jetty-launcher-8657-thread-1) [    ] o.a.s.s.SolrDispatchFilter  ___      _       Welcome to Apache Solr™ version 8.0.0
   [junit4]   2> 3601937 INFO  (jetty-launcher-8657-thread-1) [    ] o.a.s.s.SolrDispatchFilter / __| ___| |_ _   Starting in cloud mode on port null
   [junit4]   2> 3601937 INFO  (jetty-launcher-8657-thread-1) [    ] o.a.s.s.SolrDispatchFilter \__ \/ _ \ | '_|  Install dir: null
   [junit4]   2> 3601937 INFO  (jetty-launcher-8657-thread-1) [    ] o.a.s.s.SolrDispatchFilter |___/\___/_|_|    Start time: 2018-01-10T04:17:50.367894Z
   [junit4]   2> 3601939 INFO  (zkConnectionManagerCallback-8662-thread-1) [    ] o.a.s.c.c.ConnectionManager zkClient has connected
   [junit4]   2> 3601939 INFO  (zkConnectionManagerCallback-8664-thread-1) [    ] o.a.s.c.c.ConnectionManager zkClient has connected
   [junit4]   2> 3601940 INFO  (jetty-launcher-8657-thread-2) [    ] o.a.s.s.SolrDispatchFilter solr.xml found in ZooKeeper. Loading...
   [junit4]   2> 3601940 INFO  (jetty-launcher-8657-thread-1) [    ] o.a.s.s.SolrDispatchFilter solr.xml found in ZooKeeper. Loading...
   [junit4]   2> 3601947 INFO  (jetty-launcher-8657-thread-2) [    ] o.a.s.c.ZkContainer Zookeeper client=127.0.0.1:60935/solr
   [junit4]   2> 3601947 INFO  (jetty-launcher-8657-thread-1) [    ] o.a.s.c.ZkContainer Zookeeper client=127.0.0.1:60935/solr
   [junit4]   2> 3601949 INFO  (zkConnectionManagerCallback-8670-thread-1) [    ] o.a.s.c.c.ConnectionManager zkClient has connected
   [junit4]   2> 3601949 INFO  (zkConnectionManagerCallback-8672-thread-1) [    ] o.a.s.c.c.ConnectionManager zkClient has connected
   [junit4]   2> 3601953 INFO  (zkConnectionManagerCallback-8676-thread-1-processing-n:127.0.0.1:60937_solr) [n:127.0.0.1:60937_solr    ] o.a.s.c.c.ConnectionManager zkClient has connected
   [junit4]   2> 3601953 INFO  (zkConnectionManagerCallback-8675-thread-1-processing-n:127.0.0.1:60938_solr) [n:127.0.0.1:60938_solr    ] o.a.s.c.c.ConnectionManager zkClient has connected
   [junit4]   2> 3602103 INFO  (jetty-launcher-8657-thread-2) [n:127.0.0.1:60937_solr    ] o.a.s.c.Overseer Overseer (id=null) closing
   [junit4]   2> 3602104 INFO  (jetty-launcher-8657-thread-1) [n:127.0.0.1:60938_solr    ] o.a.s.c.Overseer Overseer (id=null) closing
   [junit4]   2> 3602104 INFO  (jetty-launcher-8657-thread-2) [n:127.0.0.1:60937_solr    ] o.a.s.c.OverseerElectionContext I am going to be the leader 127.0.0.1:60937_solr
   [junit4]   2> 3602106 INFO  (jetty-launcher-8657-thread-1) [n:127.0.0.1:60938_solr    ] o.a.s.c.ZkController Register node as live in ZooKeeper:/live_nodes/127.0.0.1:60938_solr
   [junit4]   2> 3602106 INFO  (jetty-launcher-8657-thread-2) [n:127.0.0.1:60937_solr    ] o.a.s.c.Overseer Overseer (id=99323600583852037-127.0.0.1:60937_solr-n_0000000000) starting
   [junit4]   2> 3602108 INFO  (zkCallback-8674-thread-1-processing-n:127.0.0.1:60938_solr) [n:127.0.0.1:60938_solr    ] o.a.s.c.c.ZkStateReader Updated live nodes from ZooKeeper... (0) -> (1)
   [junit4]   2> 3602108 INFO  (zkCallback-8673-thread-1-processing-n:127.0.0.1:60937_solr) [n:127.0.0.1:60937_solr    ] o.a.s.c.c.ZkStateReader Updated live nodes from ZooKeeper... (0) -> (1)
   [junit4]   2> 3602123 INFO  (jetty-launcher-8657-thread-2) [n:127.0.0.1:60937_solr    ] o.a.s.c.ZkController Register node as live in ZooKeeper:/live_nodes/127.0.0.1:60937_solr
   [junit4]   2> 3602126 INFO  (zkCallback-8673-thread-1-processing-n:127.0.0.1:60937_solr) [n:127.0.0.1:60937_solr    ] o.a.s.c.c.ZkStateReader Updated live nodes from ZooKeeper... (1) -> (2)
   [junit4]   2> 3602126 INFO  (zkCallback-8674-thread-1-processing-n:127.0.0.1:60938_solr) [n:127.0.0.1:60938_solr    ] o.a.s.c.c.ZkStateReader Updated live nodes from ZooKeeper... (1) -> (2)
   [junit4]   2> 3602151 INFO  (jetty-launcher-8657-thread-1) [n:127.0.0.1:60938_solr    ] o.a.s.m.r.SolrJmxReporter JMX monitoring for 'solr_60938.solr.node' (registry 'solr.node') enabled at server: com.sun.jmx.mbeanserver.JmxMBeanServer@78963aaf
   [junit4]   2> 3602161 INFO  (jetty-launcher-8657-thread-2) [n:127.0.0.1:60937_solr    ] o.a.s.m.r.SolrJmxReporter JMX monitoring for 'solr_60937.solr.node' (registry 'solr.node') enabled at server: com.sun.jmx.mbeanserver.JmxMBeanServer@78963aaf
   [junit4]   2> 3602161 INFO  (jetty-launcher-8657-thread-1) [n:127.0.0.1:60938_solr    ] o.a.s.m.r.SolrJmxReporter JMX monitoring for 'solr_60938.solr.jvm' (registry 'solr.jvm') enabled at server: com.sun.jmx.mbeanserver.JmxMBeanServer@78963aaf
   [junit4]   2> 3602161 INFO  (jetty-launcher-8657-thread-1) [n:127.0.0.1:60938_solr    ] o.a.s.m.r.SolrJmxReporter JMX monitoring for 'solr_60938.solr.jetty' (registry 'solr.jetty') enabled at server: com.sun.jmx.mbeanserver.JmxMBeanServer@78963aaf
   [junit4]   2> 3602162 INFO  (jetty-launcher-8657-thread-1) [n:127.0.0.1:60938_solr    ] o.a.s.c.CorePropertiesLocator Found 0 core definitions underneath /Users/jenkins/workspace/Lucene-Solr-master-MacOSX/solr/build/solr-core/test/J1/temp/solr.update.processor.TimeRoutedAliasUpdateProcessorTest_D97077C91C5E3F5E-001/tempDir-001/node1/.
   [junit4]   2> 3602169 INFO  (jetty-launcher-8657-thread-2) [n:127.0.0.1:60937_solr    ] o.a.s.m.r.SolrJmxReporter JMX monitoring for 'solr_60937.solr.jvm' (registry 'solr.jvm') enabled at server: com.sun.jmx.mbeanserver.JmxMBeanServer@78963aaf
   [junit4]   2> 3602169 INFO  (jetty-launcher-8657-thread-2) [n:127.0.0.1:60937_solr    ] o.a.s.m.r.SolrJmxReporter JMX monitoring for 'solr_60937.solr.jetty' (registry 'solr.jetty') enabled at server: com.sun.jmx.mbeanserver.JmxMBeanServer@78963aaf
   [junit4]   2> 3602169 INFO  (jetty-launcher-8657-thread-2) [n:127.0.0.1:60937_solr    ] o.a.s.c.CorePropertiesLocator Found 0 core definitions underneath /Users/jenkins/workspace/Lucene-Solr-master-MacOSX/solr/build/solr-core/test/J1/temp/solr.update.processor.TimeRoutedAliasUpdateProcessorTest_D97077C91C5E3F5E-001/tempDir-001/node2/.
   [junit4]   2> 3602199 INFO  (zkConnectionManagerCallback-8682-thread-1) [    ] o.a.s.c.c.ConnectionManager zkClient has connected
   [junit4]   2> 3602205 INFO  (qtp1273237479-33493) [n:127.0.0.1:60938_solr    ] o.a.s.h.a.CollectionsHandler Invoked Collection Action :clusterstatus with params action=CLUSTERSTATUS&wt=javabin&version=2 and sendToOCPQueue=true
   [junit4]   2> 3602205 INFO  (qtp1273237479-33493) [n:127.0.0.1:60938_solr    ] o.a.s.s.HttpSolrCall [admin] webapp=null path=/admin/collections params={action=CLUSTERSTATUS&wt=javabin&version=2} status=0 QTime=0
   [junit4]   2> 3602219 INFO  (TEST-TimeRoutedAliasUpdateProcessorTest.test-seed#[D97077C91C5E3F5E]) [    ] o.a.s.SolrTestCaseJ4 ###Starting test
   [junit4]   2> 3602221 INFO  (qtp1273237479-33499) [n:127.0.0.1:60938_solr    ] o.a.s.h.a.CollectionsHandler Invoked Collection Action :clusterstatus with params action=CLUSTERSTATUS&wt=javabin&version=2 and sendToOCPQueue=true
   [junit4]   2> 3602222 INFO  (qtp1273237479-33499) [n:127.0.0.1:60938_solr    ] o.a.s.s.HttpSolrCall [admin] webapp=null path=/admin/collections params={action=CLUSTERSTATUS&wt=javabin&version=2} status=0 QTime=1
   [junit4]   2> 3602222 INFO  (qtp1273237479-33501) [n:127.0.0.1:60938_solr    ] o.a.s.h.a.CollectionsHandler Invoked Collection Action :clusterstatus with params action=CLUSTERSTATUS&wt=javabin&version=2 and sendToOCPQueue=true
   [junit4]   2> 3602223 INFO  (qtp1273237479-33501) [n:127.0.0.1:60938_solr    ] o.a.s.s.HttpSolrCall [admin] webapp=null path=/admin/collections params={action=CLUSTERSTATUS&wt=javabin&version=2} status=0 QTime=0
   [junit4]   2> 3602224 INFO  (qtp1273237479-33486) [n:127.0.0.1:60938_solr    ] o.a.s.h.a.CollectionsHandler Invoked Collection Action :list with params action=LIST&wt=javabin&version=2 and sendToOCPQueue=true
   [junit4]   2> 3602224 INFO  (qtp1273237479-33486) [n:127.0.0.1:60938_solr    ] o.a.s.s.HttpSolrCall [admin] webapp=null path=/admin/collections params={action=LIST&wt=javabin&version=2} status=0 QTime=0
   [junit4]   2> 3602225 INFO  (qtp1273237479-33494) [n:127.0.0.1:60938_solr    ] o.a.s.h.a.CollectionsHandler Invoked Collection Action :clusterstatus with params action=CLUSTERSTATUS&wt=javabin&version=2 and sendToOCPQueue=true
   [junit4]   2> 3602226 INFO  (qtp1273237479-33494) [n:127.0.0.1:60938_solr    ] o.a.s.s.HttpSolrCall [admin] webapp=null path=/admin/collections params={action=CLUSTERSTATUS&wt=javabin&version=2} status=0 QTime=1
   [junit4]   2> 3602226 INFO  (qtp1273237479-33497) [n:127.0.0.1:60938_solr    ] o.a.s.h.a.CollectionsHandler Invoked Collection Action :clusterstatus with params action=CLUSTERSTATUS&wt=javabin&version=2 and sendToOCPQueue=true
   [junit4]   2> 3602227 INFO  (qtp1273237479-33497) [n:127.0.0.1:60938_solr    ] o.a.s.s.HttpSolrCall [admin] webapp=null path=/admin/collections params={action=CLUSTERSTATUS&wt=javabin&version=2} status=0 QTime=1
   [junit4]   2> 3602228 INFO  (qtp1273237479-33496) [n:127.0.0.1:60938_solr    ] o.a.s.h.a.CollectionsHandler Invoked Collection Action :create with params pullReplicas=0&replicationFactor=1&name=timeConfig&nrtReplicas=1&action=CREATE&numShards=1&tlogReplicas=0&wt=javabin&version=2 and sendToOCPQueue=true
   [junit4]   2> 3602230 INFO  (OverseerThreadFactory-12155-thread-1-processing-n:127.0.0.1:60937_solr) [n:127.0.0.1:60937_solr    ] o.a.s.c.CreateCollectionCmd Create collection timeConfig
   [junit4]   2> 3602231 INFO  (OverseerThreadFactory-12155-thread-1-processing-n:127.0.0.1:60937_solr) [n:127.0.0.1:60937_solr    ] o.a.s.c.CreateCollectionCmd Only _default config set found, using it.
   [junit4]   2> 3602232 INFO  (OverseerThreadFactory-12155-thread-1-processing-n:127.0.0.1:60937_solr) [n:127.0.0.1:60937_solr    ] o.a.s.c.c.ZkConfigManager Copying zk node /configs/_default/managed-schema to /configs/timeConfig/managed-schema
   [junit4]   2> 3602235 INFO  (OverseerThreadFactory-12155-thread-1-processing-n:127.0.0.1:60937_solr) [n:127.0.0.1:60937_solr    ] o.a.s.c.c.ZkConfigManager Copying zk node /configs/_default/protwords.txt to /configs/timeConfig/protwords.txt
   [junit4]   2> 3602238 INFO  (OverseerThreadFactory-12155-thread-1-processing-n:127.0.0.1:60937_solr) [n:127.0.0.1:60937_solr    ] o.a.s.c.c.ZkConfigManager Copying zk node /configs/_default/solrconfig.xml to /configs/timeConfig/solrconfig.xml
   [junit4]   2> 3602240 INFO  (OverseerThreadFactory-12155-thread-1-processing-n:127.0.0.1:60937_solr) [n:127.0.0.1:60937_solr    ] o.a.s.c.c.ZkConfigManager Copying zk node /configs/_default/synonyms.txt to /configs/timeConfig/synonyms.txt
   [junit4]   2> 3602243 INFO  (OverseerThreadFactory-12155-thread-1-processing-n:127.0.0.1:60937_solr) [n:127.0.0.1:60937_solr    ] o.a.s.c.c.ZkConfigManager Copying zk node /configs/_default/stopwords.txt to /configs/timeConfig/stopwords.txt
   [junit4]   2> 3602246 INFO  (OverseerThreadFactory-12155-thread-1-processing-n:127.0.0.1:60937_solr) [n:127.0.0.1:60937_solr    ] o.a.s.c.c.ZkConfigManager Copying zk node /configs/_default/lang/contractions_it.txt to /configs/timeConfig/lang/contractions_it.txt
   [junit4]   2> 3602250 INFO  (OverseerThreadFactory-12155-thread-1-processing-n:127.0.0.1:60937_solr) [n:127.0.0.1:60937_solr    ] o.a.s.c.c.ZkConfigManager Copying zk node /configs/_default/lang/contractions_ca.txt to /configs/timeConfig/lang/contractions_ca.txt
   [junit4]   2> 3602252 INFO  (OverseerThreadFactory-12155-thread-1-processing-n:127.0.0.1:60937_solr) [n:127.0.0.1:60937_solr    ] o.a.s.c.c.ZkConfigManager Copying zk node /configs/_default/lang/stemdict_nl.txt to /configs/timeConfig/lang/stemdict_nl.txt
   [junit4]   2> 3602258 INFO  (OverseerThreadFactory-12155-thread-1-processing-n:127.0.0.1:60937_solr) [n:127.0.0.1:60937_solr    ] o.a.s.c.c.ZkConfigManager Copying zk node /configs/_default/lang/stopwords_hy.txt to /configs/timeConfig/lang/stopwords_hy.txt
   [junit4]   2> 3602260 INFO  (OverseerThreadFactory-12155-thread-1-processing-n:127.0.0.1:60937_solr) [n:127.0.0.1:60937_solr    ] o.a.s.c.c.ZkConfigManager Copying zk node /configs/_default/lang/stopwords_no.txt to /configs/timeConfig/lang/stopwords_no.txt
   [junit4]   2> 3602263 INFO  (OverseerThreadFactory-12155-thread-1-processing-n:127.0.0.1:60937_solr) [n:127.0.0.1:60937_solr    ] o.a.s.c.c.ZkConfigManager Copying zk node /configs/_default/lang/stopwords_id.txt to /configs/timeConfig/lang/stopwords_id.txt
   [junit4]   2> 3602266 INFO  (OverseerThreadFactory-12155-thread-1-processing-n:127.0.0.1:60937_solr) [n:127.0.0.1:60937_solr    ] o.a.s.c.c.ZkConfigManager Copying zk node /configs/_default/lang/stopwords_da.txt to /configs/timeConfig/lang/stopwords_da.txt
   [junit4]   2> 3602269 INFO  (OverseerThreadFactory-12155-thread-1-processing-n:127.0.0.1:60937_solr) [n:127.0.0.1:60937_solr    ] o.a.s.c.c.ZkConfigManager Copying zk node /configs/_default/lang/stopwords_ga.txt to /configs/timeConfig/lang/stopwords_ga.txt
   [junit4]   2> 3602272 INFO  (OverseerThreadFactory-12155-thread-1-processing-n:127.0.0.1:60937_solr) [n:127.0.0.1:60937_solr    ] o.a.s.c.c.ZkConfigManager Copying zk node /configs/_default/lang/stopwords_hi.txt to /configs/timeConfig/lang/stopwords_hi.txt
   [junit4]   2> 3602275 INFO  (OverseerThreadFactory-12155-thread-1-processing-n:127.0.0.1:60937_solr) [n:127.0.0.1:60937_solr    ] o.a.s.c.c.ZkConfigManager Copying zk node /configs/_default/lang/stopwords_ja.txt to /configs/timeConfig/lang/stopwords_ja.txt
   [junit4]   2> 3602277 INFO  (OverseerThreadFactory-12155-thread-1-processing-n:127.0.0.1:60937_solr) [n:127.0.0.1:60937_solr    ] o.a.s.c.c.ZkConfigManager Copying zk node /configs/_default/lang/stopwords_pt.txt to /configs/timeConfig/lang/stopwords_pt.txt
   [junit4]   2> 3602283 INFO  (OverseerThreadFactory-12155-thread-1-processing-n:127.0.0.1:60937_solr) [n:127.0.0.1:60937_solr    ] o.a.s.c.c.ZkConfigManager Copying zk node /configs/_default/lang/stopwords_hu.txt to /configs/timeConfig/lang/stopwords_hu.txt
   [junit4]   2> 3602286 INFO  (OverseerThreadFactory-12155-thread-1-processing-n:127.0.0.1:60937_solr) [n:127.0.0.1:60937_solr    ] o.a.s.c.c.ZkConfigManager Copying zk node /configs/_default/lang/stopwords_el.txt to /configs/timeConfig/lang/stopwords_el.txt
   [junit4]   2> 3602289 INFO  (OverseerThreadFactory-12155-thread-1-processing-n:127.0.0.1:60937_solr) [n:127.0.0.1:60937_solr    ] o.a.s.c.c.ZkConfigManager Copying zk node /configs/_default/lang/stopwords_ru.txt to /configs/timeConfig/lang/stopwords_ru.txt
   [junit4]   2> 3602292 INFO  (OverseerThreadFactory-12155-thread-1-processing-n:127.0.0.1:60937_solr) [n:127.0.0.1:60937_solr    ] o.a.s.c.c.ZkConfigManager Copying zk node /configs/_default/lang/stopwords_tr.txt to /configs/timeConfig/lang/stopwords_tr.txt
   [junit4]   2> 3602295 INFO  (OverseerThreadFactory-12155-thread-1-processing-n:127.0.0.1:60937_solr) [n:127.0.0.1:60937_solr    ] o.a.s.c.c.ZkConfigManager Copying zk node /configs/_default/lang/stopwords_ar.txt to /configs/timeConfig/lang/stopwords_ar.txt
   [junit4]   2> 3602298 INFO  (OverseerThreadFactory-12155-thread-1-processing-n:127.0.0.1:60937_solr) [n:127.0.0.1:60937_solr    ] o.a.s.c.c.ZkConfigManager Copying zk node /configs/_default/lang/userdict_ja.txt to /configs/timeConfig/lang/userdict_ja.txt
   [junit4]   2> 3602301 INFO  (OverseerThreadFactory-12155-thread-1-processing-n:127.0.0.1:60937_solr) [n:127.0.0.1:60937_solr    ] o.a.s.c.c.ZkConfigManager Copying zk node /configs/_default/lang/stopwords_eu.txt to /configs/timeConfig/lang/stopwords_eu.txt
   [junit4]   2> 3602304 INFO  (OverseerThreadFactory-12155-thread-1-processing-n:127.0.0.1:60937_solr) [n:127.0.0.1:60937_solr    ] o.a.s.c.c.ZkConfigManager Copying zk node /configs/_default/lang/stopwords_it.txt to /configs/timeConfig/lang/stopwords_it.txt
   [junit4]   2> 3602307 INFO  (OverseerThreadFactory-12155-thread-1-processing-n:127.0.0.1:60937_solr) [n:127.0.0.1:60937_solr    ] o.a.s.c.c.ZkConfigManager Copying zk node /configs/_default/lang/stopwords_cz.txt to /configs/timeConfig/lang/stopwords_cz.txt
   [junit4]   2> 3602310 INFO  (OverseerThreadFactory-12155-thread-1-processing-n:127.0.0.1:60937_solr) [n:127.0.0.1:60937_solr    ] o.a.s.c.c.ZkConfigManager Copying zk node /configs/_default/lang/stoptags_ja.txt to /configs/timeConfig/lang/stoptags_ja.txt
   [junit4]   2> 3602313 INFO  (OverseerThreadFactory-12155-thread-1-processing-n:127.0.0.1:60937_solr) [n:127.0.0.1:60937_solr    ] o.a.s.c.c.ZkConfigManager Copying zk node /configs/_default/lang/contractions_fr.txt to /configs/timeConfig/lang/contractions_fr.txt
   [junit4]   2> 3602316 INFO  (OverseerThreadFactory-12155-thread-1-processing-n:127.0.0.1:60937_solr) [n:127.0.0.1:60937_solr    ] o.a.s.c.c.ZkConfigManager Copying zk node /configs/_default/lang/stopwords_de.txt to /configs/timeConfig/lang/stopwords_de.txt
   [junit4]   2> 3602319 INFO  (OverseerThreadFactory-12155-thread-1-processing-n:127.0.0.1:60937_solr) [n:127.0.0.1:60937_solr    ] o.a.s.c.c.ZkConfigManager Copying zk node /configs/_default/lang/stopwords_fa.txt to /configs/timeConfig/lang/stopwords_fa.txt
   [junit4]   2> 3602322 INFO  (OverseerThreadFactory-12155-thread-1-processing-n:127.0.0.1:60937_solr) [n:127.0.0.1:60937_solr    ] o.a.s.c.c.ZkConfigManager Copying zk node /configs/_default/lang/contractions_ga.txt to /configs/timeConfig/lang/contractions_ga.txt
   [junit4]   2> 3602325 INFO  (OverseerThreadFactory-12155-thread-1-processing-n:127.0.0.1:60937_solr) [n:127.0.0.1:60937_solr    ] o.a.s.c.c.ZkConfigManager Copying zk node /configs/_default/lang/stopwords_ca.txt to /configs/timeConfig/lang/stopwords_ca.txt
   [junit4]   2> 3602328 INFO  (OverseerThreadFactory-12155-thread-1-processing-n:127.0.0.1:60937_solr) [n:127.0.0.1:60937_solr    ] o.a.s.c.c.ZkConfigManager Copying zk node /configs/_default/lang/stopwords_nl.txt to /configs/timeConfig/lang/stopwords_nl.txt
   [junit4]   2> 3602331 INFO  (OverseerThreadFactory-12155-thread-1-processing-n:127.0.0.1:60937_solr) [n:127.0.0.1:60937_solr    ] o.a.s.c.c.ZkConfigManager Copying zk node /configs/_default/lang/stopwords_bg.txt to /configs/timeConfig/lang/stopwords_bg.txt
   [junit4]   2> 3602334 INFO  (OverseerThreadFactory-12155-thread-1-processing-n:127.0.0.1:60937_solr) [n:127.0.0.1:60937_solr    ] o.a.s.c.c.ZkConfigManager Copying zk node /configs/_default/lang/stopwords_en.txt to /configs/timeConfig/lang/stopwords_en.txt
   [junit4]   2> 3602338 INFO  (OverseerThreadFactory-12155-thread-1-processing-n:127.0.0.1:60937_solr) [n:127.0.0.1:60937_solr    ] o.a.s.c.c.ZkConfigManager Copying zk node /configs/_default/lang/stopwords_es.txt to /configs/timeConfig/lang/stopwords_es.txt
   [junit4]   2> 3602341 INFO  (OverseerThreadFactory-12155-thread-1-processing-n:127.0.0.1:60937_solr) [n:127.0.0.1:60937_solr    ] o.a.s.c.c.ZkConfigManager Copying zk node /configs/_default/lang/stopwords_lv.txt to /configs/timeConfig/lang/stopwords_lv.txt
   [junit4]   2> 3602344 INFO  (OverseerThreadFactory-12155-thread-1-processing-n:127.0.0.1:60937_solr) [n:127.0.0.1:60937_solr    ] o.a.s.c.c.ZkConfigManager Copying zk node /configs/_default/lang/stopwords_ro.txt to /configs/timeConfig/lang/stopwords_ro.txt
   [junit4]   2> 3602347 INFO  (OverseerThreadFactory-12155-thread-1-processing-n:127.0.0.1:60937_solr) [n:127.0.0.1:60937_solr    ] o.a.s.c.c.ZkConfigManager Copying zk node /configs/_default/lang/stopwords_th.txt to /configs/timeConfig/lang/stopwords_th.txt
   [junit4]   2> 3602350 INFO  (OverseerThreadFactory-12155-thread-1-processing-n:127.0.0.1:60937_solr) [n:127.0.0.1:60937_solr    ] o.a.s.c.c.ZkConfigManager Copying zk node /configs/_default/lang/stopwords_fr.txt to /configs/timeConfig/lang/stopwords_fr.txt
   [junit4]   2> 3602353 INFO  (OverseerThreadFactory-12155-thread-1-processing-n:127.0.0.1:60937_solr) [n:127.0.0.1:60937_solr    ] o.a.s.c.c.ZkConfigManager Copying zk node /configs/_default/lang/stopwords_sv.txt to /configs/timeConfig/lang/stopwords_sv.txt
   [junit4]   2> 3602356 INFO  (OverseerThreadFactory-12155-thread-1-processing-n:127.0.0.1:60937_solr) [n:127.0.0.1:60937_solr    ] o.a.s.c.c.ZkConfigManager Copying zk node /configs/_default/lang/stopwords_fi.txt to /configs/timeConfig/lang/stopwords_fi.txt
   [junit4]   2> 3602359 INFO  (OverseerThreadFactory-12155-thread-1-processing-n:127.0.0.1:60937_solr) [n:127.0.0.1:60937_solr    ] o.a.s.c.c.ZkConfigManager Copying zk node /configs/_default/lang/hyphenations_ga.txt to /configs/timeConfig/lang/hyphenations_ga.txt
   [junit4]   2> 3602361 INFO  (OverseerThreadFactory-12155-thread-1-processing-n:127.0.0.1:60937_solr) [n:127.0.0.1:60937_solr    ] o.a.s.c.c.ZkConfigManager Copying zk node /configs/_default/lang/stopwords_gl.txt to /configs/timeConfig/lang/stopwords_gl.txt
   [junit4]   2> 3602368 INFO  (OverseerThreadFactory-12155-thread-1-processing-n:127.0.0.1:60937_solr) [n:127.0.0.1:60937_solr    ] o.a.s.c.c.ZkConfigManager Copying zk node /configs/_default/params.json to /configs/timeConfig/params.json
   [junit4]   2> 3602491 INFO  (OverseerStateUpdate-99323600583852037-127.0.0.1:60937_solr-n_0000000000) [n:127.0.0.1:60937_solr    ] o.a.s.c.o.SliceMutator createReplica() {
   [junit4]   2>   "operation":"ADDREPLICA",
   [junit4]   2>   "collection":"timeConfig",
   [junit4]   2>   "shard":"shard1",
   [junit4]   2>   "core":"timeConfig_shard1_replica_n1",
   [junit4]   2>   "state":"down",
   [junit4]   2>   "base_url":"http://127.0.0.1:60938/solr",
   [junit4]   2>   "type":"NRT",
   [junit4]   2>   "waitForFinalState":"false"} 
   [junit4]   2> 3602698 INFO  (qtp1273237479-33501) [n:127.0.0.1:60938_solr    ] o.a.s.h.a.CoreAdminOperation core create command qt=/admin/cores&coreNodeName=core_node2&collection.configName=timeConfig&newCollection=true&name=timeConfig_shard1_replica_n1&action=CREATE&numShards=1&collection=timeConfig&shard=shard1&wt=javabin&version=2&replicaType=NRT
   [junit4]   2> 3602698 INFO  (qtp1273237479-33501) [n:127.0.0.1:60938_solr    ] o.a.s.c.TransientSolrCoreCacheDefault Allocating transient cache for 2147483647 transient cores
   [junit4]   2> 3602811 INFO  (zkCallback-8674-thread-1-processing-n:127.0.0.1:60938_solr) [n:127.0.0.1:60938_solr    ] o.a.s.c.c.ZkStateReader A cluster state change: [WatchedEvent state:SyncConnected type:NodeDataChanged path:/collections/timeConfig/state.json] for collection [timeConfig] has occurred - updating... (live nodes size: [2])
   [junit4]   2> 3602812 INFO  (zkCallback-8674-thread-2-processing-n:127.0.0.1:60938_solr) [n:127.0.0.1:60938_solr    ] o.a.s.c.c.ZkStateReader A cluster state change: [WatchedEvent state:SyncConnected type:NodeDataChanged path:/collections/timeConfig/state.json] for collection [timeConfig] has occurred - updating... (live nodes size: [2])
   [junit4]   2> 3603722 INFO  (qtp1273237479-33501) [n:127.0.0.1:60938_solr c:timeConfig s:shard1 r:core_node2 x:timeConfig_shard1_replica_n1] o.a.s.c.RequestParams conf resource params.json loaded . version : 0 
   [junit4]   2> 3603723 INFO  (qtp1273237479-33501) [n:127.0.0.1:60938_solr c:timeConfig s:shard1 r:core_node2 x:timeConfig_shard1_replica_n1] o.a.s.c.RequestParams request params refreshed to version 0
   [junit4]   2> 3603723 WARN  (qtp1273237479-33501) [n:127.0.0.1:60938_solr c:timeConfig s:shard1 r:core_node2 x:timeConfig_shard1_replica_n1] o.a.s.c.SolrConfig Couldn't add files from /Users/jenkins/workspace/Lucene-Solr-master-MacOSX/solr/build/solr-core/test/J1/temp/solr.update.processor.TimeRoutedAliasUpdateProcessorTest_D97077C91C5E3F5E-001/tempDir-001/node1/timeConfig_shard1_replica_n1/../../../../contrib/extraction/lib filtered by .*\.jar to classpath: /Users/jenkins/workspace/Lucene-Solr-master-MacOSX/solr/build/solr-core/test/J1/temp/solr.update.processor.TimeRoutedAliasUpdateProcessorTest_D97077C91C5E3F5E-001/tempDir-001/node1/timeConfig_shard1_replica_n1/../../../../contrib/extraction/lib
   [junit4]   2> 3603723 WARN  (qtp1273237479-33501) [n:127.0.0.1:60938_solr c:timeConfig s:shard1 r:core_node2 x:timeConfig_shard1_replica_n1] o.a.s.c.SolrConfig Couldn't add files from /Users/jenkins/workspace/Lucene-Solr-master-MacOSX/solr/build/solr-core/test/J1/temp/solr.update.processor.TimeRoutedAliasUpdateProcessorTest_D97077C91C5E3F5E-001/tempDir-001/node1/timeConfig_shard1_replica_n1/../../../../dist filtered by solr-cell-\d.*\.jar to classpath: /Users/jenkins/workspace/Lucene-Solr-master-MacOSX/solr/build/solr-core/test/J1/temp/solr.update.processor.TimeRoutedAliasUpdateProcessorTest_D97077C91C5E3F5E-001/tempDir-001/node1/timeConfig_shard1_replica_n1/../../../../dist
   [junit4]   2> 3603724 WARN  (qtp1273237479-33501) [n:127.0.0.1:60938_solr c:timeConfig s:shard1 r:core_node2 x:timeConfig_shard1_replica_n1] o.a.s.c.SolrConfig Couldn't add files from /Users/jenkins/workspace/Lucene-Solr-master-MacOSX/solr/build/solr-core/test/J1/temp/solr.update.processor.TimeRoutedAliasUpdateProcessorTest_D97077C91C5E3F5E-001/tempDir-001/node1/timeConfig_shard1_replica_n1/../../../../contrib/clustering/lib filtered by .*\.jar to classpath: /Users/jenkins/workspace/Lucene-Solr-master-MacOSX/solr/build/solr-core/test/J1/temp/solr.update.processor.TimeRoutedAliasUpdateProcessorTest_D97077C91C5E3F5E-001/tempDir-001/node1/timeConfig_shard1_replica_n1/../../../../contrib/clustering/lib
   [junit4]   2> 3603724 WARN  (qtp1273237479-33501) [n:127.0.0.1:60938_solr c:timeConfig s:shard1 r:core_node2 x:timeConfig_shard1_replica_n1] o.a.s.c.SolrConfig Couldn't add files from /Users/jenkins/workspace/Lucene-Solr-master-MacOSX/solr/build/solr-core/test/J1/temp/solr.update.processor.TimeRoutedAliasUpdateProcessorTest_D97077C91C5E3F5E-001/tempDir-001/node1/timeConfig_shard1_replica_n1/../../../../dist filtered by solr-clustering-\d.*\.jar to classpath: /Users/jenkins/workspace/Lucene-Solr-master-MacOSX/solr/build/solr-core/test/J1/temp/solr.update.processor.TimeRoutedAliasUpdateProcessorTest_D97077C91C5E3F5E-001/tempDir-001/node1/timeConfig_shard1_replica_n1/../../../../dist
   [junit4]   2> 3603724 WARN  (qtp1273237479-33501) [n:127.0.0.1:60938_solr c:timeConfig s:shard1 r:core_node2 x:timeConfig_shard1_replica_n1] o.a.s.c.SolrConfig Couldn't add files from /Users/jenkins/workspace/Lucene-Solr-master-MacOSX/solr/build/solr-core/test/J1/temp/solr.update.processor.TimeRoutedAliasUpdateProcessorTest_D97077C91C5E3F5E-001/tempDir-001/node1/timeConfig_shard1_replica_n1/../../../../contrib/langid/lib filtered by .*\.jar to classpath: /Users/jenkins/workspace/Lucene-Solr-master-MacOSX/solr/build/solr-core/test/J1/temp/solr.update.processor.TimeRoutedAliasUpdateProcessorTest_D97077C91C5E3F5E-001/tempDir-001/node1/timeConfig_shard1_replica_n1/../../../../contrib/langid/lib
   [junit4]   2> 3603724 WARN  (qtp1273237479-33501) [n:127.0.0.1:60938_solr c:timeConfig s:shard1 r:core_node2 x:timeConfig_shard1_replica_n1] o.a.s.c.SolrConfig Couldn't add files from /Users/jenkins/workspace/Lucene-Solr-master-MacOSX/solr/build/solr-core/test/J1/temp/solr.update.processor.TimeRoutedAliasUpdateProcessorTest_D97077C91C5E3F5E-001/tempDir-001/node1/timeConfig_shard1_replica_n1/../../../../dist filtered by solr-langid-\d.*\.jar to classpath: /Users/jenkins/workspace/Lucene-Solr-master-MacOSX/solr/build/solr-core/test/J1/temp/solr.update.processor.TimeRoutedAliasUpdateProcessorTest_D97077C91C5E3F5E-001/tempDir-001/node1/timeConfig_shard1_replica_n1/../../../../dist
   [junit4]   2> 3603724 WARN  (qtp1273237479-33501) [n:127.0.0.1:60938_solr c:timeConfig s:shard1 r:core_node2 x:timeConfig_shard1_replica_n1] o.a.s.c.SolrConfig Couldn't add files from /Users/jenkins/workspace/Lucene-Solr-master-MacOSX/solr/build/solr-core/test/J1/temp/solr.update.processor.TimeRoutedAliasUpdateProcessorTest_D97077C91C5E3F5E-001/tempDir-001/node1/timeConfig_shard1_replica_n1/../../../../contrib/velocity/lib filtered by .*\.jar to classpath: /Users/jenkins/workspace/Lucene-Solr-master-MacOSX/solr/build/solr-core/test/J1/temp/solr.update.processor.TimeRoutedAliasUpdateProcessorTest_D97077C91C5E3F5E-001/tempDir-001/node1/timeConfig_shard1_replica_n1/../../../../contrib/velocity/lib
   [junit4]   2> 3603725 WARN  (qtp1273237479-33501) [n:127.0.0.1:60938_solr c:timeConfig s:shard1 r:core_node2 x:timeConfig_shard1_replica_n1] o.a.s.c.SolrConfig Couldn't add files from /Users/jenkins/workspace/Lucene-Solr-master-MacOSX/solr/build/solr-core/test/J1/temp/solr.update.processor.TimeRoutedAliasUpdateProcessorTest_D97077C91C5E3F5E-001/tempDir-001/node1/timeConfig_shard1_replica_n1/../../../../dist filtered by solr-velocity-\d.*\.jar to classpath: /Users/jenkins/workspace/Lucene-Solr-master-MacOSX/solr/build/solr-core/test/J1/temp/solr.update.processor.TimeRoutedAliasUpdateProcessorTest_D97077C91C5E3F5E-001/tempDir-001/node1/timeConfig_shard1_replica_n1/../../../../dist
   [junit4]   2> 3603729 INFO  (qtp1273237479-33501) [n:127.0.0.1:60938_solr c:timeConfig s:shard1 r:core_node2 x:timeConfig_shard1_replica_n1] o.a.s.c.SolrConfig Using Lucene MatchVersion: 8.0.0
   [junit4]   2> 3603754 INFO  (qtp1273237479-33501) [n:127.0.0.1:60938_solr c:timeConfig s:shard1 r:core_node2 x:timeConfig_shard1_replica_n1] o.a.s.s.IndexSchema [timeConfig_shard1_replica_n1] Schema name=default-config
   [junit4]   2> 3603911 INFO  (qtp1273237479-33501) [n:127.0.0.1:60938_solr c:timeConfig s:shard1 r:core_node2 x:timeConfig_shard1_replica_n1] o.a.s.s.IndexSchema Loaded schema default-config/1.6 with uniqueid field id
   [junit4]   2> 3603957 INFO  (qtp1273237479-33501) [n:127.0.0.1:60938_solr c:timeConfig s:shard1 r:core_node2 x:timeConfig_shard1_replica_n1] o.a.s.c.CoreContainer Creating SolrCore 'timeConfig_shard1_replica_n1' using configuration from collection timeConfig, trusted=true
   [junit4]   2> 3603957 INFO  (qtp1273237479-33501) [n:127.0.0.1:60938_solr c:timeConfig s:shard1 r:core_node2 x:timeConfig_shard1_replica_n1] o.a.s.m.r.SolrJmxReporter JMX monitoring for 'solr_60938.solr.core.timeConfig.shard1.replica_n1' (registry 'solr.core.timeConfig.shard1.replica_n1') enabled at server: com.sun.jmx.mbeanserver.JmxMBeanServer@78963aaf
   [junit4]   2> 3603958 INFO  (qtp1273237479-33501) [n:127.0.0.1:60938_solr c:timeConfig s:shard1 r:core_node2 x:timeConfig_shard1_replica_n1] o.a.s.c.SolrCore solr.RecoveryStrategy.Builder
   [junit4]   2> 3603958 INFO  (qtp1273237479-33501) [n:127.0.0.1:60938_solr c:timeConfig s:shard1 r:core_node2 x:timeConfig_shard1_replica_n1] o.a.s.c.SolrCore [[timeConfig_shard1_replica_n1] ] Opening new SolrCore at [/Users/jenkins/workspace/Lucene-Solr-master-MacOSX/solr/build/solr-core/test/J1/temp/solr.update.processor.TimeRoutedAliasUpdateProcessorTest_D97077C91C5E3F5E-001/tempDir-001/node1/timeConfig_shard1_replica_n1], dataDir=[/Users/jenkins/workspace/Lucene-Solr-master-MacOSX/solr/build/solr-core/test/J1/temp/solr.update.processor.TimeRoutedAliasUpdateProcessorTest_D97077C91C5E3F5E-001/tempDir-001/node1/./timeConfig_shard1_replica_n1/data/]
   [junit4]   2> 3603960 INFO  (qtp1273237479-33501) [n:127.0.0.1:60938_solr c:timeConfig s:shard1 r:core_node2 x:timeConfig_shard1_replica_n1] o.a.s.r.XSLTResponseWriter xsltCacheLifetimeSeconds=5
   [junit4]   2> 3604006 INFO  (qtp1273237479-33501) [n:127.0.0.1:60938_solr c:timeConfig s:shard1 r:core_node2 x:timeConfig_shard1_replica_n1] o.a.s.u.UpdateHandler Using UpdateLog implementation: org.apache.solr.update.UpdateLog
   [junit4]   2> 3604006 INFO  (qtp1273237479-33501) [n:127.0.0.1:60938_solr c:timeConfig s:shard1 r:core_node2 x:timeConfig_shard1_replica_n1] o.a.s.u.UpdateLog Initializing UpdateLog: dataDir= defaultSyncLevel=FLUSH numRecordsToKeep=100 maxNumLogsToKeep=10 numVersionBuckets=65536
   [junit4]   2> 3604007 INFO  (qtp1273237479-33501) [n:127.0.0.1:60938_solr c:timeConfig s:shard1 r:core_node2 x:timeConfig_shard1_replica_n1] o.a.s.u.CommitTracker Hard AutoCommit: if uncommited for 15000ms; 
   [junit4]   2> 3604007 INFO  (qtp1273237479-33501) [n:127.0.0.1:60938_solr c:timeConfig s:shard1 r:core_node2 x:timeConfig_shard1_replica_n1] o.a.s.u.CommitTracker Soft AutoCommit: disabled
   [junit4]   2> 3604009 INFO  (qtp1273237479-33501) [n:127.0.0.1:60938_solr c:timeConfig s:shard1 r:core_node2 x:timeConfig_shard1_replica_n1] o.a.s.s.SolrIndexSearcher Opening [Searcher@5cd9d92e[timeConfig_shard1_replica_n1] main]
   [junit4]   2> 3604010 INFO  (qtp1273237479-33501) [n:127.0.0.1:60938_solr c:timeConfig s:shard1 r:core_node2 x:timeConfig_shard1_replica_n1] o.a.s.r.ManagedResourceStorage Configured ZooKeeperStorageIO with znodeBase: /configs/timeConfig
   [junit4]   2> 3604011 INFO  (qtp1273237479-33501) [n:127.0.0.1:60938_solr c:timeConfig s:shard1 r:core_node2 x:timeConfig_shard1_replica_n1] o.a.s.r.ManagedResourceStorage Loaded null at path _rest_managed.json using ZooKeeperStorageIO:path=/configs/timeConfig
   [junit4]   2> 3604011 INFO  (qtp1273237479-33501) [n:127.0.0.1:60938_solr c:timeConfig s:shard1 r:core_node2 x:timeConfig_shard1_replica_n1] o.a.s.s.ZkIndexSchemaReader Creating ZooKeeper watch for the managed schema at /configs/timeConfig/managed-schema
   [junit4]   2> 3604011 INFO  (qtp1273237479-33501) [n:127.0.0.1:60938_solr c:timeConfig s:shard1 r:core_node2 x:timeConfig_shard1_replica_n1] o.a.s.s.ZkIndexSchemaReader Current schema version 0 is already the latest
   [junit4]   2> 3604012 INFO  (qtp1273237479-33501) [n:127.0.0.1:60938_solr c:timeConfig s:shard1 r:core_node2 x:timeConfig_shard1_replica_n1] o.a.s.h.c.SpellCheckComponent Initializing spell checkers
   [junit4]   2> 3604012 INFO  (qtp1273237479-33501) [n:127.0.0.1:60938_solr c:timeConfig s:shard1 r:core_node2 x:timeConfig_shard1_replica_n1] o.a.s.s.DirectSolrSpellChecker init: {name=default,field=_text_,classname=solr.DirectSolrSpellChecker,distanceMeasure=internal,accuracy=0.5,maxEdits=2,minPrefix=1,maxInspections=5,minQueryLength=4,maxQueryFrequency=0.01}
   [junit4]   2> 3604014 INFO  (qtp1273237479-33501) [n:127.0.0.1:60938_solr c:timeConfig s:shard1 r:core_node2 x:timeConfig_shard1_replica_n1] o.a.s.h.ReplicationHandler Commits will be reserved for 10000ms.
   [junit4]   2> 3604014 INFO  (qtp1273237479-33501) [n:127.0.0.1:60938_solr c:timeConfig s:shard1 r:core_node2 x:timeConfig_shard1_replica_n1] o.a.s.u.UpdateLog Could not find max version in index or recent updates, using new clock 1589177611655839744
   [junit4]   2> 3604014 INFO  (searcherExecutor-12160-thread-1-processing-n:127.0.0.1:60938_solr x:timeConfig_shard1_replica_n1 s:shard1 c:timeConfig r:core_node2) [n:127.0.0.1:60938_solr c:timeConfig s:shard1 r:core_node2 x:timeConfig_shard1_replica_n1] o.a.s.c.QuerySenderListener QuerySenderListener sending requests to Searcher@5cd9d92e[timeConfig_shard1_replica_n1] main{ExitableDirectoryReader(UninvertingDirectoryReader())}
   [junit4]   2> 3604014 INFO  (searcherExecutor-12160-thread-1-processing-n:127.0.0.1:60938_solr x:timeConfig_shard1_replica_n1 s:shard1 c:timeConfig r:core_node2) [n:127.0.0.1:60938_solr c:timeConfig s:shard1 r:core_node2 x:timeConfig_shard1_replica_n1] o.a.s.c.QuerySenderListener QuerySenderListener done.
   [junit4]   2> 3604014 INFO  (searcherExecutor-12160-thread-1-processing-n:127.0.0.1:60938_solr x:timeConfig_shard1_replica_n1 s:shard1 c:timeConfig r:core_node2) [n:127.0.0.1:60938_solr c:timeConfig s:shard1 r:core_node2 x:timeConfig_shard1_replica_n1] o.a.s.h.c.SpellCheckComponent Loading spell index for spellchecker: default
   [junit4]   2> 3604015 INFO  (searcherExecutor-12160-thread-1-processing-n:127.0.0.1:60938_solr x:timeConfig_shard1_replica_n1 s:shard1 c:timeConfig r:core_node2) [n:127.0.0.1:60938_solr c:timeConfig s:shard1 r:core_node2 x:timeConfig_shard1_replica_n1] o.a.s.c.SolrCore [timeConfig_shard1_replica_n1] Registered new searcher Searcher@5cd9d92e[timeConfig_shard1_replica_n1] main{ExitableDirectoryReader(UninvertingDirectoryReader())}
   [junit4]   2> 3604023 INFO  (qtp1273237479-33501) [n:127.0.0.1:60938_solr c:timeConfig s:shard1 r:core_node2 x:timeConfig_shard1_replica_n1] o.a.s.c.ShardLeaderElectionContext Enough replicas found to continue.
   [junit4]   2> 3604023 INFO  (qtp1273237479-33501) [n:127.0.0.1:60938_solr c:timeConfig s:shard1 r:core_node2 x:timeConfig_shard1_replica_n1] o.a.s.c.ShardLeaderElectionContext I may be the new leader - try and sync
   [junit4]   2> 3604023 INFO  (qtp1273237479-33501) [n:127.0.0.1:60938_solr c:timeConfig s:shard1 r:core_node2 x:timeConfig_shard1_replica_n1] o.a.s.c.SyncStrategy Sync replicas to http://127.0.0.1:60938/solr/timeConfig_shard1_replica_n1/
   [junit4]   2> 3604023 INFO  (qtp1273237479-33501) [n:127.0.0.1:60938_solr c:timeConfig s:shard1 r:core_node2 x:timeConfig_shard1_replica_n1] o.a.s.c.SyncStrategy Sync Success - now sync replicas to me
   [junit4]   2> 3604023 INFO  (qtp1273237479-33501) [n:127.0.0.1:60938_solr c:timeConfig s:shard1 r:core_node2 x:timeConfig_shard1_replica_n1] o.a.s.c.SyncStrategy http://127.0.0.1:60938/solr/timeConfig_shard1_replica_n1/ has no replicas
   [junit4]   2> 3604023 INFO  (qtp1273237479-33501) [n:127.0.0.1:60938_solr c:timeConfig s:shard1 r:core_node2 x:timeConfig_shard1_replica_n1] o.a.s.c.ShardLeaderElectionContext Found all replicas participating in election, clear LIR
   [junit4]   2> 3604028 INFO  (qtp1273237479-33501) [n:127.0.0.1:60938_solr c:timeConfig s:shard1 r:core_node2 x:timeConfig_shard1_replica_n1] o.a.s.c.ShardLeaderElectionContext I am the new leader: http://127.0.0.1:60938/solr/timeConfig_shard1_replica_n1/ shard1
   [junit4]   2> 3604131 INFO  (zkCallback-8674-thread-2-processing-n:127.0.0.1:60938_solr) [n:127.0.0.1:60938_solr    ] o.a.s.c.c.ZkStateReader A cluster state change: [WatchedEvent state:SyncConnected type:NodeDataChanged path:/collections/timeConfig/state.json] for collection [timeConfig] has occurred - updating... (live nodes size: [2])
   [junit4]   2> 3604131 INFO  (zkCallback-8674-thread-1-processing-n:127.0.0.1:60938_solr) [n:127.0.0.1:60938_solr    ] o.a.s.c.c.ZkStateReader A cluster state change: [WatchedEvent state:SyncConnected type:NodeDataChanged path:/collections/timeConfig/state.json] for collection [timeConfig] has occurred - updating... (live nodes size: [2])
   [junit4]   2> 3604148 INFO  (qtp1273237479-33501) [n:127.0.0.1:60938_solr c:timeConfig s:shard1 r:core_node2 x:timeConfig_shard1_replica_n1] o.a.s.c.ZkController I am the leader, no recovery necessary
   [junit4]   2> 3604149 INFO  (qtp1273237479-33501) [n:127.0.0.1:60938_solr c:timeConfig s:shard1 r:core_node2 x:timeConfig_shard1_replica_n1] o.a.s.s.HttpSolrCall [admin] webapp=null path=/admin/cores params={qt=/admin/cores&coreNodeName=core_node2&collection.configName=timeConfig&newCollection=true&name=timeConfig_shard1_replica_n1&action=CREATE&numShards=1&collection=timeConfig&shard=shard1&wt=javabin&version=2&replicaType=NRT} status=0 QTime=1451
   [junit4]   2> 3604155 INFO  (qtp1273237479-33496) [n:127.0.0.1:60938_solr    ] o.a.s.h.a.CollectionsHandler Wait for new collection to be active for at most 30 seconds. Check all shard replicas
   [junit4]   2> 3604236 INFO  (OverseerCollectionConfigSetProcessor-99323600583852037-127.0.0.1:60937_solr-n_0000000000) [n:127.0.0.1:60937_solr    ] o.a.s.c.OverseerTaskQueue Response ZK path: /overseer/collection-queue-work/qnr-0000000000 doesn't exist.  Requestor may have disconnected from ZooKeeper
   [junit4]   2> 3604252 INFO  (zkCallback-8674-thread-2-processing-n:127.0.0.1:60938_solr) [n:127.0.0.1:60938_solr    ] o.a.s.c.c.ZkStateReader A cluster state change: [WatchedEvent state:SyncConnected type:NodeDataChanged path:/collections/timeConfig/state.json] for collection [timeConfig] has occurred - updating... (live nodes size: [2])
   [junit4]   2> 3604252 INFO  (zkCallback-8674-thread-1-processing-n:127.0.0.1:60938_solr) [n:127.0.0.1:60938_solr    ] o.a.s.c.c.ZkStateReader A cluster state change: [WatchedEvent state:SyncConnected type:NodeDataChanged path:/collections/timeConfig/state.json] for collection [timeConfig] has occurred - updating... (live nodes size: [2])
   [junit4]   2> 3605162 INFO  (qtp1273237479-33496) [n:127.0.0.1:60938_solr    ] o.a.s.s.HttpSolrCall [admin] webapp=null path=/admin/collections params={pullReplicas=0&replicationFactor=1&name=timeConfig&nrtReplicas=1&action=CREATE&numShards=1&tlogReplicas=0&wt=javabin&version=2} status=0 QTime=2933
   [junit4]   2> 3605164 INFO  (qtp1273237479-33493) [n:127.0.0.1:60938_solr    ] o.a.s.h.a.CollectionsHandler Invoked Collection Action :clusterstatus with params action=CLUSTERSTATUS&wt=javabin&version=2 and sendToOCPQueue=true
   [junit4]   2> 3605166 INFO  (qtp1273237479-33493) [n:127.0.0.1:60938_solr    ] o.a.s.s.HttpSolrCall [admin] webapp=null path=/admin/collections params={action=CLUSTERSTATUS&wt=javabin&version=2} status=0 QTime=2
   [junit4]   2> 3605174 INFO  (qtp1273237479-33486) [n:127.0.0.1:60938_solr c:timeConfig s:shard1 r:core_node2 x:timeConfig_shard1_replica_n1] o.a.s.h.SolrConfigHandler Executed config commands successfully and persisted to ZK [{"set-user-property":{"timePartitionAliasName":"myalias"}}, {"set-user-property":{"update.autoCreateFields":false}}, {"add-updateprocessor":{
   [junit4]   2>     "name":"tolerant",
   [junit4]   2>     "class":"solr.TolerantUpdateProcessorFactory"}}, {"add-updateprocessor":{
   [junit4]   2>     "name":"inc",
   [junit4]   2>     "class":"org.apache.solr.update.processor.TimeRoutedAliasUpdateProcessorTest$IncrementURPFactory",
   [junit4]   2>     "fieldName":"integer_i"}}]
   [junit4]   2> 3605174 INFO  (qtp1273237479-33486) [n:127.0.0.1:60938_solr c:timeConfig s:shard1 r:core_node2 x:timeConfig_shard1_replica_n1] o.a.s.h.SolrConfigHandler Waiting up to 30 secs for 1 replicas to set the property overlay to be of version 0 for collection timeConfig
   [junit4]   2> 3605175 INFO  (Thread-5275) [n:127.0.0.1:60938_solr    ] o.a.s.c.SolrCore config update listener called for core timeConfig_shard1_replica_n1
   [junit4]   2> 3605175 INFO  (solrHandlerExecutor-12165-thread-1-processing-n:127.0.0.1:60938_solr x:timeConfig_shard1_replica_n1 s:shard1 c:timeConfig r:core_node2) [n:127.0.0.1:60938_solr c:timeConfig s:shard1 r:core_node2 x:timeConfig_shard1_replica_n1] o.a.s.h.SolrConfigHandler Time elapsed : 0 secs, maxWait 30
   [junit4]   2> 3605176 INFO  (Thread-5275) [n:127.0.0.1:60938_solr    ] o.a.s.c.SolrCore core reload timeConfig_shard1_replica_n1
   [junit4]   2> 3605184 INFO  (Thread-5275) [n:127.0.0.1:60938_solr    ] o.a.s.c.RequestParams conf resource params.json loaded . version : 0 
   [junit4]   2> 3605185 INFO  (Thread-5275) [n:127.0.0.1:60938_solr    ] o.a.s.c.RequestParams request params refreshed to version 0
   [junit4]   2> 3605185 WARN  (Thread-5275) [n:127.0.0.1:60938_solr    ] o.a.s.c.SolrConfig Couldn't add files from /Users/jenkins/workspace/Lucene-Solr-master-MacOSX/solr/build/solr-core/test/J1/temp/solr.update.processor.TimeRoutedAliasUpdateProcessorTest_D97077C91C5E3F5E-001/tempDir-001/node1/timeConfig_shard1_replica_n1/../../../../contrib/extraction/lib filtered by .*\.jar to classpath: /Users/jenkins/workspace/Lucene-Solr-master-MacOSX/solr/build/solr-core/test/J1/temp/solr.update.processor.TimeRoutedAliasUpdateProcessorTest_D97077C91C5E3F5E-001/tempDir-001/node1/timeConfig_shard1_replica_n1/../../../../contrib/extraction/lib
   [junit4]   2> 3605185 WARN  (Thread-5275) [n:127.0.0.1:60938_solr    ] o.a.s.c.SolrConfig Couldn't add files from /Users/jenkins/workspace/Lucene-Solr-master-MacOSX/solr/build/solr-core/test/J1/temp/solr.update.processor.TimeRoutedAliasUpdateProcessorTest_D97077C91C5E3F5E-001/tempDir-001/node1/timeConfig_shard1_replica_n1/../../../../dist filtered by solr-cell-\d.*\.jar to classpath: /Users/jenkins/workspace/Lucene-Solr-master-MacOSX/solr/build/solr-core/test/J1/temp/solr.update.processor.TimeRoutedAliasUpdateProcessorTest_D97077C91C5E3F5E-001/tempDir-001/node1/timeConfig_shard1_replica_n1/../../../../dist
   [junit4]   2> 3605185 WARN  (Thread-5275) [n:127.0.0.1:60938_solr    ] o.a.s.c.SolrConfig Couldn't add files from /Users/jenkins/workspace/Lucene-Solr-master-MacOSX/solr/build/solr-core/test/J1/temp/solr.update.processor.TimeRoutedAliasUpdateProcessorTest_D97077C91C5E3F5E-001/tempDir-001/node1/timeConfig_shard1_replica_n1/../../../../contrib/clustering/lib filtered by .*\.jar to classpath: /Users/jenkins/workspace/Lucene-Solr-master-MacOSX/solr/build/solr-core/test/J1/temp/solr.update.processor.TimeRoutedAliasUpdateProcessorTest_D97077C91C5E3F5E-001/tempDir-001/node1/timeConfig_shard1_replica_n1/../../../../contrib/clustering/lib
   [junit4]   2> 3605186 WARN  (Thread-5275) [n:127.0.0.1:60938_solr    ] o.a.s.c.SolrConfig Couldn't add files from /Users/jenkins/workspace/Lucene-Solr-master-MacOSX/solr/build/solr-core/test/J1/temp/solr.update.processor.TimeRoutedAliasUpdateProcessorTest_D97077C91C5E3F5E-001/tempDir-001/node1/timeConfig_shard1_replica_n1/../../../../dist filtered by solr-clustering-\d.*\.jar to classpath: /Users/jenkins/workspace/Lucene-Solr-master-MacOSX/solr/build/solr-core/test/J1/temp/solr.update.processor.TimeRoutedAliasUpdateProcessorTest_D97077C91C5E3F5E-001/tempDir-001/node1/timeConfig_shard1_replica_n1/../../../../dist
   [junit4]   2> 3605186 WARN  (Thread-5275) [n:127.0.0.1:60938_solr    ] o.a.s.c.SolrConfig Couldn't add files from /Users/jenkins/workspace/Lucene-Solr-master-MacOSX/solr/build/solr-core/test/J1/temp/solr.update.processor.TimeRoutedAliasUpdateProcessorTest_D97077C91C5E3F5E-001/tempDir-001/node1/timeConfig_shard1_replica_n1/../../../../contrib/langid/lib filtered by .*\.jar to classpath: /Users/jenkins/workspace/Lucene-Solr-master-MacOSX/solr/build/solr-core/test/J1/temp/solr.update.processor.TimeRoutedAliasUpdateProcessorTest_D97077C91C5E3F5E-001/tempDir-001/node1/timeConfig_shard1_replica_n1/../../../../contrib/langid/lib
   [junit4]   2> 3605186 WARN  (Thread-5275) [n:127.0.0.1:60938_solr    ] o.a.s.c.SolrConfig Couldn't add files from /Users/jenkins/workspace/Lucene-Solr-master-MacOSX/solr/build/solr-core/test/J1/temp/solr.update.processor.TimeRoutedAliasUpdateProcessorTest_D97077C91C5E3F5E-001/tempDir-001/node1/timeConfig_shard1_replica_n1/../../../../dist filtered by solr-langid-\d.*\.jar to classpath: /Users/jenkins/workspace/Lucene-Solr-master-MacOSX/solr/build/solr-core/test/J1/temp/solr.update.processor.TimeRoutedAliasUpdateProcessorTest_D97077C91C5E3F5E-001/tempDir-001/node1/timeConfig_shard1_replica_n1/../../../../dist
   [junit4]   2> 3605186 WARN  (Thread-5275) [n:127.0.0.1:60938_solr    ] o.a.s.c.SolrConfig Couldn't add files from /Users/jenkins/workspace/Lucene-Solr-master-MacOSX/solr/build/solr-core/test/J1/temp/solr.update.processor.TimeRoutedAliasUpdateProcessorTest_D97077C91C5E3F5E-001/tempDir-001/node1/timeConfig_shard1_replica_n1/../../../../contrib/velocity/lib filtered by .*\.jar to classpath: /Users/jenkins/workspace/Lucene-Solr-master-MacOSX/solr/build/solr-core/test/J1/temp/solr.update.processor.TimeRoutedAliasUpdateProcessorTest_D97077C91C5E3F5E-001/tempDir-001/node1/timeConfig_shard1_replica_n1/../../../../contrib/velocity/lib
   [junit4]   2> 3605186 WARN  (Thread-5275) [n:127.0.0.1:60938_solr    ] o.a.s.c.SolrConfig Couldn't add files from /Users/jenkins/workspace/Lucene-Solr-master-MacOSX/solr/build/solr-core/test/J1/temp/solr.update.processor.TimeRoutedAliasUpdateProcessorTest_D97077C91C5E3F5E-001/tempDir-001/node1/timeConfig_shard1_replica_n1/../../../../dist filtered by solr-velocity-\d.*\.jar to classpath: /Users/jenkins/workspace/Lucene-Solr-master-MacOSX/solr/build/solr-core/test/J1/temp/solr.update.processor.TimeRoutedAliasUpdateProcessorTest_D97077C91C5E3F5E-001/tempDir-001/node1/timeConfig_shard1_replica_n1/../../../../dist
   [junit4]   2> 3605191 INFO  (Thread-5275) [n:127.0.0.1:60938_solr    ] o.a.s.c.SolrConfig Using Lucene MatchVersion: 8.0.0
   [junit4]   2> 3605208 INFO  (Thread-5275) [n:127.0.0.1:60938_solr    ] o.a.s.s.IndexSchema [timeConfig_shard1_replica_n1] Schema name=default-config
   [junit4]   2> 3605277 INFO  (qtp1273237479-33497) [n:127.0.0.1:60938_solr c:timeConfig s:shard1 r:core_node2 x:timeConfig_shard1_replica_n1] o.a.s.h.SolrConfigHandler expecting overlay version 0 but my version is -1
   [junit4]   2> 3605277 INFO  (qtp1273237479-33497) [n:127.0.0.1:60938_solr c:timeConfig s:shard1 r:core_node2 x:timeConfig_shard1_replica_n1] o.a.s.c.S.Request [timeConfig_shard1_replica_n1]  webapp=/solr path=/config/znodeVersion params={overlay=0&wt=javabin&version=2} status=0 QTime=0
   [junit4]   2> 3605277 INFO  (SolrConfigHandler-refreshconf) [n:127.0.0.1:60938_solr c:timeConfig s:shard1 r:core_node2 x:timeConfig_shard1_replica_n1] o.a.s.h.SolrConfigHandler Another reload is in progress . Not doing anything
   [junit4]   2> 3605277 INFO  (solrHandlerExecutor-12165-thread-1-processing-n:127.0.0.1:60938_solr x:timeConfig_shard1_replica_n1 s:shard1 c:timeConfig r:core_node2) [n:127.0.0.1:60938_solr c:timeConfig s:shard1 r:core_node2 x:timeConfig_shard1_replica_n1] o.a.s.h.SolrConfigHandler Could not get expectedVersion 0 from http://127.0.0.1:60938/solr/timeConfig_shard1_replica_n1/ for prop overlay   after 1 attempts
   [junit4]   2> 3605277 INFO  (solrHandlerExecutor-12165-thread-1-processing-n:127.0.0.1:60938_solr x:timeConfig_shard1_replica_n1 s:shard1 c:timeConfig r:core_node2) [n:127.0.0.1:60938_solr c:timeConfig s:shard1 r:core_node2 x:timeConfig_shard1_replica_n1] o.a.s.h.SolrConfigHandler Time elapsed : 0 secs, maxWait 30
   [junit4]   2> 3605361 INFO  (Thread-5275) [n:127.0.0.1:60938_solr    ] o.a.s.s.IndexSchema Loaded schema default-config/1.6 with uniqueid field id
   [junit4]   2> 3605378 INFO  (qtp1273237479-33499) [n:127.0.0.1:60938_solr c:timeConfig s:shard1 r:core_node2 x:timeConfig_shard1_replica_n1] o.a.s.h.SolrConfigHandler expecting overlay version 0 but my version is -1
   [junit4]   2> 3605378 INFO  (qtp1273237479-33499) [n:127.0.0.1:60938_solr c:timeConfig s:shard1 r:core_node2 x:timeConfig_shard1_replica_n1] o.a.s.c.S.Request [timeConfig_shard1_replica_n1]  webapp=/solr path=/config/znodeVersion params={overlay=0&wt=javabin&version=2} status=0 QTime=0
   [junit4]   2> 3605378 INFO  (SolrConfigHandler-refreshconf) [n:127.0.0.1:60938_solr c:timeConfig s:shard1 r:core_node2 x:timeConfig_shard1_replica_n1] o.a.s.h.SolrConfigHandler Another reload is in progress . Not doing anything
   [junit4]   2> 3605378 INFO  (solrHandlerExecutor-12165-thread-1-processing-n:127.0.0.1:60938_solr x:timeConfig_shard1_replica_n1 s:shard1 c:timeConfig r:core_node2) [n:127.0.0.1:60938_solr c:timeConfig s:shard1 r:core_node2 x:timeConfig_shard1_replica_n1] o.a.s.h.SolrConfigHandler Could not get expectedVersion 0 from http://127.0.0.1:60938/solr/timeConfig_shard1_replica_n1/ for prop overlay   after 2 attempts
   [junit4]   2> 3605379 INFO  (solrHandlerExecutor-12165-thread-1-processing-n:127.0.0.1:60938_solr x:timeConfig_shard1_replica_n1 s:shard1 c:timeConfig r:core_node2) [n:127.0.0.1:60938_solr c:timeConfig s:shard1 r:core_node2 x:timeConfig_shard1_replica_n1] o.a.s.h.SolrConfigHandler Time elapsed : 0 secs, maxWait 30
   [junit4]   2> 3605489 INFO  (qtp1273237479-33501) [n:127.0.0.1:60938_solr c:timeConfig s:shard1 r:core_node2 x:timeConfig_shard1_replica_n1] o.a.s.h.SolrConfigHandler expecting overlay version 0 but my version is -1
   [junit4]   2> 3605490 INFO  (qtp1273237479-33501) [n:127.0.0.1:60938_solr c:timeConfig s:shard1 r:core_node2 x:timeConfig_shard1_replica_n1] o.a.s.c.S.Request [timeConfig_shard1_replica_n1]  webapp=/solr path=/config/znodeVersion params={overlay=0&wt=javabin&version=2} status=0 QTime=1
   [junit4]   2> 3605490 INFO  (SolrConfigHandler-refreshconf) [n:127.0.0.1:60938_solr c:timeConfig s:shard1 r:core_node2 x:timeConfig_shard1_replica_n1] o.a.s.h.SolrConfigHandler Another reload is in progress . Not doing anything
   [junit4]   2> 3605490 INFO  (solrHandlerExecutor-12165-thread-1-processing-n:127.0.0.1:60938_solr x:timeConfig_shard1_replica_n1 s:shard1 c:timeConfig r:core_node2) [n:127.0.0.1:60938_solr c:timeConfig s:shard1 r:core_node2 x:timeConfig_shard1_replica_n1] o.a.s.h.SolrConfigHandler Could not get expectedVersion 0 from http://127.0.0.1:60938/solr/timeConfig_shard1_replica_n1/ for prop overlay   after 3 attempts
   [junit4]   2> 3605491 INFO  (solrHandlerExecutor-12165-thread-1-processing-n:127.0.0.1:60938_solr x:timeConfig_shard1_replica_n1 s:shard1 c:timeConfig r:core_node2) [n:127.0.0.1:60938_solr c:timeConfig s:shard1 r:core_node2 x:timeConfig_shard1_replica_n1] o.a.s.h.SolrConfigHandler Time elapsed : 0 secs, maxWait 30
   [junit4]   2> 3605519 INFO  (Thread-5275) [n:127.0.0.1:60938_solr    ] o.a.s.c.CoreContainer Reloading SolrCore 'timeConfig_shard1_replica_n1' using configuration from collection timeConfig
   [junit4]   2> 3605539 INFO  (Thread-5275) [n:127.0.0.1:60938_solr c:timeConfig s:shard1 r:core_node2 x:timeConfig_shard1_replica_n1] o.a.s.m.r.SolrJmxReporter JMX monitoring for 'solr_60938.solr.core.timeConfig.shard1.replica_n1' (registry 'solr.core.timeConfig.shard1.replica_n1') enabled at server: com.sun.jmx.mbeanserver.JmxMBeanServer@78963aaf
   [junit4]   2> 3605539 INFO  (Thread-5275) [n:127.0.0.1:60938_solr c:timeConfig s:shard1 r:core_node2 x:timeConfig_shard1_replica_n1] o.a.s.c.SolrCore [[timeConfig_shard1_replica_n1] ] Opening new SolrCore at [/Users/jenkins/workspace/Lucene-Solr-master-MacOSX/solr/build/solr-core/test/J1/temp/solr.update.processor.TimeRoutedAliasUpdateProcessorTest_D97077C91C5E3F5E-001/tempDir-001/node1/timeConfig_shard1_replica_n1], dataDir=[/Users/jenkins/workspace/Lucene-Solr-master-MacOSX/solr/build/solr-core/test/J1/temp/solr.update.processor.TimeRoutedAliasUpdateProcessorTest_D97077C91C5E3F5E-001/tempDir-001/node1/./timeConfig_shard1_replica_n1/data/]
   [junit4]   2> 3605541 INFO  (Thread-5275) [n:127.0.0.1:60938_solr c:timeConfig s:shard1 r:core_node2 x:timeConfig_shard1_replica_n1] o.a.s.r.XSLTResponseWriter xsltCacheLifetimeSeconds=5
   [junit4]   2> 3605579 INFO  (Thread-5275) [n:127.0.0.1:60938_solr c:timeConfig s:shard1 r:core_node2 x:timeConfig_shard1_replica_n1] o.a.s.u.CommitTracker Hard AutoCommit: if uncommited for 15000ms; 
   [junit4]   2> 3605580 INFO  (Thread-5275) [n:127.0.0.1:60938_solr c:timeConfig s:shard1 r:core_node2 x:timeConfig_shard1_replica_n1] o.a.s.u.CommitTracker Soft AutoCommit: disabled
   [junit4]   2> 3605581 INFO  (Thread-5275) [n:127.0.0.1:60938_solr c:timeConfig s:shard1 r:core_node2 x:timeConfig_shard1_replica_n1] o.a.s.s.SolrIndexSearcher Opening [Searcher@3623cc3e[timeConfig_shard1_replica_n1] main]
   [junit4]   2> 3605582 INFO  (Thread-5275) [n:127.0.0.1:60938_solr c:timeConfig s:shard1 r:core_node2 x:timeConfig_shard1_replica_n1] o.a.s.r.ManagedResourceStorage Configured ZooKeeperStorageIO with znodeBase: /configs/timeConfig
   [junit4]   2> 3605583 INFO  (Thread-5275) [n:127.0.0.1:60938_solr c:timeConfig s:shard1 r:core_node2 x:timeConfig_shard1_replica_n1] o.a.s.r.ManagedResourceStorage Loaded null at path _rest_managed.json using ZooKeeperStorageIO:path=/configs/timeConfig
   [junit4]   2> 3605583 INFO  (Thread-5275) [n:127.0.0.1:60938_solr c:timeConfig s:shard1 r:core_node2 x:timeConfig_shard1_replica_n1] o.a.s.s.ZkIndexSchemaReader Creating ZooKeeper watch for the managed schema at /configs/timeConfig/managed-schema
   [junit4]   2> 3605584 INFO  (Thread-5275) [n:127.0.0.1:60938_solr c:timeConfig s:shard1 r:core_node2 x:timeConfig_shard1_replica_n1] o.a.s.s.ZkIndexSchemaReader Current schema version 0 is already the latest
   [junit4]   2> 3605584 INFO  (Thread-5275) [n:127.0.0.1:60938_solr c:timeConfig s:shard1 r:core_node2 x:timeConfig_shard1_replica_n1] o.a.s.h.c.SpellCheckComponent Initializing spell checkers
   [junit4]   2> 3605584 INFO  (Thread-5275) [n:127.0.0.1:60938_solr c:timeConfig s:shard1 r:core_node2 x:timeConfig_shard1_replica_n1] o.a.s.s.DirectSolrSpellChecker init: {name=default,field=_text_,classname=solr.DirectSolrSpellChecker,distanceMeasure=internal,accuracy=0.5,maxEdits=2,minPrefix=1,maxInspections=5,minQueryLength=4,maxQueryFrequency=0.01}
   [junit4]   2> 3605585 INFO  (Thread-5275) [n:127.0.0.1:60938_solr c:timeConfig s:shard1 r:core_node2 x:timeConfig_shard1_replica_n1] o.a.s.h.ReplicationHandler Commits will be reserved for 10000ms.
   [junit4]   2> 3605586 INFO  (Thread-5275) [n:127.0.0.1:60938_solr c:timeConfig s:shard1 r:core_node2 x:timeConfig_shard1_replica_n1] o.a.s.u.UpdateLog Could not find max version in index or recent updates, using new clock 1589177613304201216
   [junit4]   2> 3605586 INFO  (searcherExecutor-12166-thread-1-processing-n:127.0.0.1:60938_solr x:timeConfig_shard1_replica_n1 s:shard1 c:timeConfig r:core_node2) [n:127.0.0.1:60938_solr c:timeConfig s:shard1 r:core_node2 x:timeConfig_shard1_replica_n1] o.a.s.c.QuerySenderListener QuerySenderListener sending requests to Searcher@3623cc3e[timeConfig_shard1_replica_n1] main{ExitableDirectoryReader(UninvertingDirectoryReader())}
   [junit4]   2> 3605586 INFO  (searcherExecutor-12166-thread-1-processing-n:127.0.0.1:60938_solr x:timeConfig_shard1_replica_n1 s:shard1 c:timeConfig r:core_node2) [n:127.0.0.1:60938_solr c:timeConfig s:shard1 r:core_node2 x:timeConfig_shard1_replica_n1] o.a.s.c.QuerySenderListener QuerySenderListener done.
   [junit4]   2> 3605586 INFO  (searcherExecutor-12166-thread-1-processing-n:127.0.0.1:60938_solr x:timeConfig_shard1_replica_n1 s:shard1 c:timeConfig r:core_node2) [n:127.0.0.1:60938_solr c:timeConfig s:shard1 r:core_node2 x:timeConfig_shard1_replica_n1] o.a.s.h.c.SpellCheckComponent Loading spell index for spellchecker: default
   [junit4]   2> 3605588 INFO  (searcherExecutor-12166-thread-1-processing-n:127.0.0.1:60938_solr x:timeConfig_shard1_replica_n1 s:shard1 c:timeConfig r:core_node2) [n:127.0.0.1:60938_solr c:timeConfig s:shard1 r:core_node2 x:timeConfig_shard1_replica_n1] o.a.s.c.SolrCore [timeConfig_shard1_replica_n1] Registered new searcher Searcher@3623cc3e[timeConfig_shard1_replica_n1] main{ExitableDirectoryReader(UninvertingDirectoryReader())}
   [junit4]   2> 3605589 INFO  (Thread-5275) [n:127.0.0.1:60938_solr c:timeConfig s:shard1 r:core_node2 x:timeConfig_shard1_replica_n1] o.a.s.u.DefaultSolrCoreState New IndexWriter is ready to be used.
   [junit4]   2> 3605589 INFO  (Thread-5275) [n:127.0.0.1:60938_solr c:timeConfig s:shard1 r:core_node2 x:timeConfig_shard1_replica_n1] o.a.s.s.SolrIndexSearcher Opening [Searcher@1af08adc[timeConfig_shard1_replica_n1] main]
   [junit4]   2> 3605589 INFO  (searcherExecutor-12166-thread-1-processing-n:127.0.0.1:60938_solr x:timeConfig_shard1_replica_n1 s:shard1 c:timeConfig r:core_node2) [n:127.0.0.1:60938_solr c:timeConfig s:shard1 r:core_node2 x:timeConfig_shard1_replica_n1] o.a.s.c.QuerySenderListener QuerySenderListener sending requests to Searcher@1af08adc[timeConfig_shard1_replica_n1] main{ExitableDirectoryReader(UninvertingDirectoryReader())}
   [junit4]   2> 3605590 INFO  (searcherExecutor-12166-thread-1-processing-n:127.0.0.1:60938_solr x:timeConfig_shard1_replica_n1 s:shard1 c:timeConfig r:core_node2) [n:127.0.0.1:60938_solr c:timeConfig s:shard1 r:core_node2 x:timeConfig_shard1_replica_n1] o.a.s.c.QuerySenderListener QuerySenderListener done.
   [junit4]   2> 3605592 INFO  (searcherExecutor-12166-thread-1-processing-n:127.0.0.1:60938_solr x:timeConfig_shard1_replica_n1 s:shard1 c:timeConfig r:core_node2) [n:127.0.0.1:60938_solr c:timeConfig s:shard1 r:core_node2 x:timeConfig_shard1_replica_n1] o.a.s.c.SolrCore [timeConfig_shard1_replica_n1] Registered new searcher Searcher@1af08adc[timeConfig_shard1_replica_n1] main{ExitableDirectoryReader(UninvertingDirectoryReader())}
   [junit4]   2> 3605601 INFO  (qtp1273237479-33496) [n:127.0.0.1:60938_solr c:timeConfig s:shard1 r:core_node2 x:timeConfig_shard1_replica_n1] o.a.s.h.SolrConfigHandler I already have the expected version 0 of config
   [junit4]   2> 3605601 INFO  (qtp1273237479-33496) [n:127.0.0.1:60938_solr c:timeConfig s:shard1 r:core_node2 x:timeConfig_shard1_replica_n1] o.a.s.h.SolrConfigHandler isStale false , resourceloader org.apache.solr.cloud.ZkSolrResourceLoader
   [junit4]   2> 3605601 INFO  (qtp1273237479-33496) [n:127.0.0.1:60938_solr c:timeConfig s:shard1 r:core_node2 x:timeConfig_shard1_replica_n1] o.a.s.c.S.Request [timeConfig_shard1_replica_n1]  webapp=/solr path=/config/znodeVersion params={overlay=0&wt=javabin&version=2} status=0 QTime=0
   [junit4]   2> 3605602 INFO  (qtp1273237479-33486) [n:127.0.0.1:60938_solr c:timeConfig s:shard1 r:core_node2 x:timeConfig_shard1_replica_n1] o.a.s.h.SolrConfigHandler Took 428.0ms to set the property overlay to be of version 0 for collection timeConfig
   [junit4]   2> 3605602 INFO  (qtp1273237479-33486) [n:127.0.0.1:60938_solr c:timeConfig s:shard1 r:core_node2 x:timeConfig_shard1_replica_n1] o.a.s.c.S.Request [timeConfig_shard1_replica_n1]  webapp=/solr path=/config params={wt=javabin&version=2} status=0 QTime=431
   [junit4]   2> 3605602 INFO  (qtp1273237479-33486) [n:127.0.0.1:60938_solr c:timeConfig s:shard1 r:core_node2 x:timeConfig_shard1_replica_n1] o.a.s.c.SolrCore [timeConfig_shard1_replica_n1]  CLOSING SolrCore org.apache.solr.core.SolrCore@4726bcfa
   [junit4]   2> 3605602 INFO  (qtp1273237479-33486) [n:127.0.0.1:60938_solr c:timeConfig s:shard1 r:core_node2 x:timeConfig_shard1_replica_n1] o.a.s.m.SolrMetricManager Closing metric reporters for registry=solr.core.timeConfig.shard1.replica_n1, tag=1193721082
   [junit4]   2> 3605602 INFO  (qtp1273237479-33486) [n:127.0.0.1:60938_solr c:timeConfig s:shard1 r:core_node2 x:timeConfig_shard1_replica_n1] o.a.s.m.r.SolrJmxReporter Closing reporter [org.apache.solr.metrics.reporters.SolrJmxReporter@2df86b7c: rootName = solr_60938, domain = solr.core.timeConfig.shard1.replica_n1, service url = null, agent id = null] for registry solr.core.timeConfig.shard1.replica_n1 / com.codahale.metrics.MetricRegistry@4e875a38
   [junit4]   2> 3605609 INFO  (qtp1273237479-33486) [n:127.0.0.1:60938_solr c:timeConfig s:shard1 r:core_node2 x:timeConfig_shard1_replica_n1] o.a.s.m.SolrMetricManager Closing metric reporters for registry=solr.collection.timeConfig.shard1.leader, tag=1193721082
   [junit4]   2> 3605610 INFO  (qtp1273237479-33493) [n:127.0.0.1:60938_solr    ] o.a.s.h.a.CollectionsHandler Invoked Collection Action :clusterstatus with params action=CLUSTERSTATUS&wt=javabin&version=2 and sendToOCPQueue=true
   [junit4]   2> 3605612 INFO  (qtp1273237479-33493) [n:127.0.0.1:60938_solr    ] o.a.s.s.HttpSolrCall [admin] webapp=null path=/admin/collections params={action=CLUSTERSTATUS&wt=javabin&version=2} status=0 QTime=1
   [junit4]   2> 3605614 INFO  (qtp1273237479-33497) [n:127.0.0.1:60938_solr c:timeConfig s:shard1 r:core_node2 x:timeConfig_shard1_replica_n1] o.a.s.c.ZkController Persisted config data to node /configs/timeConfig/params.json 
   [junit4]   2> 3605614 INFO  (qtp1273237479-33497) [n:127.0.0.1:60938_solr c:timeConfig s:shard1 r:core_node2 x:timeConfig_shard1_replica_n1] o.a.s.h.SolrConfigHandler Waiting up to 30 secs for 1 replicas to set the property params to be of version 1 for collection timeConfig
   [junit4]   2> 3605615 INFO  (Thread-5276) [n:127.0.0.1:60938_solr    ] o.a.s.c.SolrCore config update listener called for core timeConfig_shard1_replica_n1
   [junit4]   2> 3605615 INFO  (solrHandlerExecutor-12170-thread-1-processing-n:127.0.0.1:60938_solr x:timeConfig_shard1_replica_n1 s:shard1 c:timeConfig r:core_node2) [n:127.0.0.1:60938_solr c:timeConfig s:shard1 r:core_node2 x:timeConfig_shard1_replica_n1] o.a.s.h.SolrConfigHandler Time elapsed : 0 secs, maxWait 30
   [junit4]   2> 3605616 INFO  (Thread-5276) [n:127.0.0.1:60938_solr    ] o.a.s.c.RequestParams conf resource params.json loaded . version : 1 
   [junit4]   2> 3605616 INFO  (Thread-5276) [n:127.0.0.1:60938_solr    ] o.a.s.c.RequestParams request params refreshed to version 1
   [junit4]   2> 3605725 INFO  (qtp1273237479-33501) [n:127.0.0.1:60938_solr c:timeConfig s:shard1 r:core_node2 x:timeConfig_shard1_replica_n1] o.a.s.h.SolrConfigHandler I already have the expected version 1 of params
   [junit4]   2> 3605725 INFO  (qtp1273237479-33501) [n:127.0.0.1:60938_solr c:timeConfig s:shard1 r:core_node2 x:timeConfig_shard1_replica_n1] o.a.s.h.SolrConfigHandler isStale false , resourceloader org.apache.solr.cloud.ZkSolrResourceLoader
   [junit4]   2> 3605725 INFO  (qtp1273237479-33501) [n:127.0.0.1:60938_solr c:timeConfig s:shard1 r:core_node2 x:timeConfig_shard1_replica_n1] o.a.s.c.S.Request [timeConfig_shard1_replica_n1]  webapp=/solr path=/config/znodeVersion params={params=1&wt=javabin&version=2} status=0 QTime=0
   [junit4]   2> 3605725 INFO  (qtp1273237479-33497) [n:127.0.0.1:60938_solr c:timeConfig s:shard1 r:core_node2 x:timeConfig_shard1_replica_n1] o.a.s.h.SolrConfigHandler Took 111.0ms to set the property params to be of version 1 for collection timeConfig
   [junit4]   2> 3605726 INFO  (qtp1273237479-33496) [n:127.0.0.1:60938_solr    ] o.a.s.h.a.CollectionsHandler Invoked Collection Action :clusterstatus with params action=CLUSTERSTATUS&wt=javabin&version=2 and sendToOCPQueue=true
   [junit4]   2> 3605728 INFO  (qtp1273237479-33496) [n:127.0.0.1:60938_solr    ] o.a.s.s.HttpSolrCall [admin] webapp=null path=/admin/collections params={action=CLUSTERSTATUS&wt=javabin&version=2} status=0 QTime=1
   [junit4]   2> 3605729 INFO  (qtp1273237479-33486) [n:127.0.0.1:60938_solr    ] o.a.s.h.a.CollectionsHandler Invoked Collection Action :clusterstatus with params action=CLUSTERSTATUS&wt=javabin&version=2 and sendToOCPQueue=true
   [junit4]   2> 3605730 INFO  (qtp1273237479-33486) [n:127.0.0.1:60938_solr    ] o.a.s.s.HttpSolrCall [admin] webapp=null path=/admin/collections params={action=CLUSTERSTATUS&wt=javabin&version=2} status=0 QTime=1
   [junit4]   2> 3605731 INFO  (qtp1273237479-33493) [n:127.0.0.1:60938_solr    ] o.a.s.h.a.CollectionsHandler Invoked Collection Action :delete with params name=timeConfig&action=DELETE&wt=javabin&version=2 and sendToOCPQueue=true
   [junit4]   2> 3605735 INFO  (OverseerThreadFactory-12155-thread-2-processing-n:127.0.0.1:60937_solr) [n:127.0.0.1:60937_solr    ] o.a.s.c.OverseerCollectionMessageHandler Executing Collection Cmd : action=UNLOAD&deleteInstanceDir=true&deleteDataDir=true
   [junit4]   2> 3605736 INFO  (qtp1273237479-33499) [n:127.0.0.1:60938_solr    ] o.a.s.m.SolrMetricManager Closing metric reporters for registry=solr.core.timeConfig.shard1.replica_n1, tag=null
   [junit4]   2> 3605736 INFO  (qtp1273237479-33499) [n:127.0.0.1:60938_solr    ] o.a.s.m.r.SolrJmxReporter Closing reporter [org.apache.solr.metrics.reporters.SolrJmxReporter@3dbb9aff: rootName = solr_60938, domain = solr.core.timeConfig.shard1.replica_n1, service url = null, agent id = null] for registry solr.core.timeConfig.shard1.replica_n1 / com.codahale.metrics.MetricRegistry@4e875a38
   [junit4]   2> 3605747 INFO  (qtp1273237479-33499) [n:127.0.0.1:60938_solr    ] o.a.s.c.SolrCore [timeConfig_shard1_replica_n1]  CLOSING SolrCore org.apache.solr.core.SolrCore@41c1537f
   [junit4]   2> 3605747 INFO  (qtp1273237479-33499) [n:127.0.0.1:60938_solr    ] o.a.s.m.SolrMetricManager Closing metric reporters for registry=solr.core.timeConfig.shard1.replica_n1, tag=1103188863
   [junit4]   2> 3605747 INFO  (qtp1273237479-33499) [n:127.0.0.1:60938_solr    ] o.a.s.m.SolrMetricManager Closing metric reporters for registry=solr.collection.timeConfig.shard1.leader, tag=1103188863
   [junit4]   2> 3605752 INFO  (qtp1273237479-33499) [n:127.0.0.1:60938_solr    ] o.a.s.s.HttpSolrCall [admin] webapp=null path=/admin/cores params={deleteInstanceDir=true&core=timeConfig_shard1_replica_n1&qt=/admin/cores&deleteDataDir=true&action=UNLOAD&wt=javabin&version=2} status=0 QTime=15
   [junit4]   2> 3606478 INFO  (qtp1273237479-33493) [n:127.0.0.1:60938_solr    ] o.a.s.s.HttpSolrCall [admin] webapp=null path=/admin/collections params={name=timeConfig&action=DELETE&wt=javabin&version=2} status=0 QTime=746
   [junit4]   2> 3606478 INFO  (qtp1273237479-33501) [n:127.0.0.1:60938_solr    ] o.a.s.h.a.CollectionsHandler Invoked Collection Action :clusterstatus with params action=CLUSTERSTATUS&wt=javabin&version=2 and sendToOCPQueue=true
   [junit4]   2> 3606479 INFO  (qtp1273237479-33501) [n:127.0.0.1:60938_solr    ] o.a.s.s.HttpSolrCall [admin] webapp=null path=/admin/collections params={action=CLUSTERSTATUS&wt=javabin&version=2} status=0 QTime=0
   [junit4]   2> 3606480 INFO  (qtp1273237479-33494) [n:127.0.0.1:60938_solr    ] o.a.s.h.a.CollectionsHandler Invoked Collection Action :clusterstatus with params action=CLUSTERSTATUS&wt=javabin&version=2 and sendToOCPQueue=true
   [junit4]   2> 3606481 INFO  (qtp1273237479-33494) [n:127.0.0.1:60938_solr    ] o.a.s.s.HttpSolrCall [admin] webapp=null path=/admin/collections params={action=CLUSTERSTATUS&wt=javabin&version=2} status=0 QTime=0
   [junit4]   2> 3606481 INFO  (qtp1273237479-33497) [n:127.0.0.1:60938_solr    ] o.a.s.h.a.CollectionsHandler Invoked Collection Action :create with params replicationFactor=2&property.timePartitionAliasName=myalias&collection.configName=timeConfig&maxShardsPerNode=2&name=myalias_2017-10-23&nrtReplicas=2&action=CREATE&numShards=2&wt=javabin&version=2 and sendToOCPQueue=true
   [junit4]   2> 3606484 INFO  (OverseerThreadFactory-12155-thread-3-processing-n:127.0.0.1:60937_solr) [n:127.0.0.1:60937_solr    ] o.a.s.c.CreateCollectionCmd Create collection myalias_2017-10-23
   [junit4]   2> 3606485 INFO  (OverseerCollectionConfigSetProcessor-99323600583852037-127.0.0.1:60937_solr-n_0000000000) [n:127.0.0.1:60937_solr    ] o.a.s.c.OverseerTaskQueue Response ZK path: /overseer/collection-queue-work/qnr-0000000002 doesn't exist.  Requestor may have disconnected from ZooKeeper
   [junit4]   2> 3606715 INFO  (OverseerStateUpdate-99323600583852037-127.0.0.1:60937_solr-n_0000000000) [n:127.0.0.1:60937_solr    ] o.a.s.c.o.SliceMutator createReplica() {
   [junit4]   2>   "operation":"ADDREPLICA",
   [junit4]   2>   "collection":"myalias_2017-10-23",
   [junit4]   2>   "shard":"shard1",
   [junit4]   2>   "core":"myalias_2017-10-23_shard1_replica_n1",
   [junit4]   2>   "state":"down",
   [junit4]   2>   "base_url":"http://127.0.0.1:60938/solr",
   [junit4]   2>   "type":"NRT",
   [junit4]   2>   "waitForFinalState":"false"} 
   [junit4]   2> 3606719 INFO  (OverseerStateUpdate-99323600583852037-127.0.0.1:60937_solr-n_0000000000) [n:127.0.0.1:60937_solr    ] o.a.s.c.o.SliceMutator createReplica() {
   [junit4]   2>   "operation":"ADDREPLICA",
   [junit4]   2>   "collection":"myalias_2017-10-23",
   [junit4]   2>   "shard":"shard1",
   [junit4]   2>   "core":"myalias_2017-10-23_shard1_replica_n2",
   [junit4]   2>   "state":"down",
   [junit4]   2>   "base_url":"http://127.0.0.1:60937/solr",
   [junit4]   2>   "type":"NRT",
   [junit4]   2>   "waitForFinalState":"false"} 
   [junit4]   2> 3606723 INFO  (OverseerStateUpdate-99323600583852037-127.0.0.1:60937_solr-n_0000000000) [n:127.0.0.1:60937_solr    ] o.a.s.c.o.SliceMutator createReplica() {
   [junit4]   2>   "operation":"ADDREPLICA",
   [junit4]   2>   "collection":"myalias_2017-10-23",
   [junit4]   2>   "shard":"shard2",
   [junit4]   2>   "core":"myalias_2017-10-23_shard2_replica_n4",
   [junit4]   2>   "state":"down",
   [junit4]   2>   "base_url":"http://127.0.0.1:60938/solr",
   [junit4]   2>   "type":"NRT",
   [junit4]   2>   "waitForFinalState":"false"} 
   [junit4]   2> 3606727 INFO  (OverseerStateUpdate-99323600583852037-127.0.0.1:60937_solr-n_0000000000) [n:127.0.0.1:60937_solr    ] o.a.s.c.o.SliceMutator createReplica() {
   [junit4]   2>   "operation":"ADDREPLICA",
   [junit4]   2>   "collection":"myalias_2017-10-23",
   [junit4]   2>   "shard":"shard2",
   [junit4]   2>   "core":"myalias_2017-10-23_shard2_replica_n6",
   [junit4]   2>   "state":"down",
   [junit4]   2>   "base_url":"http://127.0.0.1:60937/solr",
   [junit4]   2>   "type":"NRT",
   [junit4]   2>   "waitForFinalState":"false"} 
   [junit4]   2> 3606942 INFO  (qtp1273237479-33496) [n:127.0.0.1:60938_solr    ] o.a.s.h.a.CoreAdminOperation core create command qt=/admin/cores&collection.configName=timeConfig&newCollection=true&collection=myalias_2017-10-23&version=2&replicaType=NRT&coreNodeName=core_node3&property.timePartitionAliasName=myalias&name=myalias_2017-10-23_shard1_replica_n1&action=CREATE&numShards=2&shard=shard1&wt=javabin
   [junit4]   2> 3606943 INFO  (qtp1056688897-33490) [n:127.0.0.1:60937_solr    ] o.a.s.h.a.CoreAdminOperation core create command qt=/admin/cores&collection.configName=timeConfig&newCollection=true&collection=myalias_2017-10-23&version=2&replicaType=NRT&coreNodeName=core_node5&property.timePartitionAliasName=myalias&name=myalias_2017-10-23_shard1_replica_n2&action=CREATE&numShards=2&shard=shard1&wt=javabin
   [junit4]   2> 3606943 INFO  (qtp1056688897-33490) [n:127.0.0.1:60937_solr    ] o.a.s.c.TransientSolrCoreCacheDefault Allocating transient cache for 2147483647 transient cores
   [junit4]   2> 3606944 INFO  (qtp1273237479-33486) [n:127.0.0.1:60938_solr    ] o.a.s.h.a.CoreAdminOperation core create command qt=/admin/cores&collection.configName=timeConfig&newCollection=true&collection=myalias_2017-10-23&version=2&replicaType=NRT&coreNodeName=core_node7&property.timePartitionAliasName=myalias&name=myalias_2017-10-23_shard2_replica_n4&action=CREATE&numShards=2&shard=shard2&wt=javabin
   [junit4]   2> 3606944 INFO  (qtp1056688897-33491) [n:127.0.0.1:60937_solr    ] o.a.s.h.a.CoreAdminOperation core create command qt=/admin/cores&collection.configName=timeConfig&newCollection=true&collection=myalias_2017-10-23&version=2&replicaType=NRT&coreNodeName=core_node8&property.timePartitionAliasName=myalias&name=myalias_2017-10-23_shard2_replica_n6&action=CREATE&numShards=2&shard=shard2&wt=javabin
   [junit4]   2> 3607062 INFO  (zkCallback-8673-thread-2-processing-n:127.0.0.1:60937_solr) [n:127.0.0.1:60937_solr    ] o.a.s.c.c.ZkStateReader A cluster state change: [WatchedEvent state:SyncConnected type:NodeDataChanged path:/collections/myalias_2017-10-23/state.json] for collection [myalias_2017-10-23] has occurred - updating... (live nodes size: [2])
   [junit4]   2> 3607062 INFO  (zkCallback-8674-thread-2-processing-n:127.0.0.1:60938_solr) [n:127.0.0.1:60938_solr    ] o.a.s.c.c.ZkStateReader A cluster state change: [WatchedEvent state:SyncConnected type:NodeDataChanged path:/collections/myalias_2017-10-23/state.json] for collection [myalias_2017-10-23] has occurred - updating... (live nodes size: [2])
   [junit4]   2> 3607062 INFO  (zkCallback-8673-thread-1-processing-n:127.0.0.1:60937_solr) [n:127.0.0.1:60937_solr    ] o.a.s.c.c.ZkStateReader A cluster state change: [WatchedEvent state:SyncConnected type:NodeDataChanged path:/collections/myalias_2017-10-23/state.json] for collection [myalias_2017-10-23] has occurred - updating... (live nodes size: [2])
   [junit4]   2> 3607062 INFO  (zkCallback-8674-thread-1-processing-n:127.0.0.1:60938_solr) [n:127.0.0.1:60938_solr    ] o.a.s.c.c.ZkStateReader A cluster state change: [WatchedEvent state:SyncConnected type:NodeDataChanged path:/collections/myalias_2017-10-23/state.json] for collection [myalias_2017-10-23] has occurred - updating... (live nodes size: [2])
   [junit4]   2> 3607974 INFO  (qtp1056688897-33490) [n:127.0.0.1:60937_solr c:myalias_2017-10-23 s:shard1 r:core_node5 x:myalias_2017-10-23_shard1_replica_n2] o.a.s.c.RequestParams conf resource params.json loaded . version : 1 
   [junit4]   2> 3607974 INFO  (qtp1056688897-33490) [n:127.0.0.1:60937_solr c:myalias_2017-10-23 s:shard1 r:core_node5 x:myalias_2017-10-23_shard1_replica_n2] o.a.s.c.RequestParams request params refreshed to version 1
   [junit4]   2> 3607974 WARN  (qtp1056688897-33490) [n:127.0.0.1:60937_solr c:myalias_2017-10-23 s:shard1 r:core_node5 x:myalias_2017-10-23_shard1_replica_n2] o.a.s.c.SolrConfig Couldn't add files from /Users/jenkins/workspace/Lucene-Solr-master-MacOSX/solr/build/solr-core/test/J1/temp/solr.update.processor.TimeRoutedAliasUpdateProcessorTest_D97077C91C5E3F5E-001/tempDir-001/node2/myalias_2017-10-23_shard1_replica_n2/../../../../contrib/extraction/lib filtered by .*\.jar to classpath: /Users/jenkins/workspace/Lucene-Solr-master-MacOSX/solr/build/solr-core/test/J1/temp/solr.update.processor.TimeRoutedAliasUpdateProcessorTest_D97077C91C5E3F5E-001/tempDir-001/node2/myalias_2017-10-23_shard1_replica_n2/../../../../contrib/extraction/lib
   [junit4]   2> 3607975 WARN  (qtp1056688897-33490) [n:127.0.0.1:60937_solr c:myalias_2017-10-23 s:shard1 r:core_node5 x:myalias_2017-10-23_shard1_replica_n2] o.a.s.c.SolrConfig Couldn't add files from /Users/jenkins/workspace/Lucene-Solr-master-MacOSX/solr/build/solr-core/test/J1/temp/solr.update.processor.TimeRoutedAliasUpdateProcessorTest_D97077C91C5E3F5E-001/tempDir-001/node2/myalias_2017-10-23_shard1_replica_n2/../../../../dist filtered by solr-cell-\d.*\.jar to classpath: /Users/jenkins/workspace/Lucene-Solr-master-MacOSX/solr/build/solr-core/test/J1/temp/solr.update.processor.TimeRoutedAliasUpdateProcessorTest_D97077C91C5E3F5E-001/tempDir-001/node2/myalias_2017-10-23_shard1_replica_n2/../../../../dist
   [junit4]   2> 3607975 WARN  (qtp1056688897-33490) [n:127.0.0.1:60937_solr c:myalias_2017-10-23 s:shard1 r:core_node5 x:myalias_2017-10-23_shard1_replica_n2] o.a.s.c.SolrConfig Couldn't add files from /Users/jenkins/workspace/Lucene-Solr-master-MacOSX/solr/build/solr-core/test/J1/temp/solr.update.processor.TimeRoutedAliasUpdateProcessorTest_D97077C91C5E3F5E-001/tempDir-001/node2/myalias_2017-10-23_shard1_replica_n2/../../../../contrib/clustering/lib filtered by .*\.jar to classpath: /Users/jenkins/workspace/Lucene-Solr-master-MacOSX/solr/build/solr-core/test/J1/temp/solr.update.processor.TimeRoutedAliasUpdateProcessorTest_D97077C91C5E3F5E-001/tempDir-001/node2/myalias_2017-10-23_shard1_replica_n2/../../../../contrib/clustering/lib
   [junit4]   2> 3607975 WARN  (qtp1056688897-33490) [n:127.0.0.1:60937_solr c:myalias_2017-10-23 s:shard1 r:core_node5 x:myalias_2017-10-23_shard1_replica_n2] o.a.s.c.SolrConfig Couldn't add files from /Users/jenkins/workspace/Lucene-Solr-master-MacOSX/solr/build/solr-core/test/J1/temp/solr.update.processor.TimeRoutedAliasUpdateProcessorTest_D97077C91C5E3F5E-001/tempDir-001/node2/myalias_2017-10-23_shard1_replica_n2/../../../../dist filtered by solr-clustering-\d.*\.jar to classpath: /Users/jenkins/workspace/Lucene-Solr-master-MacOSX/solr/build/solr-core/test/J1/temp/solr.update.processor.TimeRoutedAliasUpdateProcessorTest_D97077C91C5E3F5E-001/tempDir-001/node2/myalias_2017-10-23_shard1_replica_n2/../../../../dist
   [junit4]   2> 3607975 WARN  (qtp1056688897-33490) [n:127.0.0.1:60937_solr c:myalias_2017-10-23 s:shard1 r:core_node5 x:myalias_2017-10-23_shard1_replica_n2] o.a.s.c.SolrConfig Couldn't add files from /Users/jenkins/workspace/Lucene-Solr-master-MacOSX/solr/build/solr-core/test/J1/temp/solr.update.processor.TimeRoutedAliasUpdateProcessorTest_D97077C91C5E3F5E-001/tempDir-001/node2/myalias_2017-10-23_shard1_replica_n2/../../../../contrib/langid/lib filtered by .*\.jar to classpath: /Users/jenkins/workspace/Lucene-Solr-master-MacOSX/solr/build/solr-core/test/J1/temp/solr.update.processor.TimeRoutedAliasUpdateProcessorTest_D97077C91C5E3F5E-001/tempDir-001/node2/myalias_2017-10-23_shard1_replica_n2/../../../../contrib/langid/lib
   [junit4]   2> 3607976 WARN  (qtp1056688897-33490) [n:127.0.0.1:60937_solr c:myalias_2017-10-23 s:shard1 r:core_node5 x:myalias_2017-10-23_shard1_replica_n2] o.a.s.c.SolrConfig Couldn't add files from /Users/jenkins/workspace/Lucene-Solr-master-MacOSX/solr/build/solr-core/test/J1/temp/solr.update.processor.TimeRoutedAliasUpdateProcessorTest_D97077C91C5E3F5E-001/tempDir-001/node2/myalias_2017-10-23_shard1_replica_n2/../../../../dist filtered by solr-langid-\d.*\.jar to classpath: /Users/jenkins/workspace/Lucene-Solr-master-MacOSX/solr/build/solr-core/test/J1/temp/solr.update.processor.TimeRoutedAliasUpdateProcessorTest_D97077C91C5E3F5E-001/tempDir-001/node2/myalias_2017-10-23_shard1_replica_n2/../

[...truncated too long message...]

 3622663 ERROR (SUITE-TimeRoutedAliasUpdateProcessorTest-seed#[D97077C91C5E3F5E]-worker) [    ] o.a.z.s.ZooKeeperServer ZKShutdownHandler is not registered, so ZooKeeper server won't take any action on ERROR or SHUTDOWN server state changes
   [junit4]   2> 3622663 INFO  (SUITE-TimeRoutedAliasUpdateProcessorTest-seed#[D97077C91C5E3F5E]-worker) [    ] o.a.s.c.ZkTestServer connecting to 127.0.0.1:60935 60935
   [junit4]   2> 3622679 INFO  (Thread-5256) [    ] o.a.s.c.ZkTestServer connecting to 127.0.0.1:60935 60935
   [junit4]   2> 3623019 WARN  (Thread-5256) [    ] o.a.s.c.ZkTestServer Watch limit violations: 
   [junit4]   2> Maximum concurrent create/delete watches above limit:
   [junit4]   2> 
   [junit4]   2> 	9	/solr/configs/timeConfig/managed-schema
   [junit4]   2> 	6	/solr/configs/timeConfig
   [junit4]   2> 	3	/solr/clusterprops.json
   [junit4]   2> 	3	/solr/aliases.json
   [junit4]   2> 	2	/solr/security.json
   [junit4]   2> 
   [junit4]   2> Maximum concurrent data watches above limit:
   [junit4]   2> 
   [junit4]   2> 	14	/solr/collections/myalias_2017-10-23/state.json
   [junit4]   2> 	5	/solr/collections/myalias_2017-10-24/state.json
   [junit4]   2> 	5	/solr/collections/myalias_2017-10-25/state.json
   [junit4]   2> 	5	/solr/collections/myalias_2017-10-26/state.json
   [junit4]   2> 	5	/solr/collections/timeConfig/state.json
   [junit4]   2> 	3	/solr/clusterstate.json
   [junit4]   2> 
   [junit4]   2> Maximum concurrent children watches above limit:
   [junit4]   2> 
   [junit4]   2> 	3	/solr/live_nodes
   [junit4]   2> 	3	/solr/collections
   [junit4]   2> 
   [junit4]   2> NOTE: leaving temporary files on disk at: /Users/jenkins/workspace/Lucene-Solr-master-MacOSX/solr/build/solr-core/test/J1/temp/solr.update.processor.TimeRoutedAliasUpdateProcessorTest_D97077C91C5E3F5E-001
   [junit4]   2> Jan 10, 2018 4:18:11 AM com.carrotsearch.randomizedtesting.ThreadLeakControl checkThreadLeaks
   [junit4]   2> WARNING: Will linger awaiting termination of 1 leaked thread(s).
   [junit4]   2> NOTE: test params are: codec=Asserting(Lucene70): {}, docValues:{}, maxPointsInLeafNode=1397, maxMBSortInHeap=6.653627264708519, sim=Asserting(org.apache.lucene.search.similarities.AssertingSimilarity@215a417f), locale=sah, timezone=US/Hawaii
   [junit4]   2> NOTE: Mac OS X 10.11.6 x86_64/Oracle Corporation 9 (64-bit)/cpus=3,threads=1,free=385111504,total=536870912
   [junit4]   2> NOTE: All tests run in this JVM: [LargeFieldTest, HdfsCollectionsAPIDistributedZkTest, TestStandardQParsers, TestJettySolrRunner, AtomicUpdatesTest, ConnectionManagerTest, DocValuesNotIndexedTest, BlockDirectoryTest, LeaderInitiatedRecoveryOnShardRestartTest, TestReloadAndDeleteDocs, DebugComponentTest, NodeAddedTriggerTest, TestSearchPerf, SoftAutoCommitTest, TestStreamBody, HighlighterMaxOffsetTest, SmileWriterTest, QueryElevationComponentTest, TestExceedMaxTermLength, TestCustomDocTransformer, DistributedSuggestComponentTest, AnalysisAfterCoreReloadTest, RegexBytesRefFilterTest, TestQueryUtils, TestSolrDeletionPolicy1, OverriddenZkACLAndCredentialsProvidersTest, TestIndexSearcher, DistributedFacetExistsSmallTest, TestPerFieldSimilarityWithDefaultOverride, TestRestManager, TestSolrXml, TestConfigSetsAPI, HdfsChaosMonkeyNothingIsSafeTest, TestDistributedGrouping, TestJsonFacetRefinement, DistributedDebugComponentTest, SpellPossibilityIteratorTest, TestCustomSort, TestSort, DeleteStatusTest, TestDelegationWithHadoopAuth, BasicAuthStandaloneTest, ChaosMonkeyNothingIsSafeWithPullReplicasTest, ClassificationUpdateProcessorIntegrationTest, TestAddFieldRealTimeGet, SolrCoreCheckLockOnStartupTest, TestInitParams, SecurityConfHandlerTest, SolrCloudReportersTest, NodeMutatorTest, TestComplexPhraseLeadingWildcard, TermVectorComponentTest, TestHashQParserPlugin, FullSolrCloudDistribCmdsTest, TestPointFields, SOLR749Test, OverseerModifyCollectionTest, DocValuesMultiTest, SolrMetricManagerTest, SearchHandlerTest, LeaderFailureAfterFreshStartTest, TestPayloadCheckQParserPlugin, SuggestComponentContextFilterQueryTest, TestLocalFSCloudBackupRestore, TestFieldCacheSortRandom, TestChildDocTransformer, HealthCheckHandlerTest, CollectionsAPIDistributedZkTest, TestLeaderElectionZkExpiry, TestManagedSchemaAPI, PingRequestHandlerTest, TestComponentsName, TestElisionMultitermQuery, TestSearcherReuse, TestGroupingSearch, StressHdfsTest, TestTrieFacet, TestCloudSchemaless, TestBadConfig, MigrateRouteKeyTest, HdfsBasicDistributedZk2Test, TestTolerantUpdateProcessorRandomCloud, TestMultiValuedNumericRangeQuery, TestSQLHandler, TestSystemCollAutoCreate, TestSchemaVersionResource, PeerSyncReplicationTest, EnumFieldTest, TestNoOpRegenerator, SolrMetricsIntegrationTest, TestSystemIdResolver, VMParamsZkACLAndCredentialsProvidersTest, JsonLoaderTest, StatsReloadRaceTest, TestDistributedStatsComponentCardinality, TestFieldCacheReopen, TestSolrConfigHandlerCloud, TestFieldResource, TestConfigSets, FileBasedSpellCheckerTest, TestRetrieveFieldsOptimizer, TestPolicyCloud, TestLRUCache, TestMergePolicyConfig, PluginInfoTest, TestQueryTypes, TestFileDictionaryLookup, TestConfigSetImmutable, TestReplicaProperties, CustomCollectionTest, TestCloudSearcherWarming, AliasIntegrationTest, TestTlogReplica, AnalyticsQueryTest, MetricUtilsTest, V2StandaloneTest, ExternalFileFieldSortTest, SolrJmxReporterTest, SchemaVersionSpecificBehaviorTest, DOMUtilTest, UUIDUpdateProcessorFallbackTest, CacheHeaderTest, UtilsToolTest, PreAnalyzedUpdateProcessorTest, TestCollectionAPIs, BasicDistributedZk2Test, TestGeoJSONResponseWriter, ShardRoutingCustomTest, ChangedSchemaMergeTest, ZkStateReaderTest, TestCloudJSONFacetJoinDomain, TestValueSourceCache, TestHdfsCloudBackupRestore, TestSolrCoreSnapshots, HttpTriggerListenerTest, TestLRUStatsCache, TestRecoveryHdfs, TestPerFieldSimilarity, TestConfig, SimpleFacetsTest, HdfsDirectoryFactoryTest, TestLMJelinekMercerSimilarityFactory, TestSimpleTrackingShardHandler, TestCopyFieldCollectionResource, DistributedFacetPivotSmallTest, SolrPluginUtilsTest, PeerSyncTest, FullHLLTest, TestNodeAddedTrigger, RulesTest, TestStressInPlaceUpdates, ConjunctionSolrSpellCheckerTest, TestTrackingShardHandlerFactory, BlockJoinFacetSimpleTest, RankQueryTest, ShufflingReplicaListTransformerTest, SaslZkACLProviderTest, CloneFieldUpdateProcessorFactoryTest, TestRuleBasedAuthorizationPlugin, EchoParamsTest, TestLegacyField, RemoteQueryErrorTest, AddSchemaFieldsUpdateProcessorFactoryTest, TestFieldCacheWithThreads, PreAnalyzedFieldTest, TestDistributedMissingSort, ZkNodePropsTest, HdfsUnloadDistributedZkTest, IgnoreCommitOptimizeUpdateProcessorFactoryTest, TestFoldingMultitermQuery, TestClusterStateProvider, QueryEqualityTest, ChaosMonkeySafeLeaderTest, TestReqParamsAPI, TestBulkSchemaConcurrent, RollingRestartTest, TestImplicitCoreProperties, TestHalfAndHalfDocValues, TestNumericRangeQuery64, TestMinMaxOnMultiValuedField, CoreAdminHandlerTest, ConfigureRecoveryStrategyTest, ExecutePlanActionTest, TestMissingGroups, TestCoreAdminApis, TestCollectionAPI, TestFieldTypeResource, TestBM25SimilarityFactory, BasicDistributedZkTest, CloudExitableDirectoryReaderTest, CollectionTooManyReplicasTest, ConcurrentDeleteAndCreateCollectionTest, ConfigSetsAPITest, DeleteInactiveReplicaTest, DeleteLastCustomShardedReplicaTest, DeleteNodeTest, DeleteShardTest, DistribDocExpirationUpdateProcessorTest, HttpPartitionTest, MultiThreadedOCPTest, ReplicationFactorTest, ShardSplitTest, TestRandomFlRTGCloud, TestRandomRequestDistribution, TestRequestForwarding, TestRequestStatusCollectionAPI, TestSSLRandomization, TestSegmentSorting, TestSkipOverseerOperations, TestSolrCloudWithDelegationTokens, TestSolrCloudWithKerberosAlt, TestSolrCloudWithSecureImpersonation, TestTolerantUpdateProcessorCloud, AutoAddReplicasIntegrationTest, TestPolicyCloud, TestDistribStateManager, TestExecutePlanAction, TestGenericDistributedQueue, TestNodeLostTrigger, TestTriggerIntegration, BaseCdcrDistributedZkTest, CdcrBidirectionalTest, CdcrReplicationDistributedZkTest, CdcrRequestHandlerTest, CdcrVersionReplicationTest, HdfsBasicDistributedZkTest, HdfsChaosMonkeySafeLeaderTest, HdfsNNFailoverTest, HdfsRecoverLeaseTest, HdfsRecoveryZkTest, HdfsRestartWhileUpdatingTest, HdfsThreadLeakTest, HdfsTlogReplayBufferedWhileIndexingTest, ZkStateWriterTest, ImplicitSnitchTest, RuleEngineTest, CachingDirectoryFactoryTest, DirectoryFactoryTest, ExitableDirectoryReaderTest, TestBackupRepositoryFactory, TestConfigOverlay, TestCorePropertiesReload, TestCustomStream, TestDynamicLoading, TestHdfsBackupRestoreCore, TestReplicationHandlerBackup, InfoHandlerTest, MetricsHandlerTest, DistributedFacetPivotLongTailTest, DistributedQueryComponentCustomSortTest, FacetPivotSmallTest, InfixSuggestersTest, TestHttpShardHandlerFactory, TestSlowCompositeReaderWrapper, UninvertDocValuesMergePolicyTest, WrapperMergePolicyFactoryTest, TestLegacyNumericUtils, TestLegacyTerms, JvmMetricsTest, MetricsConfigTest, SolrCoreMetricManagerTest, SolrGraphiteReporterTest, SubstringBytesRefFilterTest, TestIntervalFaceting, TestDynamicFieldResource, TestUniqueKeyFieldResource, TestManagedSynonymFilterFactory, DocValuesMissingTest, PreAnalyzedFieldManagedSchemaCloudTest, TestCloudManagedSchema, TestReRankQParserPlugin, TestReloadDeadlock, TestSimpleQParserPlugin, TestSmileRequest, TestSolrCoreParser, TestStressUserVersions, TestXmlQParser, TestXmlQParserPlugin, DistributedFacetSimpleRefinementLongTailTest, TestOrdValues, TestSortByMinMaxFunction, BlockJoinFacetDistribTest, TestScoreJoinQPNoScore, TestJsonRequest, CloudMLTQParserTest, TestExactSharedStatsCache, TestAuthorizationFramework, TestUninvertingReader, AnalysisErrorHandlingTest, SolrIndexMetricsTest, UpdateLogTest, VersionInfoTest, AtomicUpdateProcessorFactoryTest, DocExpirationUpdateProcessorFactoryTest, ParsingFieldUpdateProcessorsTest, TemplateUpdateProcessorTest, TimeRoutedAliasUpdateProcessorTest]
   [junit4] Completed [756/767 (1!)] on J1 in 21.99s, 2 tests, 1 error <<< FAILURES!

[...truncated 40824 lines...]

Mime
View raw message