lucene-dev mailing list archives

Site index · List index
Message view « Date » · « Thread »
Top « Date » · « Thread »
From Apache Jenkins Server <jenk...@builds.apache.org>
Subject [JENKINS] Lucene-Solr-Tests-master - Build # 2252 - Still Unstable
Date Wed, 10 Jan 2018 07:13:36 GMT
Build: https://builds.apache.org/job/Lucene-Solr-Tests-master/2252/

1 tests failed.
FAILED:  org.apache.solr.update.processor.TimeRoutedAliasUpdateProcessorTest.testParse

Error Message:
Error from server at https://127.0.0.1:36154/solr: Collection : myalias_2017-10-24 is part of alias myalias remove or modify the alias before removing this collection.

Stack Trace:
org.apache.solr.client.solrj.impl.HttpSolrClient$RemoteSolrException: Error from server at https://127.0.0.1:36154/solr: Collection : myalias_2017-10-24 is part of alias myalias remove or modify the alias before removing this collection.
	at __randomizedtesting.SeedInfo.seed([DF868EAC660D298E:B003C5F4DA7B1A61]:0)
	at org.apache.solr.client.solrj.impl.HttpSolrClient.executeMethod(HttpSolrClient.java:643)
	at org.apache.solr.client.solrj.impl.HttpSolrClient.request(HttpSolrClient.java:255)
	at org.apache.solr.client.solrj.impl.HttpSolrClient.request(HttpSolrClient.java:244)
	at org.apache.solr.client.solrj.impl.LBHttpSolrClient.doRequest(LBHttpSolrClient.java:483)
	at org.apache.solr.client.solrj.impl.LBHttpSolrClient.request(LBHttpSolrClient.java:413)
	at org.apache.solr.client.solrj.impl.CloudSolrClient.sendRequest(CloudSolrClient.java:1104)
	at org.apache.solr.client.solrj.impl.CloudSolrClient.requestWithRetryOnStaleState(CloudSolrClient.java:884)
	at org.apache.solr.client.solrj.impl.CloudSolrClient.request(CloudSolrClient.java:817)
	at org.apache.solr.client.solrj.SolrRequest.process(SolrRequest.java:194)
	at org.apache.solr.client.solrj.SolrRequest.process(SolrRequest.java:211)
	at org.apache.solr.update.processor.TimeRoutedAliasUpdateProcessorTest.doBefore(TimeRoutedAliasUpdateProcessorTest.java:84)
	at sun.reflect.NativeMethodAccessorImpl.invoke0(Native Method)
	at sun.reflect.NativeMethodAccessorImpl.invoke(NativeMethodAccessorImpl.java:62)
	at sun.reflect.DelegatingMethodAccessorImpl.invoke(DelegatingMethodAccessorImpl.java:43)
	at java.lang.reflect.Method.invoke(Method.java:498)
	at com.carrotsearch.randomizedtesting.RandomizedRunner.invoke(RandomizedRunner.java:1737)
	at com.carrotsearch.randomizedtesting.RandomizedRunner$9.evaluate(RandomizedRunner.java:968)
	at com.carrotsearch.randomizedtesting.RandomizedRunner$10.evaluate(RandomizedRunner.java:984)
	at com.carrotsearch.randomizedtesting.rules.SystemPropertiesRestoreRule$1.evaluate(SystemPropertiesRestoreRule.java:57)
	at org.apache.lucene.util.TestRuleSetupTeardownChained$1.evaluate(TestRuleSetupTeardownChained.java:49)
	at org.apache.lucene.util.AbstractBeforeAfterRule$1.evaluate(AbstractBeforeAfterRule.java:45)
	at org.apache.lucene.util.TestRuleThreadAndTestName$1.evaluate(TestRuleThreadAndTestName.java:48)
	at org.apache.lucene.util.TestRuleIgnoreAfterMaxFailures$1.evaluate(TestRuleIgnoreAfterMaxFailures.java:64)
	at org.apache.lucene.util.TestRuleMarkFailure$1.evaluate(TestRuleMarkFailure.java:47)
	at com.carrotsearch.randomizedtesting.rules.StatementAdapter.evaluate(StatementAdapter.java:36)
	at com.carrotsearch.randomizedtesting.ThreadLeakControl$StatementRunner.run(ThreadLeakControl.java:368)
	at com.carrotsearch.randomizedtesting.ThreadLeakControl.forkTimeoutingTask(ThreadLeakControl.java:817)
	at com.carrotsearch.randomizedtesting.ThreadLeakControl$3.evaluate(ThreadLeakControl.java:468)
	at com.carrotsearch.randomizedtesting.RandomizedRunner.runSingleTest(RandomizedRunner.java:943)
	at com.carrotsearch.randomizedtesting.RandomizedRunner$5.evaluate(RandomizedRunner.java:829)
	at com.carrotsearch.randomizedtesting.RandomizedRunner$6.evaluate(RandomizedRunner.java:879)
	at com.carrotsearch.randomizedtesting.RandomizedRunner$7.evaluate(RandomizedRunner.java:890)
	at com.carrotsearch.randomizedtesting.rules.StatementAdapter.evaluate(StatementAdapter.java:36)
	at com.carrotsearch.randomizedtesting.rules.SystemPropertiesRestoreRule$1.evaluate(SystemPropertiesRestoreRule.java:57)
	at org.apache.lucene.util.AbstractBeforeAfterRule$1.evaluate(AbstractBeforeAfterRule.java:45)
	at com.carrotsearch.randomizedtesting.rules.StatementAdapter.evaluate(StatementAdapter.java:36)
	at org.apache.lucene.util.TestRuleStoreClassName$1.evaluate(TestRuleStoreClassName.java:41)
	at com.carrotsearch.randomizedtesting.rules.NoShadowingOrOverridesOnMethodsRule$1.evaluate(NoShadowingOrOverridesOnMethodsRule.java:40)
	at com.carrotsearch.randomizedtesting.rules.NoShadowingOrOverridesOnMethodsRule$1.evaluate(NoShadowingOrOverridesOnMethodsRule.java:40)
	at com.carrotsearch.randomizedtesting.rules.StatementAdapter.evaluate(StatementAdapter.java:36)
	at com.carrotsearch.randomizedtesting.rules.StatementAdapter.evaluate(StatementAdapter.java:36)
	at com.carrotsearch.randomizedtesting.rules.StatementAdapter.evaluate(StatementAdapter.java:36)
	at org.apache.lucene.util.TestRuleAssertionsRequired$1.evaluate(TestRuleAssertionsRequired.java:53)
	at org.apache.lucene.util.TestRuleMarkFailure$1.evaluate(TestRuleMarkFailure.java:47)
	at org.apache.lucene.util.TestRuleIgnoreAfterMaxFailures$1.evaluate(TestRuleIgnoreAfterMaxFailures.java:64)
	at org.apache.lucene.util.TestRuleIgnoreTestSuites$1.evaluate(TestRuleIgnoreTestSuites.java:54)
	at com.carrotsearch.randomizedtesting.rules.StatementAdapter.evaluate(StatementAdapter.java:36)
	at com.carrotsearch.randomizedtesting.ThreadLeakControl$StatementRunner.run(ThreadLeakControl.java:368)
	at java.lang.Thread.run(Thread.java:748)




Build Log:
[...truncated 12411 lines...]
   [junit4] Suite: org.apache.solr.update.processor.TimeRoutedAliasUpdateProcessorTest
   [junit4]   2> Creating dataDir: /home/jenkins/jenkins-slave/workspace/Lucene-Solr-Tests-master/solr/build/solr-core/test/J0/temp/solr.update.processor.TimeRoutedAliasUpdateProcessorTest_DF868EAC660D298E-001/init-core-data-001
   [junit4]   2> 1504130 WARN  (SUITE-TimeRoutedAliasUpdateProcessorTest-seed#[DF868EAC660D298E]-worker) [    ] o.a.s.SolrTestCaseJ4 startTrackingSearchers: numOpens=1 numCloses=1
   [junit4]   2> 1504130 INFO  (SUITE-TimeRoutedAliasUpdateProcessorTest-seed#[DF868EAC660D298E]-worker) [    ] o.a.s.SolrTestCaseJ4 Using PointFields (NUMERIC_POINTS_SYSPROP=true) w/NUMERIC_DOCVALUES_SYSPROP=true
   [junit4]   2> 1504132 INFO  (SUITE-TimeRoutedAliasUpdateProcessorTest-seed#[DF868EAC660D298E]-worker) [    ] o.a.s.SolrTestCaseJ4 Randomized ssl (true) and clientAuth (false) via: @org.apache.solr.util.RandomizeSSL(reason=, ssl=NaN, value=NaN, clientAuth=NaN)
   [junit4]   2> 1504132 INFO  (SUITE-TimeRoutedAliasUpdateProcessorTest-seed#[DF868EAC660D298E]-worker) [    ] o.a.s.SolrTestCaseJ4 SecureRandom sanity checks: test.solr.allowed.securerandom=null & java.security.egd=file:/dev/./urandom
   [junit4]   2> 1504132 INFO  (SUITE-TimeRoutedAliasUpdateProcessorTest-seed#[DF868EAC660D298E]-worker) [    ] o.a.s.c.MiniSolrCloudCluster Starting cluster of 2 servers in /home/jenkins/jenkins-slave/workspace/Lucene-Solr-Tests-master/solr/build/solr-core/test/J0/temp/solr.update.processor.TimeRoutedAliasUpdateProcessorTest_DF868EAC660D298E-001/tempDir-001
   [junit4]   2> 1504132 INFO  (SUITE-TimeRoutedAliasUpdateProcessorTest-seed#[DF868EAC660D298E]-worker) [    ] o.a.s.c.ZkTestServer STARTING ZK TEST SERVER
   [junit4]   2> 1504132 INFO  (Thread-4105) [    ] o.a.s.c.ZkTestServer client port:0.0.0.0/0.0.0.0:0
   [junit4]   2> 1504132 INFO  (Thread-4105) [    ] o.a.s.c.ZkTestServer Starting server
   [junit4]   2> 1504147 ERROR (Thread-4105) [    ] o.a.z.s.ZooKeeperServer ZKShutdownHandler is not registered, so ZooKeeper server won't take any action on ERROR or SHUTDOWN server state changes
   [junit4]   2> 1504232 INFO  (SUITE-TimeRoutedAliasUpdateProcessorTest-seed#[DF868EAC660D298E]-worker) [    ] o.a.s.c.ZkTestServer start zk server on port:39218
   [junit4]   2> 1504236 INFO  (zkConnectionManagerCallback-1295-thread-1) [    ] o.a.s.c.c.ConnectionManager zkClient has connected
   [junit4]   2> 1504249 INFO  (jetty-launcher-1292-thread-1) [    ] o.e.j.s.Server jetty-9.3.20.v20170531
   [junit4]   2> 1504256 INFO  (jetty-launcher-1292-thread-1) [    ] o.e.j.s.h.ContextHandler Started o.e.j.s.ServletContextHandler@26aa2fdc{/solr,null,AVAILABLE}
   [junit4]   2> 1504263 INFO  (jetty-launcher-1292-thread-1) [    ] o.e.j.s.AbstractConnector Started ServerConnector@62f7c9ee{SSL,[ssl, http/1.1]}{127.0.0.1:37758}
   [junit4]   2> 1504263 INFO  (jetty-launcher-1292-thread-1) [    ] o.e.j.s.Server Started @1514065ms
   [junit4]   2> 1504263 INFO  (jetty-launcher-1292-thread-1) [    ] o.a.s.c.s.e.JettySolrRunner Jetty properties: {hostContext=/solr, hostPort=37758}
   [junit4]   2> 1504263 ERROR (jetty-launcher-1292-thread-1) [    ] o.a.s.u.StartupLoggingUtils Missing Java Option solr.log.dir. Logging may be missing or incomplete.
   [junit4]   2> 1504264 INFO  (jetty-launcher-1292-thread-1) [    ] o.a.s.s.SolrDispatchFilter  ___      _       Welcome to Apache Solr? version 8.0.0
   [junit4]   2> 1504264 INFO  (jetty-launcher-1292-thread-1) [    ] o.a.s.s.SolrDispatchFilter / __| ___| |_ _   Starting in cloud mode on port null
   [junit4]   2> 1504264 INFO  (jetty-launcher-1292-thread-1) [    ] o.a.s.s.SolrDispatchFilter \__ \/ _ \ | '_|  Install dir: null
   [junit4]   2> 1504264 INFO  (jetty-launcher-1292-thread-1) [    ] o.a.s.s.SolrDispatchFilter |___/\___/_|_|    Start time: 2018-01-10T05:45:31.001Z
   [junit4]   2> 1504266 INFO  (jetty-launcher-1292-thread-2) [    ] o.e.j.s.Server jetty-9.3.20.v20170531
   [junit4]   2> 1504268 INFO  (jetty-launcher-1292-thread-2) [    ] o.e.j.s.h.ContextHandler Started o.e.j.s.ServletContextHandler@15ea0a01{/solr,null,AVAILABLE}
   [junit4]   2> 1504268 INFO  (zkConnectionManagerCallback-1297-thread-1) [    ] o.a.s.c.c.ConnectionManager zkClient has connected
   [junit4]   2> 1504269 INFO  (jetty-launcher-1292-thread-1) [    ] o.a.s.s.SolrDispatchFilter solr.xml found in ZooKeeper. Loading...
   [junit4]   2> 1504269 INFO  (jetty-launcher-1292-thread-2) [    ] o.e.j.s.AbstractConnector Started ServerConnector@21ca7b83{SSL,[ssl, http/1.1]}{127.0.0.1:36154}
   [junit4]   2> 1504269 INFO  (jetty-launcher-1292-thread-2) [    ] o.e.j.s.Server Started @1514071ms
   [junit4]   2> 1504269 INFO  (jetty-launcher-1292-thread-2) [    ] o.a.s.c.s.e.JettySolrRunner Jetty properties: {hostContext=/solr, hostPort=36154}
   [junit4]   2> 1504269 ERROR (jetty-launcher-1292-thread-2) [    ] o.a.s.u.StartupLoggingUtils Missing Java Option solr.log.dir. Logging may be missing or incomplete.
   [junit4]   2> 1504269 INFO  (jetty-launcher-1292-thread-2) [    ] o.a.s.s.SolrDispatchFilter  ___      _       Welcome to Apache Solr? version 8.0.0
   [junit4]   2> 1504269 INFO  (jetty-launcher-1292-thread-2) [    ] o.a.s.s.SolrDispatchFilter / __| ___| |_ _   Starting in cloud mode on port null
   [junit4]   2> 1504269 INFO  (jetty-launcher-1292-thread-2) [    ] o.a.s.s.SolrDispatchFilter \__ \/ _ \ | '_|  Install dir: null
   [junit4]   2> 1504269 INFO  (jetty-launcher-1292-thread-2) [    ] o.a.s.s.SolrDispatchFilter |___/\___/_|_|    Start time: 2018-01-10T05:45:31.006Z
   [junit4]   2> 1504273 INFO  (zkConnectionManagerCallback-1299-thread-1) [    ] o.a.s.c.c.ConnectionManager zkClient has connected
   [junit4]   2> 1504274 INFO  (jetty-launcher-1292-thread-2) [    ] o.a.s.s.SolrDispatchFilter solr.xml found in ZooKeeper. Loading...
   [junit4]   2> 1504281 INFO  (jetty-launcher-1292-thread-1) [    ] o.a.s.c.ZkContainer Zookeeper client=127.0.0.1:39218/solr
   [junit4]   2> 1504283 INFO  (jetty-launcher-1292-thread-2) [    ] o.a.s.c.ZkContainer Zookeeper client=127.0.0.1:39218/solr
   [junit4]   2> 1504302 INFO  (zkConnectionManagerCallback-1307-thread-1) [    ] o.a.s.c.c.ConnectionManager zkClient has connected
   [junit4]   2> 1504304 INFO  (zkConnectionManagerCallback-1303-thread-1) [    ] o.a.s.c.c.ConnectionManager zkClient has connected
   [junit4]   2> 1504308 INFO  (zkConnectionManagerCallback-1309-thread-1-processing-n:127.0.0.1:36154_solr) [n:127.0.0.1:36154_solr    ] o.a.s.c.c.ConnectionManager zkClient has connected
   [junit4]   2> 1504310 INFO  (zkConnectionManagerCallback-1311-thread-1-processing-n:127.0.0.1:37758_solr) [n:127.0.0.1:37758_solr    ] o.a.s.c.c.ConnectionManager zkClient has connected
   [junit4]   2> 1504447 INFO  (jetty-launcher-1292-thread-1) [n:127.0.0.1:37758_solr    ] o.a.s.c.Overseer Overseer (id=null) closing
   [junit4]   2> 1504448 INFO  (jetty-launcher-1292-thread-1) [n:127.0.0.1:37758_solr    ] o.a.s.c.OverseerElectionContext I am going to be the leader 127.0.0.1:37758_solr
   [junit4]   2> 1504449 INFO  (jetty-launcher-1292-thread-1) [n:127.0.0.1:37758_solr    ] o.a.s.c.Overseer Overseer (id=99323945344696326-127.0.0.1:37758_solr-n_0000000000) starting
   [junit4]   2> 1504492 INFO  (jetty-launcher-1292-thread-1) [n:127.0.0.1:37758_solr    ] o.a.s.c.ZkController Register node as live in ZooKeeper:/live_nodes/127.0.0.1:37758_solr
   [junit4]   2> 1504501 INFO  (jetty-launcher-1292-thread-2) [n:127.0.0.1:36154_solr    ] o.a.s.c.c.ZkStateReader Updated live nodes from ZooKeeper... (0) -> (1)
   [junit4]   2> 1504502 INFO  (zkCallback-1310-thread-1-processing-n:127.0.0.1:37758_solr) [n:127.0.0.1:37758_solr    ] o.a.s.c.c.ZkStateReader Updated live nodes from ZooKeeper... (0) -> (1)
   [junit4]   2> 1504503 INFO  (jetty-launcher-1292-thread-2) [n:127.0.0.1:36154_solr    ] o.a.s.c.Overseer Overseer (id=null) closing
   [junit4]   2> 1504504 INFO  (jetty-launcher-1292-thread-2) [n:127.0.0.1:36154_solr    ] o.a.s.c.ZkController Register node as live in ZooKeeper:/live_nodes/127.0.0.1:36154_solr
   [junit4]   2> 1504556 INFO  (zkCallback-1308-thread-1-processing-n:127.0.0.1:36154_solr) [n:127.0.0.1:36154_solr    ] o.a.s.c.c.ZkStateReader Updated live nodes from ZooKeeper... (1) -> (2)
   [junit4]   2> 1504570 INFO  (zkCallback-1310-thread-2-processing-n:127.0.0.1:37758_solr) [n:127.0.0.1:37758_solr    ] o.a.s.c.c.ZkStateReader Updated live nodes from ZooKeeper... (1) -> (2)
   [junit4]   2> 1504599 INFO  (jetty-launcher-1292-thread-2) [n:127.0.0.1:36154_solr    ] o.a.s.m.r.SolrJmxReporter JMX monitoring for 'solr_36154.solr.node' (registry 'solr.node') enabled at server: com.sun.jmx.mbeanserver.JmxMBeanServer@6390bd4e
   [junit4]   2> 1504617 INFO  (jetty-launcher-1292-thread-2) [n:127.0.0.1:36154_solr    ] o.a.s.m.r.SolrJmxReporter JMX monitoring for 'solr_36154.solr.jvm' (registry 'solr.jvm') enabled at server: com.sun.jmx.mbeanserver.JmxMBeanServer@6390bd4e
   [junit4]   2> 1504617 INFO  (jetty-launcher-1292-thread-2) [n:127.0.0.1:36154_solr    ] o.a.s.m.r.SolrJmxReporter JMX monitoring for 'solr_36154.solr.jetty' (registry 'solr.jetty') enabled at server: com.sun.jmx.mbeanserver.JmxMBeanServer@6390bd4e
   [junit4]   2> 1504618 INFO  (jetty-launcher-1292-thread-2) [n:127.0.0.1:36154_solr    ] o.a.s.c.CorePropertiesLocator Found 0 core definitions underneath /home/jenkins/jenkins-slave/workspace/Lucene-Solr-Tests-master/solr/build/solr-core/test/J0/temp/solr.update.processor.TimeRoutedAliasUpdateProcessorTest_DF868EAC660D298E-001/tempDir-001/node2/.
   [junit4]   2> 1504649 INFO  (jetty-launcher-1292-thread-1) [n:127.0.0.1:37758_solr    ] o.a.s.m.r.SolrJmxReporter JMX monitoring for 'solr_37758.solr.node' (registry 'solr.node') enabled at server: com.sun.jmx.mbeanserver.JmxMBeanServer@6390bd4e
   [junit4]   2> 1504655 INFO  (jetty-launcher-1292-thread-1) [n:127.0.0.1:37758_solr    ] o.a.s.m.r.SolrJmxReporter JMX monitoring for 'solr_37758.solr.jvm' (registry 'solr.jvm') enabled at server: com.sun.jmx.mbeanserver.JmxMBeanServer@6390bd4e
   [junit4]   2> 1504656 INFO  (jetty-launcher-1292-thread-1) [n:127.0.0.1:37758_solr    ] o.a.s.m.r.SolrJmxReporter JMX monitoring for 'solr_37758.solr.jetty' (registry 'solr.jetty') enabled at server: com.sun.jmx.mbeanserver.JmxMBeanServer@6390bd4e
   [junit4]   2> 1504657 INFO  (jetty-launcher-1292-thread-1) [n:127.0.0.1:37758_solr    ] o.a.s.c.CorePropertiesLocator Found 0 core definitions underneath /home/jenkins/jenkins-slave/workspace/Lucene-Solr-Tests-master/solr/build/solr-core/test/J0/temp/solr.update.processor.TimeRoutedAliasUpdateProcessorTest_DF868EAC660D298E-001/tempDir-001/node1/.
   [junit4]   2> 1504693 INFO  (zkConnectionManagerCallback-1317-thread-1) [    ] o.a.s.c.c.ConnectionManager zkClient has connected
   [junit4]   2> 1504713 INFO  (TEST-TimeRoutedAliasUpdateProcessorTest.test-seed#[DF868EAC660D298E]) [    ] o.a.s.SolrTestCaseJ4 ###Starting test
   [junit4]   2> 1504730 INFO  (zkConnectionManagerCallback-1322-thread-1) [    ] o.a.s.c.c.ConnectionManager zkClient has connected
   [junit4]   2> 1504731 INFO  (TEST-TimeRoutedAliasUpdateProcessorTest.test-seed#[DF868EAC660D298E]) [    ] o.a.s.c.c.ZkStateReader Updated live nodes from ZooKeeper... (0) -> (2)
   [junit4]   2> 1504732 INFO  (TEST-TimeRoutedAliasUpdateProcessorTest.test-seed#[DF868EAC660D298E]) [    ] o.a.s.c.s.i.ZkClientClusterStateProvider Cluster at 127.0.0.1:39218/solr ready
   [junit4]   2> 1504746 INFO  (qtp849971433-8762) [n:127.0.0.1:36154_solr    ] o.a.s.h.a.CollectionsHandler Invoked Collection Action :list with params action=LIST&wt=javabin&version=2 and sendToOCPQueue=true
   [junit4]   2> 1504746 INFO  (qtp849971433-8762) [n:127.0.0.1:36154_solr    ] o.a.s.s.HttpSolrCall [admin] webapp=null path=/admin/collections params={action=LIST&wt=javabin&version=2} status=0 QTime=1
   [junit4]   2> 1504747 INFO  (qtp849971433-8758) [n:127.0.0.1:36154_solr    ] o.a.s.h.a.CollectionsHandler Invoked Collection Action :create with params pullReplicas=0&replicationFactor=1&name=timeConfig&nrtReplicas=1&action=CREATE&numShards=1&tlogReplicas=0&wt=javabin&version=2 and sendToOCPQueue=true
   [junit4]   2> 1504758 INFO  (OverseerThreadFactory-2619-thread-1-processing-n:127.0.0.1:37758_solr) [n:127.0.0.1:37758_solr    ] o.a.s.c.CreateCollectionCmd Create collection timeConfig
   [junit4]   2> 1504758 INFO  (OverseerThreadFactory-2619-thread-1-processing-n:127.0.0.1:37758_solr) [n:127.0.0.1:37758_solr    ] o.a.s.c.CreateCollectionCmd Only _default config set found, using it.
   [junit4]   2> 1504759 INFO  (OverseerThreadFactory-2619-thread-1-processing-n:127.0.0.1:37758_solr) [n:127.0.0.1:37758_solr    ] o.a.s.c.c.ZkConfigManager Copying zk node /configs/_default/protwords.txt to /configs/timeConfig/protwords.txt
   [junit4]   2> 1504761 INFO  (OverseerThreadFactory-2619-thread-1-processing-n:127.0.0.1:37758_solr) [n:127.0.0.1:37758_solr    ] o.a.s.c.c.ZkConfigManager Copying zk node /configs/_default/managed-schema to /configs/timeConfig/managed-schema
   [junit4]   2> 1504762 INFO  (OverseerThreadFactory-2619-thread-1-processing-n:127.0.0.1:37758_solr) [n:127.0.0.1:37758_solr    ] o.a.s.c.c.ZkConfigManager Copying zk node /configs/_default/solrconfig.xml to /configs/timeConfig/solrconfig.xml
   [junit4]   2> 1504763 INFO  (OverseerThreadFactory-2619-thread-1-processing-n:127.0.0.1:37758_solr) [n:127.0.0.1:37758_solr    ] o.a.s.c.c.ZkConfigManager Copying zk node /configs/_default/synonyms.txt to /configs/timeConfig/synonyms.txt
   [junit4]   2> 1504764 INFO  (OverseerThreadFactory-2619-thread-1-processing-n:127.0.0.1:37758_solr) [n:127.0.0.1:37758_solr    ] o.a.s.c.c.ZkConfigManager Copying zk node /configs/_default/stopwords.txt to /configs/timeConfig/stopwords.txt
   [junit4]   2> 1504765 INFO  (OverseerThreadFactory-2619-thread-1-processing-n:127.0.0.1:37758_solr) [n:127.0.0.1:37758_solr    ] o.a.s.c.c.ZkConfigManager Copying zk node /configs/_default/params.json to /configs/timeConfig/params.json
   [junit4]   2> 1504766 INFO  (OverseerThreadFactory-2619-thread-1-processing-n:127.0.0.1:37758_solr) [n:127.0.0.1:37758_solr    ] o.a.s.c.c.ZkConfigManager Copying zk node /configs/_default/lang/contractions_it.txt to /configs/timeConfig/lang/contractions_it.txt
   [junit4]   2> 1504768 INFO  (OverseerThreadFactory-2619-thread-1-processing-n:127.0.0.1:37758_solr) [n:127.0.0.1:37758_solr    ] o.a.s.c.c.ZkConfigManager Copying zk node /configs/_default/lang/stopwords_no.txt to /configs/timeConfig/lang/stopwords_no.txt
   [junit4]   2> 1504769 INFO  (OverseerThreadFactory-2619-thread-1-processing-n:127.0.0.1:37758_solr) [n:127.0.0.1:37758_solr    ] o.a.s.c.c.ZkConfigManager Copying zk node /configs/_default/lang/stopwords_hy.txt to /configs/timeConfig/lang/stopwords_hy.txt
   [junit4]   2> 1504770 INFO  (OverseerThreadFactory-2619-thread-1-processing-n:127.0.0.1:37758_solr) [n:127.0.0.1:37758_solr    ] o.a.s.c.c.ZkConfigManager Copying zk node /configs/_default/lang/stemdict_nl.txt to /configs/timeConfig/lang/stemdict_nl.txt
   [junit4]   2> 1504771 INFO  (OverseerThreadFactory-2619-thread-1-processing-n:127.0.0.1:37758_solr) [n:127.0.0.1:37758_solr    ] o.a.s.c.c.ZkConfigManager Copying zk node /configs/_default/lang/contractions_ca.txt to /configs/timeConfig/lang/contractions_ca.txt
   [junit4]   2> 1504772 INFO  (OverseerThreadFactory-2619-thread-1-processing-n:127.0.0.1:37758_solr) [n:127.0.0.1:37758_solr    ] o.a.s.c.c.ZkConfigManager Copying zk node /configs/_default/lang/stopwords_id.txt to /configs/timeConfig/lang/stopwords_id.txt
   [junit4]   2> 1504773 INFO  (OverseerThreadFactory-2619-thread-1-processing-n:127.0.0.1:37758_solr) [n:127.0.0.1:37758_solr    ] o.a.s.c.c.ZkConfigManager Copying zk node /configs/_default/lang/stopwords_ga.txt to /configs/timeConfig/lang/stopwords_ga.txt
   [junit4]   2> 1504774 INFO  (OverseerThreadFactory-2619-thread-1-processing-n:127.0.0.1:37758_solr) [n:127.0.0.1:37758_solr    ] o.a.s.c.c.ZkConfigManager Copying zk node /configs/_default/lang/stopwords_da.txt to /configs/timeConfig/lang/stopwords_da.txt
   [junit4]   2> 1504775 INFO  (OverseerThreadFactory-2619-thread-1-processing-n:127.0.0.1:37758_solr) [n:127.0.0.1:37758_solr    ] o.a.s.c.c.ZkConfigManager Copying zk node /configs/_default/lang/stopwords_hi.txt to /configs/timeConfig/lang/stopwords_hi.txt
   [junit4]   2> 1504778 INFO  (OverseerThreadFactory-2619-thread-1-processing-n:127.0.0.1:37758_solr) [n:127.0.0.1:37758_solr    ] o.a.s.c.c.ZkConfigManager Copying zk node /configs/_default/lang/stopwords_ja.txt to /configs/timeConfig/lang/stopwords_ja.txt
   [junit4]   2> 1504779 INFO  (OverseerThreadFactory-2619-thread-1-processing-n:127.0.0.1:37758_solr) [n:127.0.0.1:37758_solr    ] o.a.s.c.c.ZkConfigManager Copying zk node /configs/_default/lang/stopwords_pt.txt to /configs/timeConfig/lang/stopwords_pt.txt
   [junit4]   2> 1504781 INFO  (OverseerThreadFactory-2619-thread-1-processing-n:127.0.0.1:37758_solr) [n:127.0.0.1:37758_solr    ] o.a.s.c.c.ZkConfigManager Copying zk node /configs/_default/lang/stopwords_hu.txt to /configs/timeConfig/lang/stopwords_hu.txt
   [junit4]   2> 1504782 INFO  (OverseerThreadFactory-2619-thread-1-processing-n:127.0.0.1:37758_solr) [n:127.0.0.1:37758_solr    ] o.a.s.c.c.ZkConfigManager Copying zk node /configs/_default/lang/stopwords_el.txt to /configs/timeConfig/lang/stopwords_el.txt
   [junit4]   2> 1504783 INFO  (OverseerThreadFactory-2619-thread-1-processing-n:127.0.0.1:37758_solr) [n:127.0.0.1:37758_solr    ] o.a.s.c.c.ZkConfigManager Copying zk node /configs/_default/lang/stopwords_ru.txt to /configs/timeConfig/lang/stopwords_ru.txt
   [junit4]   2> 1504784 INFO  (OverseerThreadFactory-2619-thread-1-processing-n:127.0.0.1:37758_solr) [n:127.0.0.1:37758_solr    ] o.a.s.c.c.ZkConfigManager Copying zk node /configs/_default/lang/stopwords_tr.txt to /configs/timeConfig/lang/stopwords_tr.txt
   [junit4]   2> 1504785 INFO  (OverseerThreadFactory-2619-thread-1-processing-n:127.0.0.1:37758_solr) [n:127.0.0.1:37758_solr    ] o.a.s.c.c.ZkConfigManager Copying zk node /configs/_default/lang/stopwords_ar.txt to /configs/timeConfig/lang/stopwords_ar.txt
   [junit4]   2> 1504786 INFO  (OverseerThreadFactory-2619-thread-1-processing-n:127.0.0.1:37758_solr) [n:127.0.0.1:37758_solr    ] o.a.s.c.c.ZkConfigManager Copying zk node /configs/_default/lang/userdict_ja.txt to /configs/timeConfig/lang/userdict_ja.txt
   [junit4]   2> 1504788 INFO  (OverseerThreadFactory-2619-thread-1-processing-n:127.0.0.1:37758_solr) [n:127.0.0.1:37758_solr    ] o.a.s.c.c.ZkConfigManager Copying zk node /configs/_default/lang/stopwords_it.txt to /configs/timeConfig/lang/stopwords_it.txt
   [junit4]   2> 1504789 INFO  (OverseerThreadFactory-2619-thread-1-processing-n:127.0.0.1:37758_solr) [n:127.0.0.1:37758_solr    ] o.a.s.c.c.ZkConfigManager Copying zk node /configs/_default/lang/stopwords_eu.txt to /configs/timeConfig/lang/stopwords_eu.txt
   [junit4]   2> 1504790 INFO  (OverseerThreadFactory-2619-thread-1-processing-n:127.0.0.1:37758_solr) [n:127.0.0.1:37758_solr    ] o.a.s.c.c.ZkConfigManager Copying zk node /configs/_default/lang/stopwords_cz.txt to /configs/timeConfig/lang/stopwords_cz.txt
   [junit4]   2> 1504791 INFO  (OverseerThreadFactory-2619-thread-1-processing-n:127.0.0.1:37758_solr) [n:127.0.0.1:37758_solr    ] o.a.s.c.c.ZkConfigManager Copying zk node /configs/_default/lang/stoptags_ja.txt to /configs/timeConfig/lang/stoptags_ja.txt
   [junit4]   2> 1504793 INFO  (OverseerThreadFactory-2619-thread-1-processing-n:127.0.0.1:37758_solr) [n:127.0.0.1:37758_solr    ] o.a.s.c.c.ZkConfigManager Copying zk node /configs/_default/lang/contractions_fr.txt to /configs/timeConfig/lang/contractions_fr.txt
   [junit4]   2> 1504794 INFO  (OverseerThreadFactory-2619-thread-1-processing-n:127.0.0.1:37758_solr) [n:127.0.0.1:37758_solr    ] o.a.s.c.c.ZkConfigManager Copying zk node /configs/_default/lang/stopwords_fa.txt to /configs/timeConfig/lang/stopwords_fa.txt
   [junit4]   2> 1504796 INFO  (OverseerThreadFactory-2619-thread-1-processing-n:127.0.0.1:37758_solr) [n:127.0.0.1:37758_solr    ] o.a.s.c.c.ZkConfigManager Copying zk node /configs/_default/lang/stopwords_de.txt to /configs/timeConfig/lang/stopwords_de.txt
   [junit4]   2> 1504797 INFO  (OverseerThreadFactory-2619-thread-1-processing-n:127.0.0.1:37758_solr) [n:127.0.0.1:37758_solr    ] o.a.s.c.c.ZkConfigManager Copying zk node /configs/_default/lang/contractions_ga.txt to /configs/timeConfig/lang/contractions_ga.txt
   [junit4]   2> 1504807 INFO  (OverseerThreadFactory-2619-thread-1-processing-n:127.0.0.1:37758_solr) [n:127.0.0.1:37758_solr    ] o.a.s.c.c.ZkConfigManager Copying zk node /configs/_default/lang/stopwords_ca.txt to /configs/timeConfig/lang/stopwords_ca.txt
   [junit4]   2> 1504808 INFO  (OverseerThreadFactory-2619-thread-1-processing-n:127.0.0.1:37758_solr) [n:127.0.0.1:37758_solr    ] o.a.s.c.c.ZkConfigManager Copying zk node /configs/_default/lang/stopwords_nl.txt to /configs/timeConfig/lang/stopwords_nl.txt
   [junit4]   2> 1504809 INFO  (OverseerThreadFactory-2619-thread-1-processing-n:127.0.0.1:37758_solr) [n:127.0.0.1:37758_solr    ] o.a.s.c.c.ZkConfigManager Copying zk node /configs/_default/lang/stopwords_bg.txt to /configs/timeConfig/lang/stopwords_bg.txt
   [junit4]   2> 1504809 INFO  (OverseerThreadFactory-2619-thread-1-processing-n:127.0.0.1:37758_solr) [n:127.0.0.1:37758_solr    ] o.a.s.c.c.ZkConfigManager Copying zk node /configs/_default/lang/stopwords_es.txt to /configs/timeConfig/lang/stopwords_es.txt
   [junit4]   2> 1504810 INFO  (OverseerThreadFactory-2619-thread-1-processing-n:127.0.0.1:37758_solr) [n:127.0.0.1:37758_solr    ] o.a.s.c.c.ZkConfigManager Copying zk node /configs/_default/lang/stopwords_en.txt to /configs/timeConfig/lang/stopwords_en.txt
   [junit4]   2> 1504811 INFO  (OverseerThreadFactory-2619-thread-1-processing-n:127.0.0.1:37758_solr) [n:127.0.0.1:37758_solr    ] o.a.s.c.c.ZkConfigManager Copying zk node /configs/_default/lang/stopwords_lv.txt to /configs/timeConfig/lang/stopwords_lv.txt
   [junit4]   2> 1504812 INFO  (OverseerThreadFactory-2619-thread-1-processing-n:127.0.0.1:37758_solr) [n:127.0.0.1:37758_solr    ] o.a.s.c.c.ZkConfigManager Copying zk node /configs/_default/lang/stopwords_th.txt to /configs/timeConfig/lang/stopwords_th.txt
   [junit4]   2> 1504813 INFO  (OverseerThreadFactory-2619-thread-1-processing-n:127.0.0.1:37758_solr) [n:127.0.0.1:37758_solr    ] o.a.s.c.c.ZkConfigManager Copying zk node /configs/_default/lang/stopwords_ro.txt to /configs/timeConfig/lang/stopwords_ro.txt
   [junit4]   2> 1504813 INFO  (OverseerThreadFactory-2619-thread-1-processing-n:127.0.0.1:37758_solr) [n:127.0.0.1:37758_solr    ] o.a.s.c.c.ZkConfigManager Copying zk node /configs/_default/lang/stopwords_fr.txt to /configs/timeConfig/lang/stopwords_fr.txt
   [junit4]   2> 1504814 INFO  (OverseerThreadFactory-2619-thread-1-processing-n:127.0.0.1:37758_solr) [n:127.0.0.1:37758_solr    ] o.a.s.c.c.ZkConfigManager Copying zk node /configs/_default/lang/stopwords_sv.txt to /configs/timeConfig/lang/stopwords_sv.txt
   [junit4]   2> 1504816 INFO  (OverseerThreadFactory-2619-thread-1-processing-n:127.0.0.1:37758_solr) [n:127.0.0.1:37758_solr    ] o.a.s.c.c.ZkConfigManager Copying zk node /configs/_default/lang/stopwords_fi.txt to /configs/timeConfig/lang/stopwords_fi.txt
   [junit4]   2> 1504817 INFO  (OverseerThreadFactory-2619-thread-1-processing-n:127.0.0.1:37758_solr) [n:127.0.0.1:37758_solr    ] o.a.s.c.c.ZkConfigManager Copying zk node /configs/_default/lang/hyphenations_ga.txt to /configs/timeConfig/lang/hyphenations_ga.txt
   [junit4]   2> 1504818 INFO  (OverseerThreadFactory-2619-thread-1-processing-n:127.0.0.1:37758_solr) [n:127.0.0.1:37758_solr    ] o.a.s.c.c.ZkConfigManager Copying zk node /configs/_default/lang/stopwords_gl.txt to /configs/timeConfig/lang/stopwords_gl.txt
   [junit4]   2> 1504926 INFO  (OverseerStateUpdate-99323945344696326-127.0.0.1:37758_solr-n_0000000000) [n:127.0.0.1:37758_solr    ] o.a.s.c.o.SliceMutator createReplica() {
   [junit4]   2>   "operation":"ADDREPLICA",
   [junit4]   2>   "collection":"timeConfig",
   [junit4]   2>   "shard":"shard1",
   [junit4]   2>   "core":"timeConfig_shard1_replica_n1",
   [junit4]   2>   "state":"down",
   [junit4]   2>   "base_url":"https://127.0.0.1:36154/solr",
   [junit4]   2>   "type":"NRT",
   [junit4]   2>   "waitForFinalState":"false"} 
   [junit4]   2> 1505136 INFO  (qtp849971433-8761) [n:127.0.0.1:36154_solr    ] o.a.s.h.a.CoreAdminOperation core create command qt=/admin/cores&coreNodeName=core_node2&collection.configName=timeConfig&newCollection=true&name=timeConfig_shard1_replica_n1&action=CREATE&numShards=1&collection=timeConfig&shard=shard1&wt=javabin&version=2&replicaType=NRT
   [junit4]   2> 1505136 INFO  (qtp849971433-8761) [n:127.0.0.1:36154_solr    ] o.a.s.c.TransientSolrCoreCacheDefault Allocating transient cache for 2147483647 transient cores
   [junit4]   2> 1505242 INFO  (zkCallback-1308-thread-1-processing-n:127.0.0.1:36154_solr) [n:127.0.0.1:36154_solr    ] o.a.s.c.c.ZkStateReader A cluster state change: [WatchedEvent state:SyncConnected type:NodeDataChanged path:/collections/timeConfig/state.json] for collection [timeConfig] has occurred - updating... (live nodes size: [2])
   [junit4]   2> 1505243 INFO  (zkCallback-1308-thread-2-processing-n:127.0.0.1:36154_solr) [n:127.0.0.1:36154_solr    ] o.a.s.c.c.ZkStateReader A cluster state change: [WatchedEvent state:SyncConnected type:NodeDataChanged path:/collections/timeConfig/state.json] for collection [timeConfig] has occurred - updating... (live nodes size: [2])
   [junit4]   2> 1506157 INFO  (qtp849971433-8761) [n:127.0.0.1:36154_solr c:timeConfig s:shard1 r:core_node2 x:timeConfig_shard1_replica_n1] o.a.s.c.RequestParams conf resource params.json loaded . version : 0 
   [junit4]   2> 1506159 INFO  (qtp849971433-8761) [n:127.0.0.1:36154_solr c:timeConfig s:shard1 r:core_node2 x:timeConfig_shard1_replica_n1] o.a.s.c.RequestParams request params refreshed to version 0
   [junit4]   2> 1506159 WARN  (qtp849971433-8761) [n:127.0.0.1:36154_solr c:timeConfig s:shard1 r:core_node2 x:timeConfig_shard1_replica_n1] o.a.s.c.SolrConfig Couldn't add files from /home/jenkins/jenkins-slave/workspace/Lucene-Solr-Tests-master/solr/build/solr-core/test/J0/temp/solr.update.processor.TimeRoutedAliasUpdateProcessorTest_DF868EAC660D298E-001/tempDir-001/node2/timeConfig_shard1_replica_n1/../../../../contrib/extraction/lib filtered by .*\.jar to classpath: /home/jenkins/jenkins-slave/workspace/Lucene-Solr-Tests-master/solr/build/solr-core/test/J0/temp/solr.update.processor.TimeRoutedAliasUpdateProcessorTest_DF868EAC660D298E-001/tempDir-001/node2/timeConfig_shard1_replica_n1/../../../../contrib/extraction/lib
   [junit4]   2> 1506160 WARN  (qtp849971433-8761) [n:127.0.0.1:36154_solr c:timeConfig s:shard1 r:core_node2 x:timeConfig_shard1_replica_n1] o.a.s.c.SolrConfig Couldn't add files from /home/jenkins/jenkins-slave/workspace/Lucene-Solr-Tests-master/solr/build/solr-core/test/J0/temp/solr.update.processor.TimeRoutedAliasUpdateProcessorTest_DF868EAC660D298E-001/tempDir-001/node2/timeConfig_shard1_replica_n1/../../../../dist filtered by solr-cell-\d.*\.jar to classpath: /home/jenkins/jenkins-slave/workspace/Lucene-Solr-Tests-master/solr/build/solr-core/test/J0/temp/solr.update.processor.TimeRoutedAliasUpdateProcessorTest_DF868EAC660D298E-001/tempDir-001/node2/timeConfig_shard1_replica_n1/../../../../dist
   [junit4]   2> 1506160 WARN  (qtp849971433-8761) [n:127.0.0.1:36154_solr c:timeConfig s:shard1 r:core_node2 x:timeConfig_shard1_replica_n1] o.a.s.c.SolrConfig Couldn't add files from /home/jenkins/jenkins-slave/workspace/Lucene-Solr-Tests-master/solr/build/solr-core/test/J0/temp/solr.update.processor.TimeRoutedAliasUpdateProcessorTest_DF868EAC660D298E-001/tempDir-001/node2/timeConfig_shard1_replica_n1/../../../../contrib/clustering/lib filtered by .*\.jar to classpath: /home/jenkins/jenkins-slave/workspace/Lucene-Solr-Tests-master/solr/build/solr-core/test/J0/temp/solr.update.processor.TimeRoutedAliasUpdateProcessorTest_DF868EAC660D298E-001/tempDir-001/node2/timeConfig_shard1_replica_n1/../../../../contrib/clustering/lib
   [junit4]   2> 1506160 WARN  (qtp849971433-8761) [n:127.0.0.1:36154_solr c:timeConfig s:shard1 r:core_node2 x:timeConfig_shard1_replica_n1] o.a.s.c.SolrConfig Couldn't add files from /home/jenkins/jenkins-slave/workspace/Lucene-Solr-Tests-master/solr/build/solr-core/test/J0/temp/solr.update.processor.TimeRoutedAliasUpdateProcessorTest_DF868EAC660D298E-001/tempDir-001/node2/timeConfig_shard1_replica_n1/../../../../dist filtered by solr-clustering-\d.*\.jar to classpath: /home/jenkins/jenkins-slave/workspace/Lucene-Solr-Tests-master/solr/build/solr-core/test/J0/temp/solr.update.processor.TimeRoutedAliasUpdateProcessorTest_DF868EAC660D298E-001/tempDir-001/node2/timeConfig_shard1_replica_n1/../../../../dist
   [junit4]   2> 1506160 WARN  (qtp849971433-8761) [n:127.0.0.1:36154_solr c:timeConfig s:shard1 r:core_node2 x:timeConfig_shard1_replica_n1] o.a.s.c.SolrConfig Couldn't add files from /home/jenkins/jenkins-slave/workspace/Lucene-Solr-Tests-master/solr/build/solr-core/test/J0/temp/solr.update.processor.TimeRoutedAliasUpdateProcessorTest_DF868EAC660D298E-001/tempDir-001/node2/timeConfig_shard1_replica_n1/../../../../contrib/langid/lib filtered by .*\.jar to classpath: /home/jenkins/jenkins-slave/workspace/Lucene-Solr-Tests-master/solr/build/solr-core/test/J0/temp/solr.update.processor.TimeRoutedAliasUpdateProcessorTest_DF868EAC660D298E-001/tempDir-001/node2/timeConfig_shard1_replica_n1/../../../../contrib/langid/lib
   [junit4]   2> 1506160 WARN  (qtp849971433-8761) [n:127.0.0.1:36154_solr c:timeConfig s:shard1 r:core_node2 x:timeConfig_shard1_replica_n1] o.a.s.c.SolrConfig Couldn't add files from /home/jenkins/jenkins-slave/workspace/Lucene-Solr-Tests-master/solr/build/solr-core/test/J0/temp/solr.update.processor.TimeRoutedAliasUpdateProcessorTest_DF868EAC660D298E-001/tempDir-001/node2/timeConfig_shard1_replica_n1/../../../../dist filtered by solr-langid-\d.*\.jar to classpath: /home/jenkins/jenkins-slave/workspace/Lucene-Solr-Tests-master/solr/build/solr-core/test/J0/temp/solr.update.processor.TimeRoutedAliasUpdateProcessorTest_DF868EAC660D298E-001/tempDir-001/node2/timeConfig_shard1_replica_n1/../../../../dist
   [junit4]   2> 1506160 WARN  (qtp849971433-8761) [n:127.0.0.1:36154_solr c:timeConfig s:shard1 r:core_node2 x:timeConfig_shard1_replica_n1] o.a.s.c.SolrConfig Couldn't add files from /home/jenkins/jenkins-slave/workspace/Lucene-Solr-Tests-master/solr/build/solr-core/test/J0/temp/solr.update.processor.TimeRoutedAliasUpdateProcessorTest_DF868EAC660D298E-001/tempDir-001/node2/timeConfig_shard1_replica_n1/../../../../contrib/velocity/lib filtered by .*\.jar to classpath: /home/jenkins/jenkins-slave/workspace/Lucene-Solr-Tests-master/solr/build/solr-core/test/J0/temp/solr.update.processor.TimeRoutedAliasUpdateProcessorTest_DF868EAC660D298E-001/tempDir-001/node2/timeConfig_shard1_replica_n1/../../../../contrib/velocity/lib
   [junit4]   2> 1506160 WARN  (qtp849971433-8761) [n:127.0.0.1:36154_solr c:timeConfig s:shard1 r:core_node2 x:timeConfig_shard1_replica_n1] o.a.s.c.SolrConfig Couldn't add files from /home/jenkins/jenkins-slave/workspace/Lucene-Solr-Tests-master/solr/build/solr-core/test/J0/temp/solr.update.processor.TimeRoutedAliasUpdateProcessorTest_DF868EAC660D298E-001/tempDir-001/node2/timeConfig_shard1_replica_n1/../../../../dist filtered by solr-velocity-\d.*\.jar to classpath: /home/jenkins/jenkins-slave/workspace/Lucene-Solr-Tests-master/solr/build/solr-core/test/J0/temp/solr.update.processor.TimeRoutedAliasUpdateProcessorTest_DF868EAC660D298E-001/tempDir-001/node2/timeConfig_shard1_replica_n1/../../../../dist
   [junit4]   2> 1506167 INFO  (qtp849971433-8761) [n:127.0.0.1:36154_solr c:timeConfig s:shard1 r:core_node2 x:timeConfig_shard1_replica_n1] o.a.s.c.SolrConfig Using Lucene MatchVersion: 8.0.0
   [junit4]   2> 1506188 INFO  (qtp849971433-8761) [n:127.0.0.1:36154_solr c:timeConfig s:shard1 r:core_node2 x:timeConfig_shard1_replica_n1] o.a.s.s.IndexSchema [timeConfig_shard1_replica_n1] Schema name=default-config
   [junit4]   2> 1506423 INFO  (qtp849971433-8761) [n:127.0.0.1:36154_solr c:timeConfig s:shard1 r:core_node2 x:timeConfig_shard1_replica_n1] o.a.s.s.IndexSchema Loaded schema default-config/1.6 with uniqueid field id
   [junit4]   2> 1506494 INFO  (qtp849971433-8761) [n:127.0.0.1:36154_solr c:timeConfig s:shard1 r:core_node2 x:timeConfig_shard1_replica_n1] o.a.s.c.CoreContainer Creating SolrCore 'timeConfig_shard1_replica_n1' using configuration from collection timeConfig, trusted=true
   [junit4]   2> 1506495 INFO  (qtp849971433-8761) [n:127.0.0.1:36154_solr c:timeConfig s:shard1 r:core_node2 x:timeConfig_shard1_replica_n1] o.a.s.m.r.SolrJmxReporter JMX monitoring for 'solr_36154.solr.core.timeConfig.shard1.replica_n1' (registry 'solr.core.timeConfig.shard1.replica_n1') enabled at server: com.sun.jmx.mbeanserver.JmxMBeanServer@6390bd4e
   [junit4]   2> 1506495 INFO  (qtp849971433-8761) [n:127.0.0.1:36154_solr c:timeConfig s:shard1 r:core_node2 x:timeConfig_shard1_replica_n1] o.a.s.c.SolrCore solr.RecoveryStrategy.Builder
   [junit4]   2> 1506495 INFO  (qtp849971433-8761) [n:127.0.0.1:36154_solr c:timeConfig s:shard1 r:core_node2 x:timeConfig_shard1_replica_n1] o.a.s.c.SolrCore [[timeConfig_shard1_replica_n1] ] Opening new SolrCore at [/home/jenkins/jenkins-slave/workspace/Lucene-Solr-Tests-master/solr/build/solr-core/test/J0/temp/solr.update.processor.TimeRoutedAliasUpdateProcessorTest_DF868EAC660D298E-001/tempDir-001/node2/timeConfig_shard1_replica_n1], dataDir=[/home/jenkins/jenkins-slave/workspace/Lucene-Solr-Tests-master/solr/build/solr-core/test/J0/temp/solr.update.processor.TimeRoutedAliasUpdateProcessorTest_DF868EAC660D298E-001/tempDir-001/node2/./timeConfig_shard1_replica_n1/data/]
   [junit4]   2> 1506514 INFO  (qtp849971433-8761) [n:127.0.0.1:36154_solr c:timeConfig s:shard1 r:core_node2 x:timeConfig_shard1_replica_n1] o.a.s.r.XSLTResponseWriter xsltCacheLifetimeSeconds=5
   [junit4]   2> 1506573 INFO  (qtp849971433-8761) [n:127.0.0.1:36154_solr c:timeConfig s:shard1 r:core_node2 x:timeConfig_shard1_replica_n1] o.a.s.u.UpdateHandler Using UpdateLog implementation: org.apache.solr.update.UpdateLog
   [junit4]   2> 1506573 INFO  (qtp849971433-8761) [n:127.0.0.1:36154_solr c:timeConfig s:shard1 r:core_node2 x:timeConfig_shard1_replica_n1] o.a.s.u.UpdateLog Initializing UpdateLog: dataDir= defaultSyncLevel=FLUSH numRecordsToKeep=100 maxNumLogsToKeep=10 numVersionBuckets=65536
   [junit4]   2> 1506574 INFO  (qtp849971433-8761) [n:127.0.0.1:36154_solr c:timeConfig s:shard1 r:core_node2 x:timeConfig_shard1_replica_n1] o.a.s.u.CommitTracker Hard AutoCommit: if uncommited for 15000ms; 
   [junit4]   2> 1506574 INFO  (qtp849971433-8761) [n:127.0.0.1:36154_solr c:timeConfig s:shard1 r:core_node2 x:timeConfig_shard1_replica_n1] o.a.s.u.CommitTracker Soft AutoCommit: disabled
   [junit4]   2> 1506576 INFO  (qtp849971433-8761) [n:127.0.0.1:36154_solr c:timeConfig s:shard1 r:core_node2 x:timeConfig_shard1_replica_n1] o.a.s.s.SolrIndexSearcher Opening [Searcher@dedef20[timeConfig_shard1_replica_n1] main]
   [junit4]   2> 1506577 INFO  (qtp849971433-8761) [n:127.0.0.1:36154_solr c:timeConfig s:shard1 r:core_node2 x:timeConfig_shard1_replica_n1] o.a.s.r.ManagedResourceStorage Configured ZooKeeperStorageIO with znodeBase: /configs/timeConfig
   [junit4]   2> 1506577 INFO  (qtp849971433-8761) [n:127.0.0.1:36154_solr c:timeConfig s:shard1 r:core_node2 x:timeConfig_shard1_replica_n1] o.a.s.r.ManagedResourceStorage Loaded null at path _rest_managed.json using ZooKeeperStorageIO:path=/configs/timeConfig
   [junit4]   2> 1506577 INFO  (qtp849971433-8761) [n:127.0.0.1:36154_solr c:timeConfig s:shard1 r:core_node2 x:timeConfig_shard1_replica_n1] o.a.s.s.ZkIndexSchemaReader Creating ZooKeeper watch for the managed schema at /configs/timeConfig/managed-schema
   [junit4]   2> 1506578 INFO  (qtp849971433-8761) [n:127.0.0.1:36154_solr c:timeConfig s:shard1 r:core_node2 x:timeConfig_shard1_replica_n1] o.a.s.s.ZkIndexSchemaReader Current schema version 0 is already the latest
   [junit4]   2> 1506578 INFO  (qtp849971433-8761) [n:127.0.0.1:36154_solr c:timeConfig s:shard1 r:core_node2 x:timeConfig_shard1_replica_n1] o.a.s.h.c.SpellCheckComponent Initializing spell checkers
   [junit4]   2> 1506578 INFO  (qtp849971433-8761) [n:127.0.0.1:36154_solr c:timeConfig s:shard1 r:core_node2 x:timeConfig_shard1_replica_n1] o.a.s.s.DirectSolrSpellChecker init: {name=default,field=_text_,classname=solr.DirectSolrSpellChecker,distanceMeasure=internal,accuracy=0.5,maxEdits=2,minPrefix=1,maxInspections=5,minQueryLength=4,maxQueryFrequency=0.01}
   [junit4]   2> 1506586 INFO  (qtp849971433-8761) [n:127.0.0.1:36154_solr c:timeConfig s:shard1 r:core_node2 x:timeConfig_shard1_replica_n1] o.a.s.h.ReplicationHandler Commits will be reserved for 10000ms.
   [junit4]   2> 1506586 INFO  (qtp849971433-8761) [n:127.0.0.1:36154_solr c:timeConfig s:shard1 r:core_node2 x:timeConfig_shard1_replica_n1] o.a.s.u.UpdateLog Could not find max version in index or recent updates, using new clock 1589183128087298048
   [junit4]   2> 1506586 INFO  (searcherExecutor-2624-thread-1-processing-n:127.0.0.1:36154_solr x:timeConfig_shard1_replica_n1 s:shard1 c:timeConfig r:core_node2) [n:127.0.0.1:36154_solr c:timeConfig s:shard1 r:core_node2 x:timeConfig_shard1_replica_n1] o.a.s.c.QuerySenderListener QuerySenderListener sending requests to Searcher@dedef20[timeConfig_shard1_replica_n1] main{ExitableDirectoryReader(UninvertingDirectoryReader())}
   [junit4]   2> 1506586 INFO  (searcherExecutor-2624-thread-1-processing-n:127.0.0.1:36154_solr x:timeConfig_shard1_replica_n1 s:shard1 c:timeConfig r:core_node2) [n:127.0.0.1:36154_solr c:timeConfig s:shard1 r:core_node2 x:timeConfig_shard1_replica_n1] o.a.s.c.QuerySenderListener QuerySenderListener done.
   [junit4]   2> 1506586 INFO  (searcherExecutor-2624-thread-1-processing-n:127.0.0.1:36154_solr x:timeConfig_shard1_replica_n1 s:shard1 c:timeConfig r:core_node2) [n:127.0.0.1:36154_solr c:timeConfig s:shard1 r:core_node2 x:timeConfig_shard1_replica_n1] o.a.s.h.c.SpellCheckComponent Loading spell index for spellchecker: default
   [junit4]   2> 1506587 INFO  (searcherExecutor-2624-thread-1-processing-n:127.0.0.1:36154_solr x:timeConfig_shard1_replica_n1 s:shard1 c:timeConfig r:core_node2) [n:127.0.0.1:36154_solr c:timeConfig s:shard1 r:core_node2 x:timeConfig_shard1_replica_n1] o.a.s.c.SolrCore [timeConfig_shard1_replica_n1] Registered new searcher Searcher@dedef20[timeConfig_shard1_replica_n1] main{ExitableDirectoryReader(UninvertingDirectoryReader())}
   [junit4]   2> 1506593 INFO  (qtp849971433-8761) [n:127.0.0.1:36154_solr c:timeConfig s:shard1 r:core_node2 x:timeConfig_shard1_replica_n1] o.a.s.c.ShardLeaderElectionContext Enough replicas found to continue.
   [junit4]   2> 1506593 INFO  (qtp849971433-8761) [n:127.0.0.1:36154_solr c:timeConfig s:shard1 r:core_node2 x:timeConfig_shard1_replica_n1] o.a.s.c.ShardLeaderElectionContext I may be the new leader - try and sync
   [junit4]   2> 1506593 INFO  (qtp849971433-8761) [n:127.0.0.1:36154_solr c:timeConfig s:shard1 r:core_node2 x:timeConfig_shard1_replica_n1] o.a.s.c.SyncStrategy Sync replicas to https://127.0.0.1:36154/solr/timeConfig_shard1_replica_n1/
   [junit4]   2> 1506593 INFO  (qtp849971433-8761) [n:127.0.0.1:36154_solr c:timeConfig s:shard1 r:core_node2 x:timeConfig_shard1_replica_n1] o.a.s.c.SyncStrategy Sync Success - now sync replicas to me
   [junit4]   2> 1506593 INFO  (qtp849971433-8761) [n:127.0.0.1:36154_solr c:timeConfig s:shard1 r:core_node2 x:timeConfig_shard1_replica_n1] o.a.s.c.SyncStrategy https://127.0.0.1:36154/solr/timeConfig_shard1_replica_n1/ has no replicas
   [junit4]   2> 1506593 INFO  (qtp849971433-8761) [n:127.0.0.1:36154_solr c:timeConfig s:shard1 r:core_node2 x:timeConfig_shard1_replica_n1] o.a.s.c.ShardLeaderElectionContext Found all replicas participating in election, clear LIR
   [junit4]   2> 1506610 INFO  (qtp849971433-8761) [n:127.0.0.1:36154_solr c:timeConfig s:shard1 r:core_node2 x:timeConfig_shard1_replica_n1] o.a.s.c.ShardLeaderElectionContext I am the new leader: https://127.0.0.1:36154/solr/timeConfig_shard1_replica_n1/ shard1
   [junit4]   2> 1506712 INFO  (zkCallback-1308-thread-2-processing-n:127.0.0.1:36154_solr) [n:127.0.0.1:36154_solr    ] o.a.s.c.c.ZkStateReader A cluster state change: [WatchedEvent state:SyncConnected type:NodeDataChanged path:/collections/timeConfig/state.json] for collection [timeConfig] has occurred - updating... (live nodes size: [2])
   [junit4]   2> 1506718 INFO  (zkCallback-1308-thread-1-processing-n:127.0.0.1:36154_solr) [n:127.0.0.1:36154_solr    ] o.a.s.c.c.ZkStateReader A cluster state change: [WatchedEvent state:SyncConnected type:NodeDataChanged path:/collections/timeConfig/state.json] for collection [timeConfig] has occurred - updating... (live nodes size: [2])
   [junit4]   2> 1506761 INFO  (qtp849971433-8761) [n:127.0.0.1:36154_solr c:timeConfig s:shard1 r:core_node2 x:timeConfig_shard1_replica_n1] o.a.s.c.ZkController I am the leader, no recovery necessary
   [junit4]   2> 1506763 INFO  (qtp849971433-8761) [n:127.0.0.1:36154_solr c:timeConfig s:shard1 r:core_node2 x:timeConfig_shard1_replica_n1] o.a.s.s.HttpSolrCall [admin] webapp=null path=/admin/cores params={qt=/admin/cores&coreNodeName=core_node2&collection.configName=timeConfig&newCollection=true&name=timeConfig_shard1_replica_n1&action=CREATE&numShards=1&collection=timeConfig&shard=shard1&wt=javabin&version=2&replicaType=NRT} status=0 QTime=1627
   [junit4]   2> 1506765 INFO  (qtp849971433-8758) [n:127.0.0.1:36154_solr    ] o.a.s.h.a.CollectionsHandler Wait for new collection to be active for at most 30 seconds. Check all shard replicas
   [junit4]   2> 1506864 INFO  (zkCallback-1308-thread-1-processing-n:127.0.0.1:36154_solr) [n:127.0.0.1:36154_solr    ] o.a.s.c.c.ZkStateReader A cluster state change: [WatchedEvent state:SyncConnected type:NodeDataChanged path:/collections/timeConfig/state.json] for collection [timeConfig] has occurred - updating... (live nodes size: [2])
   [junit4]   2> 1506864 INFO  (zkCallback-1308-thread-2-processing-n:127.0.0.1:36154_solr) [n:127.0.0.1:36154_solr    ] o.a.s.c.c.ZkStateReader A cluster state change: [WatchedEvent state:SyncConnected type:NodeDataChanged path:/collections/timeConfig/state.json] for collection [timeConfig] has occurred - updating... (live nodes size: [2])
   [junit4]   2> 1507766 INFO  (qtp849971433-8758) [n:127.0.0.1:36154_solr    ] o.a.s.s.HttpSolrCall [admin] webapp=null path=/admin/collections params={pullReplicas=0&replicationFactor=1&name=timeConfig&nrtReplicas=1&action=CREATE&numShards=1&tlogReplicas=0&wt=javabin&version=2} status=0 QTime=3018
   [junit4]   2> 1507770 INFO  (qtp849971433-8759) [n:127.0.0.1:36154_solr c:timeConfig s:shard1 r:core_node2 x:timeConfig_shard1_replica_n1] o.a.s.h.SolrConfigHandler Executed config commands successfully and persisted to ZK [{"set-user-property":{"timePartitionAliasName":"myalias"}}, {"set-user-property":{"update.autoCreateFields":false}}, {"add-updateprocessor":{
   [junit4]   2>     "name":"tolerant",
   [junit4]   2>     "class":"solr.TolerantUpdateProcessorFactory"}}, {"add-updateprocessor":{
   [junit4]   2>     "name":"inc",
   [junit4]   2>     "class":"org.apache.solr.update.processor.TimeRoutedAliasUpdateProcessorTest$IncrementURPFactory",
   [junit4]   2>     "fieldName":"integer_i"}}]
   [junit4]   2> 1507770 INFO  (qtp849971433-8759) [n:127.0.0.1:36154_solr c:timeConfig s:shard1 r:core_node2 x:timeConfig_shard1_replica_n1] o.a.s.h.SolrConfigHandler Waiting up to 30 secs for 1 replicas to set the property overlay to be of version 0 for collection timeConfig
   [junit4]   2> 1507770 INFO  (Thread-4124) [n:127.0.0.1:36154_solr    ] o.a.s.c.SolrCore config update listener called for core timeConfig_shard1_replica_n1
   [junit4]   2> 1507771 INFO  (Thread-4124) [n:127.0.0.1:36154_solr    ] o.a.s.c.SolrCore core reload timeConfig_shard1_replica_n1
   [junit4]   2> 1507771 INFO  (solrHandlerExecutor-2629-thread-1-processing-n:127.0.0.1:36154_solr x:timeConfig_shard1_replica_n1 s:shard1 c:timeConfig r:core_node2) [n:127.0.0.1:36154_solr c:timeConfig s:shard1 r:core_node2 x:timeConfig_shard1_replica_n1] o.a.s.h.SolrConfigHandler Time elapsed : 0 secs, maxWait 30
   [junit4]   2> 1507779 INFO  (Thread-4124) [n:127.0.0.1:36154_solr    ] o.a.s.c.RequestParams conf resource params.json loaded . version : 0 
   [junit4]   2> 1507779 INFO  (Thread-4124) [n:127.0.0.1:36154_solr    ] o.a.s.c.RequestParams request params refreshed to version 0
   [junit4]   2> 1507780 WARN  (Thread-4124) [n:127.0.0.1:36154_solr    ] o.a.s.c.SolrConfig Couldn't add files from /home/jenkins/jenkins-slave/workspace/Lucene-Solr-Tests-master/solr/build/solr-core/test/J0/temp/solr.update.processor.TimeRoutedAliasUpdateProcessorTest_DF868EAC660D298E-001/tempDir-001/node2/timeConfig_shard1_replica_n1/../../../../contrib/extraction/lib filtered by .*\.jar to classpath: /home/jenkins/jenkins-slave/workspace/Lucene-Solr-Tests-master/solr/build/solr-core/test/J0/temp/solr.update.processor.TimeRoutedAliasUpdateProcessorTest_DF868EAC660D298E-001/tempDir-001/node2/timeConfig_shard1_replica_n1/../../../../contrib/extraction/lib
   [junit4]   2> 1507780 WARN  (Thread-4124) [n:127.0.0.1:36154_solr    ] o.a.s.c.SolrConfig Couldn't add files from /home/jenkins/jenkins-slave/workspace/Lucene-Solr-Tests-master/solr/build/solr-core/test/J0/temp/solr.update.processor.TimeRoutedAliasUpdateProcessorTest_DF868EAC660D298E-001/tempDir-001/node2/timeConfig_shard1_replica_n1/../../../../dist filtered by solr-cell-\d.*\.jar to classpath: /home/jenkins/jenkins-slave/workspace/Lucene-Solr-Tests-master/solr/build/solr-core/test/J0/temp/solr.update.processor.TimeRoutedAliasUpdateProcessorTest_DF868EAC660D298E-001/tempDir-001/node2/timeConfig_shard1_replica_n1/../../../../dist
   [junit4]   2> 1507780 WARN  (Thread-4124) [n:127.0.0.1:36154_solr    ] o.a.s.c.SolrConfig Couldn't add files from /home/jenkins/jenkins-slave/workspace/Lucene-Solr-Tests-master/solr/build/solr-core/test/J0/temp/solr.update.processor.TimeRoutedAliasUpdateProcessorTest_DF868EAC660D298E-001/tempDir-001/node2/timeConfig_shard1_replica_n1/../../../../contrib/clustering/lib filtered by .*\.jar to classpath: /home/jenkins/jenkins-slave/workspace/Lucene-Solr-Tests-master/solr/build/solr-core/test/J0/temp/solr.update.processor.TimeRoutedAliasUpdateProcessorTest_DF868EAC660D298E-001/tempDir-001/node2/timeConfig_shard1_replica_n1/../../../../contrib/clustering/lib
   [junit4]   2> 1507780 WARN  (Thread-4124) [n:127.0.0.1:36154_solr    ] o.a.s.c.SolrConfig Couldn't add files from /home/jenkins/jenkins-slave/workspace/Lucene-Solr-Tests-master/solr/build/solr-core/test/J0/temp/solr.update.processor.TimeRoutedAliasUpdateProcessorTest_DF868EAC660D298E-001/tempDir-001/node2/timeConfig_shard1_replica_n1/../../../../dist filtered by solr-clustering-\d.*\.jar to classpath: /home/jenkins/jenkins-slave/workspace/Lucene-Solr-Tests-master/solr/build/solr-core/test/J0/temp/solr.update.processor.TimeRoutedAliasUpdateProcessorTest_DF868EAC660D298E-001/tempDir-001/node2/timeConfig_shard1_replica_n1/../../../../dist
   [junit4]   2> 1507780 WARN  (Thread-4124) [n:127.0.0.1:36154_solr    ] o.a.s.c.SolrConfig Couldn't add files from /home/jenkins/jenkins-slave/workspace/Lucene-Solr-Tests-master/solr/build/solr-core/test/J0/temp/solr.update.processor.TimeRoutedAliasUpdateProcessorTest_DF868EAC660D298E-001/tempDir-001/node2/timeConfig_shard1_replica_n1/../../../../contrib/langid/lib filtered by .*\.jar to classpath: /home/jenkins/jenkins-slave/workspace/Lucene-Solr-Tests-master/solr/build/solr-core/test/J0/temp/solr.update.processor.TimeRoutedAliasUpdateProcessorTest_DF868EAC660D298E-001/tempDir-001/node2/timeConfig_shard1_replica_n1/../../../../contrib/langid/lib
   [junit4]   2> 1507780 WARN  (Thread-4124) [n:127.0.0.1:36154_solr    ] o.a.s.c.SolrConfig Couldn't add files from /home/jenkins/jenkins-slave/workspace/Lucene-Solr-Tests-master/solr/build/solr-core/test/J0/temp/solr.update.processor.TimeRoutedAliasUpdateProcessorTest_DF868EAC660D298E-001/tempDir-001/node2/timeConfig_shard1_replica_n1/../../../../dist filtered by solr-langid-\d.*\.jar to classpath: /home/jenkins/jenkins-slave/workspace/Lucene-Solr-Tests-master/solr/build/solr-core/test/J0/temp/solr.update.processor.TimeRoutedAliasUpdateProcessorTest_DF868EAC660D298E-001/tempDir-001/node2/timeConfig_shard1_replica_n1/../../../../dist
   [junit4]   2> 1507781 WARN  (Thread-4124) [n:127.0.0.1:36154_solr    ] o.a.s.c.SolrConfig Couldn't add files from /home/jenkins/jenkins-slave/workspace/Lucene-Solr-Tests-master/solr/build/solr-core/test/J0/temp/solr.update.processor.TimeRoutedAliasUpdateProcessorTest_DF868EAC660D298E-001/tempDir-001/node2/timeConfig_shard1_replica_n1/../../../../contrib/velocity/lib filtered by .*\.jar to classpath: /home/jenkins/jenkins-slave/workspace/Lucene-Solr-Tests-master/solr/build/solr-core/test/J0/temp/solr.update.processor.TimeRoutedAliasUpdateProcessorTest_DF868EAC660D298E-001/tempDir-001/node2/timeConfig_shard1_replica_n1/../../../../contrib/velocity/lib
   [junit4]   2> 1507781 WARN  (Thread-4124) [n:127.0.0.1:36154_solr    ] o.a.s.c.SolrConfig Couldn't add files from /home/jenkins/jenkins-slave/workspace/Lucene-Solr-Tests-master/solr/build/solr-core/test/J0/temp/solr.update.processor.TimeRoutedAliasUpdateProcessorTest_DF868EAC660D298E-001/tempDir-001/node2/timeConfig_shard1_replica_n1/../../../../dist filtered by solr-velocity-\d.*\.jar to classpath: /home/jenkins/jenkins-slave/workspace/Lucene-Solr-Tests-master/solr/build/solr-core/test/J0/temp/solr.update.processor.TimeRoutedAliasUpdateProcessorTest_DF868EAC660D298E-001/tempDir-001/node2/timeConfig_shard1_replica_n1/../../../../dist
   [junit4]   2> 1507791 INFO  (Thread-4124) [n:127.0.0.1:36154_solr    ] o.a.s.c.SolrConfig Using Lucene MatchVersion: 8.0.0
   [junit4]   2> 1507811 INFO  (Thread-4124) [n:127.0.0.1:36154_solr    ] o.a.s.s.IndexSchema [timeConfig_shard1_replica_n1] Schema name=default-config
   [junit4]   2> 1507874 INFO  (qtp849971433-8756) [n:127.0.0.1:36154_solr c:timeConfig s:shard1 r:core_node2 x:timeConfig_shard1_replica_n1] o.a.s.h.SolrConfigHandler expecting overlay version 0 but my version is -1
   [junit4]   2> 1507875 INFO  (qtp849971433-8756) [n:127.0.0.1:36154_solr c:timeConfig s:shard1 r:core_node2 x:timeConfig_shard1_replica_n1] o.a.s.c.S.Request [timeConfig_shard1_replica_n1]  webapp=/solr path=/config/znodeVersion params={overlay=0&wt=javabin&version=2} status=0 QTime=0
   [junit4]   2> 1507875 INFO  (SolrConfigHandler-refreshconf) [n:127.0.0.1:36154_solr c:timeConfig s:shard1 r:core_node2 x:timeConfig_shard1_replica_n1] o.a.s.h.SolrConfigHandler Another reload is in progress . Not doing anything
   [junit4]   2> 1507875 INFO  (solrHandlerExecutor-2629-thread-1-processing-n:127.0.0.1:36154_solr x:timeConfig_shard1_replica_n1 s:shard1 c:timeConfig r:core_node2) [n:127.0.0.1:36154_solr c:timeConfig s:shard1 r:core_node2 x:timeConfig_shard1_replica_n1] o.a.s.h.SolrConfigHandler Could not get expectedVersion 0 from https://127.0.0.1:36154/solr/timeConfig_shard1_replica_n1/ for prop overlay   after 1 attempts
   [junit4]   2> 1507875 INFO  (solrHandlerExecutor-2629-thread-1-processing-n:127.0.0.1:36154_solr x:timeConfig_shard1_replica_n1 s:shard1 c:timeConfig r:core_node2) [n:127.0.0.1:36154_solr c:timeConfig s:shard1 r:core_node2 x:timeConfig_shard1_replica_n1] o.a.s.h.SolrConfigHandler Time elapsed : 0 secs, maxWait 30
   [junit4]   2> 1507960 INFO  (Thread-4124) [n:127.0.0.1:36154_solr    ] o.a.s.s.IndexSchema Loaded schema default-config/1.6 with uniqueid field id
   [junit4]   2> 1507976 INFO  (qtp849971433-8761) [n:127.0.0.1:36154_solr c:timeConfig s:shard1 r:core_node2 x:timeConfig_shard1_replica_n1] o.a.s.h.SolrConfigHandler expecting overlay version 0 but my version is -1
   [junit4]   2> 1507976 INFO  (qtp849971433-8761) [n:127.0.0.1:36154_solr c:timeConfig s:shard1 r:core_node2 x:timeConfig_shard1_replica_n1] o.a.s.c.S.Request [timeConfig_shard1_replica_n1]  webapp=/solr path=/config/znodeVersion params={overlay=0&wt=javabin&version=2} status=0 QTime=0
   [junit4]   2> 1507976 INFO  (SolrConfigHandler-refreshconf) [n:127.0.0.1:36154_solr c:timeConfig s:shard1 r:core_node2 x:timeConfig_shard1_replica_n1] o.a.s.h.SolrConfigHandler Another reload is in progress . Not doing anything
   [junit4]   2> 1507976 INFO  (solrHandlerExecutor-2629-thread-1-processing-n:127.0.0.1:36154_solr x:timeConfig_shard1_replica_n1 s:shard1 c:timeConfig r:core_node2) [n:127.0.0.1:36154_solr c:timeConfig s:shard1 r:core_node2 x:timeConfig_shard1_replica_n1] o.a.s.h.SolrConfigHandler Could not get expectedVersion 0 from https://127.0.0.1:36154/solr/timeConfig_shard1_replica_n1/ for prop overlay   after 2 attempts
   [junit4]   2> 1507976 INFO  (solrHandlerExecutor-2629-thread-1-processing-n:127.0.0.1:36154_solr x:timeConfig_shard1_replica_n1 s:shard1 c:timeConfig r:core_node2) [n:127.0.0.1:36154_solr c:timeConfig s:shard1 r:core_node2 x:timeConfig_shard1_replica_n1] o.a.s.h.SolrConfigHandler Time elapsed : 0 secs, maxWait 30
   [junit4]   2> 1507998 INFO  (Thread-4124) [n:127.0.0.1:36154_solr    ] o.a.s.c.CoreContainer Reloading SolrCore 'timeConfig_shard1_replica_n1' using configuration from collection timeConfig
   [junit4]   2> 1508016 INFO  (Thread-4124) [n:127.0.0.1:36154_solr c:timeConfig s:shard1 r:core_node2 x:timeConfig_shard1_replica_n1] o.a.s.m.r.SolrJmxReporter JMX monitoring for 'solr_36154.solr.core.timeConfig.shard1.replica_n1' (registry 'solr.core.timeConfig.shard1.replica_n1') enabled at server: com.sun.jmx.mbeanserver.JmxMBeanServer@6390bd4e
   [junit4]   2> 1508016 INFO  (Thread-4124) [n:127.0.0.1:36154_solr c:timeConfig s:shard1 r:core_node2 x:timeConfig_shard1_replica_n1] o.a.s.c.SolrCore [[timeConfig_shard1_replica_n1] ] Opening new SolrCore at [/home/jenkins/jenkins-slave/workspace/Lucene-Solr-Tests-master/solr/build/solr-core/test/J0/temp/solr.update.processor.TimeRoutedAliasUpdateProcessorTest_DF868EAC660D298E-001/tempDir-001/node2/timeConfig_shard1_replica_n1], dataDir=[/home/jenkins/jenkins-slave/workspace/Lucene-Solr-Tests-master/solr/build/solr-core/test/J0/temp/solr.update.processor.TimeRoutedAliasUpdateProcessorTest_DF868EAC660D298E-001/tempDir-001/node2/./timeConfig_shard1_replica_n1/data/]
   [junit4]   2> 1508018 INFO  (Thread-4124) [n:127.0.0.1:36154_solr c:timeConfig s:shard1 r:core_node2 x:timeConfig_shard1_replica_n1] o.a.s.r.XSLTResponseWriter xsltCacheLifetimeSeconds=5
   [junit4]   2> 1508047 INFO  (Thread-4124) [n:127.0.0.1:36154_solr c:timeConfig s:shard1 r:core_node2 x:timeConfig_shard1_replica_n1] o.a.s.u.CommitTracker Hard AutoCommit: if uncommited for 15000ms; 
   [junit4]   2> 1508047 INFO  (Thread-4124) [n:127.0.0.1:36154_solr c:timeConfig s:shard1 r:core_node2 x:timeConfig_shard1_replica_n1] o.a.s.u.CommitTracker Soft AutoCommit: disabled
   [junit4]   2> 1508049 INFO  (Thread-4124) [n:127.0.0.1:36154_solr c:timeConfig s:shard1 r:core_node2 x:timeConfig_shard1_replica_n1] o.a.s.s.SolrIndexSearcher Opening [Searcher@4f194aea[timeConfig_shard1_replica_n1] main]
   [junit4]   2> 1508050 INFO  (Thread-4124) [n:127.0.0.1:36154_solr c:timeConfig s:shard1 r:core_node2 x:timeConfig_shard1_replica_n1] o.a.s.r.ManagedResourceStorage Configured ZooKeeperStorageIO with znodeBase: /configs/timeConfig
   [junit4]   2> 1508050 INFO  (Thread-4124) [n:127.0.0.1:36154_solr c:timeConfig s:shard1 r:core_node2 x:timeConfig_shard1_replica_n1] o.a.s.r.ManagedResourceStorage Loaded null at path _rest_managed.json using ZooKeeperStorageIO:path=/configs/timeConfig
   [junit4]   2> 1508050 INFO  (Thread-4124) [n:127.0.0.1:36154_solr c:timeConfig s:shard1 r:core_node2 x:timeConfig_shard1_replica_n1] o.a.s.s.ZkIndexSchemaReader Creating ZooKeeper watch for the managed schema at /configs/timeConfig/managed-schema
   [junit4]   2> 1508051 INFO  (Thread-4124) [n:127.0.0.1:36154_solr c:timeConfig s:shard1 r:core_node2 x:timeConfig_shard1_replica_n1] o.a.s.s.ZkIndexSchemaReader Current schema version 0 is already the latest
   [junit4]   2> 1508051 INFO  (Thread-4124) [n:127.0.0.1:36154_solr c:timeConfig s:shard1 r:core_node2 x:timeConfig_shard1_replica_n1] o.a.s.h.c.SpellCheckComponent Initializing spell checkers
   [junit4]   2> 1508051 INFO  (Thread-4124) [n:127.0.0.1:36154_solr c:timeConfig s:shard1 r:core_node2 x:timeConfig_shard1_replica_n1] o.a.s.s.DirectSolrSpellChecker init: {name=default,field=_text_,classname=solr.DirectSolrSpellChecker,distanceMeasure=internal,accuracy=0.5,maxEdits=2,minPrefix=1,maxInspections=5,minQueryLength=4,maxQueryFrequency=0.01}
   [junit4]   2> 1508052 INFO  (Thread-4124) [n:127.0.0.1:36154_solr c:timeConfig s:shard1 r:core_node2 x:timeConfig_shard1_replica_n1] o.a.s.h.ReplicationHandler Commits will be reserved for 10000ms.
   [junit4]   2> 1508052 INFO  (searcherExecutor-2630-thread-1-processing-n:127.0.0.1:36154_solr x:timeConfig_shard1_replica_n1 s:shard1 c:timeConfig r:core_node2) [n:127.0.0.1:36154_solr c:timeConfig s:shard1 r:core_node2 x:timeConfig_shard1_replica_n1] o.a.s.c.QuerySenderListener QuerySenderListener sending requests to Searcher@4f194aea[timeConfig_shard1_replica_n1] main{ExitableDirectoryReader(UninvertingDirectoryReader())}
   [junit4]   2> 1508062 INFO  (Thread-4124) [n:127.0.0.1:36154_solr c:timeConfig s:shard1 r:core_node2 x:timeConfig_shard1_replica_n1] o.a.s.u.UpdateLog Could not find max version in index or recent updates, using new clock 1589183129634996224
   [junit4]   2> 1508062 INFO  (searcherExecutor-2630-thread-1-processing-n:127.0.0.1:36154_solr x:timeConfig_shard1_replica_n1 s:shard1 c:timeConfig r:core_node2) [n:127.0.0.1:36154_solr c:timeConfig s:shard1 r:core_node2 x:timeConfig_shard1_replica_n1] o.a.s.c.QuerySenderListener QuerySenderListener done.
   [junit4]   2> 1508062 INFO  (searcherExecutor-2630-thread-1-processing-n:127.0.0.1:36154_solr x:timeConfig_shard1_replica_n1 s:shard1 c:timeConfig r:core_node2) [n:127.0.0.1:36154_solr c:timeConfig s:shard1 r:core_node2 x:timeConfig_shard1_replica_n1] o.a.s.h.c.SpellCheckComponent Loading spell index for spellchecker: default
   [junit4]   2> 1508065 INFO  (Thread-4124) [n:127.0.0.1:36154_solr c:timeConfig s:shard1 r:core_node2 x:timeConfig_shard1_replica_n1] o.a.s.u.DefaultSolrCoreState New IndexWriter is ready to be used.
   [junit4]   2> 1508065 INFO  (searcherExecutor-2630-thread-1-processing-n:127.0.0.1:36154_solr x:timeConfig_shard1_replica_n1 s:shard1 c:timeConfig r:core_node2) [n:127.0.0.1:36154_solr c:timeConfig s:shard1 r:core_node2 x:timeConfig_shard1_replica_n1] o.a.s.c.SolrCore [timeConfig_shard1_replica_n1] Registered new searcher Searcher@4f194aea[timeConfig_shard1_replica_n1] main{ExitableDirectoryReader(UninvertingDirectoryReader())}
   [junit4]   2> 1508066 INFO  (Thread-4124) [n:127.0.0.1:36154_solr c:timeConfig s:shard1 r:core_node2 x:timeConfig_shard1_replica_n1] o.a.s.s.SolrIndexSearcher Opening [Searcher@646362d2[timeConfig_shard1_replica_n1] main]
   [junit4]   2> 1508066 INFO  (searcherExecutor-2630-thread-1-processing-n:127.0.0.1:36154_solr x:timeConfig_shard1_replica_n1 s:shard1 c:timeConfig r:core_node2) [n:127.0.0.1:36154_solr c:timeConfig s:shard1 r:core_node2 x:timeConfig_shard1_replica_n1] o.a.s.c.QuerySenderListener QuerySenderListener sending requests to Searcher@646362d2[timeConfig_shard1_replica_n1] main{ExitableDirectoryReader(UninvertingDirectoryReader())}
   [junit4]   2> 1508066 INFO  (searcherExecutor-2630-thread-1-processing-n:127.0.0.1:36154_solr x:timeConfig_shard1_replica_n1 s:shard1 c:timeConfig r:core_node2) [n:127.0.0.1:36154_solr c:timeConfig s:shard1 r:core_node2 x:timeConfig_shard1_replica_n1] o.a.s.c.QuerySenderListener QuerySenderListener done.
   [junit4]   2> 1508069 INFO  (searcherExecutor-2630-thread-1-processing-n:127.0.0.1:36154_solr x:timeConfig_shard1_replica_n1 s:shard1 c:timeConfig r:core_node2) [n:127.0.0.1:36154_solr c:timeConfig s:shard1 r:core_node2 x:timeConfig_shard1_replica_n1] o.a.s.c.SolrCore [timeConfig_shard1_replica_n1] Registered new searcher Searcher@646362d2[timeConfig_shard1_replica_n1] main{ExitableDirectoryReader(UninvertingDirectoryReader())}
   [junit4]   2> 1508077 INFO  (qtp849971433-8758) [n:127.0.0.1:36154_solr c:timeConfig s:shard1 r:core_node2 x:timeConfig_shard1_replica_n1] o.a.s.h.SolrConfigHandler I already have the expected version 0 of config
   [junit4]   2> 1508077 INFO  (qtp849971433-8758) [n:127.0.0.1:36154_solr c:timeConfig s:shard1 r:core_node2 x:timeConfig_shard1_replica_n1] o.a.s.h.SolrConfigHandler isStale false , resourceloader org.apache.solr.cloud.ZkSolrResourceLoader
   [junit4]   2> 1508077 INFO  (qtp849971433-8758) [n:127.0.0.1:36154_solr c:timeConfig s:shard1 r:core_node2 x:timeConfig_shard1_replica_n1] o.a.s.c.S.Request [timeConfig_shard1_replica_n1]  webapp=/solr path=/config/znodeVersion params={overlay=0&wt=javabin&version=2} status=0 QTime=0
   [junit4]   2> 1508078 INFO  (qtp849971433-8759) [n:127.0.0.1:36154_solr c:timeConfig s:shard1 r:core_node2 x:timeConfig_shard1_replica_n1] o.a.s.h.SolrConfigHandler Took 307.0ms to set the property overlay to be of version 0 for collection timeConfig
   [junit4]   2> 1508078 INFO  (qtp849971433-8759) [n:127.0.0.1:36154_solr c:timeConfig s:shard1 r:core_node2 x:timeConfig_shard1_replica_n1] o.a.s.c.SolrCore [timeConfig_shard1_replica_n1]  CLOSING SolrCore org.apache.solr.core.SolrCore@11e6d630
   [junit4]   2> 1508078 INFO  (qtp849971433-8759) [n:127.0.0.1:36154_solr c:timeConfig s:shard1 r:core_node2 x:timeConfig_shard1_replica_n1] o.a.s.m.SolrMetricManager Closing metric reporters for registry=solr.core.timeConfig.shard1.replica_n1, tag=300340784
   [junit4]   2> 1508078 INFO  (qtp849971433-8759) [n:127.0.0.1:36154_solr c:timeConfig s:shard1 r:core_node2 x:timeConfig_shard1_replica_n1] o.a.s.m.r.SolrJmxReporter Closing reporter [org.apache.solr.metrics.reporters.SolrJmxReporter@394c89ea: rootName = solr_36154, domain = solr.core.timeConfig.shard1.replica_n1, service url = null, agent id = null] for registry solr.core.timeConfig.shard1.replica_n1 / com.codahale.metrics.MetricRegistry@2ae286ef
   [junit4]   2> 1508085 INFO  (qtp849971433-8759) [n:127.0.0.1:36154_solr c:timeConfig s:shard1 r:core_node2 x:timeConfig_shard1_replica_n1] o.a.s.m.SolrMetricManager Closing metric reporters for registry=solr.collection.timeConfig.shard1.leader, tag=300340784
   [junit4]   2> 1508111 INFO  (qtp849971433-8758) [n:127.0.0.1:36154_solr c:timeConfig s:shard1 r:core_node2 x:timeConfig_shard1_replica_n1] o.a.s.c.ZkController Persisted config data to node /configs/timeConfig/params.json 
   [junit4]   2> 1508112 INFO  (qtp849971433-8758) [n:127.0.0.1:36154_solr c:timeConfig s:shard1 r:core_node2 x:timeConfig_shard1_replica_n1] o.a.s.h.SolrConfigHandler Waiting up to 30 secs for 1 replicas to set the property params to be of version 1 for collection timeConfig
   [junit4]   2> 1508115 INFO  (Thread-4125) [n:127.0.0.1:36154_solr    ] o.a.s.c.SolrCore config update listener called for core timeConfig_shard1_replica_n1
   [junit4]   2> 1508116 INFO  (Thread-4125) [n:127.0.0.1:36154_solr    ] o.a.s.c.RequestParams conf resource params.json loaded . version : 1 
   [junit4]   2> 1508116 INFO  (Thread-4125) [n:127.0.0.1:36154_solr    ] o.a.s.c.RequestParams request params refreshed to version 1
   [junit4]   2> 1508120 INFO  (solrHandlerExecutor-2634-thread-1-processing-n:127.0.0.1:36154_solr x:timeConfig_shard1_replica_n1 s:shard1 c:timeConfig r:core_node2) [n:127.0.0.1:36154_solr c:timeConfig s:shard1 r:core_node2 x:timeConfig_shard1_replica_n1] o.a.s.h.SolrConfigHandler Time elapsed : 0 secs, maxWait 30
   [junit4]   2> 1508228 INFO  (qtp849971433-8759) [n:127.0.0.1:36154_solr c:timeConfig s:shard1 r:core_node2 x:timeConfig_shard1_replica_n1] o.a.s.h.SolrConfigHandler I already have the expected version 1 of params
   [junit4]   2> 1508229 INFO  (qtp849971433-8759) [n:127.0.0.1:36154_solr c:timeConfig s:shard1 r:core_node2 x:timeConfig_shard1_replica_n1] o.a.s.h.SolrConfigHandler isStale false , resourceloader org.apache.solr.cloud.ZkSolrResourceLoader
   [junit4]   2> 1508229 INFO  (qtp849971433-8759) [n:127.0.0.1:36154_solr c:timeConfig s:shard1 r:core_node2 x:timeConfig_shard1_replica_n1] o.a.s.c.S.Request [timeConfig_shard1_replica_n1]  webapp=/solr path=/config/znodeVersion params={params=1&wt=javabin&version=2} status=0 QTime=0
   [junit4]   2> 1508229 INFO  (qtp849971433-8758) [n:127.0.0.1:36154_solr c:timeConfig s:shard1 r:core_node2 x:timeConfig_shard1_replica_n1] o.a.s.h.SolrConfigHandler Took 117.0ms to set the property params to be of version 1 for collection timeConfig
   [junit4]   2> 1508229 INFO  (qtp849971433-8758) [n:127.0.0.1:36154_solr c:timeConfig s:shard1 r:core_node2 x:timeConfig_shard1_replica_n1] o.a.s.c.S.Request [timeConfig_shard1_replica_n1]  webapp=/solr path=/config/params params={wt=javabin&version=2} status=0 QTime=118
   [junit4]   2> 1508230 INFO  (qtp849971433-8756) [n:127.0.0.1:36154_solr    ] o.a.s.h.a.CollectionsHandler Invoked Collection Action :delete with params name=timeConfig&action=DELETE&wt=javabin&version=2 and sendToOCPQueue=true
   [junit4]   2> 1508232 INFO  (OverseerCollectionConfigSetProcessor-99323945344696326-127.0.0.1:37758_solr-n_0000000000) [n:127.0.0.1:37758_solr    ] o.a.s.c.OverseerTaskQueue Response ZK path: /overseer/collection-queue-work/qnr-0000000000 doesn't exist.  Requestor may have disconnected from ZooKeeper
   [junit4]   2> 1508232 INFO  (OverseerThreadFactory-2619-thread-2-processing-n:127.0.0.1:37758_solr) [n:127.0.0.1:37758_solr    ] o.a.s.c.OverseerCollectionMessageHandler Executing Collection Cmd : action=UNLOAD&deleteInstanceDir=true&deleteDataDir=true
   [junit4]   2> 1508233 INFO  (qtp849971433-8763) [n:127.0.0.1:36154_solr    ] o.a.s.m.SolrMetricManager Closing metric reporters for registry=solr.core.timeConfig.shard1.replica_n1, tag=null
   [junit4]   2> 1508233 INFO  (qtp849971433-8763) [n:127.0.0.1:36154_solr    ] o.a.s.m.r.SolrJmxReporter Closing reporter [org.apache.solr.metrics.reporters.SolrJmxReporter@49255399: rootName = solr_36154, domain = solr.core.timeConfig.shard1.replica_n1, service url = null, agent id = null] for registry solr.core.timeConfig.shard1.replica_n1 / com.codahale.metrics.MetricRegistry@2ae286ef
   [junit4]   2> 1508243 INFO  (qtp849971433-8763) [n:127.0.0.1:36154_solr    ] o.a.s.c.SolrCore [timeConfig_shard1_replica_n1]  CLOSING SolrCore org.apache.solr.core.SolrCore@353535f5
   [junit4]   2> 1508243 INFO  (qtp849971433-8763) [n:127.0.0.1:36154_solr    ] o.a.s.m.SolrMetricManager Closing metric reporters for registry=solr.core.timeConfig.shard1.replica_n1, tag=892679669
   [junit4]   2> 1508243 INFO  (qtp849971433-8763) [n:127.0.0.1:36154_solr    ] o.a.s.m.SolrMetricManager Closing metric reporters for registry=solr.collection.timeConfig.shard1.leader, tag=892679669
   [junit4]   2> 1508247 INFO  (qtp849971433-8763) [n:127.0.0.1:36154_solr    ] o.a.s.s.HttpSolrCall [admin] webapp=null path=/admin/cores params={deleteInstanceDir=true&core=timeConfig_shard1_replica_n1&qt=/admin/cores&deleteDataDir=true&action=UNLOAD&wt=javabin&version=2} status=0 QTime=13
   [junit4]   2> 1508951 INFO  (qtp849971433-8756) [n:127.0.0.1:36154_solr    ] o.a.s.s.HttpSolrCall [admin] webapp=null path=/admin/collections params={name=timeConfig&action=DELETE&wt=javabin&version=2} status=0 QTime=721
   [junit4]   2> 1508952 INFO  (qtp849971433-8762) [n:127.0.0.1:36154_solr    ] o.a.s.h.a.CollectionsHandler Invoked Collection Action :create with params replicationFactor=2&property.timePartitionAliasName=myalias&collection.configName=timeConfig&maxShardsPerNode=2&name=myalias_2017-10-23&nrtReplicas=2&action=CREATE&numShards=2&wt=javabin&version=2 and sendToOCPQueue=true
   [junit4]   2> 1508954 INFO  (OverseerThreadFactory-2619-thread-3-processing-n:127.0.0.1:37758_solr) [n:127.0.0.1:37758_solr    ] o.a.s.c.CreateCollectionCmd Create collection myalias_2017-10-23
   [junit4]   2> 1508954 INFO  (OverseerCollectionConfigSetProcessor-99323945344696326-127.0.0.1:37758_solr-n_0000000000) [n:127.0.0.1:37758_solr    ] o.a.s.c.OverseerTaskQueue Response ZK path: /overseer/collection-queue-work/qnr-0000000002 doesn't exist.  Requestor may have disconnected from ZooKeeper
   [junit4]   2> 1509162 INFO  (OverseerStateUpdate-99323945344696326-127.0.0.1:37758_solr-n_0000000000) [n:127.0.0.1:37758_solr    ] o.a.s.c.o.SliceMutator createReplica() {
   [junit4]   2>   "operation":"ADDREPLICA",
   [junit4]   2>   "collection":"myalias_2017-10-23",
   [junit4]   2>   "shard":"shard1",
   [junit4]   2>   "core":"myalias_2017-10-23_shard1_replica_n1",
   [junit4]   2>   "state":"down",
   [junit4]   2>   "base_url":"https://127.0.0.1:37758/solr",
   [junit4]   2>   "type":"NRT",
   [junit4]   2>   "waitForFinalState":"false"} 
   [junit4]   2> 1509164 INFO  (OverseerStateUpdate-99323945344696326-127.0.0.1:37758_solr-n_0000000000) [n:127.0.0.1:37758_solr    ] o.a.s.c.o.SliceMutator createReplica() {
   [junit4]   2>   "operation":"ADDREPLICA",
   [junit4]   2>   "collection":"myalias_2017-10-23",
   [junit4]   2>   "shard":"shard1",
   [junit4]   2>   "core":"myalias_2017-10-23_shard1_replica_n2",
   [junit4]   2>   "state":"down",
   [junit4]   2>   "base_url":"https://127.0.0.1:36154/solr",
   [junit4]   2>   "type":"NRT",
   [junit4]   2>   "waitForFinalState":"false"} 
   [junit4]   2> 1509175 INFO  (OverseerStateUpdate-99323945344696326-127.0.0.1:37758_solr-n_0000000000) [n:127.0.0.1:37758_solr    ] o.a.s.c.o.SliceMutator createReplica() {
   [junit4]   2>   "operation":"ADDREPLICA",
   [junit4]   2>   "collection":"myalias_2017-10-23",
   [junit4]   2>   "shard":"shard2",
   [junit4]   2>   "core":"myalias_2017-10-23_shard2_replica_n4",
   [junit4]   2>   "state":"down",
   [junit4]   2>   "base_url":"https://127.0.0.1:37758/solr",
   [junit4]   2>   "type":"NRT",
   [junit4]   2>   "waitForFinalState":"false"} 
   [junit4]   2> 1509177 INFO  (OverseerStateUpdate-99323945344696326-127.0.0.1:37758_solr-n_0000000000) [n:127.0.0.1:37758_solr    ] o.a.s.c.o.SliceMutator createReplica() {
   [junit4]   2>   "operation":"ADDREPLICA",
   [junit4]   2>   "collection":"myalias_2017-10-23",
   [junit4]   2>   "shard":"shard2",
   [junit4]   2>   "core":"myalias_2017-10-23_shard2_replica_n6",
   [junit4]   2>   "state":"down",
   [junit4]   2>   "base_url":"https://127.0.0.1:36154/solr",
   [junit4]   2>   "type":"NRT",
   [junit4]   2>   "waitForFinalState":"false"} 
   [junit4]   2> 1509392 INFO  (qtp849971433-8759) [n:127.0.0.1:36154_solr    ] o.a.s.h.a.CoreAdminOperation core create command qt=/admin/cores&collection.configName=timeConfig&newCollection=true&collection=myalias_2017-10-23&version=2&replicaType=NRT&coreNodeName=core_node5&property.timePartitionAliasName=myalias&name=myalias_2017-10-23_shard1_replica_n2&action=CREATE&numShards=2&shard=shard1&wt=javabin
   [junit4]   2> 1509392 INFO  (qtp892038354-8749) [n:127.0.0.1:37758_solr    ] o.a.s.h.a.CoreAdminOperation core create command qt=/admin/cores&collection.configName=timeConfig&newCollection=true&collection=myalias_2017-10-23&version=2&replicaType=NRT&coreNodeName=core_node3&property.timePartitionAliasName=myalias&name=myalias_2017-10-23_shard1_replica_n1&action=CREATE&numShards=2&shard=shard1&wt=javabin
   [junit4]   2> 1509392 INFO  (qtp892038354-8749) [n:127.0.0.1:37758_solr    ] o.a.s.c.TransientSolrCoreCacheDefault Allocating transient cache for 2147483647 transient cores
   [junit4]   2> 1509409 INFO  (qtp892038354-8750) [n:127.0.0.1:37758_solr    ] o.a.s.h.a.CoreAdminOperation core create command qt=/admin/cores&collection.configName=timeConfig&newCollection=true&collection=myalias_2017-10-23&version=2&replicaType=NRT&coreNodeName=core_node7&property.timePartitionAliasName=myalias&name=myalias_2017-10-23_shard2_replica_n4&action=CREATE&numShards=2&shard=shard2&wt=javabin
   [junit4]   2> 1509410 INFO  (qtp849971433-8763) [n:127.0.0.1:36154_solr    ] o.a.s.h.a.CoreAdminOperation core create command qt=/admin/cores&collection.configName=timeConfig&newCollection=true&collection=myalias_2017-10-23&version=2&replicaType=NRT&coreNodeName=core_node8&property.timePartitionAliasName=myalias&name=myalias_2017-10-23_shard2_replica_n6&action=CREATE&numShards=2&shard=shard2&wt=javabin
   [junit4]   2> 1509512 INFO  (zkCallback-1308-thread-1-processing-n:127.0.0.1:36154_solr) [n:127.0.0.1:36154_solr    ] o.a.s.c.c.ZkStateReader A cluster state change: [WatchedEvent state:SyncConnected type:NodeDataChanged path:/collections/myalias_2017-10-23/state.json] for collection [myalias_2017-10-23] has occurred - updating... (live nodes size: [2])
   [junit4]   2> 1509512 INFO  (zkCallback-1308-thread-2-processing-n:127.0.0.1:36154_solr) [n:127.0.0.1:36154_solr    ] o.a.s.c.c.ZkStateReader A cluster state change: [WatchedEvent state:SyncConnected type:NodeDataChanged path:/collections/myalias_2017-10-23/state.json] for collection [myalias_2017-10-23] has occurred - updating... (live nodes size: [2])
   [junit4]   2> 1509513 INFO  (zkCallback-1310-thread-1-processing-n:127.0.0.1:37758_solr) [n:127.0.0.1:37758_solr    ] o.a.s.c.c.ZkStateReader A cluster state change: [WatchedEvent state:SyncConnected type:NodeDataChanged path:/collections/myalias_2017-10-23/state.json] for collection [myalias_2017-10-23] has occurred - updating... (live nodes size: [2])
   [junit4]   2> 1509513 INFO  (zkCallback-1310-thread-2-processing-n:127.0.0.1:37758_solr) [n:127.0.0.1:37758_solr    ] o.a.s.c.c.ZkStateReader A cluster state change: [WatchedEvent state:SyncConnected type:NodeDataChanged path:/collections/myalias_2017-10-23/state.json] for collection [myalias_2017-10-23] has occurred - updating... (live nodes size: [2])
   [junit4]   2> 1510403 INFO  (qtp849971433-8759) [n:127.0.0.1:36154_solr c:myalias_2017-10-23 s:shard1 r:core_node5 x:myalias_2017-10-23_shard1_replica_n2] o.a.s.c.RequestParams conf resource params.json loaded . version : 1 
   [junit4]   2> 1510403 INFO  (qtp849971433-8759) [n:127.0.0.1:36154_solr c:myalias_2017-10-23 s:shard1 r:core_node5 x:myalias_2017-10-23_shard1_replica_n2] o.a.s.c.RequestParams request params refreshed to version 1
   [junit4]   2> 1510404 WARN  (qtp849971433-8759) [n:127.0.0.1:36154_solr c:myalias_2017-10-23 s:shard1 r:core_node5 x:myalias_2017-10-23_shard1_replica_n2] o.a.s.c.SolrConfig Couldn't add files from /home/jenkins/jenkins-slave/workspace/Lucene-Solr-Tests-master/solr/build/solr-core/test/J0/temp/solr.update.processor.TimeRoutedAliasUpdateProcessorTest_DF868EAC660D298E-001/tempDir-001/node2/myalias_2017-10-23_shard1_replica_n2/../../../../contrib/extraction/lib filtered by .*\.jar to classpath: /home/jenkins/jenkins-slave/workspace/Lucene-Solr-Tests-master/solr/build/solr-core/test/J0/temp/solr.update.processor.TimeRoutedAliasUpdateProcessorTest_DF868EAC660D298E-001/tempDir-001/node2/myalias_2017-10-23_shard1_replica_n2/../../../../contrib/extraction/lib
   [junit4]   2> 1510404 WARN  (qtp849971433-8759) [n:127.0.0.1:36154_solr c:myalias_2017-10-23 s:shard1 r:core_node5 x:myalias_2017-10-23_shard1_replica_n2] o.a.s.c.SolrConfig Couldn't add files from /home/jenkins/jenkins-slave/workspace/Lucene-Solr-Tests-master/solr/build/solr-core/test/J0/temp/solr.update.processor.TimeRoutedAliasUpdateProcessorTest_DF868EAC660D298E-001/tempDir-001/node2/myalias_2017-10-23_shard1_replica_n2/../../../../dist filtered by solr-cell-\d.*\.jar to classpath: /home/jenkins/jenkins-slave/workspace/Lucene-Solr-Tests-master/solr/build/solr-core/test/J0/temp/solr.update.processor.TimeRoutedAliasUpdateProcessorTest_DF868EAC660D298E-001/tempDir-001/node2/myalias_2017-10-23_shard1_replica_n2/../../../../dist
   [junit4]   2> 1510404 WARN  (qtp849971433-8759) [n:127.0.0.1:36154_solr c:myalias_2017-10-23 s:shard1 r:core_node5 x:myalias_2017-10-23_shard1_replica_n2] o.a.s.c.SolrConfig Couldn't add files from /home/jenkins/jenkins-slave/workspace/Lucene-Solr-Tests-master/solr/build/solr-core/test/J0/temp/solr.update.processor.TimeRoutedAliasUpdateProcessorTest_DF868EAC660D298E-001/tempDir-001/node2/myalias_2017-10-23_shard1_replica_n2/../../../../contrib/clustering/lib filtered by .*\.jar to classpath: /home/jenkins/jenkins-slave/workspace/Lucene-Solr-Tests-master/solr/build/solr-core/test/J0/temp/solr.update.processor.TimeRoutedAliasUpdateProcessorTest_DF868EAC660D298E-001/tempDir-001/node2/myalias_2017-10-23_shard1_replica_n2/../../../../contrib/clustering/lib
   [junit4]   2> 1510404 WARN  (qtp849971433-8759) [n:127.0.0.1:36154_solr c:myalias_2017-10-23 s:shard1 r:core_node5 x:myalias_2017-10-23_shard1_replica_n2] o.a.s.c.SolrConfig Couldn't add files from /home/jenkins/jenkins-slave/workspace/Lucene-Solr-Tests-master/solr/build/solr-core/test/J0/temp/solr.update.processor.TimeRoutedAliasUpdateProcessorTest_DF868EAC660D298E-001/tempDir-001/node2/myalias_2017-10-23_shard1_replica_n2/../../../../dist filtered by solr-clustering-\d.*\.jar to classpath: /home/jenkins/jenkins-slave/workspace/Lucene-Solr-Tests-master/solr/build/solr-core/test/J0/temp/solr.update.processor.TimeRoutedAliasUpdateProcessorTest_DF868EAC660D298E-001/tempDir-001/node2/myalias_2017-10-23_shard1_replica_n2/../../../../dist
   [junit4]   2> 1510404 WARN  (qtp849971433-8759) [n:127.0.0.1:36154_solr c:myalias_2017-10-23 s:shard1 r:core_node5 x:myalias_2017-10-23_shard1_replica_n2] o.a.s.c.SolrConfig Couldn't add files from /home/jenkins/jenkins-slave/workspace/Lucene-Solr-Tests-master/solr/build/solr-core/test/J0/temp/solr.update.processor.TimeRoutedAliasUpdateProcessorTest_DF868EAC660D298E-001/tempDir-001/node2/myalias_2017-10-23_shard1_replica_n2/../../../../contrib/langid/lib filtered by .*\.jar to classpath: /home/jenkins/jenkins-slave/workspace/Lucene-Solr-Tests-master/solr/build/solr-core/test/J0/temp/solr.update.processor.TimeRoutedAliasUpdateProcessorTest_DF868EAC660D298E-001/tempDir-001/node2/myalias_2017-10-23_shard1_replica_n2/../../../../contrib/langid/lib
   [junit4]   2> 1510405 WARN  (qtp849971433-8759) [n:127.0.0.1:36154_solr c:myalias_2017-10-23 s:shard1 r:core_node5 x:myalias_2017-10-23_shard1_replica_n2] o.a.s.c.SolrConfig Couldn't add files from /home/jenkins/jenkins-slave/workspace/Lucene-Solr-Tests-master/solr/build/solr-core/test/J0/temp/solr.update.processor.TimeRoutedAliasUpdateProcessorTest_DF868EAC660D298E-001/tempDir-001/node2/myalias_2017-10-23_shard1_replica_n2/../../../../dist filtered by solr-langid-\d.*\.jar to classpath: /home/jenkins/jenkins-slave/workspace/Lucene-Solr-Tests-master/solr/build/solr-core/test/J0/temp/solr.update.processor.TimeRoutedAliasUpdateProcessorTest_DF868EAC660D298E-001/tempDir-001/node2/myalias_2017-10-23_shard1_replica_n2/../../../../dist
   [junit4]   2> 1510405 WARN  (qtp849971433-8759) [n:127.0.0.1:36154_solr c:myalias_2017-10-23 s:shard1 r:core_node5 x:myalias_2017-10-23_shard1_replica_n2] o.a.s.c.SolrConfig Couldn't add files from /home/jenkins/jenkins-slave/workspace/Lucene-Solr-Tests-master/solr/build/solr-core/test/J0/temp/solr.update.processor.TimeRoutedAliasUpdateProcessorTest_DF868EAC660D298E-001/tempDir-001/node2/myalias_2017-10-23_shard1_replica_n2/../../../../contrib/velocity/lib filtered by .*\.jar to classpath: /home/jenkins/jenkins-slave/workspace/Lucene-Solr-Tests-master/solr/build/solr-core/test/J0/temp/solr.update.processor.TimeRoutedAliasUpdateProcessorTest_DF868EAC660D298E-001/tempDir-001/node2/myalias_2017-10-23_shard1_replica_n2/../../../../contrib/velocity/lib
   [junit4]   2> 1510405 WARN  (qtp849971433-8759) [n:127.0.0.1:36154_solr c:myalias_2017-10-23 s:shard1 r:core_node5 x:myalias_2017-10-23_shard1_replica_n2] o.a.s.c.SolrConfig Couldn't add files from /home/jenkins/jenkins-slave/workspace/Lucene-Solr-Tests-master/solr/build/solr-core/test/J0/temp/solr.update.processor.TimeRoutedAliasUpdateProcessorTest_DF868EAC660D298E-001/tempDir-001/node2/myalias_2017-10-23_shard1_replica_n2/../../../../dist filtered by solr-velocity-\d.*\.jar to classpath: /home/jenkins/jenkins-slave/workspace/Lucene-Solr-Tests-master/solr/build/solr-core/test/J0/temp/solr.update.processor.TimeRoutedAliasUpdateProcessorTest_DF868EAC660D298E-001/tempDir-001/node2/myalias_2017-10-23_shard1_replica_n2/../../../../dist
   [junit4]   2> 1510406 INFO  (qtp892038354-8749) [n:127.0.0.1:37758_solr c:myalias_2017-10-23 s:shard1 r:core_node3 x:myalias_2017-10-23_shard1_replica_n1] o.a.s.c.RequestParams conf resource params.json loaded . version : 1 
   [junit4]   2> 1510406 INFO  (qtp892038354-8749) [n:127.0.0.1:37758_solr c:myalias_2017-10-23 s:shard1 r:core_node3 x:myalias_2017-10-23_shard1_replica_n1] o.a.s.c.RequestParams request params refreshed to version 1
   [junit4]   2> 1510406 WARN  (qtp892038354-8749) [n:127.0.0.1:37758_solr c:myalias_2017-10-23 s:shard1 r:core_node3 x:myalias_2017-10-23_shard1_replica_n1] o.a.s.c.SolrConfig Couldn't add files from /home/jenkins/jenkins-slave/workspace/Lucene-Solr-Tests-master/solr/build/solr-core/test/J0/temp/solr.update.processor.TimeRoutedAliasUpdateProcessorTest_DF868EAC660D298E-001/tempDir-001/node1/myalias_2017-10-23_shard1_replica_n1/../../../../contrib/extraction/lib filtered by .*\.jar to classpath: /home/jenkins/jenkins-slave/workspace/Lucene-Solr-Tests-master/solr/build/solr-core/test/J0/temp/solr.update.processor.TimeRoutedAliasUpdateProcessorTest_DF868EAC660D298E-001/tempDir-001/node1/myalias_2017-10-23_shard1_replica_n1/../../../../contrib/extraction/lib
   [junit4]   2> 1510407 WARN  (qtp892038354-8749) [n:127.0.0.1:37758_solr c:myalias_2017-10-23 s:shard1 r:core_node3 x:myalias_2017-10-23_shard1_replica_n1] o.a.s.c.SolrConfig Couldn't add files from /home/jenkins/jenkins-slave/workspace/Lucene-Solr-Tests-master/solr/build/solr-core/test/J0/temp/solr.update.processor.TimeRoutedAliasUpdateProcessorTest_DF868EAC660D298E-001/tempDir-001/node1/myalias_2017-10-23_shard1_replica_n1/../../../../dist filtered by solr-cell-\d.*\.jar to classpath: /home/jenkins/jenkins-slave/workspace/Lucene-Solr-Tests-master/solr/build/solr-core/test/J0/temp/solr.update.processor.TimeRoutedAliasUpdateProcessorTest_DF868EAC660D298E-001/tempDir-001/node1/myalias_2017-10-23_shard1_replica_n1/../../../../dist
   [junit4]   2> 1510407 WARN  (qtp892038354-8749) [n:127.0.0.1:37758_solr c:myalias_2017-10-23 s:shard1 r:core_node3 x:myalias_2017-10-23_shard1_replica_n1] o.a.s.c.SolrConfig Couldn't add files from /home/jenkins/jenkins-slave/workspace/Lucene-Solr-Tests-master/solr/build/solr-core/test/J0/temp/solr.update.processor.TimeRoutedAliasUpdateProcessorTest_DF868EAC660D298E-001/tempDir-001/node1/myalias_2017-10-23_shard1_replica_n1/../../../../contrib/clustering/lib filtered by .*\.jar to classpath: /home/jenkins/jenkins-slave/workspace/Lucene-Solr-Tests-master/solr/build/solr-core/test/J0/temp/solr.update.processor.TimeRoutedAliasUpdateProcessorTest_DF868EAC660D298E-001/tempDir-001/node1/myalias_2017-10-23_shard1_replica_n1/../../../../contrib/clustering/lib
   [junit4]   2> 1510407 WARN  (qtp892038354-8749) [n:127.0.0.1:37758_solr c:myalias_2017-10-23 s:shard1 r:core_node3 x:myalias_2017-10-23_shard1_replica_n1] o.a.s.c.SolrConfig Couldn't add files from /home/jenkins/jenkins-slave/workspace/Lucene-Solr-Tests-master/solr/build/solr-core/test/J0/temp/solr.update.processor.TimeRoutedAliasUpdateProcessorTest_DF868EAC660D298E-001/tempDir-001/node1/myalias_2017-10-23_shard1_replica_n1/../../../../dist filtered by solr-clustering-\d.*\.jar to classpath: /home/jenkins/jenkins-slave/workspace/Lucene-Solr-Tests-master/solr/build/solr-core/test/J0/temp/solr.update.processor.TimeRoutedAliasUpdateProcessorTest_DF868EAC660D298E-001/tempDir-001/node1/myalias_2017-10-23_shard1_replica_n1/../../../../dist
   [junit4]   2> 1510407 WARN  (qtp892038354-8749) [n:127.0.0.1:37758_solr c:myalias_2017-10-23 s:shard1 r:core_node3 x:myalias_2017-10-23_shard1_replica_n1] o.a.s.c.SolrConfig Couldn't add files from /home/jenkins/jenkins-slave/workspace/Lucene-Solr-Tests-master/solr/build/solr-core/test/J0/temp/solr.update.processor.TimeRoutedAliasUpdateProcessorTest_DF868EAC660D298E-001/tempDir-001/node1/myalias_2017-10-23_shard1_replica_n1/../../../../contrib/langid/lib filtered by .*\.jar to classpath: /home/jenkins/jenkins-slave/workspace/Lucene-Solr-Tests-master/solr/build/solr-core/test/J0/temp/solr.update.processor.TimeRo

[...truncated too long message...]

) -> (0)
   [junit4]   2> 1524421 INFO  (coreCloseExecutor-2672-thread-1) [n:127.0.0.1:37758_solr c:myalias_2017-10-24 s:shard1 r:core_node2 x:myalias_2017-10-24_shard1_replica_n1] o.a.s.c.SolrCore [myalias_2017-10-24_shard1_replica_n1]  CLOSING SolrCore org.apache.solr.core.SolrCore@6c2dc0a8
   [junit4]   2> 1524421 INFO  (coreCloseExecutor-2672-thread-1) [n:127.0.0.1:37758_solr c:myalias_2017-10-24 s:shard1 r:core_node2 x:myalias_2017-10-24_shard1_replica_n1] o.a.s.m.SolrMetricManager Closing metric reporters for registry=solr.core.myalias_2017-10-24.shard1.replica_n1, tag=1814937768
   [junit4]   2> 1524421 INFO  (coreCloseExecutor-2672-thread-1) [n:127.0.0.1:37758_solr c:myalias_2017-10-24 s:shard1 r:core_node2 x:myalias_2017-10-24_shard1_replica_n1] o.a.s.m.r.SolrJmxReporter Closing reporter [org.apache.solr.metrics.reporters.SolrJmxReporter@29c6d3d5: rootName = solr_37758, domain = solr.core.myalias_2017-10-24.shard1.replica_n1, service url = null, agent id = null] for registry solr.core.myalias_2017-10-24.shard1.replica_n1 / com.codahale.metrics.MetricRegistry@6302ea68
   [junit4]   2> 1524422 INFO  (coreCloseExecutor-2672-thread-2) [n:127.0.0.1:37758_solr c:myalias_2017-10-26 s:shard1 r:core_node2 x:myalias_2017-10-26_shard1_replica_n1] o.a.s.c.SolrCore [myalias_2017-10-26_shard1_replica_n1]  CLOSING SolrCore org.apache.solr.core.SolrCore@6850e9d
   [junit4]   2> 1524442 INFO  (coreCloseExecutor-2671-thread-1) [n:127.0.0.1:36154_solr c:myalias_2017-10-25 s:shard1 r:core_node2 x:myalias_2017-10-25_shard1_replica_n1] o.a.s.m.SolrMetricManager Closing metric reporters for registry=solr.collection.myalias_2017-10-25.shard1.leader, tag=514230075
   [junit4]   2> 1524442 INFO  (coreCloseExecutor-2671-thread-1) [n:127.0.0.1:36154_solr c:myalias_2017-10-25 s:shard1 r:core_node2 x:myalias_2017-10-25_shard1_replica_n1] o.a.s.u.DirectUpdateHandler2 Committing on IndexWriter close.
   [junit4]   2> 1524443 INFO  (coreCloseExecutor-2671-thread-1) [n:127.0.0.1:36154_solr c:myalias_2017-10-25 s:shard1 r:core_node2 x:myalias_2017-10-25_shard1_replica_n1] o.a.s.u.SolrIndexWriter Calling setCommitData with IW:org.apache.solr.update.SolrIndexWriter@6d058e42 commitCommandVersion:0
   [junit4]   2> 1524463 INFO  (jetty-closer-1293-thread-1) [    ] o.e.j.s.h.ContextHandler Stopped o.e.j.s.ServletContextHandler@15ea0a01{/solr,null,UNAVAILABLE}
   [junit4]   2> 1524474 INFO  (coreCloseExecutor-2672-thread-1) [n:127.0.0.1:37758_solr c:myalias_2017-10-24 s:shard1 r:core_node2 x:myalias_2017-10-24_shard1_replica_n1] o.a.s.m.SolrMetricManager Closing metric reporters for registry=solr.collection.myalias_2017-10-24.shard1.leader, tag=1814937768
   [junit4]   2> 1524475 INFO  (coreCloseExecutor-2672-thread-2) [n:127.0.0.1:37758_solr c:myalias_2017-10-26 s:shard1 r:core_node2 x:myalias_2017-10-26_shard1_replica_n1] o.a.s.m.SolrMetricManager Closing metric reporters for registry=solr.core.myalias_2017-10-26.shard1.replica_n1, tag=109383325
   [junit4]   2> 1524475 INFO  (coreCloseExecutor-2672-thread-2) [n:127.0.0.1:37758_solr c:myalias_2017-10-26 s:shard1 r:core_node2 x:myalias_2017-10-26_shard1_replica_n1] o.a.s.m.r.SolrJmxReporter Closing reporter [org.apache.solr.metrics.reporters.SolrJmxReporter@782c1921: rootName = solr_37758, domain = solr.core.myalias_2017-10-26.shard1.replica_n1, service url = null, agent id = null] for registry solr.core.myalias_2017-10-26.shard1.replica_n1 / com.codahale.metrics.MetricRegistry@22acfc8f
   [junit4]   2> 1524475 INFO  (coreCloseExecutor-2672-thread-1) [n:127.0.0.1:37758_solr c:myalias_2017-10-24 s:shard1 r:core_node2 x:myalias_2017-10-24_shard1_replica_n1] o.a.s.u.DirectUpdateHandler2 Committing on IndexWriter close.
   [junit4]   2> 1524475 INFO  (coreCloseExecutor-2672-thread-1) [n:127.0.0.1:37758_solr c:myalias_2017-10-24 s:shard1 r:core_node2 x:myalias_2017-10-24_shard1_replica_n1] o.a.s.u.SolrIndexWriter Calling setCommitData with IW:org.apache.solr.update.SolrIndexWriter@47b33ec commitCommandVersion:0
   [junit4]   2> 1524482 INFO  (coreCloseExecutor-2672-thread-2) [n:127.0.0.1:37758_solr c:myalias_2017-10-26 s:shard1 r:core_node2 x:myalias_2017-10-26_shard1_replica_n1] o.a.s.m.SolrMetricManager Closing metric reporters for registry=solr.collection.myalias_2017-10-26.shard1.leader, tag=109383325
   [junit4]   2> 1524482 INFO  (coreCloseExecutor-2672-thread-2) [n:127.0.0.1:37758_solr c:myalias_2017-10-26 s:shard1 r:core_node2 x:myalias_2017-10-26_shard1_replica_n1] o.a.s.u.DirectUpdateHandler2 Committing on IndexWriter close.
   [junit4]   2> 1524482 INFO  (coreCloseExecutor-2672-thread-2) [n:127.0.0.1:37758_solr c:myalias_2017-10-26 s:shard1 r:core_node2 x:myalias_2017-10-26_shard1_replica_n1] o.a.s.u.SolrIndexWriter Calling setCommitData with IW:org.apache.solr.update.SolrIndexWriter@285497ff commitCommandVersion:0
   [junit4]   2> 1524501 INFO  (jetty-closer-1293-thread-2) [    ] o.a.s.c.Overseer Overseer (id=99323945344696326-127.0.0.1:37758_solr-n_0000000000) closing
   [junit4]   2> 1524501 INFO  (OverseerStateUpdate-99323945344696326-127.0.0.1:37758_solr-n_0000000000) [n:127.0.0.1:37758_solr    ] o.a.s.c.Overseer Overseer Loop exiting : 127.0.0.1:37758_solr
   [junit4]   2> 1524504 WARN  (OverseerAutoScalingTriggerThread-99323945344696326-127.0.0.1:37758_solr-n_0000000000) [n:127.0.0.1:37758_solr    ] o.a.s.c.a.OverseerTriggerThread OverseerTriggerThread woken up but we are closed, exiting.
   [junit4]   2> 1524521 INFO  (jetty-closer-1293-thread-2) [    ] o.e.j.s.h.ContextHandler Stopped o.e.j.s.ServletContextHandler@26aa2fdc{/solr,null,UNAVAILABLE}
   [junit4]   2> 1524522 ERROR (SUITE-TimeRoutedAliasUpdateProcessorTest-seed#[DF868EAC660D298E]-worker) [    ] o.a.z.s.ZooKeeperServer ZKShutdownHandler is not registered, so ZooKeeper server won't take any action on ERROR or SHUTDOWN server state changes
   [junit4]   2> 1524523 INFO  (SUITE-TimeRoutedAliasUpdateProcessorTest-seed#[DF868EAC660D298E]-worker) [    ] o.a.s.c.ZkTestServer connecting to 127.0.0.1:39218 39218
   [junit4]   2> 1524583 INFO  (Thread-4105) [    ] o.a.s.c.ZkTestServer connecting to 127.0.0.1:39218 39218
   [junit4]   2> 1524584 WARN  (Thread-4105) [    ] o.a.s.c.ZkTestServer Watch limit violations: 
   [junit4]   2> Maximum concurrent create/delete watches above limit:
   [junit4]   2> 
   [junit4]   2> 	9	/solr/configs/timeConfig/managed-schema
   [junit4]   2> 	6	/solr/configs/timeConfig
   [junit4]   2> 	6	/solr/aliases.json
   [junit4]   2> 	2	/solr/security.json
   [junit4]   2> 
   [junit4]   2> Maximum concurrent data watches above limit:
   [junit4]   2> 
   [junit4]   2> 	14	/solr/collections/myalias_2017-10-23/state.json
   [junit4]   2> 	6	/solr/clusterprops.json
   [junit4]   2> 	6	/solr/clusterstate.json
   [junit4]   2> 	5	/solr/collections/myalias_2017-10-25/state.json
   [junit4]   2> 	5	/solr/collections/myalias_2017-10-24/state.json
   [junit4]   2> 	5	/solr/collections/myalias_2017-10-26/state.json
   [junit4]   2> 	5	/solr/collections/timeConfig/state.json
   [junit4]   2> 
   [junit4]   2> Maximum concurrent children watches above limit:
   [junit4]   2> 
   [junit4]   2> 	6	/solr/live_nodes
   [junit4]   2> 	6	/solr/collections
   [junit4]   2> 
   [junit4]   2> NOTE: leaving temporary files on disk at: /home/jenkins/jenkins-slave/workspace/Lucene-Solr-Tests-master/solr/build/solr-core/test/J0/temp/solr.update.processor.TimeRoutedAliasUpdateProcessorTest_DF868EAC660D298E-001
   [junit4]   2> Jan 10, 2018 5:45:51 AM com.carrotsearch.randomizedtesting.ThreadLeakControl checkThreadLeaks
   [junit4]   2> WARNING: Will linger awaiting termination of 1 leaked thread(s).
   [junit4]   2> NOTE: test params are: codec=Asserting(Lucene70): {}, docValues:{}, maxPointsInLeafNode=1168, maxMBSortInHeap=6.514598185947125, sim=Asserting(org.apache.lucene.search.similarities.AssertingSimilarity@39f418ef), locale=de-GR, timezone=Africa/Lome
   [junit4]   2> NOTE: Linux 4.4.0-104-generic amd64/Oracle Corporation 1.8.0_152 (64-bit)/cpus=4,threads=1,free=132661568,total=526385152
   [junit4]   2> NOTE: All tests run in this JVM: [LeaderInitiatedRecoveryOnCommitTest, AnalyticsQueryTest, CustomHighlightComponentTest, TestSubQueryTransformerCrossCore, LeaderElectionContextKeyTest, HdfsRecoveryZkTest, TestOverriddenPrefixQueryForCustomFieldType, TestSolrCloudWithHadoopAuthPlugin, OverseerStatusTest, DistanceUnitsTest, DocValuesTest, OverseerCollectionConfigSetProcessorTest, SoftAutoCommitTest, JavabinLoaderTest, DistributedQueryElevationComponentTest, DistributedFacetExistsSmallTest, PreAnalyzedFieldManagedSchemaCloudTest, BasicFunctionalityTest, TestPointFields, TestAnalyzeInfixSuggestions, MinimalSchemaTest, HdfsWriteToMultipleCollectionsTest, TestFreeTextSuggestions, HttpTriggerListenerTest, TestMissingGroups, DataDrivenBlockJoinTest, HdfsCollectionsAPIDistributedZkTest, CheckHdfsIndexTest, BigEndianAscendingWordDeserializerTest, TestLegacyNumericUtils, TestFoldingMultitermQuery, MetricsHandlerTest, SpellCheckCollatorTest, TestScoreJoinQPNoScore, PeerSyncTest, ClassificationUpdateProcessorTest, TestHttpShardHandlerFactory, TestComplexPhraseQParserPlugin, TestDistribDocBasedVersion, DirectUpdateHandlerOptimizeTest, DeleteInactiveReplicaTest, TestSchemaSimilarityResource, GraphQueryTest, TestFieldCacheVsDocValues, SimpleFacetsTest, SliceStateTest, DistribCursorPagingTest, DistributedQueryComponentCustomSortTest, TestEmbeddedSolrServerSchemaAPI, TestConfig, TestRandomRequestDistribution, ResourceLoaderTest, DistributedQueueTest, RequestLoggingTest, TestStreamBody, TestComputePlanAction, TestManagedSchema, TestConfigOverlay, FastVectorHighlighterTest, SubstringBytesRefFilterTest, SyncSliceTest, TestRecovery, BlockDirectoryTest, TestTolerantUpdateProcessorRandomCloud, CoreAdminRequestStatusTest, TestSolrConfigHandlerConcurrent, TestInitParams, ResponseHeaderTest, TimeRoutedAliasUpdateProcessorTest]
   [junit4] Completed [221/767 (1!)] on J0 in 21.36s, 2 tests, 1 error <<< FAILURES!

[...truncated 50012 lines...]

Mime
View raw message