lucene-dev mailing list archives

Site index · List index
Message view « Date » · « Thread »
Top « Date » · « Thread »
From Policeman Jenkins Server <jenk...@thetaphi.de>
Subject [JENKINS] Lucene-Solr-master-Solaris (64bit/jdk1.8.0) - Build # 1599 - Unstable!
Date Mon, 01 Jan 2018 18:53:44 GMT
Build: https://jenkins.thetaphi.de/job/Lucene-Solr-master-Solaris/1599/
Java: 64bit/jdk1.8.0 -XX:+UseCompressedOops -XX:+UseConcMarkSweepGC

1 tests failed.
FAILED:  org.apache.lucene.spatial3d.geom.GeoExactCircleTest.RandomPointBearingCardinalTest
{seed=[9B396D4370D9A417:2EB1A7D9D6576B3F]}

Error Message:
PlanetModel(ab=1.4480214400167273 c=0.9401231636665168) 0.03351679378070793 2.7289712469337446

Stack Trace:
java.lang.AssertionError: PlanetModel(ab=1.4480214400167273 c=0.9401231636665168) 0.03351679378070793
2.7289712469337446
	at __randomizedtesting.SeedInfo.seed([9B396D4370D9A417:2EB1A7D9D6576B3F]:0)
	at org.junit.Assert.fail(Assert.java:93)
	at org.junit.Assert.assertTrue(Assert.java:43)
	at org.apache.lucene.spatial3d.geom.GeoExactCircleTest.checkBearingPoint(GeoExactCircleTest.java:117)
	at org.apache.lucene.spatial3d.geom.GeoExactCircleTest.RandomPointBearingCardinalTest(GeoExactCircleTest.java:109)
	at sun.reflect.GeneratedMethodAccessor5.invoke(Unknown Source)
	at sun.reflect.DelegatingMethodAccessorImpl.invoke(DelegatingMethodAccessorImpl.java:43)
	at java.lang.reflect.Method.invoke(Method.java:498)
	at com.carrotsearch.randomizedtesting.RandomizedRunner.invoke(RandomizedRunner.java:1737)
	at com.carrotsearch.randomizedtesting.RandomizedRunner$8.evaluate(RandomizedRunner.java:934)
	at com.carrotsearch.randomizedtesting.RandomizedRunner$9.evaluate(RandomizedRunner.java:970)
	at com.carrotsearch.randomizedtesting.RandomizedRunner$10.evaluate(RandomizedRunner.java:984)
	at org.apache.lucene.util.TestRuleSetupTeardownChained$1.evaluate(TestRuleSetupTeardownChained.java:49)
	at org.apache.lucene.util.AbstractBeforeAfterRule$1.evaluate(AbstractBeforeAfterRule.java:45)
	at org.apache.lucene.util.TestRuleThreadAndTestName$1.evaluate(TestRuleThreadAndTestName.java:48)
	at org.apache.lucene.util.TestRuleIgnoreAfterMaxFailures$1.evaluate(TestRuleIgnoreAfterMaxFailures.java:64)
	at org.apache.lucene.util.TestRuleMarkFailure$1.evaluate(TestRuleMarkFailure.java:47)
	at com.carrotsearch.randomizedtesting.rules.StatementAdapter.evaluate(StatementAdapter.java:36)
	at com.carrotsearch.randomizedtesting.ThreadLeakControl$StatementRunner.run(ThreadLeakControl.java:368)
	at com.carrotsearch.randomizedtesting.ThreadLeakControl.forkTimeoutingTask(ThreadLeakControl.java:817)
	at com.carrotsearch.randomizedtesting.ThreadLeakControl$3.evaluate(ThreadLeakControl.java:468)
	at com.carrotsearch.randomizedtesting.RandomizedRunner.runSingleTest(RandomizedRunner.java:943)
	at com.carrotsearch.randomizedtesting.RandomizedRunner$5.evaluate(RandomizedRunner.java:829)
	at com.carrotsearch.randomizedtesting.RandomizedRunner$6.evaluate(RandomizedRunner.java:879)
	at com.carrotsearch.randomizedtesting.RandomizedRunner$7.evaluate(RandomizedRunner.java:890)
	at org.apache.lucene.util.AbstractBeforeAfterRule$1.evaluate(AbstractBeforeAfterRule.java:45)
	at com.carrotsearch.randomizedtesting.rules.StatementAdapter.evaluate(StatementAdapter.java:36)
	at org.apache.lucene.util.TestRuleStoreClassName$1.evaluate(TestRuleStoreClassName.java:41)
	at com.carrotsearch.randomizedtesting.rules.NoShadowingOrOverridesOnMethodsRule$1.evaluate(NoShadowingOrOverridesOnMethodsRule.java:40)
	at com.carrotsearch.randomizedtesting.rules.NoShadowingOrOverridesOnMethodsRule$1.evaluate(NoShadowingOrOverridesOnMethodsRule.java:40)
	at com.carrotsearch.randomizedtesting.rules.StatementAdapter.evaluate(StatementAdapter.java:36)
	at com.carrotsearch.randomizedtesting.rules.StatementAdapter.evaluate(StatementAdapter.java:36)
	at com.carrotsearch.randomizedtesting.rules.StatementAdapter.evaluate(StatementAdapter.java:36)
	at org.apache.lucene.util.TestRuleAssertionsRequired$1.evaluate(TestRuleAssertionsRequired.java:53)
	at org.apache.lucene.util.TestRuleMarkFailure$1.evaluate(TestRuleMarkFailure.java:47)
	at org.apache.lucene.util.TestRuleIgnoreAfterMaxFailures$1.evaluate(TestRuleIgnoreAfterMaxFailures.java:64)
	at org.apache.lucene.util.TestRuleIgnoreTestSuites$1.evaluate(TestRuleIgnoreTestSuites.java:54)
	at com.carrotsearch.randomizedtesting.rules.StatementAdapter.evaluate(StatementAdapter.java:36)
	at com.carrotsearch.randomizedtesting.ThreadLeakControl$StatementRunner.run(ThreadLeakControl.java:368)
	at java.lang.Thread.run(Thread.java:748)




Build Log:
[...truncated 9688 lines...]
   [junit4] Suite: org.apache.lucene.spatial3d.geom.GeoExactCircleTest
   [junit4]   2> NOTE: reproduce with: ant test  -Dtestcase=GeoExactCircleTest -Dtests.method=RandomPointBearingCardinalTest
-Dtests.seed=9B396D4370D9A417 -Dtests.slow=true -Dtests.locale=fi -Dtests.timezone=America/El_Salvador
-Dtests.asserts=true -Dtests.file.encoding=ISO-8859-1
   [junit4] FAILURE 0.01s J0 | GeoExactCircleTest.RandomPointBearingCardinalTest {seed=[9B396D4370D9A417:2EB1A7D9D6576B3F]}
<<<
   [junit4]    > Throwable #1: java.lang.AssertionError: PlanetModel(ab=1.4480214400167273
c=0.9401231636665168) 0.03351679378070793 2.7289712469337446
   [junit4]    > 	at __randomizedtesting.SeedInfo.seed([9B396D4370D9A417:2EB1A7D9D6576B3F]:0)
   [junit4]    > 	at org.apache.lucene.spatial3d.geom.GeoExactCircleTest.checkBearingPoint(GeoExactCircleTest.java:117)
   [junit4]    > 	at org.apache.lucene.spatial3d.geom.GeoExactCircleTest.RandomPointBearingCardinalTest(GeoExactCircleTest.java:109)
   [junit4]    > 	at java.lang.Thread.run(Thread.java:748)
   [junit4]   2> NOTE: test params are: codec=Asserting(Lucene70), sim=Asserting(org.apache.lucene.search.similarities.AssertingSimilarity@3462494e),
locale=fi, timezone=America/El_Salvador
   [junit4]   2> NOTE: SunOS 5.11 amd64/Oracle Corporation 1.8.0_152 (64-bit)/cpus=3,threads=1,free=81822480,total=97320960
   [junit4]   2> NOTE: All tests run in this JVM: [TestGeo3DDocValues, GeoCircleTest, GeoExactCircleTest]
   [junit4] Completed [12/16 (1!)] on J0 in 0.74s, 311 tests, 1 failure <<< FAILURES!

[...truncated 52498 lines...]

Mime
View raw message