lucene-dev mailing list archives

Site index · List index
Message view « Date » · « Thread »
Top « Date » · « Thread »
From Policeman Jenkins Server <jenk...@thetaphi.de>
Subject [JENKINS] Lucene-Solr-7.x-Windows (64bit/jdk-9.0.1) - Build # 376 - Still Unstable!
Date Tue, 02 Jan 2018 11:29:38 GMT
Build: https://jenkins.thetaphi.de/job/Lucene-Solr-7.x-Windows/376/
Java: 64bit/jdk-9.0.1 -XX:-UseCompressedOops -XX:+UseSerialGC

2 tests failed.
FAILED:  org.apache.solr.rest.schema.analysis.TestManagedSynonymFilterFactory.testManagedSynonyms

Error Message:
Unable to delete directory C:\Users\jenkins\workspace\Lucene-Solr-7.x-Windows\solr\build\solr-core\test\J1\temp\solr.rest.schema.analysis.TestManagedSynonymFilterFactory_AC744C4F1871A189-001\tempDir-001\collection1.

Stack Trace:
java.io.IOException: Unable to delete directory C:\Users\jenkins\workspace\Lucene-Solr-7.x-Windows\solr\build\solr-core\test\J1\temp\solr.rest.schema.analysis.TestManagedSynonymFilterFactory_AC744C4F1871A189-001\tempDir-001\collection1.
	at __randomizedtesting.SeedInfo.seed([AC744C4F1871A189:1E04F3259805E5AD]:0)
	at org.apache.commons.io.FileUtils.deleteDirectory(FileUtils.java:1581)
	at org.apache.commons.io.FileUtils.forceDelete(FileUtils.java:2372)
	at org.apache.commons.io.FileUtils.cleanDirectory(FileUtils.java:1679)
	at org.apache.commons.io.FileUtils.deleteDirectory(FileUtils.java:1575)
	at org.apache.solr.rest.schema.analysis.TestManagedSynonymFilterFactory.after(TestManagedSynonymFilterFactory.java:64)
	at java.base/jdk.internal.reflect.NativeMethodAccessorImpl.invoke0(Native Method)
	at java.base/jdk.internal.reflect.NativeMethodAccessorImpl.invoke(NativeMethodAccessorImpl.java:62)
	at java.base/jdk.internal.reflect.DelegatingMethodAccessorImpl.invoke(DelegatingMethodAccessorImpl.java:43)
	at java.base/java.lang.reflect.Method.invoke(Method.java:564)
	at com.carrotsearch.randomizedtesting.RandomizedRunner.invoke(RandomizedRunner.java:1737)
	at com.carrotsearch.randomizedtesting.RandomizedRunner$10.evaluate(RandomizedRunner.java:992)
	at com.carrotsearch.randomizedtesting.rules.SystemPropertiesRestoreRule$1.evaluate(SystemPropertiesRestoreRule.java:57)
	at org.apache.lucene.util.TestRuleSetupTeardownChained$1.evaluate(TestRuleSetupTeardownChained.java:49)
	at org.apache.lucene.util.AbstractBeforeAfterRule$1.evaluate(AbstractBeforeAfterRule.java:45)
	at org.apache.lucene.util.TestRuleThreadAndTestName$1.evaluate(TestRuleThreadAndTestName.java:48)
	at org.apache.lucene.util.TestRuleIgnoreAfterMaxFailures$1.evaluate(TestRuleIgnoreAfterMaxFailures.java:64)
	at org.apache.lucene.util.TestRuleMarkFailure$1.evaluate(TestRuleMarkFailure.java:47)
	at com.carrotsearch.randomizedtesting.rules.StatementAdapter.evaluate(StatementAdapter.java:36)
	at com.carrotsearch.randomizedtesting.ThreadLeakControl$StatementRunner.run(ThreadLeakControl.java:368)
	at com.carrotsearch.randomizedtesting.ThreadLeakControl.forkTimeoutingTask(ThreadLeakControl.java:817)
	at com.carrotsearch.randomizedtesting.ThreadLeakControl$3.evaluate(ThreadLeakControl.java:468)
	at com.carrotsearch.randomizedtesting.RandomizedRunner.runSingleTest(RandomizedRunner.java:943)
	at com.carrotsearch.randomizedtesting.RandomizedRunner$5.evaluate(RandomizedRunner.java:829)
	at com.carrotsearch.randomizedtesting.RandomizedRunner$6.evaluate(RandomizedRunner.java:879)
	at com.carrotsearch.randomizedtesting.RandomizedRunner$7.evaluate(RandomizedRunner.java:890)
	at com.carrotsearch.randomizedtesting.rules.StatementAdapter.evaluate(StatementAdapter.java:36)
	at com.carrotsearch.randomizedtesting.rules.SystemPropertiesRestoreRule$1.evaluate(SystemPropertiesRestoreRule.java:57)
	at org.apache.lucene.util.AbstractBeforeAfterRule$1.evaluate(AbstractBeforeAfterRule.java:45)
	at com.carrotsearch.randomizedtesting.rules.StatementAdapter.evaluate(StatementAdapter.java:36)
	at org.apache.lucene.util.TestRuleStoreClassName$1.evaluate(TestRuleStoreClassName.java:41)
	at com.carrotsearch.randomizedtesting.rules.NoShadowingOrOverridesOnMethodsRule$1.evaluate(NoShadowingOrOverridesOnMethodsRule.java:40)
	at com.carrotsearch.randomizedtesting.rules.NoShadowingOrOverridesOnMethodsRule$1.evaluate(NoShadowingOrOverridesOnMethodsRule.java:40)
	at com.carrotsearch.randomizedtesting.rules.StatementAdapter.evaluate(StatementAdapter.java:36)
	at com.carrotsearch.randomizedtesting.rules.StatementAdapter.evaluate(StatementAdapter.java:36)
	at org.apache.lucene.util.TestRuleAssertionsRequired$1.evaluate(TestRuleAssertionsRequired.java:53)
	at org.apache.lucene.util.TestRuleMarkFailure$1.evaluate(TestRuleMarkFailure.java:47)
	at org.apache.lucene.util.TestRuleIgnoreAfterMaxFailures$1.evaluate(TestRuleIgnoreAfterMaxFailures.java:64)
	at org.apache.lucene.util.TestRuleIgnoreTestSuites$1.evaluate(TestRuleIgnoreTestSuites.java:54)
	at com.carrotsearch.randomizedtesting.rules.StatementAdapter.evaluate(StatementAdapter.java:36)
	at com.carrotsearch.randomizedtesting.ThreadLeakControl$StatementRunner.run(ThreadLeakControl.java:368)
	at java.base/java.lang.Thread.run(Thread.java:844)


FAILED:  junit.framework.TestSuite.org.apache.solr.update.processor.TestOpenNLPExtractNamedEntitiesUpdateProcessorFactory

Error Message:
Could not remove the following files (in the order of attempts):    C:\Users\jenkins\workspace\Lucene-Solr-7.x-Windows\solr\build\contrib\solr-analysis-extras\test\J1\temp\solr.update.processor.TestOpenNLPExtractNamedEntitiesUpdateProcessorFactory_CDB16AF551E7A267-001\tempDir-001\collection1\conf: java.nio.file.DirectoryNotEmptyException: C:\Users\jenkins\workspace\Lucene-Solr-7.x-Windows\solr\build\contrib\solr-analysis-extras\test\J1\temp\solr.update.processor.TestOpenNLPExtractNamedEntitiesUpdateProcessorFactory_CDB16AF551E7A267-001\tempDir-001\collection1\conf    C:\Users\jenkins\workspace\Lucene-Solr-7.x-Windows\solr\build\contrib\solr-analysis-extras\test\J1\temp\solr.update.processor.TestOpenNLPExtractNamedEntitiesUpdateProcessorFactory_CDB16AF551E7A267-001\tempDir-001\collection1: java.nio.file.DirectoryNotEmptyException: C:\Users\jenkins\workspace\Lucene-Solr-7.x-Windows\solr\build\contrib\solr-analysis-extras\test\J1\temp\solr.update.processor.TestOpenNLPExtractNamedEntitiesUpdateProcessorFactory_CDB16AF551E7A267-001\tempDir-001\collection1    C:\Users\jenkins\workspace\Lucene-Solr-7.x-Windows\solr\build\contrib\solr-analysis-extras\test\J1\temp\solr.update.processor.TestOpenNLPExtractNamedEntitiesUpdateProcessorFactory_CDB16AF551E7A267-001\tempDir-001: java.nio.file.DirectoryNotEmptyException: C:\Users\jenkins\workspace\Lucene-Solr-7.x-Windows\solr\build\contrib\solr-analysis-extras\test\J1\temp\solr.update.processor.TestOpenNLPExtractNamedEntitiesUpdateProcessorFactory_CDB16AF551E7A267-001\tempDir-001    C:\Users\jenkins\workspace\Lucene-Solr-7.x-Windows\solr\build\contrib\solr-analysis-extras\test\J1\temp\solr.update.processor.TestOpenNLPExtractNamedEntitiesUpdateProcessorFactory_CDB16AF551E7A267-001\tempDir-001\collection1\conf\en-test-ner-person.bin: java.nio.file.AccessDeniedException: C:\Users\jenkins\workspace\Lucene-Solr-7.x-Windows\solr\build\contrib\solr-analysis-extras\test\J1\temp\solr.update.processor.TestOpenNLPExtractNamedEntitiesUpdateProcessorFactory_CDB16AF551E7A267-001\tempDir-001\collection1\conf\en-test-ner-person.bin    C:\Users\jenkins\workspace\Lucene-Solr-7.x-Windows\solr\build\contrib\solr-analysis-extras\test\J1\temp\solr.update.processor.TestOpenNLPExtractNamedEntitiesUpdateProcessorFactory_CDB16AF551E7A267-001\tempDir-001\collection1\conf\en-test-tokenizer.bin: java.nio.file.AccessDeniedException: C:\Users\jenkins\workspace\Lucene-Solr-7.x-Windows\solr\build\contrib\solr-analysis-extras\test\J1\temp\solr.update.processor.TestOpenNLPExtractNamedEntitiesUpdateProcessorFactory_CDB16AF551E7A267-001\tempDir-001\collection1\conf\en-test-tokenizer.bin    C:\Users\jenkins\workspace\Lucene-Solr-7.x-Windows\solr\build\contrib\solr-analysis-extras\test\J1\temp\solr.update.processor.TestOpenNLPExtractNamedEntitiesUpdateProcessorFactory_CDB16AF551E7A267-001\tempDir-001\collection1\conf\en-test-sent.bin: java.nio.file.AccessDeniedException: C:\Users\jenkins\workspace\Lucene-Solr-7.x-Windows\solr\build\contrib\solr-analysis-extras\test\J1\temp\solr.update.processor.TestOpenNLPExtractNamedEntitiesUpdateProcessorFactory_CDB16AF551E7A267-001\tempDir-001\collection1\conf\en-test-sent.bin    C:\Users\jenkins\workspace\Lucene-Solr-7.x-Windows\solr\build\contrib\solr-analysis-extras\test\J1\temp\solr.update.processor.TestOpenNLPExtractNamedEntitiesUpdateProcessorFactory_CDB16AF551E7A267-001: java.nio.file.DirectoryNotEmptyException: C:\Users\jenkins\workspace\Lucene-Solr-7.x-Windows\solr\build\contrib\solr-analysis-extras\test\J1\temp\solr.update.processor.TestOpenNLPExtractNamedEntitiesUpdateProcessorFactory_CDB16AF551E7A267-001 

Stack Trace:
java.io.IOException: Could not remove the following files (in the order of attempts):
   C:\Users\jenkins\workspace\Lucene-Solr-7.x-Windows\solr\build\contrib\solr-analysis-extras\test\J1\temp\solr.update.processor.TestOpenNLPExtractNamedEntitiesUpdateProcessorFactory_CDB16AF551E7A267-001\tempDir-001\collection1\conf: java.nio.file.DirectoryNotEmptyException: C:\Users\jenkins\workspace\Lucene-Solr-7.x-Windows\solr\build\contrib\solr-analysis-extras\test\J1\temp\solr.update.processor.TestOpenNLPExtractNamedEntitiesUpdateProcessorFactory_CDB16AF551E7A267-001\tempDir-001\collection1\conf
   C:\Users\jenkins\workspace\Lucene-Solr-7.x-Windows\solr\build\contrib\solr-analysis-extras\test\J1\temp\solr.update.processor.TestOpenNLPExtractNamedEntitiesUpdateProcessorFactory_CDB16AF551E7A267-001\tempDir-001\collection1: java.nio.file.DirectoryNotEmptyException: C:\Users\jenkins\workspace\Lucene-Solr-7.x-Windows\solr\build\contrib\solr-analysis-extras\test\J1\temp\solr.update.processor.TestOpenNLPExtractNamedEntitiesUpdateProcessorFactory_CDB16AF551E7A267-001\tempDir-001\collection1
   C:\Users\jenkins\workspace\Lucene-Solr-7.x-Windows\solr\build\contrib\solr-analysis-extras\test\J1\temp\solr.update.processor.TestOpenNLPExtractNamedEntitiesUpdateProcessorFactory_CDB16AF551E7A267-001\tempDir-001: java.nio.file.DirectoryNotEmptyException: C:\Users\jenkins\workspace\Lucene-Solr-7.x-Windows\solr\build\contrib\solr-analysis-extras\test\J1\temp\solr.update.processor.TestOpenNLPExtractNamedEntitiesUpdateProcessorFactory_CDB16AF551E7A267-001\tempDir-001
   C:\Users\jenkins\workspace\Lucene-Solr-7.x-Windows\solr\build\contrib\solr-analysis-extras\test\J1\temp\solr.update.processor.TestOpenNLPExtractNamedEntitiesUpdateProcessorFactory_CDB16AF551E7A267-001\tempDir-001\collection1\conf\en-test-ner-person.bin: java.nio.file.AccessDeniedException: C:\Users\jenkins\workspace\Lucene-Solr-7.x-Windows\solr\build\contrib\solr-analysis-extras\test\J1\temp\solr.update.processor.TestOpenNLPExtractNamedEntitiesUpdateProcessorFactory_CDB16AF551E7A267-001\tempDir-001\collection1\conf\en-test-ner-person.bin
   C:\Users\jenkins\workspace\Lucene-Solr-7.x-Windows\solr\build\contrib\solr-analysis-extras\test\J1\temp\solr.update.processor.TestOpenNLPExtractNamedEntitiesUpdateProcessorFactory_CDB16AF551E7A267-001\tempDir-001\collection1\conf\en-test-tokenizer.bin: java.nio.file.AccessDeniedException: C:\Users\jenkins\workspace\Lucene-Solr-7.x-Windows\solr\build\contrib\solr-analysis-extras\test\J1\temp\solr.update.processor.TestOpenNLPExtractNamedEntitiesUpdateProcessorFactory_CDB16AF551E7A267-001\tempDir-001\collection1\conf\en-test-tokenizer.bin
   C:\Users\jenkins\workspace\Lucene-Solr-7.x-Windows\solr\build\contrib\solr-analysis-extras\test\J1\temp\solr.update.processor.TestOpenNLPExtractNamedEntitiesUpdateProcessorFactory_CDB16AF551E7A267-001\tempDir-001\collection1\conf\en-test-sent.bin: java.nio.file.AccessDeniedException: C:\Users\jenkins\workspace\Lucene-Solr-7.x-Windows\solr\build\contrib\solr-analysis-extras\test\J1\temp\solr.update.processor.TestOpenNLPExtractNamedEntitiesUpdateProcessorFactory_CDB16AF551E7A267-001\tempDir-001\collection1\conf\en-test-sent.bin
   C:\Users\jenkins\workspace\Lucene-Solr-7.x-Windows\solr\build\contrib\solr-analysis-extras\test\J1\temp\solr.update.processor.TestOpenNLPExtractNamedEntitiesUpdateProcessorFactory_CDB16AF551E7A267-001: java.nio.file.DirectoryNotEmptyException: C:\Users\jenkins\workspace\Lucene-Solr-7.x-Windows\solr\build\contrib\solr-analysis-extras\test\J1\temp\solr.update.processor.TestOpenNLPExtractNamedEntitiesUpdateProcessorFactory_CDB16AF551E7A267-001

	at __randomizedtesting.SeedInfo.seed([CDB16AF551E7A267]:0)
	at org.apache.lucene.util.IOUtils.rm(IOUtils.java:329)
	at org.apache.lucene.util.TestRuleTemporaryFilesCleanup.afterAlways(TestRuleTemporaryFilesCleanup.java:216)
	at com.carrotsearch.randomizedtesting.rules.TestRuleAdapter$1.afterAlways(TestRuleAdapter.java:31)
	at com.carrotsearch.randomizedtesting.rules.StatementAdapter.evaluate(StatementAdapter.java:43)
	at com.carrotsearch.randomizedtesting.rules.StatementAdapter.evaluate(StatementAdapter.java:36)
	at org.apache.lucene.util.TestRuleAssertionsRequired$1.evaluate(TestRuleAssertionsRequired.java:53)
	at org.apache.lucene.util.TestRuleMarkFailure$1.evaluate(TestRuleMarkFailure.java:47)
	at org.apache.lucene.util.TestRuleIgnoreAfterMaxFailures$1.evaluate(TestRuleIgnoreAfterMaxFailures.java:64)
	at org.apache.lucene.util.TestRuleIgnoreTestSuites$1.evaluate(TestRuleIgnoreTestSuites.java:54)
	at com.carrotsearch.randomizedtesting.rules.StatementAdapter.evaluate(StatementAdapter.java:36)
	at com.carrotsearch.randomizedtesting.ThreadLeakControl$StatementRunner.run(ThreadLeakControl.java:368)
	at java.base/java.lang.Thread.run(Thread.java:844)




Build Log:
[...truncated 12907 lines...]
   [junit4] Suite: org.apache.solr.rest.schema.analysis.TestManagedSynonymFilterFactory
   [junit4]   2> Creating dataDir: C:\Users\jenkins\workspace\Lucene-Solr-7.x-Windows\solr\build\solr-core\test\J1\temp\solr.rest.schema.analysis.TestManagedSynonymFilterFactory_AC744C4F1871A189-001\init-core-data-001
   [junit4]   2> 1793212 WARN  (SUITE-TestManagedSynonymFilterFactory-seed#[AC744C4F1871A189]-worker) [    ] o.a.s.SolrTestCaseJ4 startTrackingSearchers: numOpens=1 numCloses=1
   [junit4]   2> 1793212 INFO  (SUITE-TestManagedSynonymFilterFactory-seed#[AC744C4F1871A189]-worker) [    ] o.a.s.SolrTestCaseJ4 Using PointFields (NUMERIC_POINTS_SYSPROP=true) w/NUMERIC_DOCVALUES_SYSPROP=true
   [junit4]   2> 1793214 INFO  (SUITE-TestManagedSynonymFilterFactory-seed#[AC744C4F1871A189]-worker) [    ] o.a.s.SolrTestCaseJ4 Randomized ssl (true) and clientAuth (false) via: @org.apache.solr.util.RandomizeSSL(reason="", value=0.0/0.0, ssl=0.0/0.0, clientAuth=0.0/0.0)
   [junit4]   2> 1793214 INFO  (SUITE-TestManagedSynonymFilterFactory-seed#[AC744C4F1871A189]-worker) [    ] o.a.s.SolrTestCaseJ4 SecureRandom sanity checks: test.solr.allowed.securerandom=null & java.security.egd=file:/dev/./urandom
   [junit4]   2> 1793215 INFO  (TEST-TestManagedSynonymFilterFactory.testCanHandleDecodingAndEncodingForSynonyms-seed#[AC744C4F1871A189]) [    ] o.a.s.SolrTestCaseJ4 ###Starting testCanHandleDecodingAndEncodingForSynonyms
   [junit4]   2> 1793585 INFO  (TEST-TestManagedSynonymFilterFactory.testCanHandleDecodingAndEncodingForSynonyms-seed#[AC744C4F1871A189]) [    ] o.a.s.SolrTestCaseJ4 ####initCore
   [junit4]   2> 1793585 INFO  (TEST-TestManagedSynonymFilterFactory.testCanHandleDecodingAndEncodingForSynonyms-seed#[AC744C4F1871A189]) [    ] o.a.s.SolrTestCaseJ4 ####initCore end
   [junit4]   2> 1793585 INFO  (TEST-TestManagedSynonymFilterFactory.testCanHandleDecodingAndEncodingForSynonyms-seed#[AC744C4F1871A189]) [    ] o.a.s.SolrTestCaseJ4 Writing core.properties file to C:\Users\jenkins\workspace\Lucene-Solr-7.x-Windows\solr\build\solr-core\test\J1\temp\solr.rest.schema.analysis.TestManagedSynonymFilterFactory_AC744C4F1871A189-001\tempDir-003\cores\core
   [junit4]   2> 1793588 INFO  (TEST-TestManagedSynonymFilterFactory.testCanHandleDecodingAndEncodingForSynonyms-seed#[AC744C4F1871A189]) [    ] o.e.j.s.Server jetty-9.3.20.v20170531
   [junit4]   2> 1793589 INFO  (TEST-TestManagedSynonymFilterFactory.testCanHandleDecodingAndEncodingForSynonyms-seed#[AC744C4F1871A189]) [    ] o.e.j.s.h.ContextHandler Started o.e.j.s.ServletContextHandler@6be8ec63{/solr,null,AVAILABLE}
   [junit4]   2> 1793589 INFO  (TEST-TestManagedSynonymFilterFactory.testCanHandleDecodingAndEncodingForSynonyms-seed#[AC744C4F1871A189]) [    ] o.e.j.s.AbstractConnector Started ServerConnector@746bcfa6{SSL,[ssl, http/1.1]}{127.0.0.1:56753}
   [junit4]   2> 1793590 INFO  (TEST-TestManagedSynonymFilterFactory.testCanHandleDecodingAndEncodingForSynonyms-seed#[AC744C4F1871A189]) [    ] o.e.j.s.Server Started @1805078ms
   [junit4]   2> 1793590 INFO  (TEST-TestManagedSynonymFilterFactory.testCanHandleDecodingAndEncodingForSynonyms-seed#[AC744C4F1871A189]) [    ] o.a.s.c.s.e.JettySolrRunner Jetty properties: {hostContext=/solr, configSetBaseDir=C:\Users\jenkins\workspace\Lucene-Solr-7.x-Windows\solr\build\solr-core\test\J1\temp\solr.rest.schema.analysis.TestManagedSynonymFilterFactory_AC744C4F1871A189-001\tempDir-001, hostPort=56753, coreRootDirectory=C:\Users\jenkins\workspace\Lucene-Solr-7.x-Windows\solr\build\solr-core\test\J1\temp\solr.rest.schema.analysis.TestManagedSynonymFilterFactory_AC744C4F1871A189-001\tempDir-003\cores}
   [junit4]   2> 1793590 ERROR (TEST-TestManagedSynonymFilterFactory.testCanHandleDecodingAndEncodingForSynonyms-seed#[AC744C4F1871A189]) [    ] o.a.s.u.StartupLoggingUtils Missing Java Option solr.log.dir. Logging may be missing or incomplete.
   [junit4]   2> 1793590 INFO  (TEST-TestManagedSynonymFilterFactory.testCanHandleDecodingAndEncodingForSynonyms-seed#[AC744C4F1871A189]) [    ] o.a.s.s.SolrDispatchFilter  ___      _       Welcome to Apache Solr? version 7.3.0
   [junit4]   2> 1793590 INFO  (TEST-TestManagedSynonymFilterFactory.testCanHandleDecodingAndEncodingForSynonyms-seed#[AC744C4F1871A189]) [    ] o.a.s.s.SolrDispatchFilter / __| ___| |_ _   Starting in standalone mode on port null
   [junit4]   2> 1793590 INFO  (TEST-TestManagedSynonymFilterFactory.testCanHandleDecodingAndEncodingForSynonyms-seed#[AC744C4F1871A189]) [    ] o.a.s.s.SolrDispatchFilter \__ \/ _ \ | '_|  Install dir: null
   [junit4]   2> 1793590 INFO  (TEST-TestManagedSynonymFilterFactory.testCanHandleDecodingAndEncodingForSynonyms-seed#[AC744C4F1871A189]) [    ] o.a.s.s.SolrDispatchFilter |___/\___/_|_|    Start time: 2018-01-02T10:40:20.818510300Z
   [junit4]   2> 1793591 INFO  (TEST-TestManagedSynonymFilterFactory.testCanHandleDecodingAndEncodingForSynonyms-seed#[AC744C4F1871A189]) [    ] o.a.s.c.SolrXmlConfig Loading container configuration from C:\Users\jenkins\workspace\Lucene-Solr-7.x-Windows\solr\build\solr-core\test\J1\temp\solr.rest.schema.analysis.TestManagedSynonymFilterFactory_AC744C4F1871A189-001\tempDir-001\solr.xml
   [junit4]   2> 1793600 INFO  (TEST-TestManagedSynonymFilterFactory.testCanHandleDecodingAndEncodingForSynonyms-seed#[AC744C4F1871A189]) [    ] o.a.s.c.SolrXmlConfig Configuration parameter autoReplicaFailoverWorkLoopDelay is ignored
   [junit4]   2> 1793600 INFO  (TEST-TestManagedSynonymFilterFactory.testCanHandleDecodingAndEncodingForSynonyms-seed#[AC744C4F1871A189]) [    ] o.a.s.c.SolrXmlConfig Configuration parameter autoReplicaFailoverBadNodeExpiration is ignored
   [junit4]   2> 1793601 INFO  (TEST-TestManagedSynonymFilterFactory.testCanHandleDecodingAndEncodingForSynonyms-seed#[AC744C4F1871A189]) [    ] o.a.s.c.SolrXmlConfig MBean server found: com.sun.jmx.mbeanserver.JmxMBeanServer@26a1fb90, but no JMX reporters were configured - adding default JMX reporter.
   [junit4]   2> 1793651 INFO  (TEST-TestManagedSynonymFilterFactory.testCanHandleDecodingAndEncodingForSynonyms-seed#[AC744C4F1871A189]) [    ] o.a.s.m.r.SolrJmxReporter JMX monitoring for 'solr.node' (registry 'solr.node') enabled at server: com.sun.jmx.mbeanserver.JmxMBeanServer@26a1fb90
   [junit4]   2> 1793661 INFO  (TEST-TestManagedSynonymFilterFactory.testCanHandleDecodingAndEncodingForSynonyms-seed#[AC744C4F1871A189]) [    ] o.a.s.m.r.SolrJmxReporter JMX monitoring for 'solr.jvm' (registry 'solr.jvm') enabled at server: com.sun.jmx.mbeanserver.JmxMBeanServer@26a1fb90
   [junit4]   2> 1793661 INFO  (TEST-TestManagedSynonymFilterFactory.testCanHandleDecodingAndEncodingForSynonyms-seed#[AC744C4F1871A189]) [    ] o.a.s.m.r.SolrJmxReporter JMX monitoring for 'solr.jetty' (registry 'solr.jetty') enabled at server: com.sun.jmx.mbeanserver.JmxMBeanServer@26a1fb90
   [junit4]   2> 1793663 INFO  (TEST-TestManagedSynonymFilterFactory.testCanHandleDecodingAndEncodingForSynonyms-seed#[AC744C4F1871A189]) [    ] o.a.s.c.CorePropertiesLocator Found 1 core definitions underneath C:\Users\jenkins\workspace\Lucene-Solr-7.x-Windows\solr\build\solr-core\test\J1\temp\solr.rest.schema.analysis.TestManagedSynonymFilterFactory_AC744C4F1871A189-001\tempDir-003\cores
   [junit4]   2> 1793663 INFO  (TEST-TestManagedSynonymFilterFactory.testCanHandleDecodingAndEncodingForSynonyms-seed#[AC744C4F1871A189]) [    ] o.a.s.c.CorePropertiesLocator Cores are: [collection1]
   [junit4]   2> 1793663 INFO  (coreLoadExecutor-6368-thread-1) [    ] o.a.s.c.TransientSolrCoreCacheDefault Allocating transient cache for 4 transient cores
   [junit4]   2> 1793664 INFO  (coreLoadExecutor-6368-thread-1) [    x:collection1] o.a.s.c.SolrResourceLoader [null] Added 2 libs to classloader, from paths: [/C:/Users/jenkins/workspace/Lucene-Solr-7.x-Windows/solr/build/solr-core/test/J1/temp/solr.rest.schema.analysis.TestManagedSynonymFilterFactory_AC744C4F1871A189-001/tempDir-001/collection1/lib, /C:/Users/jenkins/workspace/Lucene-Solr-7.x-Windows/solr/build/solr-core/test/J1/temp/solr.rest.schema.analysis.TestManagedSynonymFilterFactory_AC744C4F1871A189-001/tempDir-001/collection1/lib/classes]
   [junit4]   2> 1793687 INFO  (coreLoadExecutor-6368-thread-1) [    x:collection1] o.a.s.c.SolrConfig Using Lucene MatchVersion: 7.3.0
   [junit4]   2> 1793693 INFO  (coreLoadExecutor-6368-thread-1) [    x:collection1] o.a.s.s.ManagedIndexSchemaFactory The schema is configured as managed, but managed schema resource managed-schema not found - loading non-managed schema schema-rest.xml instead
   [junit4]   2> 1793697 INFO  (coreLoadExecutor-6368-thread-1) [    x:collection1] o.a.s.s.IndexSchema [collection1] Schema name=test-rest
   [junit4]   2> 1793801 WARN  (coreLoadExecutor-6368-thread-1) [    x:collection1] o.a.s.s.IndexSchema Field title is not multivalued and destination for multiple copyFields (3)
   [junit4]   2> 1793803 INFO  (coreLoadExecutor-6368-thread-1) [    x:collection1] o.a.s.r.RestManager Registered ManagedResource impl org.apache.solr.rest.schema.analysis.ManagedWordSetResource for path /schema/analysis/stopwords/german
   [junit4]   2> 1793803 INFO  (coreLoadExecutor-6368-thread-1) [    x:collection1] o.a.s.r.RestManager Registered ManagedResource impl org.apache.solr.rest.schema.analysis.ManagedSynonymFilterFactory$SynonymManager for path /schema/analysis/synonyms/german
   [junit4]   2> 1793805 INFO  (coreLoadExecutor-6368-thread-1) [    x:collection1] o.a.s.r.RestManager Registered ManagedResource impl org.apache.solr.rest.schema.analysis.ManagedWordSetResource for path /schema/analysis/stopwords/english
   [junit4]   2> 1793805 INFO  (coreLoadExecutor-6368-thread-1) [    x:collection1] o.a.s.r.RestManager Registered ManagedResource impl org.apache.solr.rest.schema.analysis.ManagedSynonymGraphFilterFactory$SynonymManager for path /schema/analysis/synonyms/englishgraph
   [junit4]   2> 1793805 INFO  (coreLoadExecutor-6368-thread-1) [    x:collection1] o.a.s.r.RestManager Added observer of type org.apache.solr.rest.schema.analysis.ManagedStopFilterFactory to existing ManagedResource /schema/analysis/stopwords/english
   [junit4]   2> 1793807 INFO  (coreLoadExecutor-6368-thread-1) [    x:collection1] o.a.s.r.RestManager Added observer of type org.apache.solr.rest.schema.analysis.ManagedSynonymGraphFilterFactory to existing ManagedResource /schema/analysis/synonyms/englishgraph
   [junit4]   2> 1793807 INFO  (coreLoadExecutor-6368-thread-1) [    x:collection1] o.a.s.r.RestManager Added observer of type org.apache.solr.rest.schema.analysis.ManagedStopFilterFactory to existing ManagedResource /schema/analysis/stopwords/german
   [junit4]   2> 1793807 INFO  (coreLoadExecutor-6368-thread-1) [    x:collection1] o.a.s.r.RestManager Registered ManagedResource impl org.apache.solr.rest.schema.analysis.ManagedSynonymGraphFilterFactory$SynonymManager for path /schema/analysis/synonyms/germangraph
   [junit4]   2> 1793807 INFO  (coreLoadExecutor-6368-thread-1) [    x:collection1] o.a.s.r.RestManager Added observer of type org.apache.solr.rest.schema.analysis.ManagedStopFilterFactory to existing ManagedResource /schema/analysis/stopwords/german
   [junit4]   2> 1793807 INFO  (coreLoadExecutor-6368-thread-1) [    x:collection1] o.a.s.r.RestManager Added observer of type org.apache.solr.rest.schema.analysis.ManagedSynonymGraphFilterFactory to existing ManagedResource /schema/analysis/synonyms/germangraph
   [junit4]   2> 1793811 INFO  (coreLoadExecutor-6368-thread-1) [    x:collection1] o.a.s.r.RestManager Added observer of type org.apache.solr.rest.schema.analysis.ManagedStopFilterFactory to existing ManagedResource /schema/analysis/stopwords/english
   [junit4]   2> 1793811 INFO  (coreLoadExecutor-6368-thread-1) [    x:collection1] o.a.s.r.RestManager Registered ManagedResource impl org.apache.solr.rest.schema.analysis.ManagedSynonymFilterFactory$SynonymManager for path /schema/analysis/synonyms/english
   [junit4]   2> 1793811 INFO  (coreLoadExecutor-6368-thread-1) [    x:collection1] o.a.s.s.IndexSchema Loaded schema test-rest/1.6 with uniqueid field id
   [junit4]   2> 1793817 INFO  (coreLoadExecutor-6368-thread-1) [    x:collection1] o.a.s.r.RestManager Added observer of type org.apache.solr.rest.schema.analysis.ManagedStopFilterFactory to existing ManagedResource /schema/analysis/stopwords/english
   [junit4]   2> 1793817 INFO  (coreLoadExecutor-6368-thread-1) [    x:collection1] o.a.s.r.RestManager Added observer of type org.apache.solr.rest.schema.analysis.ManagedSynonymFilterFactory to existing ManagedResource /schema/analysis/synonyms/english
   [junit4]   2> 1793817 INFO  (coreLoadExecutor-6368-thread-1) [    x:collection1] o.a.s.r.RestManager Added observer of type org.apache.solr.rest.schema.analysis.ManagedStopFilterFactory to existing ManagedResource /schema/analysis/stopwords/german
   [junit4]   2> 1793817 INFO  (coreLoadExecutor-6368-thread-1) [    x:collection1] o.a.s.r.RestManager Added observer of type org.apache.solr.rest.schema.analysis.ManagedSynonymFilterFactory to existing ManagedResource /schema/analysis/synonyms/german
   [junit4]   2> 1793817 INFO  (coreLoadExecutor-6368-thread-1) [    x:collection1] o.a.s.r.RestManager Added observer of type org.apache.solr.rest.schema.analysis.ManagedStopFilterFactory to existing ManagedResource /schema/analysis/stopwords/english
   [junit4]   2> 1793817 INFO  (coreLoadExecutor-6368-thread-1) [    x:collection1] o.a.s.r.RestManager Added observer of type org.apache.solr.rest.schema.analysis.ManagedSynonymGraphFilterFactory to existing ManagedResource /schema/analysis/synonyms/englishgraph
   [junit4]   2> 1793817 INFO  (coreLoadExecutor-6368-thread-1) [    x:collection1] o.a.s.r.RestManager Added observer of type org.apache.solr.rest.schema.analysis.ManagedStopFilterFactory to existing ManagedResource /schema/analysis/stopwords/english
   [junit4]   2> 1793817 INFO  (coreLoadExecutor-6368-thread-1) [    x:collection1] o.a.s.r.RestManager Added observer of type org.apache.solr.rest.schema.analysis.ManagedSynonymGraphFilterFactory to existing ManagedResource /schema/analysis/synonyms/englishgraph
   [junit4]   2> 1793817 INFO  (coreLoadExecutor-6368-thread-1) [    x:collection1] o.a.s.r.RestManager Added observer of type org.apache.solr.rest.schema.analysis.ManagedStopFilterFactory to existing ManagedResource /schema/analysis/stopwords/german
   [junit4]   2> 1793817 INFO  (coreLoadExecutor-6368-thread-1) [    x:collection1] o.a.s.r.RestManager Added observer of type org.apache.solr.rest.schema.analysis.ManagedSynonymGraphFilterFactory to existing ManagedResource /schema/analysis/synonyms/germangraph
   [junit4]   2> 1793817 INFO  (coreLoadExecutor-6368-thread-1) [    x:collection1] o.a.s.r.RestManager Added observer of type org.apache.solr.rest.schema.analysis.ManagedStopFilterFactory to existing ManagedResource /schema/analysis/stopwords/german
   [junit4]   2> 1793817 INFO  (coreLoadExecutor-6368-thread-1) [    x:collection1] o.a.s.r.RestManager Added observer of type org.apache.solr.rest.schema.analysis.ManagedSynonymGraphFilterFactory to existing ManagedResource /schema/analysis/synonyms/germangraph
   [junit4]   2> 1793819 INFO  (coreLoadExecutor-6368-thread-1) [    x:collection1] o.a.s.s.ManagedIndexSchema Upgraded to managed schema at C:\Users\jenkins\workspace\Lucene-Solr-7.x-Windows\solr\build\solr-core\test\J1\temp\solr.rest.schema.analysis.TestManagedSynonymFilterFactory_AC744C4F1871A189-001\tempDir-001\collection1\conf\managed-schema
   [junit4]   2> 1793822 INFO  (coreLoadExecutor-6368-thread-1) [    x:collection1] o.a.s.s.ManagedIndexSchemaFactory After upgrading to managed schema, renamed the non-managed schema C:\Users\jenkins\workspace\Lucene-Solr-7.x-Windows\solr\build\solr-core\test\J1\temp\solr.rest.schema.analysis.TestManagedSynonymFilterFactory_AC744C4F1871A189-001\tempDir-001\collection1\conf\schema-rest.xml to C:\Users\jenkins\workspace\Lucene-Solr-7.x-Windows\solr\build\solr-core\test\J1\temp\solr.rest.schema.analysis.TestManagedSynonymFilterFactory_AC744C4F1871A189-001\tempDir-001\collection1\conf\schema-rest.xml.bak
   [junit4]   2> 1793822 INFO  (coreLoadExecutor-6368-thread-1) [    x:collection1] o.a.s.c.CoreContainer Creating SolrCore 'collection1' using configuration from configset C:\Users\jenkins\workspace\Lucene-Solr-7.x-Windows\solr\build\solr-core\test\J1\temp\solr.rest.schema.analysis.TestManagedSynonymFilterFactory_AC744C4F1871A189-001\tempDir-001\collection1, trusted=true
   [junit4]   2> 1793822 INFO  (coreLoadExecutor-6368-thread-1) [    x:collection1] o.a.s.m.r.SolrJmxReporter JMX monitoring for 'solr.core.collection1' (registry 'solr.core.collection1') enabled at server: com.sun.jmx.mbeanserver.JmxMBeanServer@26a1fb90
   [junit4]   2> 1793822 INFO  (coreLoadExecutor-6368-thread-1) [    x:collection1] o.a.s.c.SolrCore solr.RecoveryStrategy.Builder
   [junit4]   2> 1793822 INFO  (coreLoadExecutor-6368-thread-1) [    x:collection1] o.a.s.c.SolrCore [[collection1] ] Opening new SolrCore at [C:\Users\jenkins\workspace\Lucene-Solr-7.x-Windows\solr\build\solr-core\test\J1\temp\solr.rest.schema.analysis.TestManagedSynonymFilterFactory_AC744C4F1871A189-001\tempDir-001\collection1], dataDir=[C:\Users\jenkins\workspace\Lucene-Solr-7.x-Windows\solr\build\solr-core\test\J1\temp\solr.rest.schema.analysis.TestManagedSynonymFilterFactory_AC744C4F1871A189-001\tempDir-003\cores\core\data\]
   [junit4]   2> 1793828 INFO  (coreLoadExecutor-6368-thread-1) [    x:collection1] o.a.s.u.RandomMergePolicy RandomMergePolicy wrapping class org.apache.lucene.index.LogByteSizeMergePolicy: [LogByteSizeMergePolicy: minMergeSize=1677721, mergeFactor=43, maxMergeSize=2147483648, maxMergeSizeForForcedMerge=9223372036854775807, calibrateSizeByDeletes=true, maxMergeDocs=2147483647, maxCFSSegmentSizeMB=8.796093022207999E12, noCFSRatio=0.0]
   [junit4]   2> 1793833 WARN  (coreLoadExecutor-6368-thread-1) [    x:collection1] o.a.s.c.RequestHandlers INVALID paramSet a in requestHandler {type = requestHandler,name = /dump,class = DumpRequestHandler,attributes = {initParams=a, name=/dump, registerPath=/solr,/v2, class=DumpRequestHandler},args = {defaults={a=A,b=B}}}
   [junit4]   2> 1793897 INFO  (coreLoadExecutor-6368-thread-1) [    x:collection1] o.a.s.u.CommitTracker Hard AutoCommit: disabled
   [junit4]   2> 1793897 INFO  (coreLoadExecutor-6368-thread-1) [    x:collection1] o.a.s.u.CommitTracker Soft AutoCommit: disabled
   [junit4]   2> 1793899 INFO  (coreLoadExecutor-6368-thread-1) [    x:collection1] o.a.s.u.RandomMergePolicy RandomMergePolicy wrapping class org.apache.lucene.index.LogDocMergePolicy: [LogDocMergePolicy: minMergeSize=1000, mergeFactor=30, maxMergeSize=9223372036854775807, maxMergeSizeForForcedMerge=9223372036854775807, calibrateSizeByDeletes=true, maxMergeDocs=2147483647, maxCFSSegmentSizeMB=8.796093022207999E12, noCFSRatio=1.0]
   [junit4]   2> 1793899 INFO  (coreLoadExecutor-6368-thread-1) [    x:collection1] o.a.s.s.SolrIndexSearcher Opening [Searcher@5c575858[collection1] main]
   [junit4]   2> 1793899 INFO  (coreLoadExecutor-6368-thread-1) [    x:collection1] o.a.s.r.ManagedResourceStorage File-based storage initialized to use dir: C:\Users\jenkins\workspace\Lucene-Solr-7.x-Windows\solr\build\solr-core\test\J1\temp\solr.rest.schema.analysis.TestManagedSynonymFilterFactory_AC744C4F1871A189-001\tempDir-001\collection1\conf
   [junit4]   2> 1793900 WARN  (coreLoadExecutor-6368-thread-1) [    x:collection1] o.a.s.r.ManagedResource No stored data found for /schema/analysis/stopwords/english
   [junit4]   2> 1793900 INFO  (coreLoadExecutor-6368-thread-1) [    x:collection1] o.a.s.r.ManagedResourceStorage Saved JSON object to path _schema_analysis_stopwords_english.json using file:dir=C:\Users\jenkins\workspace\Lucene-Solr-7.x-Windows\solr\build\solr-core\test\J1\temp\solr.rest.schema.analysis.TestManagedSynonymFilterFactory_AC744C4F1871A189-001\tempDir-001\collection1\conf
   [junit4]   2> 1793900 INFO  (coreLoadExecutor-6368-thread-1) [    x:collection1] o.a.s.r.s.a.ManagedWordSetResource Loaded 0 words for /schema/analysis/stopwords/english
   [junit4]   2> 1793900 INFO  (coreLoadExecutor-6368-thread-1) [    x:collection1] o.a.s.r.ManagedResource Notified 6 observers of /schema/analysis/stopwords/english
   [junit4]   2> 1793900 WARN  (coreLoadExecutor-6368-thread-1) [    x:collection1] o.a.s.r.ManagedResource No stored data found for /schema/analysis/stopwords/german
   [junit4]   2> 1793901 INFO  (coreLoadExecutor-6368-thread-1) [    x:collection1] o.a.s.r.ManagedResourceStorage Saved JSON object to path _schema_analysis_stopwords_german.json using file:dir=C:\Users\jenkins\workspace\Lucene-Solr-7.x-Windows\solr\build\solr-core\test\J1\temp\solr.rest.schema.analysis.TestManagedSynonymFilterFactory_AC744C4F1871A189-001\tempDir-001\collection1\conf
   [junit4]   2> 1793901 INFO  (coreLoadExecutor-6368-thread-1) [    x:collection1] o.a.s.r.s.a.ManagedWordSetResource Loaded 0 words for /schema/analysis/stopwords/german
   [junit4]   2> 1793901 INFO  (coreLoadExecutor-6368-thread-1) [    x:collection1] o.a.s.r.ManagedResource Notified 6 observers of /schema/analysis/stopwords/german
   [junit4]   2> 1793901 WARN  (coreLoadExecutor-6368-thread-1) [    x:collection1] o.a.s.r.ManagedResource No stored data found for /schema/analysis/synonyms/english
   [junit4]   2> 1793901 INFO  (coreLoadExecutor-6368-thread-1) [    x:collection1] o.a.s.r.s.a.ManagedSynonymFilterFactory Loaded 0 synonym mappings for /schema/analysis/synonyms/english
   [junit4]   2> 1793901 INFO  (coreLoadExecutor-6368-thread-1) [    x:collection1] o.a.s.r.ManagedResource Notified 2 observers of /schema/analysis/synonyms/english
   [junit4]   2> 1793901 WARN  (coreLoadExecutor-6368-thread-1) [    x:collection1] o.a.s.r.ManagedResource No stored data found for /schema/analysis/synonyms/englishgraph
   [junit4]   2> 1793901 INFO  (coreLoadExecutor-6368-thread-1) [    x:collection1] o.a.s.r.s.a.ManagedSynonymGraphFilterFactory Loaded 0 synonym mappings for /schema/analysis/synonyms/englishgraph
   [junit4]   2> 1793901 INFO  (coreLoadExecutor-6368-thread-1) [    x:collection1] o.a.s.r.ManagedResource Notified 4 observers of /schema/analysis/synonyms/englishgraph
   [junit4]   2> 1793902 WARN  (coreLoadExecutor-6368-thread-1) [    x:collection1] o.a.s.r.ManagedResource No stored data found for /schema/analysis/synonyms/german
   [junit4]   2> 1793902 INFO  (coreLoadExecutor-6368-thread-1) [    x:collection1] o.a.s.r.s.a.ManagedSynonymFilterFactory Loaded 0 synonym mappings for /schema/analysis/synonyms/german
   [junit4]   2> 1793902 INFO  (coreLoadExecutor-6368-thread-1) [    x:collection1] o.a.s.r.ManagedResource Notified 2 observers of /schema/analysis/synonyms/german
   [junit4]   2> 1793902 WARN  (coreLoadExecutor-6368-thread-1) [    x:collection1] o.a.s.r.ManagedResource No stored data found for /schema/analysis/synonyms/germangraph
   [junit4]   2> 1793902 INFO  (coreLoadExecutor-6368-thread-1) [    x:collection1] o.a.s.r.s.a.ManagedSynonymGraphFilterFactory Loaded 0 synonym mappings for /schema/analysis/synonyms/germangraph
   [junit4]   2> 1793902 INFO  (coreLoadExecutor-6368-thread-1) [    x:collection1] o.a.s.r.ManagedResource Notified 4 observers of /schema/analysis/synonyms/germangraph
   [junit4]   2> 1793902 INFO  (coreLoadExecutor-6368-thread-1) [    x:collection1] o.a.s.h.ReplicationHandler Commits will be reserved for 10000ms.
   [junit4]   2> 1793903 INFO  (TEST-TestManagedSynonymFilterFactory.testCanHandleDecodingAndEncodingForSynonyms-seed#[AC744C4F1871A189]) [    ] o.a.s.SolrJettyTestBase Jetty Assigned Port#56753
   [junit4]   2> 1793903 INFO  (searcherExecutor-6369-thread-1-processing-x:collection1) [    x:collection1] o.a.s.c.SolrCore [collection1] Registered new searcher Searcher@5c575858[collection1] main{ExitableDirectoryReader(UninvertingDirectoryReader())}
   [junit4]   2> 1793934 INFO  (qtp1039053038-18974) [    x:collection1] /solr SolrSchemaRestApi: [Restlet] ServerServlet: component class is null
   [junit4]   2> 1794075 INFO  (qtp1039053038-18974) [    x:collection1] /solr SolrSchemaRestApi: [Restlet] Attaching application: org.apache.solr.rest.SolrSchemaRestApi@70d3d83 to URI: /solr/schema
   [junit4]   2> xin 02, 2018 12:40:21 DE LA TARDI org.restlet.Application start
   [junit4]   2> INFO: Starting org.apache.solr.rest.SolrSchemaRestApi application
   [junit4]   2> 1794107 INFO  (qtp1039053038-18974) [    x:collection1] o.a.s.r.SolrSchemaRestApi createInboundRoot started for /schema
   [junit4]   2> 1794116 INFO  (qtp1039053038-18974) [    x:collection1] o.a.s.r.RestManager Attached managed resource at path: /analysis/stopwords/english
   [junit4]   2> 1794116 INFO  (qtp1039053038-18974) [    x:collection1] o.a.s.r.RestManager Attached managed resource at path: /analysis/stopwords/german
   [junit4]   2> 1794116 INFO  (qtp1039053038-18974) [    x:collection1] o.a.s.r.RestManager Attached managed resource at path: /analysis/synonyms/english
   [junit4]   2> 1794116 INFO  (qtp1039053038-18974) [    x:collection1] o.a.s.r.RestManager Attached managed resource at path: /analysis/synonyms/englishgraph
   [junit4]   2> 1794116 INFO  (qtp1039053038-18974) [    x:collection1] o.a.s.r.RestManager Attached managed resource at path: /analysis/synonyms/german
   [junit4]   2> 1794116 INFO  (qtp1039053038-18974) [    x:collection1] o.a.s.r.RestManager Attached managed resource at path: /analysis/synonyms/germangraph
   [junit4]   2> 1794118 INFO  (qtp1039053038-18974) [    x:collection1] o.a.s.r.RestManager Attached managed resource at path: /managed
   [junit4]   2> 1794118 INFO  (qtp1039053038-18974) [    x:collection1] o.a.s.r.RestManager Attached 7 ManagedResource endpoints to Restlet router: /schema
   [junit4]   2> 1794118 INFO  (qtp1039053038-18974) [    x:collection1] o.a.s.r.SolrSchemaRestApi createInboundRoot complete for /schema
   [junit4]   2> 1794140 INFO  (qtp1039053038-18974) [    x:collection1] o.a.s.r.RestManager Found ManagedResource [org.apache.solr.rest.schema.analysis.ManagedSynonymFilterFactory$SynonymManager@560a999b] for /schema/analysis/synonyms/german
   [junit4]   2> 1794141 INFO  (qtp1039053038-18974) [    x:collection1] o.a.s.r.RestManager [collection1]  webapp=/solr path=/schema/analysis/synonyms/german params={indent=on&wt=json} status=0 QTime=224
   [junit4]   2> xin 02, 2018 12:40:21 DE LA TARDI org.restlet.engine.log.LogFilter afterHandle
   [junit4]   2> INFO: 2018-01-02	12:40:21	127.0.0.1	-	127.0.0.1	56753	GET	/solr/schema/analysis/synonyms/german	wt=json&indent=on	200	-	0	52	https://127.0.0.1:56753	Apache-HttpClient/4.5.3 (Java/9.0.1)	-
   [junit4]   2> 1794169 WARN  (qtp1039053038-18974) [    x:collection1] o.e.j.s.ServletHandler Error for /solr/collection1/schema/analysis/synonyms/german
   [junit4]   2> java.lang.AssertionError: Attempted close of response output stream.
   [junit4]   2> 	at org.apache.solr.servlet.SolrDispatchFilter$2$1.close(SolrDispatchFilter.java:525)
   [junit4]   2> 	at org.eclipse.jetty.server.Dispatcher.commitResponse(Dispatcher.java:270)
   [junit4]   2> 	at org.eclipse.jetty.server.Dispatcher.forward(Dispatcher.java:202)
   [junit4]   2> 	at org.eclipse.jetty.server.Dispatcher.forward(Dispatcher.java:74)
   [junit4]   2> 	at org.apache.solr.servlet.SolrDispatchFilter.doFilter(SolrDispatchFilter.java:391)
   [junit4]   2> 	at org.apache.solr.servlet.SolrDispatchFilter.doFilter(SolrDispatchFilter.java:326)
   [junit4]   2> 	at org.eclipse.jetty.servlet.ServletHandler$CachedChain.doFilter(ServletHandler.java:1759)
   [junit4]   2> 	at org.apache.solr.client.solrj.embedded.JettySolrRunner$DebugFilter.doFilter(JettySolrRunner.java:139)
   [junit4]   2> 	at org.eclipse.jetty.servlet.ServletHandler$CachedChain.doFilter(ServletHandler.java:1759)
   [junit4]   2> 	at org.eclipse.jetty.servlet.ServletHandler.doHandle(ServletHandler.java:582)
   [junit4]   2> 	at org.eclipse.jetty.server.session.SessionHandler.doHandle(SessionHandler.java:224)
   [junit4]   2> 	at org.eclipse.jetty.server.handler.ContextHandler.doHandle(ContextHandler.java:1180)
   [junit4]   2> 	at org.eclipse.jetty.servlet.ServletHandler.doScope(ServletHandler.java:512)
   [junit4]   2> 	at org.eclipse.jetty.server.session.SessionHandler.doScope(SessionHandler.java:185)
   [junit4]   2> 	at org.eclipse.jetty.server.handler.ContextHandler.doScope(ContextHandler.java:1112)
   [junit4]   2> 	at org.eclipse.jetty.server.handler.ScopedHandler.handle(ScopedHandler.java:141)
   [junit4]   2> 	at org.eclipse.jetty.server.handler.gzip.GzipHandler.handle(GzipHandler.java:493)
   [junit4]   2> 	at org.eclipse.jetty.server.handler.HandlerWrapper.handle(HandlerWrapper.java:134)
   [junit4]   2> 	at org.eclipse.jetty.server.Server.handle(Server.java:534)
   [junit4]   2> 	at org.eclipse.jetty.server.HttpChannel.handle(HttpChannel.java:320)
   [junit4]   2> 	at org.eclipse.jetty.server.HttpConnection.onFillable(HttpConnection.java:251)
   [junit4]   2> 	at org.eclipse.jetty.io.AbstractConnection$ReadCallback.succeeded(AbstractConnection.java:283)
   [junit4]   2> 	at org.eclipse.jetty.io.FillInterest.fillable(FillInterest.java:108)
   [junit4]   2> 	at org.eclipse.jetty.io.ssl.SslConnection.onFillable(SslConnection.java:251)
   [junit4]   2> 	at org.eclipse.jetty.io.AbstractConnection$ReadCallback.succeeded(AbstractConnection.java:283)
   [junit4]   2> 	at org.eclipse.jetty.io.FillInterest.fillable(FillInterest.java:108)
   [junit4]   2> 	at org.eclipse.jetty.io.SelectChannelEndPoint$2.run(SelectChannelEndPoint.java:93)
   [junit4]   2> 	at org.eclipse.jetty.util.thread.strategy.ExecuteProduceConsume.executeProduceConsume(ExecuteProduceConsume.java:303)
   [junit4]   2> 	at org.eclipse.jetty.util.thread.strategy.ExecuteProduceConsume.produceConsume(ExecuteProduceConsume.java:148)
   [junit4]   2> 	at org.eclipse.jetty.util.thread.strategy.ExecuteProduceConsume.run(ExecuteProduceConsume.java:136)
   [junit4]   2> 	at org.eclipse.jetty.util.thread.QueuedThreadPool.runJob(QueuedThreadPool.java:671)
   [junit4]   2> 	at org.eclipse.jetty.util.thread.QueuedThreadPool$2.run(QueuedThreadPool.java:589)
   [junit4]   2> 	at java.base/java.lang.Thread.run(Thread.java:844)
   [junit4]   2> 1794177 INFO  (qtp1039053038-18975) [    x:collection1] o.a.s.r.RestManager Resource not found for /schema/analysis/synonyms/german/fr?hlich, looking for parent: /schema/analysis/synonyms/german
   [junit4]   2> 1794177 INFO  (qtp1039053038-18975) [    x:collection1] o.a.s.r.RestManager Found parent resource /schema/analysis/synonyms/german for child: fr?hlich
   [junit4]   2> 1794177 INFO  (qtp1039053038-18975) [    x:collection1] o.a.s.r.RestManager Found ManagedResource [org.apache.solr.rest.schema.analysis.ManagedSynonymFilterFactory$SynonymManager@560a999b] for /schema/analysis/synonyms/german/fr?hlich
   [junit4]   2> 1794178 INFO  (qtp1039053038-18975) [    x:collection1] o.a.s.r.RestManager [collection1]  webapp=/solr path=/schema/analysis/synonyms/german/fr?hlich params={indent=on&wt=json} msg={fr?hlich not found in /schema/analysis/synonyms/german} status=404 QTime=3
   [junit4]   2> xin 02, 2018 12:40:21 DE LA TARDI org.restlet.engine.log.LogFilter afterHandle
   [junit4]   2> INFO: 2018-01-02	12:40:21	127.0.0.1	-	127.0.0.1	56753	GET	/solr/schema/analysis/synonyms/german/fr%C3%B6hlich	wt=json&indent=on	404	-	0	2	https://127.0.0.1:56753	Apache-HttpClient/4.5.3 (Java/9.0.1)	-
   [junit4]   2> 1794180 WARN  (qtp1039053038-18975) [    x:collection1] o.e.j.s.ServletHandler Error for /solr/collection1/schema/analysis/synonyms/german/fr%C3%B6hlich
   [junit4]   2> java.lang.AssertionError: Attempted close of response output stream.
   [junit4]   2> 	at org.apache.solr.servlet.SolrDispatchFilter$2$1.close(SolrDispatchFilter.java:525)
   [junit4]   2> 	at org.eclipse.jetty.server.Dispatcher.commitResponse(Dispatcher.java:270)
   [junit4]   2> 	at org.eclipse.jetty.server.Dispatcher.forward(Dispatcher.java:202)
   [junit4]   2> 	at org.eclipse.jetty.server.Dispatcher.forward(Dispatcher.java:74)
   [junit4]   2> 	at org.apache.solr.servlet.SolrDispatchFilter.doFilter(SolrDispatchFilter.java:391)
   [junit4]   2> 	at org.apache.solr.servlet.SolrDispatchFilter.doFilter(SolrDispatchFilter.java:326)
   [junit4]   2> 	at org.eclipse.jetty.servlet.ServletHandler$CachedChain.doFilter(ServletHandler.java:1759)
   [junit4]   2> 	at org.apache.solr.client.solrj.embedded.JettySolrRunner$DebugFilter.doFilter(JettySolrRunner.java:139)
   [junit4]   2> 	at org.eclipse.jetty.servlet.ServletHandler$CachedChain.doFilter(ServletHandler.java:1759)
   [junit4]   2> 	at org.eclipse.jetty.servlet.ServletHandler.doHandle(ServletHandler.java:582)
   [junit4]   2> 	at org.eclipse.jetty.server.session.SessionHandler.doHandle(SessionHandler.java:224)
   [junit4]   2> 	at org.eclipse.jetty.server.handler.ContextHandler.doHandle(ContextHandler.java:1180)
   [junit4]   2> 	at org.eclipse.jetty.servlet.ServletHandler.doScope(ServletHandler.java:512)
   [junit4]   2> 	at org.eclipse.jetty.server.session.SessionHandler.doScope(SessionHandler.java:185)
   [junit4]   2> 	at org.eclipse.jetty.server.handler.ContextHandler.doScope(ContextHandler.java:1112)
   [junit4]   2> 	at org.eclipse.jetty.server.handler.ScopedHandler.handle(ScopedHandler.java:141)
   [junit4]   2> 	at org.eclipse.jetty.server.handler.gzip.GzipHandler.handle(GzipHandler.java:493)
   [junit4]   2> 	at org.eclipse.jetty.server.handler.HandlerWrapper.handle(HandlerWrapper.java:134)
   [junit4]   2> 	at org.eclipse.jetty.server.Server.handle(Server.java:534)
   [junit4]   2> 	at org.eclipse.jetty.server.HttpChannel.handle(HttpChannel.java:320)
   [junit4]   2> 	at org.eclipse.jetty.server.HttpConnection.onFillable(HttpConnection.java:251)
   [junit4]   2> 	at org.eclipse.jetty.io.AbstractConnection$ReadCallback.succeeded(AbstractConnection.java:283)
   [junit4]   2> 	at org.eclipse.jetty.io.FillInterest.fillable(FillInterest.java:108)
   [junit4]   2> 	at org.eclipse.jetty.io.ssl.SslConnection.onFillable(SslConnection.java:251)
   [junit4]   2> 	at org.eclipse.jetty.io.AbstractConnection$ReadCallback.succeeded(AbstractConnection.java:283)
   [junit4]   2> 	at org.eclipse.jetty.io.FillInterest.fillable(FillInterest.java:108)
   [junit4]   2> 	at org.eclipse.jetty.io.SelectChannelEndPoint$2.run(SelectChannelEndPoint.java:93)
   [junit4]   2> 	at org.eclipse.jetty.util.thread.strategy.ExecuteProduceConsume.executeProduceConsume(ExecuteProduceConsume.java:303)
   [junit4]   2> 	at org.eclipse.jetty.util.thread.strategy.ExecuteProduceConsume.produceConsume(ExecuteProduceConsume.java:148)
   [junit4]   2> 	at org.eclipse.jetty.util.thread.strategy.ExecuteProduceConsume.run(ExecuteProduceConsume.java:136)
   [junit4]   2> 	at org.eclipse.jetty.util.thread.QueuedThreadPool.runJob(QueuedThreadPool.java:671)
   [junit4]   2> 	at org.eclipse.jetty.util.thread.QueuedThreadPool$2.run(QueuedThreadPool.java:589)
   [junit4]   2> 	at java.base/java.lang.Thread.run(Thread.java:844)
   [junit4]   2> 1794193 INFO  (qtp1039053038-18976) [    x:collection1] o.a.s.r.RestManager Found ManagedResource [org.apache.solr.rest.schema.analysis.ManagedSynonymFilterFactory$SynonymManager@560a999b] for /schema/analysis/synonyms/german
   [junit4]   2> 1794194 INFO  (qtp1039053038-18976) [    x:collection1] o.a.s.r.ManagedResource Processing update to /schema/analysis/synonyms/german: {fr?hlich=[gl?cklick]} is a java.util.LinkedHashMap
   [junit4]   2> 1794195 INFO  (qtp1039053038-18976) [    x:collection1] o.a.s.r.ManagedResourceStorage Saved JSON object to path _schema_analysis_synonyms_german.json using file:dir=C:\Users\jenkins\workspace\Lucene-Solr-7.x-Windows\solr\build\solr-core\test\J1\temp\solr.rest.schema.analysis.TestManagedSynonymFilterFactory_AC744C4F1871A189-001\tempDir-001\collection1\conf
   [junit4]   2> 1794195 INFO  (qtp1039053038-18976) [    x:collection1] o.a.s.r.RestManager [collection1]  webapp=/solr path=/schema/analysis/synonyms/german params={indent=on&wt=json} status=0 QTime=9
   [junit4]   2> xin 02, 2018 12:40:21 DE LA TARDI org.restlet.engine.log.LogFilter afterHandle
   [junit4]   2> INFO: 2018-01-02	12:40:21	127.0.0.1	-	127.0.0.1	56753	PUT	/solr/schema/analysis/synonyms/german	wt=json&indent=on	200	-	28	6	https://127.0.0.1:56753	Apache-HttpClient/4.5.3 (Java/9.0.1)	-
   [junit4]   2> 1794198 WARN  (qtp1039053038-18976) [    x:collection1] o.e.j.s.ServletHandler Error for /solr/collection1/schema/analysis/synonyms/german
   [junit4]   2> java.lang.AssertionError: Attempted close of response output stream.
   [junit4]   2> 	at org.apache.solr.servlet.SolrDispatchFilter$2$1.close(SolrDispatchFilter.java:525)
   [junit4]   2> 	at org.eclipse.jetty.server.Dispatcher.commitResponse(Dispatcher.java:270)
   [junit4]   2> 	at org.eclipse.jetty.server.Dispatcher.forward(Dispatcher.java:202)
   [junit4]   2> 	at org.eclipse.jetty.server.Dispatcher.forward(Dispatcher.java:74)
   [junit4]   2> 	at org.apache.solr.servlet.SolrDispatchFilter.doFilter(SolrDispatchFilter.java:391)
   [junit4]   2> 	at org.apache.solr.servlet.SolrDispatchFilter.doFilter(SolrDispatchFilter.java:326)
   [junit4]   2> 	at org.eclipse.jetty.servlet.ServletHandler$CachedChain.doFilter(ServletHandler.java:1759)
   [junit4]   2> 	at org.apache.solr.client.solrj.embedded.JettySolrRunner$DebugFilter.doFilter(JettySolrRunner.java:139)
   [junit4]   2> 	at org.eclipse.jetty.servlet.ServletHandler$CachedChain.doFilter(ServletHandler.java:1759)
   [junit4]   2> 	at org.eclipse.jetty.servlet.ServletHandler.doHandle(ServletHandler.java:582)
   [junit4]   2> 	at org.eclipse.jetty.server.session.SessionHandler.doHandle(SessionHandler.java:224)
   [junit4]   2> 	at org.eclipse.jetty.server.handler.ContextHandler.doHandle(ContextHandler.java:1180)
   [junit4]   2> 	at org.eclipse.jetty.servlet.ServletHandler.doScope(ServletHandler.java:512)
   [junit4]   2> 	at org.eclipse.jetty.server.session.SessionHandler.doScope(SessionHandler.java:185)
   [junit4]   2> 	at org.eclipse.jetty.server.handler.ContextHandler.doScope(ContextHandler.java:1112)
   [junit4]   2> 	at org.eclipse.jetty.server.handler.ScopedHandler.handle(ScopedHandler.java:141)
   [junit4]   2> 	at org.eclipse.jetty.server.handler.gzip.GzipHandler.handle(GzipHandler.java:426)
   [junit4]   2> 	at org.eclipse.jetty.server.handler.HandlerWrapper.handle(HandlerWrapper.java:134)
   [junit4]   2> 	at org.eclipse.jetty.server.Server.handle(Server.java:534)
   [junit4]   2> 	at org.eclipse.jetty.server.HttpChannel.handle(HttpChannel.java:320)
   [junit4]   2> 	at org.eclipse.jetty.server.HttpConnection.onFillable(HttpConnection.java:251)
   [junit4]   2> 	at org.eclipse.jetty.io.AbstractConnection$ReadCallback.succeeded(AbstractConnection.java:283)
   [junit4]   2> 	at org.eclipse.jetty.io.FillInterest.fillable(FillInterest.java:108)
   [junit4]   2> 	at org.eclipse.jetty.io.ssl.SslConnection.onFillable(SslConnection.java:251)
   [junit4]   2> 	at org.eclipse.jetty.io.AbstractConnection$ReadCallback.succeeded(AbstractConnection.java:283)
   [junit4]   2> 	at org.eclipse.jetty.io.FillInterest.fillable(FillInterest.java:108)
   [junit4]   2> 	at org.eclipse.jetty.io.SelectChannelEndPoint$2.run(SelectChannelEndPoint.java:93)
   [junit4]   2> 	at org.eclipse.jetty.util.thread.strategy.ExecuteProduceConsume.executeProduceConsume(ExecuteProduceConsume.java:303)
   [junit4]   2> 	at org.eclipse.jetty.util.thread.strategy.ExecuteProduceConsume.produceConsume(ExecuteProduceConsume.java:148)
   [junit4]   2> 	at org.eclipse.jetty.util.thread.strategy.ExecuteProduceConsume.run(ExecuteProduceConsume.java:136)
   [junit4]   2> 	at org.eclipse.jetty.util.thread.QueuedThreadPool.runJob(QueuedThreadPool.java:671)
   [junit4]   2> 	at org.eclipse.jetty.util.thread.QueuedThreadPool$2.run(QueuedThreadPool.java:589)
   [junit4]   2> 	at java.base/java.lang.Thread.run(Thread.java:844)
   [junit4]   2> 1794202 INFO  (qtp1039053038-18977) [    x:collection1] o.a.s.r.RestManager Found ManagedResource [org.apache.solr.rest.schema.analysis.ManagedSynonymFilterFactory$SynonymManager@560a999b] for /schema/analysis/synonyms/german
   [junit4]   2> 1794203 INFO  (qtp1039053038-18977) [    x:collection1] o.a.s.r.RestManager [collection1]  webapp=/solr path=/schema/analysis/synonyms/german params={indent=on&wt=json} status=0 QTime=0
   [junit4]   2> xin 02, 2018 12:40:21 DE LA TARDI org.restlet.engine.log.LogFilter afterHandle
   [junit4]   2> INFO: 2018-01-02	12:40:21	127.0.0.1	-	127.0.0.1	56753	GET	/solr/schema/analysis/synonyms/german	wt=json&indent=on	200	-	0	1	https://127.0.0.1:56753	Apache-HttpClient/4.5.3 (Java/9.0.1)	-
   [junit4]   2> 1794204 WARN  (qtp1039053038-18977) [    x:collection1] o.e.j.s.ServletHandler Error for /solr/collection1/schema/analysis/synonyms/german
   [junit4]   2> java.lang.AssertionError: Attempted close of response output stream.
   [junit4]   2> 	at org.apache.solr.servlet.SolrDispatchFilter$2$1.close(SolrDispatchFilter.java:525)
   [junit4]   2> 	at org.eclipse.jetty.server.Dispatcher.commitResponse(Dispatcher.java:270)
   [junit4]   2> 	at org.eclipse.jetty.server.Dispatcher.forward(Dispatcher.java:202)
   [junit4]   2> 	at org.eclipse.jetty.server.Dispatcher.forward(Dispatcher.java:74)
   [junit4]   2> 	at org.apache.solr.servlet.SolrDispatchFilter.doFilter(SolrDispatchFilter.java:391)
   [junit4]   2> 	at org.apache.solr.servlet.SolrDispatchFilter.doFilter(SolrDispatchFilter.java:326)
   [junit4]   2> 	at org.eclipse.jetty.servlet.ServletHandler$CachedChain.doFilter(ServletHandler.java:1759)
   [junit4]   2> 	at org.apache.solr.client.solrj.embedded.JettySolrRunner$DebugFilter.doFilter(JettySolrRunner.java:139)
   [junit4]   2> 	at org.eclipse.jetty.servlet.ServletHandler$CachedChain.doFilter(ServletHandler.java:1759)
   [junit4]   2> 	at org.eclipse.jetty.servlet.ServletHandler.doHandle(ServletHandler.java:582)
   [junit4]   2> 	at org.eclipse.jetty.server.session.SessionHandler.doHandle(SessionHandler.java:224)
   [junit4]   2> 	at org.eclipse.jetty.server.handler.ContextHandler.doHandle(ContextHandler.java:1180)
   [junit4]   2> 	at org.eclipse.jetty.servlet.ServletHandler.doScope(ServletHandler.java:512)
   [junit4]   2> 	at org.eclipse.jetty.server.session.SessionHandler.doScope(SessionHandler.java:185)
   [junit4]   2> 	at org.eclipse.jetty.server.handler.ContextHandler.doScope(ContextHandler.java:1112)
   [junit4]   2> 	at org.eclipse.jetty.server.handler.ScopedHandler.handle(ScopedHandler.java:141)
   [junit4]   2> 	at org.eclipse.jetty.server.handler.gzip.GzipHandler.handle(GzipHandler.java:493)
   [junit4]   2> 	at org.eclipse.jetty.server.handler.HandlerWrapper.handle(HandlerWrapper.java:134)
   [junit4]   2> 	at org.eclipse.jetty.server.Server.handle(Server.java:534)
   [junit4]   2> 	at org.eclipse.jetty.server.HttpChannel.handle(HttpChannel.java:320)
   [junit4]   2> 	at org.eclipse.jetty.server.HttpConnection.onFillable(HttpConnection.java:251)
   [junit4]   2> 	at org.eclipse.jetty.io.AbstractConnection$ReadCallback.succeeded(AbstractConnection.java:283)
   [junit4]   2> 	at org.eclipse.jetty.io.FillInterest.fillable(FillInterest.java:108)
   [junit4]   2> 	at org.eclipse.jetty.io.ssl.SslConnection.onFillable(SslConnection.java:251)
   [junit4]   2> 	at org.eclipse.jetty.io.AbstractConnection$ReadCallback.succeeded(AbstractConnection.java:283)
   [junit4]   2> 	at org.eclipse.jetty.io.FillInterest.fillable(FillInterest.java:108)
   [junit4]   2> 	at org.eclipse.jetty.io.SelectChannelEndPoint$2.run(SelectChannelEndPoint.java:93)
   [junit4]   2> 	at org.eclipse.jetty.util.thread.strategy.ExecuteProduceConsume.executeProduceConsume(ExecuteProduceConsume.java:303)
   [junit4]   2> 	at org.eclipse.jetty.util.thread.strategy.ExecuteProduceConsume.produceConsume(ExecuteProduceConsume.java:148)
   [junit4]   2> 	at org.eclipse.jetty.util.thread.strategy.ExecuteProduceConsume.run(ExecuteProduceConsume.java:136)
   [junit4]   2> 	at org.eclipse.jetty.util.thread.QueuedThreadPool.runJob(QueuedThreadPool.java:671)
   [junit4]   2> 	at org.eclipse.jetty.util.thread.QueuedThreadPool$2.run(QueuedThreadPool.java:589)
   [junit4]   2> 	at java.base/java.lang.Thread.run(Thread.java:844)
   [junit4]   2> 1794208 INFO  (qtp1039053038-18970) [    x:collection1] o.a.s.r.RestManager Resource not found for /schema/analysis/synonyms/german/fr?hlich, looking for parent: /schema/analysis/synonyms/german
   [junit4]   2> 1794208 INFO  (qtp1039053038-18970) [    x:collection1] o.a.s.r.RestManager Found parent resource /schema/analysis/synonyms/german for child: fr?hlich
   [junit4]   2> 1794208 INFO  (qtp1039053038-18970) [    x:collection1] o.a.s.r.RestManager Found ManagedResource [org.apache.solr.rest.schema.analysis.ManagedSynonymFilterFactory$SynonymManager@560a999b] for /schema/analysis/synonyms/german/fr?hlich
   [junit4]   2> 1794209 INFO  (qtp1039053038-18970) [    x:collection1] o.a.s.r.ManagedResourceStorage Saved JSON object to path _schema_analysis_synonyms_german.json using file:dir=C:\Users\jenkins\workspace\Lucene-Solr-7.x-Windows\solr\build\solr-core\test\J1\temp\solr.rest.schema.analysis.TestManagedSynonymFilterFactory_AC744C4F1871A189-001\tempDir-001\collection1\conf
   [junit4]   2> 1794209 INFO  (qtp1039053038-18970) [    x:collection1] o.a.s.r.s.a.ManagedSynonymFilterFactory Removed synonym mappings for: fr?hlich
   [junit4]   2> 1794209 INFO  (qtp1039053038-18970) [    x:collection1] o.a.s.r.RestManager [collection1]  webapp=/solr path=/schema/analysis/synonyms/german/fr?hlich params={indent=on&wt=json} status=0 QTime=3
   [junit4]   2> xin 02, 2018 12:40:21 DE LA TARDI org.restlet.engine.log.LogFilter afterHandle
   [junit4]   2> INFO: 2018-01-02	12:40:21	127.0.0.1	-	127.0.0.1	56753	DELETE	/solr/schema/analysis/synonyms/german/fr%C3%B6hlich	wt=json&indent=on	200	-	0	3	https://127.0.0.1:56753	Apache-HttpClient/4.5.3 (Java/9.0.1)	-
   [junit4]   2> 1794211 WARN  (qtp1039053038-18970) [    x:collection1] o.e.j.s.ServletHandler Error for /solr/collection1/schema/analysis/synonyms/german/fr%C3%B6hlich
   [junit4]   2> java.lang.AssertionError: Attempted close of response output stream.
   [junit4]   2> 	at org.apache.solr.servlet.SolrDispatchFilter$2$1.close(SolrDispatchFilter.java:525)
   [junit4]   2> 	at org.eclipse.jetty.server.Dispatcher.commitResponse(Dispatcher.java:270)
   [junit4]   2> 	at org.eclipse.jetty.server.Dispatcher.forward(Dispatcher.java:202)
   [junit4]   2> 	at org.eclipse.jetty.server.Dispatcher.forward(Dispatcher.java:74)
   [junit4]   2> 	at org.apache.solr.servlet.SolrDispatchFilter.doFilter(SolrDispatchFilter.java:391)
   [junit4]   2> 	at org.apache.solr.servlet.SolrDispatchFilter.doFilter(SolrDispatchFilter.java:326)
   [junit4]   2> 	at org.eclipse.jetty.servlet.ServletHandler$CachedChain.doFilter(ServletHandler.java:1759)
   [junit4]   2> 	at org.apache.solr.client.solrj.embedded.JettySolrRunner$DebugFilter.doFilter(JettySolrRunner.java:139)
   [junit4]   2> 	at org.eclipse.jetty.servlet.ServletHandler$CachedChain.doFilter(ServletHandler.java:1759)
   [junit4]   2> 	at org.eclipse.jetty.servlet.ServletHandler.doHandle(ServletHandler.java:582)
   [junit4]   2> 	at org.eclipse.jetty.server.session.SessionHandler.doHandle(SessionHandler.java:224)
   [junit4]   2> 	at org.eclipse.jetty.server.handler.ContextHandler.doHandle(ContextHandler.java:1180)
   [junit4]   2> 	at org.eclipse.jetty.servlet.ServletHandler.doScope(ServletHandler.java:512)
   [junit4]   2> 	at org.eclipse.jetty.server.session.SessionHandler.doScope(SessionHandler.java:185)
   [junit4]   2> 	at org.eclipse.jetty.server.handler.ContextHandler.doScope(ContextHandler.java:1112)
   [junit4]   2> 	at org.eclipse.jetty.server.handler.ScopedHandler.handle(ScopedHandler.java:141)
   [junit4]   2> 	at org.eclipse.jetty.server.handler.gzip.GzipHandler.handle(GzipHandler.java:426)
   [junit4]   2> 	at org.eclipse.jetty.server.handler.HandlerWrapper.handle(HandlerWrapper.java:134)
   [junit4]   2> 	at org.eclipse.jetty.server.Server.handle(Server.java:534)
   [junit4]   2> 	at org.eclipse.jetty.server.HttpChannel.handle(HttpChannel.java:320)
   [junit4]   2> 	at org.eclipse.jetty.server.HttpConnection.onFillable(HttpConnection.java:251)
   [junit4]   2> 	at org.eclipse.jetty.io.AbstractConnection$ReadCallback.succeeded(AbstractConnection.java:283)
   [junit4]   2> 	at org.eclipse.jetty.io.FillInterest.fillable(FillInterest.java:108)
   [junit4]   2> 	at org.eclipse.jetty.io.ssl.SslConnection.onFillable(SslConnection.java:251)
   [junit4]   2> 	at org.eclipse.jetty.io.AbstractConnection$ReadCallback.succeeded(AbstractConnection.java:283)
   [junit4]   2> 	at org.eclipse.jetty.io.FillInterest.fillable(FillInterest.java:108)
   [junit4]   2> 	at org.eclipse.jetty.io.SelectChannelEndPoint$2.run(SelectChannelEndPoint.java:93)
   [junit4]   2> 	at org.eclipse.jetty.util.thread.strategy.ExecuteProduceConsume.executeProduceConsume(ExecuteProduceConsume.java:303)
   [junit4]   2> 	at org.eclipse.jetty.util.thread.strategy.ExecuteProduceConsume.produceConsume(ExecuteProduceConsume.java:148)
   [junit4]   2> 	at org.eclipse.jetty.util.thread.strategy.ExecuteProduceConsume.run(ExecuteProduceConsume.java:136)
   [junit4]   2> 	at org.eclipse.jetty.util.thread.QueuedThreadPool.runJob(QueuedThreadPool.java:671)
   [junit4]   2> 	at org.eclipse.jetty.util.thread.QueuedThreadPool$2.run(QueuedThreadPool.java:589)
   [junit4]   2> 	at java.base/java.lang.Thread.run(Thread.java:844)
   [junit4]   2> 1794214 INFO  (qtp1039053038-18972) [    x:collection1] o.a.s.r.RestManager Resource not found for /schema/analysis/synonyms/german/fr?hlich, looking for parent: /schema/analysis/synonyms/german
   [junit4]   2> 1794214 INFO  (qtp1039053038-18972) [    x:collection1] o.a.s.r.RestManager Found parent resource /schema/analysis/synonyms/german for child: fr?hlich
   [junit4]   2> 1794214 INFO  (qtp1039053038-18972) [    x:collection1] o.a.s.r.RestManager Found ManagedResource [org.apache.solr.rest.schema.analysis.ManagedSynonymFilterFactory$SynonymManager@560a999b] for /schema/analysis/synonyms/german/fr?hlich
   [junit4]   2> 1794215 INFO  (qtp1039053038-18972) [    x:collection1] o.a.s.r.RestManager [collection1]  webapp=/solr path=/schema/analysis/synonyms/german/fr?hlich params={indent=on&wt=json} msg={fr?hlich not found in /schema/analysis/synonyms/german} status=404 QTime=1
   [junit4]   2> xin 02, 2018 12:40:21 DE LA TARDI org.restlet.engine.log.LogFilter afterHandle
   [junit4]   2> INFO: 2018-01-02	12:40:21	127.0.0.1	-	127.0.0.1	56753	DELETE	/solr/schema/analysis/synonyms/german/fr%C3%B6hlich	wt=json&indent=on	404	-	0	1	https://127.0.0.1:56753	Apache-HttpClient/4.5.3 (Java/9.0.1)	-
   [junit4]   2> 1794216 WARN  (qtp1039053038-18972) [    x:collection1] o.e.j.s.ServletHandler Error for /solr/collection1/schema/analysis/synonyms/german/fr%C3%B6hlich
   [junit4]   2> java.lang.AssertionError: Attempted close of response output stream.
   [junit4]   2> 	at org.apache.solr.servlet.SolrDispatchFilter$2$1.close(SolrDispatchFilter.java:525)
   [junit4]   2> 	at org.eclipse.jetty.server.Dispatcher.commitResponse(Dispatcher.java:270)
   [junit4]   2> 	at org.eclipse.jetty.server.Dispatcher.forward(Dispatcher.java:202)
   [junit4]   2> 	at org.eclipse.jetty.server.Dispatcher.forward(Dispatcher.java:74)
   [junit4]   2> 	at org.apache.solr.servlet.SolrDispatchFilter.doFilter(SolrDispatchFilter.java:391)
   [junit4]   2> 	at org.apache.solr.servlet.SolrDispatchFilter.doFilter(SolrDispatchFilter.java:326)
   [junit4]   2> 	at org.eclipse.jetty.servlet.ServletHandler$CachedChain.doFilter(ServletHandler.java:1759)
   [junit4]   2> 	at org.apache.solr.client.solrj.embedded.JettySolrRunner$DebugFilter.doFilter(JettySolrRunner.java:139)
   [junit4]   2> 	at org.eclipse.jetty.servlet.ServletHandler$CachedChain.doFilter(ServletHandler.java:1759)
   [junit4]   2> 	at org.eclipse.jetty.servlet.ServletHandler.doHandle(ServletHandler.java:582)
   [junit4]   2> 	at org.eclipse.jetty.server.session.SessionHandler.doHandle(SessionHandler.java:224)
   [junit4]   2> 	at org.eclipse.jetty.server.handler.ContextHandler.doHandle(ContextHandler.java:1180)
   [junit4]   2> 	at org.eclipse.jetty.servlet.ServletHandler.doScope(ServletHandler.java:512)
   [junit4]   2> 	at org.eclipse.jetty.server.session.SessionHandler.doScope(SessionHandler.java:185)
   [junit4]   2> 	at org.eclipse.jetty.server.handler.ContextHandler.doScope(ContextHandler.java:1112)
   [junit4]   2> 	at org.eclipse.jetty.server.handler.ScopedHandler.handle(ScopedHandler.java:141)
   [junit4]   2> 	at org.eclipse.jetty.server.handler.gzip.GzipHandler.handle(GzipHandler.java:426)
   [junit4]   2> 	at org.eclipse.jetty.server.handler.HandlerWrapper.handle(HandlerWrapper.java:134)
   [junit4]   2> 	at org.eclipse.jetty.server.Server.handle(Server.java:534)
   [junit4]   2> 	at org.eclipse.jetty.server.HttpChannel.handle(HttpChannel.java:320)
   [junit4]   2> 	at org.eclipse.jetty.server.HttpConnection.onFillable(HttpConnection.java:251)
   [junit4]   2> 	at org.eclipse.jetty.io.AbstractConnection$ReadCallback.succeeded(AbstractConnection.java:283)
   [junit4]   2> 	at org.eclipse.jetty.io.FillInterest.fillable(FillInterest.java:108)
   [junit4]   2> 	at org.eclipse.jetty.io.ssl.SslConnection.onFillable(SslConnection.java:251)
   [junit4]   2> 	at org.eclipse.jetty.io.AbstractConnection$ReadCallback.succeeded(AbstractConnection.java:283)
   [junit4]   2> 	at org.eclipse.jetty.io.FillInterest.fillable(FillInterest.java:108)
   [junit4]   2> 	at org.eclipse.jetty.io.SelectChannelEndPoint$2.run(SelectChannelEndPoint.java:93)
   [junit4]   2> 	at org.eclipse.jetty.util.thread.strategy.ExecuteProduceConsume.executeProduceConsume(ExecuteProduceConsume.java:303)
   [junit4]   2> 	at org.eclipse.jetty.util.thread.strategy.ExecuteProduceConsume.produceConsume(ExecuteProduceConsume.java:148)
   [junit4]   2> 	at org.eclipse.jetty.util.thread.strategy.ExecuteProduceConsume.run(ExecuteProduceConsume.java:136)
   [junit4]   2> 	at org.eclipse.jetty.util.thread.QueuedThreadPool.runJob(QueuedThreadPool.java:671)
   [junit4]   2> 	at org.eclipse.jetty.util.thread.QueuedThreadPool$2.run(QueuedThreadPool.java:589)
   [junit4]   2> 	at java.base/java.lang.Thread.run(Thread.java:844)
   [junit4]   2> 1794220 INFO  (TEST-TestManagedSynonymFilterFactory.testCanHandleDecodingAndEncodingForSynonyms-seed#[AC744C4F1871A189]) [    ] o.e.j.s.AbstractConnector Stopped ServerConnector@746bcfa6{SSL,[ssl, http/1.1]}{127.0.0.1:0}
   [junit4]   2> 1794220 INFO  (TEST-TestManagedSynonymFilterFactory.testCanHandleDecodingAndEncodingForSynonyms-seed#[AC744C4F1871A189]) [    ] o.a.s.c.CoreContainer Shutting down CoreContainer instance=1203705749
   [junit4]   2> 1794220 INFO  (TEST-TestManagedSynonymFilterFactory.testCanHandleDecodingAndEncodingForSynonyms-seed#[AC744C4F1871A189]) [    ] o.a.s.m.SolrMetricManager Closing metric reporters for registry=solr.node, tag=null
   [junit4]   2> 1794220 INFO  (TEST-TestManagedSynonymFilterFactory.testCanHandleDecodingAndEncodingForSynonyms-seed#[AC744C4F1871A189]) [    ] o.a.s.m.r.SolrJmxReporter Closing reporter [org.apache.solr.metrics.reporters.SolrJmxReporter@38046caf: rootName = null, domain = solr.node, service url = null, agent id = null] for registry solr.node / com.codahale.metrics.MetricRegistry@4def7506
   [junit4]   2> 1794229 INFO  (TEST-TestManagedSynonymFilterFactory.testCanHandleDecodingAndEncodingForSynonyms-seed#[AC744C4F1871A189]) [    ] o.a.s.m.SolrMetricManager Closing metric reporters for registry=solr.jvm, tag=null
   [junit4]   2> 1794229 INFO  (TEST-TestManagedSynonymFilterFactory.testCanHandleDecodingAndEncodingForSynonyms-seed#[AC744C4F1871A189]) [    ] o.a.s.m.r.SolrJmxReporter Closing reporter [org.apache.solr.metrics.reporters.SolrJmxReporter@2ccdd165: rootName = null, domain = solr.jvm, service url = null, agent id = null] for registry solr.jvm / com.codahale.metrics.MetricRegistry@28957cf6
   [junit4]   2> 1794235 INFO  (TEST-TestManagedSynonymFilterFactory.testCanHandleDecodingAndEncodingForSynonyms-seed#[AC744C4F1871A189]) [    ] o.a.s.m.SolrMetricManager Closing metric reporters for registry=solr.jetty, tag=null
   [junit4]   2> 1794235 INFO  (TEST-TestManagedSynonymFilterFactory.testCanHandleDecodingAndEncodingForSynonyms-seed#[AC744C4F1871A189]) [    ] o.a.s.m.r.SolrJmxReporter Closing reporter [org.apache.solr.metrics.reporters.SolrJmxReporter@274f6d3e: rootName = null, domain = solr.jetty, service url = null, agent id = null] for registry solr.jetty / com.codahale.metrics.MetricRegistry@63029a7e
   [junit4]   2> 1794236 INFO  (coreCloseExecutor-6373-thread-1) [    x:collection1] o.a.s.c.SolrCore [collection1]  CLOSING SolrCore org.apache.solr.core.SolrCore@213f0883
   [junit4]   2> 1794236 INFO  (coreCloseExecutor-6373-thread-1) [    x:collection1] o.a.s.m.SolrMetricManager Closing metric reporters for registry=solr.core.collection1, tag=557779075
   [junit4]   2> 1794236 INFO  (coreCloseExecutor-6373-thread-1) [    x:collection1] o.a.s.m.r.SolrJmxReporter Closing reporter [org.apache.solr.metrics.reporters.SolrJmxReporter@84edc02: rootName = null, domain = solr.core.collection1, service url = null, agent id = null] for registry solr.core.collection1 / com.codahale.metrics.MetricRegistry@18841caa
   [junit4]   2> 1794253 INFO  (TEST-TestManagedSynonymFilterFactory.testCanHandleDecodingAndEncodingForSynonyms-seed#[AC744C4F1871A189]) [    ] o.e.j.s.h.ContextHandler Stopped o.e.j.s.ServletContextHandler@6be8ec63{/solr,null,UNAVAILABLE}
   [junit4]   2> 1794444 INFO  (TEST-TestManagedSynonymFilterFactory.testCanHandleDecodingAndEncodingForSynonyms-seed#[AC744C4F1871A189]) [    ] o.a.s.SolrTestCaseJ4 ###Ending testCanHandleDecodingAndEncodingForSynonyms
   [junit4]   2> 1794446 INFO  (TEST-TestManagedSynonymFilterFactory.testManagedSynonyms-seed#[AC744C4F1871A189]) [    ] o.a.s.SolrTestCaseJ4 ###Starting testManagedSynonyms
   [junit4]   2> 1794879 INFO  (TEST-TestManagedSynonymFilterFactory.testManagedSynonyms-seed#[AC744C4F1871A189]) [    ] o.a.s.SolrTestCaseJ4 ####initCore
   [junit4]   2> 1794879 INFO  (TEST-TestManagedSynonymFilterFactory.testManagedSynonyms-seed#[AC744C4F1871A189]) [    ] o.a.s.SolrTestCaseJ4 ####initCore end
   [junit4]   2> 1794880 INFO  (TEST-TestManagedSynonymFilterFactory.testManagedSynonyms-seed#[AC744C4F1871A189]) [    ] o.a.s.SolrTestCaseJ4 Writing core.properties file to C:\Users\jenkins\workspace\Lucene-Solr-7.x-Windows\solr\build\solr-core\test\J1\temp\solr.rest.schema.analysis.TestManagedSynonymFilterFactory_AC744C4F1871A189-001\tempDir-005\cores\core
   [junit4]   2> 1794883 INFO  (TEST-TestManagedSynonymFilterFactory.testManagedSynonyms-seed#[AC744C4F1871A189]) [    ] o.e.j.s.Server jetty-9.3.20.v20170531
   [junit4]   2> 1794885 INFO  (TEST-TestManagedSynonymFilterFactory.testManagedSynonyms-seed#[AC744C4F1871A189]) [    ] o.e.j.s.h.ContextHandler Started o.e.j.s.ServletContextHandler@7475bc4d{/solr,null,AVAILABLE}
   [junit4]   2> 1794887 INFO  (TEST-TestManagedSynonymFilterFactory.testManagedSynonyms-seed#[AC744C4F1871A189]) [    ] o.e.j.s.AbstractConnector Started ServerConnector@7543395{SSL,[ssl, http/1.1]}{127.0.0.1:56759}
   [junit4]   2> 1794887 INFO  (TEST-TestManagedSynonymFilterFactory.testManagedSynonyms-seed#[AC744C4F1871A189]) [    ] o.e.j.s.Server Started @1806375ms
   [junit4]   2> 1794887 INFO  (TEST-TestManagedSynonymFilterFactory.testManagedSynonyms-seed#[AC744C4F1871A189]) [    ] o.a.s.c.s.e.JettySolrRunner Jetty properties: {hostContext=/solr, configSetBaseDir=C:\Users\jenkins\workspace\Lucene-Solr-7.x-Windows\solr\build\solr-core\test\J1\temp\solr.rest.schema.analysis.TestManagedSynonymFilterFactory_AC744C4F1871A189-001\tempDir-001, hostPort=56759, coreRootDirectory=C:\Users\jenkins\workspace\Lucene-Solr-7.x-Windows\solr\build\solr-core\test\J1\temp\solr.rest.schema.analysis.TestManagedSynonymFilterFactory_AC744C4F1871A189-001\tempDir-005\cores}
   [junit4]   2> 1794888 ERROR (TEST-TestManagedSynonymFilterFactory.testManagedSynonyms-seed#[AC744C4F1871A189]) [    ] o.a.s.u.StartupLoggingUtils Missing Java Option solr.log.dir. Logging may be missing or incomplete.
   [junit4]   2> 1794888 INFO  (TEST-TestManagedSynonymFilterFactory.testManagedSynonyms-seed#[AC744C4F1871A189]) [    ] o.a.s.s.SolrDispatchFilter  ___      _       Welcome to Apache Solr? version 7.3.0
   [junit4]   2> 1794888 INFO  (TEST-TestManagedSynonymFilterFactory.testManagedSynonyms-seed#[AC744C4F1871A189]) [    ] o.a.s.s.SolrDispatchFilter / __| ___| |_ _   Starting in standalone mode on port null
   [junit4]   2> 1794888 INFO  (TEST-TestManagedSynonymFilterFactory.testManagedSynonyms-seed#[AC744C4F1871A189]) [    ] o.a.s.s.SolrDispatchFilter \__ \/ _ \ | '_|  Install dir: null
   [junit4]   2> 1794888 INFO  (TEST-TestManagedSynonymFilterFactory.testManagedSynonyms-seed#[AC744C4F1871A189]) [    ] o.a.s.s.SolrDispatchFilter |___/\___/_|_|    Start time: 2018-01-02T10:40:22.116458Z
   [junit4]   2> 1794888 INFO  (TEST-TestManagedSynonymFilterFactory.testManagedSynonyms-seed#[AC744C4F1871A189]) [    ] o.a.s.c.SolrXmlConfig Loading container configuration from C:\Users\jenkins\workspace\Lucene-Solr-7.x-Windows\solr\build\solr-core\test\J1\temp\solr.rest.schema.analysis.TestManagedSynonymFilterFactory_AC744C4F1871A189-001\tempDir-001\solr.xml
   [junit4]   2> 1794892 INFO  (TEST-TestManagedSynonymFilterFactory.testManagedSynonyms-seed#[AC744C4F1871A189]) [    ] o.a.s.c.SolrXmlConfig Configuration parameter autoReplicaFailoverWorkLoopDelay is ignored
   [junit4]   2> 1794893 INFO  (TEST-TestManagedSynonymFilterFactory.testManagedSynonyms-seed#[AC744C4F1871A189]) [    ] o.a.s.c.SolrXmlConfig Configuration parameter autoReplicaFailoverBadNodeExpiration is ignored
   [junit4]   2> 1794894 INFO  (TEST-TestManagedSynonymFilterFactory.testManagedSynonyms-seed#[AC744C4F1871A189]) [    ] o.a.s.c.SolrXmlConfig MBean server found: com.sun.jmx.mbeanserver.JmxMBeanServer@26a1fb90, but no JMX reporters were configured - adding default JMX reporter.
   [junit4]   2> 1794953 INFO  (TEST-TestManagedSynonymFilterFactory.testManagedSynonyms-seed#[AC744C4F1871A189]) [    ] o.a.s.m.r.SolrJmxReporter JMX monitoring for 'solr.node' (registry 'solr.node') enabled at server: com.sun.jmx.mbeanserver.JmxMBeanServer@26a1fb90
   [junit4]   2> 1794964 INFO  (TEST-TestManagedSynonymFilterFactory.testManagedSynonyms-seed#[AC744C4F1871A189]) [    ] o.a.s.m.r.SolrJmxReporter JMX monitoring for 'solr.jvm' (registry 'solr.jvm') enabled at server: com.sun.jmx.mbeanserver.JmxMBeanServer@26a1fb90
   [junit4]   2> 1794964 INFO  (TEST-TestManagedSynonymFilterFactory.testManagedSynonyms-seed#[AC744C4F1871A189]) [    ] o.a.s.m.r.SolrJmxReporter JMX monitoring for 'solr.jetty' (registry 'solr.jetty') enabled at server: com.sun.jmx.mbeanserver.JmxMBeanServer@26a1fb90
   [junit4]   2> 1794967 INFO  (TEST-TestManagedSynonymFilterFactory.testManagedSynonyms-seed#[AC744C4F1871A189]) [    ] o.a.s.c.CorePropertiesLocator Found 1 core definitions underneath C:\Users\jenkins\workspace\Lucene-Solr-7.x-Windows\solr\build\solr-core\test\J1\temp\solr.rest.schema.analysis.TestManagedSynonymFilterFactory_AC744C4F1871A189-001\tempDir-005\cores
   [junit4]   2> 1794967 INFO  (TEST-TestManagedSynonymFilterFactory.testManagedSynonyms-seed#[AC744C4F1871A189]) [    ] o.a.s.c.CorePropertiesLocator Cores are: [collection1]
   [junit4]   2> 1794968 INFO  (coreLoadExecutor-6380-thread-1) [    ] o.a.s.c.TransientSolrCoreCacheDefault Allocating transient cache for 4 transient cores
   [junit4]   2> 1794969 INFO  (coreLoadExecutor-6380-thread-1) [    x:collection1] o.a.s.c.SolrResourceLoader [null] Added 2 libs to classloader, from paths: [/C:/Users/jenkins/workspace/Lucene-Solr-7.x-Windows/solr/build/solr-core/test/J1/temp/solr.rest.schema.analysis.TestManagedSynonymFilterFactory_AC744C4F1871A189-001/tempDir-001/collection1/lib, /C:/Users/jenkins/workspace/Lucene-Solr-7.x-Windows/solr/build/solr-core/test/J1/temp/solr.rest.schema.analysis.TestManagedSynonymFilterFactory_AC744C4F1871A189-001/tempDir-001/collection1/lib/classes]
   [junit4]   2> 1795002 INFO  (coreLoadExecutor-6380-thread-1) [    x:collection1] o.a.s.c.SolrConfig Using Lucene MatchVersion: 7.3.0
   [junit4]   2> 1795008 INFO  (coreLoadExecutor-6380-thread-1) [    x:collection1] o.a.s.s.ManagedIndexSchemaFactory The schema is configured as managed, but managed schema resource managed-schema not found - loading non-managed schema schema-rest.xml instead
   [junit4]   2> 1795013 INFO  (coreLoadExecutor-6380-thread-1) [    x:collection1] o.a.s.s.IndexSchema [collection1] Schema name=test-rest
   [junit4]   2> 1795109 WARN  (coreLoadExecutor-6380-thread-1) [    x:collection1] o.a.s.s.IndexSchema Field title is not multivalued and destination for multiple copyFields (3)
   [junit4]   2> 1795112 INFO  (coreLoadExecutor-6380-thread-1) [    x:collection1] o.a.s.r.RestManager Registered ManagedResource impl org.apache.solr.rest.schema.analysis.ManagedWordSetResource for path /schema/analysis/stopwords/german
   [junit4]   2> 1795113 INFO  (coreLoadExecutor-6380-thread-1) [    x:collection1] o.a.s.r.RestManager Registered ManagedResource impl org.apache.solr.rest.schema.analysis.ManagedSynonymFilterFactory$SynonymManager for path /schema/analysis/synonyms/german
   [junit4]   2> 1795115 INFO  (coreLoadExecutor-6380-thread-1) [    x:collection1] o.a.s.r.RestManager Registered ManagedResource impl org.apache.solr.rest.schema.analysis.ManagedWordSetResource for path /schema/analysis/stopwords/english
   [junit4]   2> 1795115 INFO  (coreLoadExecutor-6380-thread-1) [    x:collection1] o.a.s.r.RestManager Registered ManagedResource impl org.apache.solr.rest.schema.analysis.ManagedSynonymGraphFilterFactory$SynonymManager for path /schema/analysis/synonyms/englishgraph
   [junit4]   2> 1795115 INFO  (coreLoadExecutor-6380-thread-1) [    x:collection1] o.a.s.r.RestManager Added observer of type org.apache.solr.rest.schema.analysis.ManagedStopFilterFactory to existing ManagedResource /schema/analysis/stopwords/english
   [junit4]   2> 1795115 INFO  (coreLoadExecutor-6380-thread-1) [    x:collection1] o.a.s.r.RestManager Added observer of type org.apache.solr.rest.schema.analysis.ManagedSynonymGraphFilterFactory to existing ManagedResource /schema/analysis/synonyms/englishgraph
   [junit4]   2> 1795116 INFO  (coreLoadExecutor-6380-thread-1) [    x:collection1] o.a.s.r.RestManager Added observer of type org.apache.solr.rest.schema.analysis.ManagedStopFilterFactory to existing ManagedResource /schema/analysis/stopwords/german
   [junit4]   2> 1795116 INFO  (coreLoadExecutor-6380-thread-1) [    x:collection1] o.a.s.r.RestManager Registered ManagedResource impl org.apache.solr.rest.schema.analysis.ManagedSynonymGraphFilterFactory$SynonymManager for path /schema/analysis/synonyms/germangraph
   [junit4]   2> 1795116 INFO  (coreLoadExecutor-6380-thread-1) [    x:collection1] o.a.s.r.RestManager Added observer of type org.apache.solr.rest.schema.analysis.ManagedStopFilterFactory to existing ManagedResource /schema/analysis/stopwords/german
   [junit4]   2> 1795116 INFO  (coreLoadExecutor-6380-thread-1) [    x:collection1] o.a.s.r.RestManager Added observer of type org.apache.solr.rest.schema.analysis.ManagedSynonymGraphFilterFactory to existing ManagedResource /schema/analysis/synonyms/germangraph
   [junit4]   2> 1795121 INFO  (coreLoadExecutor-6380-thread-1) [    x:collection1] o.a.s.r.RestManager Added observer of type org.apache.solr.rest.schema.analysis.ManagedStopFilterFactory to existing ManagedResource /schema/analysis/stopwords/english
   [junit4]   2> 1795121 INFO  (coreLoadExecutor-6380-thread-1) [    x:collection1] o.a.s.r.RestManager Registered ManagedResource impl org.apache.solr.rest.schema.analysis.ManagedSynonymFilterFactory$SynonymManager for path /schema/analysis/synonyms/english
   [junit4]   2> 1795121 INFO  (coreLoadExecutor-6380-thread-1) [    x:collection1] o.a.s.s.IndexSchema Loaded schema test-rest/1.6 with uniqueid field id
   [junit4]   2> 1795127 INFO  (coreLoadExecutor-6380-thread-1) [    x:collection1] o.a.s.r.RestManager Added observer of type org.apache.solr.rest.schema.analysis.ManagedStopFilterFactory to existing ManagedResource /schema/analysis/stopwords/english
   [junit4]   2> 1795128 INFO  (coreLoadExecutor-6380-thread-1) [    x:collection1] o.a.s.r.RestManager Added observer of type org.apache.solr.rest.schema.analysis.ManagedSynonymFilterFactory to existing ManagedResource /schema/analysis/synonyms/english
   [junit4]   2> 1795128 INFO  (coreLoadExecutor-6380-thread-1) [    x:collection1] o.a.s.r.RestManager Added observer of type org.apache.solr.rest.schema.analysis.ManagedStopFilterFactory to existing ManagedResource /schema/analysis/stopwords/german
   [junit4]   2> 1795128 INFO  (coreLoadExecutor-6380-thread-1) [    x:collection1] o.a.s.r.RestManager Added observer of type org.apache.solr.rest.schema.analysis.ManagedSynonymFilterFactory to existing ManagedResource /schema/analysis/synonyms/german
   [junit4]   2> 1795128 INFO  (coreLoadExecutor-6380-thread-1) [    x:collection1] o.a.s.r.RestManager Added observer of type org.apache.solr.rest.schema.analysis.ManagedStopFilterFactory to existing ManagedResource /schema/analysis/stopwords/english
   [junit4]   2> 1795128 INFO  (coreLoadExecutor-6380-thread-1) [    x:collection1] o.a.s.r.RestManager Added observer of type org.apache.solr.rest.schema.analysis.ManagedSynonymGraphFilterFactory to existing ManagedResource /schema/analysis/synonyms/englishgraph
   [junit4]   2> 1795128 INFO  (coreLoadExecutor-6380-thread-1) [    x:collection1] o.a.s.r.RestManager Added observer of type org.apache.solr.rest.schema.analysis.ManagedStopFilterFactory to existing ManagedResource /schema/analysis/stopwords/english
   [junit4]   2> 1795128 INFO  (coreLoadExecutor-6380-thread-1) [    x:collection1] o.a.s.r.RestManager Added observer of type org.apache.solr.rest.schema.analysis.ManagedSynonymGraphFilterFactory to existing ManagedResource /schema/analysis/synonyms/englishgraph
   [junit4]   2> 1795128 INFO  (coreLoadExecutor-6380-thread-1) [    x:collection1] o.a.s.r.RestManager Added observer of type org.apache.solr.rest.schema.analysis.ManagedStopFilterFactory to existing ManagedResource /schema/analysis/stopwords/german
   [junit4]   2> 1795128 INFO  (coreLoadExecutor-6380-thread-1) [    x:collection1] o.a.s.r.RestManager Added observer of type org.apache.solr.rest.schema.analysis.ManagedSynonymGraphFilterFactory to existing ManagedResource /schema/analysis/synonyms/germangraph
   [junit4]   2> 1795128 INFO  (coreLoadExecutor-6380-thread-1) [    x:collection1] o.a.s.r.RestManager Added observer of type org.apache.solr.rest.schema.analysis.ManagedStopFilterFactory to existing ManagedResource /schema/analysis/stopwords/german
   [junit4]   2> 1795128 INFO  (coreLoadExecutor-6380-thread-1) [    x:collection1] o.a.s.r.RestManager Added observer of type org.apache.solr.rest.schema.analysis.ManagedSynonymGraphFilterFactory to existing ManagedResource /schema/analysis/synonyms/germangraph
   [junit4]   2> 1795130 INFO  (coreLoadExecutor-6380-thread-1) [    x:collection1] o.a.s.s.ManagedIndexSchema Upgraded to managed schema at C:\Users\jenkins\workspace\Lucene-Solr-7.x-Windows\solr\build\solr-core\test\J1\temp\solr.rest.schema.analysis.TestManagedSynonymFilterFactory_AC744C4F1871A189-001\tempDir-001\collection1\conf\managed-schema
   [junit4]   2> 1795134 INFO  (coreLoadExecutor-6380-thread-1) [    x:collection1] o.a.s.s.ManagedIndexSchemaFactory After upgrading to managed schema, renamed the non-managed schema C:\Users\jenkins\workspace\Lucene-Solr-7.x-Windows\solr\build\solr-core\test\J1\temp\solr.rest.schema.analysis.TestManagedSynonymFilterFactory_AC744C4F1871A189-001\tempDir-001\collection1\conf\schema-rest.xml to C:\Users\jenkins\workspace\Lucene-Solr-7.x-Windows\solr\build\solr-core\test\J1\temp\solr.rest.schema.analysis.TestManagedSynonymFilterFactory_AC744C4F1871A189-001\tempDir-001\collection1\conf\schema-rest.xml.bak
   [junit4]   2> 1795134 INFO  (coreLoadExecutor-6380-thread-1) [    x:collection1] o.a.s.c.CoreContainer Creating SolrCore 'collection1' using configuration from configset C:\Users\jenkins\workspace\Lucene-Solr-7.x-Windows\solr\build\solr-core\test\J1\temp\solr.rest.schema.analysis.TestManagedSynonymFilterFactory_AC744C4F1871A189-001\tempDir-001\collection1, trusted=true
   [junit4]   2> 1795134 INFO  (coreLoadExecutor-6380-thread-1) [    x:collection1] o.a.s.m.r.SolrJmxReporter JMX monitoring for 'solr.core.collection1' (registry 'solr.core.collection1') enabled at server: com.sun.jmx.mbeanserver.JmxMBeanServer@26a1fb90
   [junit4]   2> 1795134 INFO  (coreLoadExecutor-6380-thread-1) [    x:collection1] o.a.s.c.SolrCore solr.RecoveryStrategy.Builder
   [junit4]   2> 1795134 INFO  (coreLoadExecutor-6380-thread-1) [    x:collection1] o.a.s.c.SolrCore [[collection1] ] Opening new SolrCore at [C:\Users\jenkins\workspace\Lucene-Solr-7.x-Windows\solr\build\solr-core\test\J1\temp\solr.rest.schema.analysis.TestManagedSynonymFilterFactory_AC744C4F1871A189-001\tempDir-001\collection1], dataDir=[C:\Users\jenkins\workspace\Lucene-Solr-7.x-Windows\solr\build\solr-core\test\J1\temp\solr.rest.schema.analysis.TestManagedSynonymFilterFactory_AC744C4F1871A189-001\tempDir-005\cores\core\data\]
   [junit4]   2> 1795140 INFO  (coreLoadExecutor-6380-thread-1) [    x:collection1] o.a.s.u.RandomMergePolicy RandomMergePolicy wrapping class org.apache.lucene.index.LogByteSizeMergePolicy: [LogByteSizeMergePolicy: minMergeSize=1677721, mergeFactor=43, maxMergeSize=2147483648, maxMergeSizeForForcedMerge=9223372036854775807, calibrateSizeByDeletes=true, maxMergeDocs=2147483647, maxCFSSegmentSizeMB=8.796093022207999E12, noCFSRatio=0.0]
   [junit4]   2> 1795143 WARN  (coreLoadExecutor-6380-thread-1) [    x:collection1] o.a.s.c.RequestHandlers INVALID paramSet a in requestHandler {type = requestHandler,name = /dump,class = DumpRequestHandler,attributes = {initParams=a, name=/dump, registerPath=/solr,/v2, class=DumpRequestHandler},args = {defaults={a=A,b=B}}}
   [junit4]   2> 1795203 INFO  (coreLoadExecutor-6380-thread-1) [    x:collection1] o.a.s.u.CommitTracker Hard AutoCommit: disabled
   [junit4]   2> 1795203 INFO  (coreLoadExecutor-6380-thread-1) [    x:collection1] o.a.s.u.CommitTracker Soft AutoCommit: disabled
   [junit4]   2> 1795204 INFO  (coreLoadExecutor-6380-thread-1) [    x:collection1] o.a.s.u.RandomMergePolicy RandomMergePolicy wrapping class org.apache.lucene.index.LogDocMergePolicy: [LogDocMergePolicy: minMergeSize=1000, mergeFactor=30, maxMergeSize=9223372036854775807, maxMergeSizeForForcedMerge=9223372036854775807, calibrateSizeByDeletes=true, maxMergeDocs=2147483647, maxCFSSegmentSizeMB=8.796093022207999E12, noCFSRatio=1.0]
   [junit4]   2> 1795205 INFO  (coreLoadExecutor-6380-thread-1) [    x:collection1] o.a.s.s.SolrIndexSearcher Opening [Searcher@613db87[collection1] main]
   [junit4]   2> 1795205 INFO  (coreLoadExecutor-6380-thread-1) [    x:collection1] o.a.s.r.ManagedResourceStorage File-based storage initialized to use dir: C:\Users\jenkins\workspace\Lucene-Solr-7.x-Windows\solr\build\solr-core\test\J1\temp\solr.rest.schema.analysis.TestManagedSynonymFilterFactory_AC744C4F1871A189-001\tempDir-001\collection1\conf
   [junit4]   2> 1795206 WARN  (coreLoadExecutor-6380-thread-1) [    x:collection1] o.a.s.r.ManagedResource No stored data found for /schema/analysis/stopwords/english
   [junit4]   2> 1795207 INFO  (coreLoadExecutor-6380-thread-1) [    x:collection1] o.a.s.r.ManagedResourceStorage Saved JSON object to path _schema_analysis_stopwords_english.json using file:dir=C:\Users\jenkins\workspace\Lucene-Solr-7.x-Windows\solr\build\solr-core\test\J1\temp\solr.rest.schema.analysis.TestManagedSynonymFilterFactory_AC744C4F1871A189-001\tempDir-001\collection1\conf
   [junit4]   2> 1795207 INFO  (coreLoadExecutor-6380-thread-1) [    x:collection1] o.a.s.r.s.a.ManagedWordSetResource Loaded 0 words for /schema/analysis/stopwords/english
   [junit4]   2> 1795207 INFO  (coreLoadExecutor-6380-thread-1) [  

[...truncated too long message...]

thodAccessorImpl.invoke(DelegatingMethodAccessorImpl.java:43)
   [junit4]    > 	at java.base/java.lang.reflect.Method.invoke(Method.java:564)
   [junit4]    > 	at java.base/java.lang.Thread.run(Thread.java:844)
   [junit4]   2> NOTE: leaving temporary files on disk at: C:\Users\jenkins\workspace\Lucene-Solr-7.x-Windows\solr\build\solr-core\test\J1\temp\solr.rest.schema.analysis.TestManagedSynonymFilterFactory_AC744C4F1871A189-001
   [junit4]   2> NOTE: test params are: codec=Asserting(Lucene70): {}, docValues:{}, maxPointsInLeafNode=973, maxMBSortInHeap=5.336404640380355, sim=RandomSimilarity(queryNorm=true): {}, locale=ast, timezone=Asia/Gaza
   [junit4]   2> NOTE: Windows 10 10.0 amd64/Oracle Corporation 9.0.1 (64-bit)/cpus=3,threads=1,free=174029512,total=518979584
   [junit4]   2> NOTE: All tests run in this JVM: [MultiThreadedOCPTest, DocValuesMultiTest, TestSchemaManager, TestScoreJoinQPScore, RecoveryAfterSoftCommitTest, TestJettySolrRunner, TestDocBasedVersionConstraints, TestDynamicLoading, TestReloadDeadlock, MoveReplicaHDFSTest, TestBadConfig, TestTrie, TestOverriddenPrefixQueryForCustomFieldType, LeaderInitiatedRecoveryOnCommitTest, TestManagedSchema, DistributedFacetExistsSmallTest, TestFastWriter, HdfsWriteToMultipleCollectionsTest, TestSimpleQParserPlugin, EchoParamsTest, TestFieldCacheSort, ShufflingReplicaListTransformerTest, TestElisionMultitermQuery, PreAnalyzedFieldManagedSchemaCloudTest, TestPartialUpdateDeduplication, TestStressCloudBlindAtomicUpdates, TestDocSet, TestQueryUtils, TestCryptoKeys, DistribDocExpirationUpdateProcessorTest, SolrGraphiteReporterTest, ClassificationUpdateProcessorTest, TestCloudRecovery, TestHttpShardHandlerFactory, TestComponentsName, OpenExchangeRatesOrgProviderTest, TriggerIntegrationTest, BlockCacheTest, TestClusterStateMutator, TestSSLRandomization, IndexSchemaRuntimeFieldTest, ShardSplitTest, TestLegacyNumericUtils, CacheHeaderTest, TestApiFramework, TestRestoreCore, DistributedMLTComponentTest, JsonLoaderTest, AliasIntegrationTest, CloudMLTQParserTest, TestCopyFieldCollectionResource, BlobRepositoryCloudTest, RuleEngineTest, TestSchemaResource, TestAnalyzedSuggestions, ZkSolrClientTest, DistributedQueueTest, TestRandomFlRTGCloud, TestNumericTerms64, SpellCheckCollatorWithCollapseTest, TestPostingsSolrHighlighter, TestRTimerTree, TestConfigSetProperties, SimpleCollectionCreateDeleteTest, StatelessScriptUpdateProcessorFactoryTest, TestImpersonationWithHadoopAuth, TestLegacyField, TestCorePropertiesReload, FileUtilsTest, TestSolrConfigHandlerConcurrent, DeleteStatusTest, TestSolr4Spatial2, SpellPossibilityIteratorTest, SampleTest, ActionThrottleTest, SoftAutoCommitTest, BigEndianAscendingWordSerializerTest, TestLuceneIndexBackCompat, TestCollationFieldDocValues, TestValueSourceCache, TestComputePlanAction, TestLuceneMatchVersion, HighlighterMaxOffsetTest, TestSolrDeletionPolicy1, TestStressVersions, TestFastOutputStream, HLLSerializationTest, TestFieldCacheVsDocValues, CoreAdminHandlerTest, SolrPluginUtilsTest, TestMacros, HdfsAutoAddReplicasIntegrationTest, SimpleFacetsTest, AutoAddReplicasPlanActionTest, TestManagedResource, TestInfoStreamLogging, TestShardHandlerFactory, LeaderElectionIntegrationTest, SolrMetricsIntegrationTest, SolrCoreTest, FieldMutatingUpdateProcessorTest, ChaosMonkeyNothingIsSafeWithPullReplicasTest, BadComponentTest, CollectionStateFormat2Test, HdfsLockFactoryTest, TestStressLiveNodes, HttpPartitionTest, PKIAuthenticationIntegrationTest, ChaosMonkeySafeLeaderTest, TestPullReplica, EnumFieldTest, TriLevelCompositeIdRoutingTest, TestShortCircuitedRequests, TestSimDistributedQueue, SolrJmxReporterTest, DateRangeFieldTest, TermsComponentTest, CdcrBootstrapTest, SolrIndexConfigTest, TestSearchPerf, TermVectorComponentDistributedTest, TestUniqueKeyFieldResource, ConnectionManagerTest, TestExecutePlanAction, RegexBytesRefFilterTest, TestNamedUpdateProcessors, TestCloudManagedSchema, TestRandomFaceting, CdcrVersionReplicationTest, TestBlendedInfixSuggestions, TestSlowCompositeReaderWrapper, TestLegacyFieldCache, DistributedQueryComponentCustomSortTest, DocValuesTest, TestPayloadScoreQParserPlugin, TestDocumentBuilder, TestManagedSchemaThreadSafety, ResponseHeaderTest, SSLMigrationTest, ExternalFileFieldSortTest, SolrIndexSplitterTest, TestLargeCluster, TestConfigsApi, PluginInfoTest, TestLMJelinekMercerSimilarityFactory, TestManagedSynonymFilterFactory]
   [junit4] Completed [342/764 (1!)] on J1 in 2.77s, 2 tests, 1 error <<< FAILURES!

[...truncated 3737 lines...]
   [junit4] Suite: org.apache.solr.update.processor.TestOpenNLPExtractNamedEntitiesUpdateProcessorFactory
   [junit4]   2> Creating dataDir: C:\Users\jenkins\workspace\Lucene-Solr-7.x-Windows\solr\build\contrib\solr-analysis-extras\test\J1\temp\solr.update.processor.TestOpenNLPExtractNamedEntitiesUpdateProcessorFactory_CDB16AF551E7A267-001\init-core-data-001
   [junit4]   2> log4j:WARN No appenders could be found for logger (org.apache.solr.SolrTestCaseJ4).
   [junit4]   2> log4j:WARN Please initialize the log4j system properly.
   [junit4]   2> log4j:WARN See http://logging.apache.org/log4j/1.2/faq.html#noconfig for more info.
   [junit4]   2> NOTE: test params are: codec=Lucene70, sim=RandomSimilarity(queryNorm=true): {}, locale=km, timezone=ACT
   [junit4]   2> NOTE: Windows 10 10.0 amd64/Oracle Corporation 9.0.1 (64-bit)/cpus=3,threads=1,free=72721568,total=97386496
   [junit4]   2> NOTE: All tests run in this JVM: [TestOpenNLPExtractNamedEntitiesUpdateProcessorFactory]
   [junit4]   2> NOTE: reproduce with: ant test  -Dtestcase=TestOpenNLPExtractNamedEntitiesUpdateProcessorFactory -Dtests.seed=CDB16AF551E7A267 -Dtests.slow=true -Dtests.locale=km -Dtests.timezone=ACT -Dtests.asserts=true -Dtests.file.encoding=Cp1252
   [junit4] ERROR   0.00s J1 | TestOpenNLPExtractNamedEntitiesUpdateProcessorFactory (suite) <<<
   [junit4]    > Throwable #1: java.io.IOException: Could not remove the following files (in the order of attempts):
   [junit4]    >    C:\Users\jenkins\workspace\Lucene-Solr-7.x-Windows\solr\build\contrib\solr-analysis-extras\test\J1\temp\solr.update.processor.TestOpenNLPExtractNamedEntitiesUpdateProcessorFactory_CDB16AF551E7A267-001\tempDir-001\collection1\conf: java.nio.file.DirectoryNotEmptyException: C:\Users\jenkins\workspace\Lucene-Solr-7.x-Windows\solr\build\contrib\solr-analysis-extras\test\J1\temp\solr.update.processor.TestOpenNLPExtractNamedEntitiesUpdateProcessorFactory_CDB16AF551E7A267-001\tempDir-001\collection1\conf
   [junit4]    >    C:\Users\jenkins\workspace\Lucene-Solr-7.x-Windows\solr\build\contrib\solr-analysis-extras\test\J1\temp\solr.update.processor.TestOpenNLPExtractNamedEntitiesUpdateProcessorFactory_CDB16AF551E7A267-001\tempDir-001\collection1: java.nio.file.DirectoryNotEmptyException: C:\Users\jenkins\workspace\Lucene-Solr-7.x-Windows\solr\build\contrib\solr-analysis-extras\test\J1\temp\solr.update.processor.TestOpenNLPExtractNamedEntitiesUpdateProcessorFactory_CDB16AF551E7A267-001\tempDir-001\collection1
   [junit4]    >    C:\Users\jenkins\workspace\Lucene-Solr-7.x-Windows\solr\build\contrib\solr-analysis-extras\test\J1\temp\solr.update.processor.TestOpenNLPExtractNamedEntitiesUpdateProcessorFactory_CDB16AF551E7A267-001\tempDir-001: java.nio.file.DirectoryNotEmptyException: C:\Users\jenkins\workspace\Lucene-Solr-7.x-Windows\solr\build\contrib\solr-analysis-extras\test\J1\temp\solr.update.processor.TestOpenNLPExtractNamedEntitiesUpdateProcessorFactory_CDB16AF551E7A267-001\tempDir-001
   [junit4]    >    C:\Users\jenkins\workspace\Lucene-Solr-7.x-Windows\solr\build\contrib\solr-analysis-extras\test\J1\temp\solr.update.processor.TestOpenNLPExtractNamedEntitiesUpdateProcessorFactory_CDB16AF551E7A267-001\tempDir-001\collection1\conf\en-test-ner-person.bin: java.nio.file.AccessDeniedException: C:\Users\jenkins\workspace\Lucene-Solr-7.x-Windows\solr\build\contrib\solr-analysis-extras\test\J1\temp\solr.update.processor.TestOpenNLPExtractNamedEntitiesUpdateProcessorFactory_CDB16AF551E7A267-001\tempDir-001\collection1\conf\en-test-ner-person.bin
   [junit4]    >    C:\Users\jenkins\workspace\Lucene-Solr-7.x-Windows\solr\build\contrib\solr-analysis-extras\test\J1\temp\solr.update.processor.TestOpenNLPExtractNamedEntitiesUpdateProcessorFactory_CDB16AF551E7A267-001\tempDir-001\collection1\conf\en-test-tokenizer.bin: java.nio.file.AccessDeniedException: C:\Users\jenkins\workspace\Lucene-Solr-7.x-Windows\solr\build\contrib\solr-analysis-extras\test\J1\temp\solr.update.processor.TestOpenNLPExtractNamedEntitiesUpdateProcessorFactory_CDB16AF551E7A267-001\tempDir-001\collection1\conf\en-test-tokenizer.bin
   [junit4]    >    C:\Users\jenkins\workspace\Lucene-Solr-7.x-Windows\solr\build\contrib\solr-analysis-extras\test\J1\temp\solr.update.processor.TestOpenNLPExtractNamedEntitiesUpdateProcessorFactory_CDB16AF551E7A267-001\tempDir-001\collection1\conf\en-test-sent.bin: java.nio.file.AccessDeniedException: C:\Users\jenkins\workspace\Lucene-Solr-7.x-Windows\solr\build\contrib\solr-analysis-extras\test\J1\temp\solr.update.processor.TestOpenNLPExtractNamedEntitiesUpdateProcessorFactory_CDB16AF551E7A267-001\tempDir-001\collection1\conf\en-test-sent.bin
   [junit4]    >    C:\Users\jenkins\workspace\Lucene-Solr-7.x-Windows\solr\build\contrib\solr-analysis-extras\test\J1\temp\solr.update.processor.TestOpenNLPExtractNamedEntitiesUpdateProcessorFactory_CDB16AF551E7A267-001: java.nio.file.DirectoryNotEmptyException: C:\Users\jenkins\workspace\Lucene-Solr-7.x-Windows\solr\build\contrib\solr-analysis-extras\test\J1\temp\solr.update.processor.TestOpenNLPExtractNamedEntitiesUpdateProcessorFactory_CDB16AF551E7A267-001
   [junit4]    > 	at __randomizedtesting.SeedInfo.seed([CDB16AF551E7A267]:0)
   [junit4]    > 	at org.apache.lucene.util.IOUtils.rm(IOUtils.java:329)
   [junit4]    > 	at java.base/java.lang.Thread.run(Thread.java:844)
   [junit4] Completed [1/5 (1!)] on J1 in 13.59s, 8 tests, 1 error <<< FAILURES!

[...truncated 38476 lines...]

Mime
View raw message