lucene-dev mailing list archives

Site index · List index
Message view « Date » · « Thread »
Top « Date » · « Thread »
From Policeman Jenkins Server <jenk...@thetaphi.de>
Subject [JENKINS] Lucene-Solr-7.x-Solaris (64bit/jdk1.8.0) - Build # 366 - Unstable!
Date Mon, 01 Jan 2018 10:08:13 GMT
Build: https://jenkins.thetaphi.de/job/Lucene-Solr-7.x-Solaris/366/
Java: 64bit/jdk1.8.0 -XX:+UseCompressedOops -XX:+UseG1GC

1 tests failed.
FAILED:  org.apache.solr.cloud.autoscaling.sim.TestDistribStateManager.testGetSetRemoveData

Error Message:
Node watch should have fired!

Stack Trace:
java.lang.AssertionError: Node watch should have fired!
	at __randomizedtesting.SeedInfo.seed([5E46C1394D99F676:78D62E6B1917307C]:0)
	at org.junit.Assert.fail(Assert.java:93)
	at org.apache.solr.cloud.autoscaling.sim.TestDistribStateManager.testGetSetRemoveData(TestDistribStateManager.java:256)
	at sun.reflect.NativeMethodAccessorImpl.invoke0(Native Method)
	at sun.reflect.NativeMethodAccessorImpl.invoke(NativeMethodAccessorImpl.java:62)
	at sun.reflect.DelegatingMethodAccessorImpl.invoke(DelegatingMethodAccessorImpl.java:43)
	at java.lang.reflect.Method.invoke(Method.java:498)
	at com.carrotsearch.randomizedtesting.RandomizedRunner.invoke(RandomizedRunner.java:1737)
	at com.carrotsearch.randomizedtesting.RandomizedRunner$8.evaluate(RandomizedRunner.java:934)
	at com.carrotsearch.randomizedtesting.RandomizedRunner$9.evaluate(RandomizedRunner.java:970)
	at com.carrotsearch.randomizedtesting.RandomizedRunner$10.evaluate(RandomizedRunner.java:984)
	at com.carrotsearch.randomizedtesting.rules.SystemPropertiesRestoreRule$1.evaluate(SystemPropertiesRestoreRule.java:57)
	at org.apache.lucene.util.TestRuleSetupTeardownChained$1.evaluate(TestRuleSetupTeardownChained.java:49)
	at org.apache.lucene.util.AbstractBeforeAfterRule$1.evaluate(AbstractBeforeAfterRule.java:45)
	at org.apache.lucene.util.TestRuleThreadAndTestName$1.evaluate(TestRuleThreadAndTestName.java:48)
	at org.apache.lucene.util.TestRuleIgnoreAfterMaxFailures$1.evaluate(TestRuleIgnoreAfterMaxFailures.java:64)
	at org.apache.lucene.util.TestRuleMarkFailure$1.evaluate(TestRuleMarkFailure.java:47)
	at com.carrotsearch.randomizedtesting.rules.StatementAdapter.evaluate(StatementAdapter.java:36)
	at com.carrotsearch.randomizedtesting.ThreadLeakControl$StatementRunner.run(ThreadLeakControl.java:368)
	at com.carrotsearch.randomizedtesting.ThreadLeakControl.forkTimeoutingTask(ThreadLeakControl.java:817)
	at com.carrotsearch.randomizedtesting.ThreadLeakControl$3.evaluate(ThreadLeakControl.java:468)
	at com.carrotsearch.randomizedtesting.RandomizedRunner.runSingleTest(RandomizedRunner.java:943)
	at com.carrotsearch.randomizedtesting.RandomizedRunner$5.evaluate(RandomizedRunner.java:829)
	at com.carrotsearch.randomizedtesting.RandomizedRunner$6.evaluate(RandomizedRunner.java:879)
	at com.carrotsearch.randomizedtesting.RandomizedRunner$7.evaluate(RandomizedRunner.java:890)
	at com.carrotsearch.randomizedtesting.rules.StatementAdapter.evaluate(StatementAdapter.java:36)
	at com.carrotsearch.randomizedtesting.rules.SystemPropertiesRestoreRule$1.evaluate(SystemPropertiesRestoreRule.java:57)
	at org.apache.lucene.util.AbstractBeforeAfterRule$1.evaluate(AbstractBeforeAfterRule.java:45)
	at com.carrotsearch.randomizedtesting.rules.StatementAdapter.evaluate(StatementAdapter.java:36)
	at org.apache.lucene.util.TestRuleStoreClassName$1.evaluate(TestRuleStoreClassName.java:41)
	at com.carrotsearch.randomizedtesting.rules.NoShadowingOrOverridesOnMethodsRule$1.evaluate(NoShadowingOrOverridesOnMethodsRule.java:40)
	at com.carrotsearch.randomizedtesting.rules.NoShadowingOrOverridesOnMethodsRule$1.evaluate(NoShadowingOrOverridesOnMethodsRule.java:40)
	at com.carrotsearch.randomizedtesting.rules.StatementAdapter.evaluate(StatementAdapter.java:36)
	at com.carrotsearch.randomizedtesting.rules.StatementAdapter.evaluate(StatementAdapter.java:36)
	at com.carrotsearch.randomizedtesting.rules.StatementAdapter.evaluate(StatementAdapter.java:36)
	at org.apache.lucene.util.TestRuleAssertionsRequired$1.evaluate(TestRuleAssertionsRequired.java:53)
	at org.apache.lucene.util.TestRuleMarkFailure$1.evaluate(TestRuleMarkFailure.java:47)
	at org.apache.lucene.util.TestRuleIgnoreAfterMaxFailures$1.evaluate(TestRuleIgnoreAfterMaxFailures.java:64)
	at org.apache.lucene.util.TestRuleIgnoreTestSuites$1.evaluate(TestRuleIgnoreTestSuites.java:54)
	at com.carrotsearch.randomizedtesting.rules.StatementAdapter.evaluate(StatementAdapter.java:36)
	at com.carrotsearch.randomizedtesting.ThreadLeakControl$StatementRunner.run(ThreadLeakControl.java:368)
	at java.lang.Thread.run(Thread.java:748)




Build Log:
[...truncated 13478 lines...]
   [junit4] Suite: org.apache.solr.cloud.autoscaling.sim.TestDistribStateManager
   [junit4]   2> 3454454 INFO  (SUITE-TestDistribStateManager-seed#[5E46C1394D99F676]-worker)
[    ] o.a.s.SolrTestCaseJ4 SecureRandom sanity checks: test.solr.allowed.securerandom=null
& java.security.egd=file:/dev/./urandom
   [junit4]   2> Creating dataDir: /export/home/jenkins/workspace/Lucene-Solr-7.x-Solaris/solr/build/solr-core/test/J1/temp/solr.cloud.autoscaling.sim.TestDistribStateManager_5E46C1394D99F676-001/init-core-data-001
   [junit4]   2> 3454454 WARN  (SUITE-TestDistribStateManager-seed#[5E46C1394D99F676]-worker)
[    ] o.a.s.SolrTestCaseJ4 startTrackingSearchers: numOpens=5 numCloses=5
   [junit4]   2> 3454454 INFO  (SUITE-TestDistribStateManager-seed#[5E46C1394D99F676]-worker)
[    ] o.a.s.SolrTestCaseJ4 Using PointFields (NUMERIC_POINTS_SYSPROP=true) w/NUMERIC_DOCVALUES_SYSPROP=true
   [junit4]   2> 3454455 INFO  (SUITE-TestDistribStateManager-seed#[5E46C1394D99F676]-worker)
[    ] o.a.s.SolrTestCaseJ4 Randomized ssl (false) and clientAuth (false) via: @org.apache.solr.util.RandomizeSSL(reason=,
value=NaN, ssl=NaN, clientAuth=NaN)
   [junit4]   2> 3454465 INFO  (TEST-TestDistribStateManager.testMulti-seed#[5E46C1394D99F676])
[    ] o.a.s.SolrTestCaseJ4 ###Starting testMulti
   [junit4]   2> 3454466 INFO  (TEST-TestDistribStateManager.testMulti-seed#[5E46C1394D99F676])
[    ] o.a.s.c.a.s.TestDistribStateManager Using org.apache.solr.cloud.autoscaling.sim.SimDistribStateManager
   [junit4]   2> 3454466 INFO  (TEST-TestDistribStateManager.testMulti-seed#[5E46C1394D99F676])
[    ] o.a.s.SolrTestCaseJ4 ###Ending testMulti
   [junit4]   2> 3454475 INFO  (TEST-TestDistribStateManager.testHasData-seed#[5E46C1394D99F676])
[    ] o.a.s.SolrTestCaseJ4 ###Starting testHasData
   [junit4]   2> 3454476 INFO  (TEST-TestDistribStateManager.testHasData-seed#[5E46C1394D99F676])
[    ] o.a.s.c.a.s.TestDistribStateManager Using org.apache.solr.cloud.autoscaling.sim.SimDistribStateManager
   [junit4]   2> 3454476 INFO  (TEST-TestDistribStateManager.testHasData-seed#[5E46C1394D99F676])
[    ] o.a.s.SolrTestCaseJ4 ###Ending testHasData
   [junit4]   2> 3454485 INFO  (TEST-TestDistribStateManager.testCreateMode-seed#[5E46C1394D99F676])
[    ] o.a.s.SolrTestCaseJ4 ###Starting testCreateMode
   [junit4]   2> 3454485 INFO  (TEST-TestDistribStateManager.testCreateMode-seed#[5E46C1394D99F676])
[    ] o.a.s.c.a.s.TestDistribStateManager Using org.apache.solr.cloud.autoscaling.sim.SimDistribStateManager
   [junit4]   2> 3454485 INFO  (TEST-TestDistribStateManager.testCreateMode-seed#[5E46C1394D99F676])
[    ] o.a.s.c.a.s.TestDistribStateManager Using org.apache.solr.cloud.autoscaling.sim.SimDistribStateManager
   [junit4]   2> 3454485 INFO  (TEST-TestDistribStateManager.testCreateMode-seed#[5E46C1394D99F676])
[    ] o.a.s.SolrTestCaseJ4 ###Ending testCreateMode
   [junit4]   2> 3454495 INFO  (TEST-TestDistribStateManager.testListData-seed#[5E46C1394D99F676])
[    ] o.a.s.SolrTestCaseJ4 ###Starting testListData
   [junit4]   2> 3454495 INFO  (TEST-TestDistribStateManager.testListData-seed#[5E46C1394D99F676])
[    ] o.a.s.c.a.s.TestDistribStateManager Using org.apache.solr.cloud.autoscaling.sim.SimDistribStateManager
   [junit4]   2> 3454495 INFO  (TEST-TestDistribStateManager.testListData-seed#[5E46C1394D99F676])
[    ] o.a.s.SolrTestCaseJ4 ###Ending testListData
   [junit4]   2> 3454505 INFO  (TEST-TestDistribStateManager.testGetSetRemoveData-seed#[5E46C1394D99F676])
[    ] o.a.s.SolrTestCaseJ4 ###Starting testGetSetRemoveData
   [junit4]   2> 3454505 INFO  (TEST-TestDistribStateManager.testGetSetRemoveData-seed#[5E46C1394D99F676])
[    ] o.a.s.c.ZkTestServer STARTING ZK TEST SERVER
   [junit4]   2> 3454505 INFO  (Thread-5920) [    ] o.a.s.c.ZkTestServer client port:0.0.0.0/0.0.0.0:0
   [junit4]   2> 3454505 INFO  (Thread-5920) [    ] o.a.s.c.ZkTestServer Starting server
   [junit4]   2> 3454509 ERROR (Thread-5920) [    ] o.a.z.s.ZooKeeperServer ZKShutdownHandler
is not registered, so ZooKeeper server won't take any action on ERROR or SHUTDOWN server state
changes
   [junit4]   2> 3454605 INFO  (TEST-TestDistribStateManager.testGetSetRemoveData-seed#[5E46C1394D99F676])
[    ] o.a.s.c.ZkTestServer start zk server on port:58235
   [junit4]   2> 3454611 INFO  (zkConnectionManagerCallback-5876-thread-1) [    ] o.a.s.c.c.ConnectionManager
zkClient has connected
   [junit4]   2> 3454612 INFO  (TEST-TestDistribStateManager.testGetSetRemoveData-seed#[5E46C1394D99F676])
[    ] o.a.s.c.a.s.TestDistribStateManager Using org.apache.solr.client.solrj.impl.ZkDistribStateManager
   [junit4]   2> 3454627 INFO  (zkConnectionManagerCallback-5878-thread-1) [    ] o.a.s.c.c.ConnectionManager
zkClient has connected
   [junit4]   2> 3454627 INFO  (TEST-TestDistribStateManager.testGetSetRemoveData-seed#[5E46C1394D99F676])
[    ] o.a.s.c.a.s.TestDistribStateManager Using org.apache.solr.client.solrj.impl.ZkDistribStateManager
   [junit4]   2> 3459628 ERROR (TEST-TestDistribStateManager.testGetSetRemoveData-seed#[5E46C1394D99F676])
[    ] o.a.z.s.ZooKeeperServer ZKShutdownHandler is not registered, so ZooKeeper server won't
take any action on ERROR or SHUTDOWN server state changes
   [junit4]   2> 3459631 INFO  (TEST-TestDistribStateManager.testGetSetRemoveData-seed#[5E46C1394D99F676])
[    ] o.a.s.c.ZkTestServer connecting to 127.0.0.1:58235 58235
   [junit4]   2> 3459781 INFO  (Thread-5920) [    ] o.a.s.c.ZkTestServer connecting to
127.0.0.1:58235 58235
   [junit4]   2> 3459788 INFO  (TEST-TestDistribStateManager.testGetSetRemoveData-seed#[5E46C1394D99F676])
[    ] o.a.s.SolrTestCaseJ4 ###Ending testGetSetRemoveData
   [junit4]   2> NOTE: reproduce with: ant test  -Dtestcase=TestDistribStateManager -Dtests.method=testGetSetRemoveData
-Dtests.seed=5E46C1394D99F676 -Dtests.slow=true -Dtests.locale=zh-HK -Dtests.timezone=Pacific/Pohnpei
-Dtests.asserts=true -Dtests.file.encoding=US-ASCII
   [junit4] FAILURE 5.30s J1 | TestDistribStateManager.testGetSetRemoveData <<<
   [junit4]    > Throwable #1: java.lang.AssertionError: Node watch should have fired!
   [junit4]    > 	at __randomizedtesting.SeedInfo.seed([5E46C1394D99F676:78D62E6B1917307C]:0)
   [junit4]    > 	at org.apache.solr.cloud.autoscaling.sim.TestDistribStateManager.testGetSetRemoveData(TestDistribStateManager.java:256)
   [junit4]    > 	at java.lang.Thread.run(Thread.java:748)
   [junit4]   2> NOTE: leaving temporary files on disk at: /export/home/jenkins/workspace/Lucene-Solr-7.x-Solaris/solr/build/solr-core/test/J1/temp/solr.cloud.autoscaling.sim.TestDistribStateManager_5E46C1394D99F676-001
   [junit4]   2> Jan 01, 2018 9:39:04 AM com.carrotsearch.randomizedtesting.ThreadLeakControl
checkThreadLeaks
   [junit4]   2> WARNING: Will linger awaiting termination of 1 leaked thread(s).
   [junit4]   2> NOTE: test params are: codec=Asserting(Lucene70), sim=RandomSimilarity(queryNorm=true):
{}, locale=zh-HK, timezone=Pacific/Pohnpei
   [junit4]   2> NOTE: SunOS 5.11 amd64/Oracle Corporation 1.8.0_152 (64-bit)/cpus=3,threads=1,free=141204776,total=536870912
   [junit4]   2> NOTE: All tests run in this JVM: [AliasIntegrationTest, TestSolrJ, TestManagedSchemaThreadSafety,
DeleteLastCustomShardedReplicaTest, TestCorePropertiesReload, TestChildDocTransformer, TestUtilizeNode,
StatelessScriptUpdateProcessorFactoryTest, HdfsWriteToMultipleCollectionsTest, TestFunctionQuery,
TestStressCloudBlindAtomicUpdates, HdfsTlogReplayBufferedWhileIndexingTest, MetricTriggerTest,
ChangedSchemaMergeTest, TestCoreBackup, CdcrVersionReplicationTest, AutoAddReplicasPlanActionTest,
BlobRepositoryCloudTest, CachingDirectoryFactoryTest, NodeLostTriggerTest, TestStressVersions,
DistributedIntervalFacetingTest, TestAuthenticationFramework, ChaosMonkeySafeLeaderTest, DistributedFacetPivotSmallTest,
TestExactStatsCache, TestDynamicLoading, TestNumericTerms64, TestComputePlanAction, TestLockTree,
TestSchemaResource, TestSha256AuthenticationProvider, AutoscalingHistoryHandlerTest, DOMUtilTest,
SpatialRPTFieldTypeTest, SimplePostToolTest, ZkStateWriterTest, TestCollectionsAPIViaSolrCloudCluster,
TestRemoteStreaming, SampleTest, ResponseHeaderTest, TestSolr4Spatial2, InfoHandlerTest, ReplaceNodeTest,
HttpPartitionTest, HdfsAutoAddReplicasIntegrationTest, TestClassicSimilarityFactory, OverseerTaskQueueTest,
TestXmlQParser, TestManagedSchema, SystemLogListenerTest, TestFieldCacheSort, TestFastWriter,
TestDocumentBuilder, ShufflingReplicaListTransformerTest, LukeRequestHandlerTest, TestTrackingShardHandlerFactory,
TestPullReplica, HLLSerializationTest, ShardSplitTest, TestWordDelimiterFilterFactory, SolrPluginUtilsTest,
TestConfig, SystemInfoHandlerTest, TestHttpShardHandlerFactory, TestInPlaceUpdatesStandalone,
TestCloudManagedSchema, LegacyCloudClusterPropTest, LeaderElectionIntegrationTest, TestSchemaManager,
CursorMarkTest, TestReloadDeadlock, TestEmbeddedSolrServerConstructors, HdfsSyncSliceTest,
SolrJmxReporterTest, TestMaxScoreQueryParser, CdcrUpdateLogTest, TestFieldResource, SpellCheckCollatorWithCollapseTest,
TestConfigsApi, CoreSorterTest, BlockCacheTest, TestComponentsName, SolrIndexConfigTest, TestRandomCollapseQParserPlugin,
TestBlobHandler, TestOnReconnectListenerSupport, TestMergePolicyConfig, TestCollationField,
TestSimpleTrackingShardHandler, TestZkAclsWithHadoopAuth, DistribDocExpirationUpdateProcessorTest,
TestNodeLostTrigger, TestCSVLoader, TestGraphTermsQParserPlugin, FullSolrCloudDistribCmdsTest,
TestRandomFaceting, CloudExitableDirectoryReaderTest, SolrCloudExampleTest, CollectionsAPIAsyncDistributedZkTest,
ActionThrottleTest, TestQueryUtils, TriggerIntegrationTest, TestCloudInspectUtil, AnalysisAfterCoreReloadTest,
TestJavabinTupleStreamParser, TestHdfsUpdateLog, HdfsChaosMonkeySafeLeaderTest, DebugComponentTest,
TestPostingsSolrHighlighter, TestPerFieldSimilarity, HdfsNNFailoverTest, TestCustomDocTransformer,
TermVectorComponentDistributedTest, QueryResultKeyTest, TestRandomFlRTGCloud, OverseerRolesTest,
TestRTGBase, TestValueSourceCache, AssignTest, SolrMetricsIntegrationTest, ConcurrentDeleteAndCreateCollectionTest,
TestManagedResource, TestGeoJSONResponseWriter, TestLeaderInitiatedRecoveryThread, PingRequestHandlerTest,
TestCloudPivotFacet, TestSolrIndexConfig, SynonymTokenizerTest, SolrCoreTest, SolrIndexSplitterTest,
TestDocBasedVersionConstraints, TestCopyFieldCollectionResource, TestRequestForwarding, TestGroupingSearch,
WrapperMergePolicyFactoryTest, TestTolerantUpdateProcessorCloud, SparseHLLTest, PropertiesRequestHandlerTest,
TestConfigSetProperties, TestUseDocValuesAsStored, TestCollapseQParserPlugin, TestExtendedDismaxParser,
TestReRankQParserPlugin, DeleteStatusTest, TestNRTOpen, SmileWriterTest, ExitableDirectoryReaderTest,
DirectSolrSpellCheckerTest, TestSchemaVersionResource, SoftAutoCommitTest, TestSkipOverseerOperations,
TestShortCircuitedRequests, ComputePlanActionTest, DistributedQueueTest, HdfsLockFactoryTest,
TestShardHandlerFactory, TestUniqueKeyFieldResource, TestCoreContainer, TestTrie, ConnectionManagerTest,
ZkNodePropsTest, TestPartialUpdateDeduplication, CollectionStateFormat2Test, TestSimDistributedQueue,
SSLMigrationTest, TestLuceneIndexBackCompat, SolrGraphiteReporterTest, TestFieldSortValues,
TestSystemIdResolver, DistanceUnitsTest, DocumentAnalysisRequestHandlerTest, HdfsBasicDistributedZkTest,
TestDistribDocBasedVersion, DistributedDebugComponentTest, DistributedFacetSimpleRefinementLongTailTest,
TestSQLHandlerNonCloud, TestClusterStateMutator, TestRawResponseWriter, TestSolrFieldCacheBean,
AddBlockUpdateTest, MoreLikeThisHandlerTest, OpenExchangeRatesOrgProviderTest, TestSolrConfigHandler,
TestSort, UpdateParamsTest, ParsingFieldUpdateProcessorsTest, TestDynamicFieldResource, BasicDistributedZkTest,
CollectionsAPIDistributedZkTest, ZkSolrClientTest, TestZkChroot, ShardRoutingCustomTest, TestDistributedGrouping,
TestFaceting, TestHashPartitioner, TestStressReorder, DistributedTermsComponentTest, SimpleFacetsTest,
StatsComponentTest, QueryElevationComponentTest, BadIndexSchemaTest, BasicFunctionalityTest,
DirectUpdateHandlerTest, TestBadConfig, TestIndexSearcher, HighlighterTest, ShowFileRequestHandlerTest,
SignatureUpdateProcessorFactoryTest, SpellCheckCollatorTest, TestFoldingMultitermQuery, DocValuesTest,
DefaultValueUpdateProcessorTest, TestSolrDeletionPolicy1, CacheHeaderTest, PrimitiveFieldTypeTest,
TermsComponentTest, TermVectorComponentTest, TestSolrQueryParser, RegexBoostProcessorTest,
UpdateRequestProcessorFactoryTest, QueryParsingTest, TestAnalyzedSuggestions, JsonLoaderTest,
CSVRequestHandlerTest, SearchHandlerTest, SOLR749Test, CopyFieldTest, ResponseLogComponentTest,
BadComponentTest, TestSolrDeletionPolicy2, TestDocSet, TestSearchPerf, NumericFieldsTest,
MinimalSchemaTest, TestElisionMultitermQuery, TestFuzzyAnalyzedSuggestions, ExternalFileFieldSortTest,
DirectSolrConnectionTest, NotRequiredUniqueKeyTest, TestLuceneMatchVersion, TestPhraseSuggestions,
SpellPossibilityIteratorTest, TestCharFilters, TestXIncludeConfig, EchoParamsTest, TestSweetSpotSimilarityFactory,
TestDFRSimilarityFactory, TestLMDirichletSimilarityFactory, TestLMJelinekMercerSimilarityFactory,
TestIBSimilarityFactory, TestBM25SimilarityFactory, TestFastOutputStream, URLClassifyProcessorTest,
PreAnalyzedFieldTest, PrimUtilsTest, TestSuggestSpellingConverter, DateFieldTest, SpellingQueryConverterTest,
RAMDirectoryFactoryTest, TestLRUCache, TestUtils, FileUtilsTest, CircularListTest, DistributedMLTComponentTest,
CursorPagingTest, SolrTestCaseJ4Test, TestCrossCoreJoin, TestCursorMarkWithoutUniqueKey, TestDistributedMissingSort,
TestTolerantSearch, TestJettySolrRunner, ConnectionReuseTest, ChaosMonkeyNothingIsSafeWithPullReplicasTest,
CollectionsAPISolrJTest, DeleteShardTest, ForceLeaderTest, MissingSegmentRecoveryTest, MoveReplicaTest,
MultiThreadedOCPTest, OverriddenZkACLAndCredentialsProvidersTest, OverseerStatusTest, ReplicationFactorTest,
RestartWhileUpdatingTest, SaslZkACLProviderTest, SharedFSAutoReplicaFailoverTest, SimpleCollectionCreateDeleteTest,
TestCloudJSONFacetJoinDomain, TestCloudSearcherWarming, TestConfigSetsAPIExclusivity, TestDeleteCollectionOnDownNodes,
TestDownShardTolerantSearch, TestExclusionRuleCollectionAccess, TestLeaderElectionWithEmptyReplica,
TestRebalanceLeaders, TestReplicaProperties, TestSSLRandomization, TestSolrCloudWithKerberosAlt,
TestSolrCloudWithSecureImpersonation, TlogReplayBufferedWhileIndexingTest, TriLevelCompositeIdRoutingTest,
TestClusterStateProvider, TestDistribStateManager]
   [junit4] Completed [570/764 (1!)] on J1 in 5.89s, 5 tests, 1 failure <<< FAILURES!

[...truncated 48840 lines...]

Mime
View raw message