lucene-dev mailing list archives

Site index · List index
Message view « Date » · « Thread »
Top « Date » · « Thread »
From Policeman Jenkins Server <jenk...@thetaphi.de>
Subject [JENKINS] Lucene-Solr-master-Linux (64bit/jdk-9.0.1) - Build # 21355 - Still Unstable!
Date Sat, 27 Jan 2018 07:02:10 GMT
Build: https://jenkins.thetaphi.de/job/Lucene-Solr-master-Linux/21355/
Java: 64bit/jdk-9.0.1 -XX:-UseCompressedOops -XX:+UseSerialGC

3 tests failed.
FAILED:  org.apache.solr.cloud.MoveReplicaHDFSTest.testFailedMove

Error Message:
No live SolrServers available to handle this request:[http://127.0.0.1:44409/solr/MoveReplicaHDFSTest_failed_coll_true, http://127.0.0.1:35875/solr/MoveReplicaHDFSTest_failed_coll_true]

Stack Trace:
org.apache.solr.client.solrj.SolrServerException: No live SolrServers available to handle this request:[http://127.0.0.1:44409/solr/MoveReplicaHDFSTest_failed_coll_true, http://127.0.0.1:35875/solr/MoveReplicaHDFSTest_failed_coll_true]
	at __randomizedtesting.SeedInfo.seed([DA3283F84AD85003:70FF500AFD0B85D3]:0)
	at org.apache.solr.client.solrj.impl.LBHttpSolrClient.request(LBHttpSolrClient.java:462)
	at org.apache.solr.client.solrj.impl.CloudSolrClient.sendRequest(CloudSolrClient.java:1104)
	at org.apache.solr.client.solrj.impl.CloudSolrClient.requestWithRetryOnStaleState(CloudSolrClient.java:884)
	at org.apache.solr.client.solrj.impl.CloudSolrClient.requestWithRetryOnStaleState(CloudSolrClient.java:991)
	at org.apache.solr.client.solrj.impl.CloudSolrClient.request(CloudSolrClient.java:817)
	at org.apache.solr.client.solrj.SolrRequest.process(SolrRequest.java:194)
	at org.apache.solr.client.solrj.SolrClient.query(SolrClient.java:942)
	at org.apache.solr.cloud.MoveReplicaTest.testFailedMove(MoveReplicaTest.java:309)
	at java.base/jdk.internal.reflect.NativeMethodAccessorImpl.invoke0(Native Method)
	at java.base/jdk.internal.reflect.NativeMethodAccessorImpl.invoke(NativeMethodAccessorImpl.java:62)
	at java.base/jdk.internal.reflect.DelegatingMethodAccessorImpl.invoke(DelegatingMethodAccessorImpl.java:43)
	at java.base/java.lang.reflect.Method.invoke(Method.java:564)
	at com.carrotsearch.randomizedtesting.RandomizedRunner.invoke(RandomizedRunner.java:1737)
	at com.carrotsearch.randomizedtesting.RandomizedRunner$8.evaluate(RandomizedRunner.java:934)
	at com.carrotsearch.randomizedtesting.RandomizedRunner$9.evaluate(RandomizedRunner.java:970)
	at com.carrotsearch.randomizedtesting.RandomizedRunner$10.evaluate(RandomizedRunner.java:984)
	at com.carrotsearch.randomizedtesting.rules.SystemPropertiesRestoreRule$1.evaluate(SystemPropertiesRestoreRule.java:57)
	at org.apache.lucene.util.TestRuleSetupTeardownChained$1.evaluate(TestRuleSetupTeardownChained.java:49)
	at org.apache.lucene.util.AbstractBeforeAfterRule$1.evaluate(AbstractBeforeAfterRule.java:45)
	at org.apache.lucene.util.TestRuleThreadAndTestName$1.evaluate(TestRuleThreadAndTestName.java:48)
	at org.apache.lucene.util.TestRuleIgnoreAfterMaxFailures$1.evaluate(TestRuleIgnoreAfterMaxFailures.java:64)
	at org.apache.lucene.util.TestRuleMarkFailure$1.evaluate(TestRuleMarkFailure.java:47)
	at com.carrotsearch.randomizedtesting.rules.StatementAdapter.evaluate(StatementAdapter.java:36)
	at com.carrotsearch.randomizedtesting.ThreadLeakControl$StatementRunner.run(ThreadLeakControl.java:368)
	at com.carrotsearch.randomizedtesting.ThreadLeakControl.forkTimeoutingTask(ThreadLeakControl.java:817)
	at com.carrotsearch.randomizedtesting.ThreadLeakControl$3.evaluate(ThreadLeakControl.java:468)
	at com.carrotsearch.randomizedtesting.RandomizedRunner.runSingleTest(RandomizedRunner.java:943)
	at com.carrotsearch.randomizedtesting.RandomizedRunner$5.evaluate(RandomizedRunner.java:829)
	at com.carrotsearch.randomizedtesting.RandomizedRunner$6.evaluate(RandomizedRunner.java:879)
	at com.carrotsearch.randomizedtesting.RandomizedRunner$7.evaluate(RandomizedRunner.java:890)
	at com.carrotsearch.randomizedtesting.rules.StatementAdapter.evaluate(StatementAdapter.java:36)
	at com.carrotsearch.randomizedtesting.rules.SystemPropertiesRestoreRule$1.evaluate(SystemPropertiesRestoreRule.java:57)
	at org.apache.lucene.util.AbstractBeforeAfterRule$1.evaluate(AbstractBeforeAfterRule.java:45)
	at com.carrotsearch.randomizedtesting.rules.StatementAdapter.evaluate(StatementAdapter.java:36)
	at org.apache.lucene.util.TestRuleStoreClassName$1.evaluate(TestRuleStoreClassName.java:41)
	at com.carrotsearch.randomizedtesting.rules.NoShadowingOrOverridesOnMethodsRule$1.evaluate(NoShadowingOrOverridesOnMethodsRule.java:40)
	at com.carrotsearch.randomizedtesting.rules.NoShadowingOrOverridesOnMethodsRule$1.evaluate(NoShadowingOrOverridesOnMethodsRule.java:40)
	at com.carrotsearch.randomizedtesting.rules.StatementAdapter.evaluate(StatementAdapter.java:36)
	at com.carrotsearch.randomizedtesting.rules.StatementAdapter.evaluate(StatementAdapter.java:36)
	at org.apache.lucene.util.TestRuleAssertionsRequired$1.evaluate(TestRuleAssertionsRequired.java:53)
	at org.apache.lucene.util.TestRuleMarkFailure$1.evaluate(TestRuleMarkFailure.java:47)
	at org.apache.lucene.util.TestRuleIgnoreAfterMaxFailures$1.evaluate(TestRuleIgnoreAfterMaxFailures.java:64)
	at org.apache.lucene.util.TestRuleIgnoreTestSuites$1.evaluate(TestRuleIgnoreTestSuites.java:54)
	at com.carrotsearch.randomizedtesting.rules.StatementAdapter.evaluate(StatementAdapter.java:36)
	at com.carrotsearch.randomizedtesting.ThreadLeakControl$StatementRunner.run(ThreadLeakControl.java:368)
	at java.base/java.lang.Thread.run(Thread.java:844)
Caused by: org.apache.solr.client.solrj.impl.HttpSolrClient$RemoteSolrException: Error from server at http://127.0.0.1:44409/solr/MoveReplicaHDFSTest_failed_coll_true: no servers hosting shard: shard1
	at org.apache.solr.client.solrj.impl.HttpSolrClient.executeMethod(HttpSolrClient.java:643)
	at org.apache.solr.client.solrj.impl.HttpSolrClient.request(HttpSolrClient.java:255)
	at org.apache.solr.client.solrj.impl.HttpSolrClient.request(HttpSolrClient.java:244)
	at org.apache.solr.client.solrj.impl.LBHttpSolrClient.doRequest(LBHttpSolrClient.java:483)
	at org.apache.solr.client.solrj.impl.LBHttpSolrClient.request(LBHttpSolrClient.java:436)
	... 45 more


FAILED:  org.apache.solr.cloud.autoscaling.TriggerIntegrationTest.testEventFromRestoredState

Error Message:


Stack Trace:
java.lang.AssertionError
	at __randomizedtesting.SeedInfo.seed([DA3283F84AD85003:DA04373863D5F469]:0)
	at org.junit.Assert.fail(Assert.java:92)
	at org.junit.Assert.assertTrue(Assert.java:43)
	at org.junit.Assert.assertTrue(Assert.java:54)
	at org.apache.solr.cloud.autoscaling.TriggerIntegrationTest.testEventFromRestoredState(TriggerIntegrationTest.java:760)
	at java.base/jdk.internal.reflect.NativeMethodAccessorImpl.invoke0(Native Method)
	at java.base/jdk.internal.reflect.NativeMethodAccessorImpl.invoke(NativeMethodAccessorImpl.java:62)
	at java.base/jdk.internal.reflect.DelegatingMethodAccessorImpl.invoke(DelegatingMethodAccessorImpl.java:43)
	at java.base/java.lang.reflect.Method.invoke(Method.java:564)
	at com.carrotsearch.randomizedtesting.RandomizedRunner.invoke(RandomizedRunner.java:1737)
	at com.carrotsearch.randomizedtesting.RandomizedRunner$8.evaluate(RandomizedRunner.java:934)
	at com.carrotsearch.randomizedtesting.RandomizedRunner$9.evaluate(RandomizedRunner.java:970)
	at com.carrotsearch.randomizedtesting.RandomizedRunner$10.evaluate(RandomizedRunner.java:984)
	at com.carrotsearch.randomizedtesting.rules.SystemPropertiesRestoreRule$1.evaluate(SystemPropertiesRestoreRule.java:57)
	at org.apache.lucene.util.TestRuleSetupTeardownChained$1.evaluate(TestRuleSetupTeardownChained.java:49)
	at org.apache.lucene.util.AbstractBeforeAfterRule$1.evaluate(AbstractBeforeAfterRule.java:45)
	at org.apache.lucene.util.TestRuleThreadAndTestName$1.evaluate(TestRuleThreadAndTestName.java:48)
	at org.apache.lucene.util.TestRuleIgnoreAfterMaxFailures$1.evaluate(TestRuleIgnoreAfterMaxFailures.java:64)
	at org.apache.lucene.util.TestRuleMarkFailure$1.evaluate(TestRuleMarkFailure.java:47)
	at com.carrotsearch.randomizedtesting.rules.StatementAdapter.evaluate(StatementAdapter.java:36)
	at com.carrotsearch.randomizedtesting.ThreadLeakControl$StatementRunner.run(ThreadLeakControl.java:368)
	at com.carrotsearch.randomizedtesting.ThreadLeakControl.forkTimeoutingTask(ThreadLeakControl.java:817)
	at com.carrotsearch.randomizedtesting.ThreadLeakControl$3.evaluate(ThreadLeakControl.java:468)
	at com.carrotsearch.randomizedtesting.RandomizedRunner.runSingleTest(RandomizedRunner.java:943)
	at com.carrotsearch.randomizedtesting.RandomizedRunner$5.evaluate(RandomizedRunner.java:829)
	at com.carrotsearch.randomizedtesting.RandomizedRunner$6.evaluate(RandomizedRunner.java:879)
	at com.carrotsearch.randomizedtesting.RandomizedRunner$7.evaluate(RandomizedRunner.java:890)
	at com.carrotsearch.randomizedtesting.rules.StatementAdapter.evaluate(StatementAdapter.java:36)
	at com.carrotsearch.randomizedtesting.rules.SystemPropertiesRestoreRule$1.evaluate(SystemPropertiesRestoreRule.java:57)
	at org.apache.lucene.util.AbstractBeforeAfterRule$1.evaluate(AbstractBeforeAfterRule.java:45)
	at com.carrotsearch.randomizedtesting.rules.StatementAdapter.evaluate(StatementAdapter.java:36)
	at org.apache.lucene.util.TestRuleStoreClassName$1.evaluate(TestRuleStoreClassName.java:41)
	at com.carrotsearch.randomizedtesting.rules.NoShadowingOrOverridesOnMethodsRule$1.evaluate(NoShadowingOrOverridesOnMethodsRule.java:40)
	at com.carrotsearch.randomizedtesting.rules.NoShadowingOrOverridesOnMethodsRule$1.evaluate(NoShadowingOrOverridesOnMethodsRule.java:40)
	at com.carrotsearch.randomizedtesting.rules.StatementAdapter.evaluate(StatementAdapter.java:36)
	at com.carrotsearch.randomizedtesting.rules.StatementAdapter.evaluate(StatementAdapter.java:36)
	at org.apache.lucene.util.TestRuleAssertionsRequired$1.evaluate(TestRuleAssertionsRequired.java:53)
	at org.apache.lucene.util.TestRuleMarkFailure$1.evaluate(TestRuleMarkFailure.java:47)
	at org.apache.lucene.util.TestRuleIgnoreAfterMaxFailures$1.evaluate(TestRuleIgnoreAfterMaxFailures.java:64)
	at org.apache.lucene.util.TestRuleIgnoreTestSuites$1.evaluate(TestRuleIgnoreTestSuites.java:54)
	at com.carrotsearch.randomizedtesting.rules.StatementAdapter.evaluate(StatementAdapter.java:36)
	at com.carrotsearch.randomizedtesting.ThreadLeakControl$StatementRunner.run(ThreadLeakControl.java:368)
	at java.base/java.lang.Thread.run(Thread.java:844)


FAILED:  org.apache.solr.cloud.autoscaling.TriggerIntegrationTest.testMetricTrigger

Error Message:


Stack Trace:
java.lang.AssertionError
	at __randomizedtesting.SeedInfo.seed([DA3283F84AD85003:603EB4771530864C]:0)
	at org.junit.Assert.fail(Assert.java:92)
	at org.junit.Assert.assertTrue(Assert.java:43)
	at org.junit.Assert.assertNull(Assert.java:551)
	at org.junit.Assert.assertNull(Assert.java:562)
	at org.apache.solr.cloud.autoscaling.TriggerIntegrationTest.testMetricTrigger(TriggerIntegrationTest.java:1575)
	at java.base/jdk.internal.reflect.NativeMethodAccessorImpl.invoke0(Native Method)
	at java.base/jdk.internal.reflect.NativeMethodAccessorImpl.invoke(NativeMethodAccessorImpl.java:62)
	at java.base/jdk.internal.reflect.DelegatingMethodAccessorImpl.invoke(DelegatingMethodAccessorImpl.java:43)
	at java.base/java.lang.reflect.Method.invoke(Method.java:564)
	at com.carrotsearch.randomizedtesting.RandomizedRunner.invoke(RandomizedRunner.java:1737)
	at com.carrotsearch.randomizedtesting.RandomizedRunner$8.evaluate(RandomizedRunner.java:934)
	at com.carrotsearch.randomizedtesting.RandomizedRunner$9.evaluate(RandomizedRunner.java:970)
	at com.carrotsearch.randomizedtesting.RandomizedRunner$10.evaluate(RandomizedRunner.java:984)
	at com.carrotsearch.randomizedtesting.rules.SystemPropertiesRestoreRule$1.evaluate(SystemPropertiesRestoreRule.java:57)
	at org.apache.lucene.util.TestRuleSetupTeardownChained$1.evaluate(TestRuleSetupTeardownChained.java:49)
	at org.apache.lucene.util.AbstractBeforeAfterRule$1.evaluate(AbstractBeforeAfterRule.java:45)
	at org.apache.lucene.util.TestRuleThreadAndTestName$1.evaluate(TestRuleThreadAndTestName.java:48)
	at org.apache.lucene.util.TestRuleIgnoreAfterMaxFailures$1.evaluate(TestRuleIgnoreAfterMaxFailures.java:64)
	at org.apache.lucene.util.TestRuleMarkFailure$1.evaluate(TestRuleMarkFailure.java:47)
	at com.carrotsearch.randomizedtesting.rules.StatementAdapter.evaluate(StatementAdapter.java:36)
	at com.carrotsearch.randomizedtesting.ThreadLeakControl$StatementRunner.run(ThreadLeakControl.java:368)
	at com.carrotsearch.randomizedtesting.ThreadLeakControl.forkTimeoutingTask(ThreadLeakControl.java:817)
	at com.carrotsearch.randomizedtesting.ThreadLeakControl$3.evaluate(ThreadLeakControl.java:468)
	at com.carrotsearch.randomizedtesting.RandomizedRunner.runSingleTest(RandomizedRunner.java:943)
	at com.carrotsearch.randomizedtesting.RandomizedRunner$5.evaluate(RandomizedRunner.java:829)
	at com.carrotsearch.randomizedtesting.RandomizedRunner$6.evaluate(RandomizedRunner.java:879)
	at com.carrotsearch.randomizedtesting.RandomizedRunner$7.evaluate(RandomizedRunner.java:890)
	at com.carrotsearch.randomizedtesting.rules.StatementAdapter.evaluate(StatementAdapter.java:36)
	at com.carrotsearch.randomizedtesting.rules.SystemPropertiesRestoreRule$1.evaluate(SystemPropertiesRestoreRule.java:57)
	at org.apache.lucene.util.AbstractBeforeAfterRule$1.evaluate(AbstractBeforeAfterRule.java:45)
	at com.carrotsearch.randomizedtesting.rules.StatementAdapter.evaluate(StatementAdapter.java:36)
	at org.apache.lucene.util.TestRuleStoreClassName$1.evaluate(TestRuleStoreClassName.java:41)
	at com.carrotsearch.randomizedtesting.rules.NoShadowingOrOverridesOnMethodsRule$1.evaluate(NoShadowingOrOverridesOnMethodsRule.java:40)
	at com.carrotsearch.randomizedtesting.rules.NoShadowingOrOverridesOnMethodsRule$1.evaluate(NoShadowingOrOverridesOnMethodsRule.java:40)
	at com.carrotsearch.randomizedtesting.rules.StatementAdapter.evaluate(StatementAdapter.java:36)
	at com.carrotsearch.randomizedtesting.rules.StatementAdapter.evaluate(StatementAdapter.java:36)
	at org.apache.lucene.util.TestRuleAssertionsRequired$1.evaluate(TestRuleAssertionsRequired.java:53)
	at org.apache.lucene.util.TestRuleMarkFailure$1.evaluate(TestRuleMarkFailure.java:47)
	at org.apache.lucene.util.TestRuleIgnoreAfterMaxFailures$1.evaluate(TestRuleIgnoreAfterMaxFailures.java:64)
	at org.apache.lucene.util.TestRuleIgnoreTestSuites$1.evaluate(TestRuleIgnoreTestSuites.java:54)
	at com.carrotsearch.randomizedtesting.rules.StatementAdapter.evaluate(StatementAdapter.java:36)
	at com.carrotsearch.randomizedtesting.ThreadLeakControl$StatementRunner.run(ThreadLeakControl.java:368)
	at java.base/java.lang.Thread.run(Thread.java:844)




Build Log:
[...truncated 12411 lines...]
   [junit4] Suite: org.apache.solr.cloud.MoveReplicaHDFSTest
   [junit4]   2> Creating dataDir: /home/jenkins/workspace/Lucene-Solr-master-Linux/solr/build/solr-core/test/J2/temp/solr.cloud.MoveReplicaHDFSTest_DA3283F84AD85003-001/init-core-data-001
   [junit4]   2> 795532 INFO  (SUITE-MoveReplicaHDFSTest-seed#[DA3283F84AD85003]-worker) [    ] o.a.s.SolrTestCaseJ4 Using PointFields (NUMERIC_POINTS_SYSPROP=true) w/NUMERIC_DOCVALUES_SYSPROP=false
   [junit4]   2> 795533 INFO  (SUITE-MoveReplicaHDFSTest-seed#[DA3283F84AD85003]-worker) [    ] o.a.s.SolrTestCaseJ4 Randomized ssl (false) and clientAuth (false) via: @org.apache.solr.util.RandomizeSSL(reason="", ssl=0.0/0.0, value=0.0/0.0, clientAuth=0.0/0.0)
   [junit4]   2> 795533 INFO  (SUITE-MoveReplicaHDFSTest-seed#[DA3283F84AD85003]-worker) [    ] o.a.s.SolrTestCaseJ4 SecureRandom sanity checks: test.solr.allowed.securerandom=null & java.security.egd=file:/dev/./urandom
   [junit4]   2> 795533 INFO  (SUITE-MoveReplicaHDFSTest-seed#[DA3283F84AD85003]-worker) [    ] o.a.s.c.MiniSolrCloudCluster Starting cluster of 4 servers in /home/jenkins/workspace/Lucene-Solr-master-Linux/solr/build/solr-core/test/J2/temp/solr.cloud.MoveReplicaHDFSTest_DA3283F84AD85003-001/tempDir-001
   [junit4]   2> 795533 INFO  (SUITE-MoveReplicaHDFSTest-seed#[DA3283F84AD85003]-worker) [    ] o.a.s.c.ZkTestServer STARTING ZK TEST SERVER
   [junit4]   2> 795533 INFO  (Thread-3723) [    ] o.a.s.c.ZkTestServer client port:0.0.0.0/0.0.0.0:0
   [junit4]   2> 795534 INFO  (Thread-3723) [    ] o.a.s.c.ZkTestServer Starting server
   [junit4]   2> 795535 ERROR (Thread-3723) [    ] o.a.z.s.ZooKeeperServer ZKShutdownHandler is not registered, so ZooKeeper server won't take any action on ERROR or SHUTDOWN server state changes
   [junit4]   2> 795633 INFO  (SUITE-MoveReplicaHDFSTest-seed#[DA3283F84AD85003]-worker) [    ] o.a.s.c.ZkTestServer start zk server on port:44867
   [junit4]   2> 795635 INFO  (zkConnectionManagerCallback-1639-thread-1) [    ] o.a.s.c.c.ConnectionManager zkClient has connected
   [junit4]   2> 795637 INFO  (jetty-launcher-1636-thread-1) [    ] o.e.j.s.Server jetty-9.4.8.v20171121, build timestamp: 2017-11-21T15:27:37-06:00, git hash: 82b8fb23f757335bb3329d540ce37a2a2615f0a8
   [junit4]   2> 795637 INFO  (jetty-launcher-1636-thread-3) [    ] o.e.j.s.Server jetty-9.4.8.v20171121, build timestamp: 2017-11-21T15:27:37-06:00, git hash: 82b8fb23f757335bb3329d540ce37a2a2615f0a8
   [junit4]   2> 795637 INFO  (jetty-launcher-1636-thread-2) [    ] o.e.j.s.Server jetty-9.4.8.v20171121, build timestamp: 2017-11-21T15:27:37-06:00, git hash: 82b8fb23f757335bb3329d540ce37a2a2615f0a8
   [junit4]   2> 795637 INFO  (jetty-launcher-1636-thread-4) [    ] o.e.j.s.Server jetty-9.4.8.v20171121, build timestamp: 2017-11-21T15:27:37-06:00, git hash: 82b8fb23f757335bb3329d540ce37a2a2615f0a8
   [junit4]   2> 795637 INFO  (jetty-launcher-1636-thread-1) [    ] o.e.j.s.session DefaultSessionIdManager workerName=node0
   [junit4]   2> 795637 INFO  (jetty-launcher-1636-thread-1) [    ] o.e.j.s.session No SessionScavenger set, using defaults
   [junit4]   2> 795637 INFO  (jetty-launcher-1636-thread-1) [    ] o.e.j.s.session Scavenging every 600000ms
   [junit4]   2> 795637 INFO  (jetty-launcher-1636-thread-1) [    ] o.e.j.s.h.ContextHandler Started o.e.j.s.ServletContextHandler@573b1d66{/solr,null,AVAILABLE}
   [junit4]   2> 795638 INFO  (jetty-launcher-1636-thread-4) [    ] o.e.j.s.session DefaultSessionIdManager workerName=node0
   [junit4]   2> 795638 INFO  (jetty-launcher-1636-thread-3) [    ] o.e.j.s.session DefaultSessionIdManager workerName=node0
   [junit4]   2> 795638 INFO  (jetty-launcher-1636-thread-4) [    ] o.e.j.s.session No SessionScavenger set, using defaults
   [junit4]   2> 795638 INFO  (jetty-launcher-1636-thread-2) [    ] o.e.j.s.session DefaultSessionIdManager workerName=node0
   [junit4]   2> 795638 INFO  (jetty-launcher-1636-thread-4) [    ] o.e.j.s.session Scavenging every 660000ms
   [junit4]   2> 795638 INFO  (jetty-launcher-1636-thread-2) [    ] o.e.j.s.session No SessionScavenger set, using defaults
   [junit4]   2> 795638 INFO  (jetty-launcher-1636-thread-3) [    ] o.e.j.s.session No SessionScavenger set, using defaults
   [junit4]   2> 795638 INFO  (jetty-launcher-1636-thread-2) [    ] o.e.j.s.session Scavenging every 660000ms
   [junit4]   2> 795638 INFO  (jetty-launcher-1636-thread-3) [    ] o.e.j.s.session Scavenging every 660000ms
   [junit4]   2> 795638 INFO  (jetty-launcher-1636-thread-4) [    ] o.e.j.s.h.ContextHandler Started o.e.j.s.ServletContextHandler@19d1a1fe{/solr,null,AVAILABLE}
   [junit4]   2> 795638 INFO  (jetty-launcher-1636-thread-2) [    ] o.e.j.s.h.ContextHandler Started o.e.j.s.ServletContextHandler@53885fa4{/solr,null,AVAILABLE}
   [junit4]   2> 795638 INFO  (jetty-launcher-1636-thread-3) [    ] o.e.j.s.h.ContextHandler Started o.e.j.s.ServletContextHandler@7515c25a{/solr,null,AVAILABLE}
   [junit4]   2> 795639 INFO  (jetty-launcher-1636-thread-3) [    ] o.e.j.s.AbstractConnector Started ServerConnector@4caa1519{HTTP/1.1,[http/1.1]}{127.0.0.1:36005}
   [junit4]   2> 795639 INFO  (jetty-launcher-1636-thread-4) [    ] o.e.j.s.AbstractConnector Started ServerConnector@6bd24620{HTTP/1.1,[http/1.1]}{127.0.0.1:40409}
   [junit4]   2> 795640 INFO  (jetty-launcher-1636-thread-3) [    ] o.e.j.s.Server Started @797114ms
   [junit4]   2> 795640 INFO  (jetty-launcher-1636-thread-4) [    ] o.e.j.s.Server Started @797114ms
   [junit4]   2> 795639 INFO  (jetty-launcher-1636-thread-2) [    ] o.e.j.s.AbstractConnector Started ServerConnector@60b2522f{HTTP/1.1,[http/1.1]}{127.0.0.1:44409}
   [junit4]   2> 795640 INFO  (jetty-launcher-1636-thread-4) [    ] o.a.s.c.s.e.JettySolrRunner Jetty properties: {hostContext=/solr, hostPort=40409}
   [junit4]   2> 795640 INFO  (jetty-launcher-1636-thread-2) [    ] o.e.j.s.Server Started @797114ms
   [junit4]   2> 795639 INFO  (jetty-launcher-1636-thread-1) [    ] o.e.j.s.AbstractConnector Started ServerConnector@7637df{HTTP/1.1,[http/1.1]}{127.0.0.1:38321}
   [junit4]   2> 795640 INFO  (jetty-launcher-1636-thread-2) [    ] o.a.s.c.s.e.JettySolrRunner Jetty properties: {hostContext=/solr, hostPort=44409}
   [junit4]   2> 795640 INFO  (jetty-launcher-1636-thread-1) [    ] o.e.j.s.Server Started @797114ms
   [junit4]   2> 795640 INFO  (jetty-launcher-1636-thread-3) [    ] o.a.s.c.s.e.JettySolrRunner Jetty properties: {hostContext=/solr, hostPort=36005}
   [junit4]   2> 795640 INFO  (jetty-launcher-1636-thread-1) [    ] o.a.s.c.s.e.JettySolrRunner Jetty properties: {hostContext=/solr, hostPort=38321}
   [junit4]   2> 795640 ERROR (jetty-launcher-1636-thread-4) [    ] o.a.s.u.StartupLoggingUtils Missing Java Option solr.log.dir. Logging may be missing or incomplete.
   [junit4]   2> 795640 ERROR (jetty-launcher-1636-thread-1) [    ] o.a.s.u.StartupLoggingUtils Missing Java Option solr.log.dir. Logging may be missing or incomplete.
   [junit4]   2> 795640 INFO  (jetty-launcher-1636-thread-4) [    ] o.a.s.s.SolrDispatchFilter  ___      _       Welcome to Apache Solr™ version 8.0.0
   [junit4]   2> 795640 INFO  (jetty-launcher-1636-thread-1) [    ] o.a.s.s.SolrDispatchFilter  ___      _       Welcome to Apache Solr™ version 8.0.0
   [junit4]   2> 795640 INFO  (jetty-launcher-1636-thread-4) [    ] o.a.s.s.SolrDispatchFilter / __| ___| |_ _   Starting in cloud mode on port null
   [junit4]   2> 795640 INFO  (jetty-launcher-1636-thread-1) [    ] o.a.s.s.SolrDispatchFilter / __| ___| |_ _   Starting in cloud mode on port null
   [junit4]   2> 795640 INFO  (jetty-launcher-1636-thread-4) [    ] o.a.s.s.SolrDispatchFilter \__ \/ _ \ | '_|  Install dir: null
   [junit4]   2> 795640 INFO  (jetty-launcher-1636-thread-1) [    ] o.a.s.s.SolrDispatchFilter \__ \/ _ \ | '_|  Install dir: null
   [junit4]   2> 795640 INFO  (jetty-launcher-1636-thread-4) [    ] o.a.s.s.SolrDispatchFilter |___/\___/_|_|    Start time: 2018-01-27T06:04:22.460501Z
   [junit4]   2> 795640 INFO  (jetty-launcher-1636-thread-1) [    ] o.a.s.s.SolrDispatchFilter |___/\___/_|_|    Start time: 2018-01-27T06:04:22.460519Z
   [junit4]   2> 795640 ERROR (jetty-launcher-1636-thread-3) [    ] o.a.s.u.StartupLoggingUtils Missing Java Option solr.log.dir. Logging may be missing or incomplete.
   [junit4]   2> 795640 ERROR (jetty-launcher-1636-thread-2) [    ] o.a.s.u.StartupLoggingUtils Missing Java Option solr.log.dir. Logging may be missing or incomplete.
   [junit4]   2> 795640 INFO  (jetty-launcher-1636-thread-3) [    ] o.a.s.s.SolrDispatchFilter  ___      _       Welcome to Apache Solr™ version 8.0.0
   [junit4]   2> 795640 INFO  (jetty-launcher-1636-thread-2) [    ] o.a.s.s.SolrDispatchFilter  ___      _       Welcome to Apache Solr™ version 8.0.0
   [junit4]   2> 795640 INFO  (jetty-launcher-1636-thread-3) [    ] o.a.s.s.SolrDispatchFilter / __| ___| |_ _   Starting in cloud mode on port null
   [junit4]   2> 795640 INFO  (jetty-launcher-1636-thread-2) [    ] o.a.s.s.SolrDispatchFilter / __| ___| |_ _   Starting in cloud mode on port null
   [junit4]   2> 795640 INFO  (jetty-launcher-1636-thread-3) [    ] o.a.s.s.SolrDispatchFilter \__ \/ _ \ | '_|  Install dir: null
   [junit4]   2> 795640 INFO  (jetty-launcher-1636-thread-2) [    ] o.a.s.s.SolrDispatchFilter \__ \/ _ \ | '_|  Install dir: null
   [junit4]   2> 795640 INFO  (jetty-launcher-1636-thread-3) [    ] o.a.s.s.SolrDispatchFilter |___/\___/_|_|    Start time: 2018-01-27T06:04:22.460758Z
   [junit4]   2> 795640 INFO  (jetty-launcher-1636-thread-2) [    ] o.a.s.s.SolrDispatchFilter |___/\___/_|_|    Start time: 2018-01-27T06:04:22.460779Z
   [junit4]   2> 795641 INFO  (zkConnectionManagerCallback-1647-thread-1) [    ] o.a.s.c.c.ConnectionManager zkClient has connected
   [junit4]   2> 795641 INFO  (zkConnectionManagerCallback-1643-thread-1) [    ] o.a.s.c.c.ConnectionManager zkClient has connected
   [junit4]   2> 795641 INFO  (zkConnectionManagerCallback-1645-thread-1) [    ] o.a.s.c.c.ConnectionManager zkClient has connected
   [junit4]   2> 795641 INFO  (zkConnectionManagerCallback-1642-thread-1) [    ] o.a.s.c.c.ConnectionManager zkClient has connected
   [junit4]   2> 795641 INFO  (jetty-launcher-1636-thread-4) [    ] o.a.s.s.SolrDispatchFilter solr.xml found in ZooKeeper. Loading...
   [junit4]   2> 795641 INFO  (jetty-launcher-1636-thread-2) [    ] o.a.s.s.SolrDispatchFilter solr.xml found in ZooKeeper. Loading...
   [junit4]   2> 795642 INFO  (jetty-launcher-1636-thread-3) [    ] o.a.s.s.SolrDispatchFilter solr.xml found in ZooKeeper. Loading...
   [junit4]   2> 795642 INFO  (jetty-launcher-1636-thread-1) [    ] o.a.s.s.SolrDispatchFilter solr.xml found in ZooKeeper. Loading...
   [junit4]   2> 795656 WARN  (NIOServerCxn.Factory:0.0.0.0/0.0.0.0:0) [    ] o.a.z.s.NIOServerCnxn caught end of stream exception
   [junit4]   2> EndOfStreamException: Unable to read additional data from client sessionid 0x16136377fd20002, likely client has closed socket
   [junit4]   2> 	at org.apache.zookeeper.server.NIOServerCnxn.doIO(NIOServerCnxn.java:239)
   [junit4]   2> 	at org.apache.zookeeper.server.NIOServerCnxnFactory.run(NIOServerCnxnFactory.java:203)
   [junit4]   2> 	at java.base/java.lang.Thread.run(Thread.java:844)
   [junit4]   2> 795657 INFO  (jetty-launcher-1636-thread-4) [    ] o.a.s.c.ZkContainer Zookeeper client=127.0.0.1:44867/solr
   [junit4]   2> 795657 INFO  (jetty-launcher-1636-thread-2) [    ] o.a.s.c.ZkContainer Zookeeper client=127.0.0.1:44867/solr
   [junit4]   2> 795657 INFO  (jetty-launcher-1636-thread-1) [    ] o.a.s.c.ZkContainer Zookeeper client=127.0.0.1:44867/solr
   [junit4]   2> 795657 INFO  (jetty-launcher-1636-thread-3) [    ] o.a.s.c.ZkContainer Zookeeper client=127.0.0.1:44867/solr
   [junit4]   2> 795663 INFO  (zkConnectionManagerCallback-1655-thread-1) [    ] o.a.s.c.c.ConnectionManager zkClient has connected
   [junit4]   2> 795667 INFO  (zkConnectionManagerCallback-1663-thread-1) [    ] o.a.s.c.c.ConnectionManager zkClient has connected
   [junit4]   2> 795667 INFO  (zkConnectionManagerCallback-1658-thread-1) [    ] o.a.s.c.c.ConnectionManager zkClient has connected
   [junit4]   2> 795667 INFO  (zkConnectionManagerCallback-1661-thread-1) [    ] o.a.s.c.c.ConnectionManager zkClient has connected
   [junit4]   2> 795667 DEBUG (jetty-launcher-1636-thread-4) [n:127.0.0.1:40409_solr    ] o.a.s.c.ZkController Added new OnReconnect listener org.apache.solr.cloud.ZkController$$Lambda$400/626461221@5450df93
   [junit4]   2> 795667 WARN  (NIOServerCxn.Factory:0.0.0.0/0.0.0.0:0) [    ] o.a.z.s.NIOServerCnxn caught end of stream exception
   [junit4]   2> EndOfStreamException: Unable to read additional data from client sessionid 0x16136377fd20007, likely client has closed socket
   [junit4]   2> 	at org.apache.zookeeper.server.NIOServerCnxn.doIO(NIOServerCnxn.java:239)
   [junit4]   2> 	at org.apache.zookeeper.server.NIOServerCnxnFactory.run(NIOServerCnxnFactory.java:203)
   [junit4]   2> 	at java.base/java.lang.Thread.run(Thread.java:844)
   [junit4]   2> 795667 DEBUG (jetty-launcher-1636-thread-3) [n:127.0.0.1:36005_solr    ] o.a.s.c.ZkController Added new OnReconnect listener org.apache.solr.cloud.ZkController$$Lambda$400/626461221@60e34cc3
   [junit4]   2> 795667 DEBUG (jetty-launcher-1636-thread-1) [n:127.0.0.1:38321_solr    ] o.a.s.c.ZkController Added new OnReconnect listener org.apache.solr.cloud.ZkController$$Lambda$400/626461221@4f3f95a1
   [junit4]   2> 795667 WARN  (NIOServerCxn.Factory:0.0.0.0/0.0.0.0:0) [    ] o.a.z.s.NIOServerCnxn caught end of stream exception
   [junit4]   2> EndOfStreamException: Unable to read additional data from client sessionid 0x16136377fd20006, likely client has closed socket
   [junit4]   2> 	at org.apache.zookeeper.server.NIOServerCnxn.doIO(NIOServerCnxn.java:239)
   [junit4]   2> 	at org.apache.zookeeper.server.NIOServerCnxnFactory.run(NIOServerCnxnFactory.java:203)
   [junit4]   2> 	at java.base/java.lang.Thread.run(Thread.java:844)
   [junit4]   2> 795667 DEBUG (jetty-launcher-1636-thread-2) [n:127.0.0.1:44409_solr    ] o.a.s.c.ZkController Added new OnReconnect listener org.apache.solr.cloud.ZkController$$Lambda$400/626461221@518faa09
   [junit4]   2> 795668 INFO  (zkConnectionManagerCallback-1665-thread-1-processing-n:127.0.0.1:40409_solr) [n:127.0.0.1:40409_solr    ] o.a.s.c.c.ConnectionManager zkClient has connected
   [junit4]   2> 795668 INFO  (zkConnectionManagerCallback-1667-thread-1-processing-n:127.0.0.1:36005_solr) [n:127.0.0.1:36005_solr    ] o.a.s.c.c.ConnectionManager zkClient has connected
   [junit4]   2> 795668 INFO  (zkConnectionManagerCallback-1671-thread-1-processing-n:127.0.0.1:44409_solr) [n:127.0.0.1:44409_solr    ] o.a.s.c.c.ConnectionManager zkClient has connected
   [junit4]   2> 795668 INFO  (zkConnectionManagerCallback-1669-thread-1-processing-n:127.0.0.1:38321_solr) [n:127.0.0.1:38321_solr    ] o.a.s.c.c.ConnectionManager zkClient has connected
   [junit4]   2> 795703 DEBUG (SyncThread:0) [    ] o.a.s.c.ZkTestServer Watch added: create/delete: /solr/clusterprops.json
   [junit4]   2> 795703 DEBUG (SyncThread:0) [    ] o.a.s.c.ZkTestServer Watch added: children: /solr/live_nodes
   [junit4]   2> 795704 DEBUG (SyncThread:0) [    ] o.a.s.c.ZkTestServer Watch added: data: /solr/clusterstate.json
   [junit4]   2> 795704 DEBUG (SyncThread:0) [    ] o.a.s.c.ZkTestServer Watch added: create/delete: /solr/clusterprops.json
   [junit4]   2> 795704 DEBUG (SyncThread:0) [    ] o.a.s.c.ZkTestServer Watch added: children: /solr/collections
   [junit4]   2> 795704 DEBUG (SyncThread:0) [    ] o.a.s.c.ZkTestServer Watch added: create/delete: /solr/clusterprops.json
   [junit4]   2> 795704 DEBUG (SyncThread:0) [    ] o.a.s.c.ZkTestServer Watch added: children: /solr/live_nodes
   [junit4]   2> 795704 DEBUG (SyncThread:0) [    ] o.a.s.c.ZkTestServer Watch added: create/delete: /solr/aliases.json
   [junit4]   2> 795704 DEBUG (SyncThread:0) [    ] o.a.s.c.ZkTestServer Watch added: children: /solr/live_nodes
   [junit4]   2> 795704 DEBUG (SyncThread:0) [    ] o.a.s.c.ZkTestServer Watch added: data: /solr/clusterstate.json
   [junit4]   2> 795704 DEBUG (SyncThread:0) [    ] o.a.s.c.ZkTestServer Watch added: data: /solr/clusterstate.json
   [junit4]   2> 795704 DEBUG (SyncThread:0) [    ] o.a.s.c.ZkTestServer Watch added: children: /solr/collections
   [junit4]   2> 795704 DEBUG (SyncThread:0) [    ] o.a.s.c.ZkTestServer Watch added: create/delete: /solr/clusterprops.json
   [junit4]   2> 795704 DEBUG (SyncThread:0) [    ] o.a.s.c.ZkTestServer Watch added: create/delete: /solr/security.json
   [junit4]   2> 795704 DEBUG (SyncThread:0) [    ] o.a.s.c.ZkTestServer Watch added: children: /solr/collections
   [junit4]   2> 795704 DEBUG (SyncThread:0) [    ] o.a.s.c.ZkTestServer Watch added: create/delete: /solr/aliases.json
   [junit4]   2> 795704 DEBUG (SyncThread:0) [    ] o.a.s.c.ZkTestServer Watch added: children: /solr/live_nodes
   [junit4]   2> 795704 DEBUG (SyncThread:0) [    ] o.a.s.c.ZkTestServer Watch added: create/delete: /solr/aliases.json
   [junit4]   2> 795704 DEBUG (SyncThread:0) [    ] o.a.s.c.ZkTestServer Watch added: data: /solr/clusterstate.json
   [junit4]   2> 795704 DEBUG (SyncThread:0) [    ] o.a.s.c.ZkTestServer Watch added: create/delete: /solr/security.json
   [junit4]   2> 795704 DEBUG (SyncThread:0) [    ] o.a.s.c.ZkTestServer Watch added: children: /solr/collections
   [junit4]   2> 795704 DEBUG (SyncThread:0) [    ] o.a.s.c.ZkTestServer Watch added: create/delete: /solr/security.json
   [junit4]   2> 795704 DEBUG (SyncThread:0) [    ] o.a.s.c.ZkTestServer Watch added: create/delete: /solr/aliases.json
   [junit4]   2> 795705 DEBUG (SyncThread:0) [    ] o.a.s.c.ZkTestServer Watch added: create/delete: /solr/security.json
   [junit4]   2> 795705 INFO  (jetty-launcher-1636-thread-3) [n:127.0.0.1:36005_solr    ] o.a.s.c.Overseer Overseer (id=null) closing
   [junit4]   2> 795705 INFO  (jetty-launcher-1636-thread-4) [n:127.0.0.1:40409_solr    ] o.a.s.c.Overseer Overseer (id=null) closing
   [junit4]   2> 795705 INFO  (jetty-launcher-1636-thread-2) [n:127.0.0.1:44409_solr    ] o.a.s.c.Overseer Overseer (id=null) closing
   [junit4]   2> 795705 INFO  (jetty-launcher-1636-thread-1) [n:127.0.0.1:38321_solr    ] o.a.s.c.Overseer Overseer (id=null) closing
   [junit4]   2> 795705 DEBUG (jetty-launcher-1636-thread-4) [n:127.0.0.1:40409_solr    ] o.a.s.c.LeaderElector Joined leadership election with path: /overseer_elect/election/99420278774431753-127.0.0.1:40409_solr-n_0000000000
   [junit4]   2> 795705 DEBUG (jetty-launcher-1636-thread-1) [n:127.0.0.1:38321_solr    ] o.a.s.c.LeaderElector Joined leadership election with path: /overseer_elect/election/99420278774431756-127.0.0.1:38321_solr-n_0000000001
   [junit4]   2> 795705 DEBUG (jetty-launcher-1636-thread-2) [n:127.0.0.1:44409_solr    ] o.a.s.c.LeaderElector Joined leadership election with path: /overseer_elect/election/99420278774431755-127.0.0.1:44409_solr-n_0000000002
   [junit4]   2> 795705 DEBUG (jetty-launcher-1636-thread-3) [n:127.0.0.1:36005_solr    ] o.a.s.c.LeaderElector Joined leadership election with path: /overseer_elect/election/99420278774431754-127.0.0.1:36005_solr-n_0000000003
   [junit4]   2> 795706 INFO  (jetty-launcher-1636-thread-4) [n:127.0.0.1:40409_solr    ] o.a.s.c.OverseerElectionContext I am going to be the leader 127.0.0.1:40409_solr
   [junit4]   2> 795706 DEBUG (SyncThread:0) [    ] o.a.s.c.ZkTestServer Watch added: data: /solr/overseer_elect/election/99420278774431753-127.0.0.1:40409_solr-n_0000000000
   [junit4]   2> 795706 DEBUG (SyncThread:0) [    ] o.a.s.c.ZkTestServer Watch added: data: /solr/overseer_elect/election/99420278774431756-127.0.0.1:38321_solr-n_0000000001
   [junit4]   2> 795706 DEBUG (jetty-launcher-1636-thread-1) [n:127.0.0.1:38321_solr    ] o.a.s.c.LeaderElector Watching path /overseer_elect/election/99420278774431753-127.0.0.1:40409_solr-n_0000000000 to know if I could be the leader
   [junit4]   2> 795706 DEBUG (SyncThread:0) [    ] o.a.s.c.ZkTestServer Watch added: data: /solr/overseer_elect/election/99420278774431755-127.0.0.1:44409_solr-n_0000000002
   [junit4]   2> 795706 DEBUG (jetty-launcher-1636-thread-2) [n:127.0.0.1:44409_solr    ] o.a.s.c.LeaderElector Watching path /overseer_elect/election/99420278774431756-127.0.0.1:38321_solr-n_0000000001 to know if I could be the leader
   [junit4]   2> 795706 DEBUG (jetty-launcher-1636-thread-3) [n:127.0.0.1:36005_solr    ] o.a.s.c.LeaderElector Watching path /overseer_elect/election/99420278774431755-127.0.0.1:44409_solr-n_0000000002 to know if I could be the leader
   [junit4]   2> 795706 INFO  (jetty-launcher-1636-thread-1) [n:127.0.0.1:38321_solr    ] o.a.s.c.ZkController Register node as live in ZooKeeper:/live_nodes/127.0.0.1:38321_solr
   [junit4]   2> 795706 INFO  (jetty-launcher-1636-thread-2) [n:127.0.0.1:44409_solr    ] o.a.s.c.ZkController Register node as live in ZooKeeper:/live_nodes/127.0.0.1:44409_solr
   [junit4]   2> 795706 INFO  (jetty-launcher-1636-thread-3) [n:127.0.0.1:36005_solr    ] o.a.s.c.ZkController Register node as live in ZooKeeper:/live_nodes/127.0.0.1:36005_solr
   [junit4]   2> 795706 INFO  (jetty-launcher-1636-thread-4) [n:127.0.0.1:40409_solr    ] o.a.s.c.Overseer Overseer (id=99420278774431753-127.0.0.1:40409_solr-n_0000000000) starting
   [junit4]   2> 795706 DEBUG (SyncThread:0) [    ] o.a.s.c.ZkTestServer Watch fired: children: /solr/live_nodes
   [junit4]   2> 795706 DEBUG (SyncThread:0) [    ] o.a.s.c.ZkTestServer Watch fired: children: /solr/live_nodes
   [junit4]   2> 795706 DEBUG (SyncThread:0) [    ] o.a.s.c.ZkTestServer Watch fired: children: /solr/live_nodes
   [junit4]   2> 795706 DEBUG (SyncThread:0) [    ] o.a.s.c.ZkTestServer Watch fired: children: /solr/live_nodes
   [junit4]   2> 795706 DEBUG (SyncThread:0) [    ] o.a.s.c.ZkTestServer Watch added: children: /solr/live_nodes
   [junit4]   2> 795706 INFO  (zkCallback-1668-thread-1-processing-n:127.0.0.1:38321_solr) [n:127.0.0.1:38321_solr    ] o.a.s.c.c.ZkStateReader Updated live nodes from ZooKeeper... (0) -> (3)
   [junit4]   2> 795707 DEBUG (SyncThread:0) [    ] o.a.s.c.ZkTestServer Watch added: children: /solr/live_nodes
   [junit4]   2> 795707 DEBUG (SyncThread:0) [    ] o.a.s.c.ZkTestServer Watch added: children: /solr/live_nodes
   [junit4]   2> 795707 INFO  (zkCallback-1664-thread-1-processing-n:127.0.0.1:40409_solr) [n:127.0.0.1:40409_solr    ] o.a.s.c.c.ZkStateReader Updated live nodes from ZooKeeper... (0) -> (3)
   [junit4]   2> 795707 INFO  (zkCallback-1666-thread-1-processing-n:127.0.0.1:36005_solr) [n:127.0.0.1:36005_solr    ] o.a.s.c.c.ZkStateReader Updated live nodes from ZooKeeper... (0) -> (3)
   [junit4]   2> 795711 DEBUG (SyncThread:0) [    ] o.a.s.c.ZkTestServer Watch added: children: /solr/live_nodes
   [junit4]   2> 795711 INFO  (zkCallback-1670-thread-1-processing-n:127.0.0.1:44409_solr) [n:127.0.0.1:44409_solr    ] o.a.s.c.c.ZkStateReader Updated live nodes from ZooKeeper... (0) -> (3)
   [junit4]   2> 795723 DEBUG (OverseerCollectionConfigSetProcessor-99420278774431753-127.0.0.1:40409_solr-n_0000000000) [n:127.0.0.1:40409_solr    ] o.a.s.c.OverseerTaskProcessor Process current queue of overseer operations
   [junit4]   2> 795723 DEBUG (OverseerStateUpdate-99420278774431753-127.0.0.1:40409_solr-n_0000000000) [n:127.0.0.1:40409_solr    ] o.a.s.c.Overseer Starting to work on the main queue
   [junit4]   2> 795723 DEBUG (jetty-launcher-1636-thread-4) [n:127.0.0.1:40409_solr    ] o.a.s.c.ZkController Publish node=127.0.0.1:40409_solr as DOWN
   [junit4]   2> 795724 DEBUG (OverseerAutoScalingTriggerThread-99420278774431753-127.0.0.1:40409_solr-n_0000000000) [n:127.0.0.1:40409_solr    ] o.a.s.c.a.OverseerTriggerThread Adding .autoAddReplicas trigger
   [junit4]   2> 795724 DEBUG (OverseerCollectionConfigSetProcessor-99420278774431753-127.0.0.1:40409_solr-n_0000000000) [n:127.0.0.1:40409_solr    ] o.a.s.c.OverseerTaskProcessor Cleaning up work-queue. #Running tasks: 0
   [junit4]   2> 795724 DEBUG (OverseerCollectionConfigSetProcessor-99420278774431753-127.0.0.1:40409_solr-n_0000000000) [n:127.0.0.1:40409_solr    ] o.a.s.c.OverseerTaskProcessor RunningTasks: []
   [junit4]   2> 795724 DEBUG (OverseerCollectionConfigSetProcessor-99420278774431753-127.0.0.1:40409_solr-n_0000000000) [n:127.0.0.1:40409_solr    ] o.a.s.c.OverseerTaskProcessor BlockedTasks: []
   [junit4]   2> 795724 DEBUG (OverseerCollectionConfigSetProcessor-99420278774431753-127.0.0.1:40409_solr-n_0000000000) [n:127.0.0.1:40409_solr    ] o.a.s.c.OverseerTaskProcessor CompletedTasks: []
   [junit4]   2> 795724 DEBUG (OverseerCollectionConfigSetProcessor-99420278774431753-127.0.0.1:40409_solr-n_0000000000) [n:127.0.0.1:40409_solr    ] o.a.s.c.OverseerTaskProcessor RunningZKTasks: []
   [junit4]   2> 795724 DEBUG (SyncThread:0) [    ] o.a.s.c.ZkTestServer Watch added: data: /solr/autoscaling.json
   [junit4]   2> 795724 INFO  (jetty-launcher-1636-thread-4) [n:127.0.0.1:40409_solr    ] o.a.s.c.ZkController Register node as live in ZooKeeper:/live_nodes/127.0.0.1:40409_solr
   [junit4]   2> 795724 DEBUG (SyncThread:0) [    ] o.a.s.c.ZkTestServer Watch added: children: /solr/overseer/queue-work
   [junit4]   2> 795724 DEBUG (OverseerCollectionConfigSetProcessor-99420278774431753-127.0.0.1:40409_solr-n_0000000000) [n:127.0.0.1:40409_solr    ] o.a.s.c.OverseerTaskQueue Peeking for top 100 elements. ExcludeSet: []
   [junit4]   2> 795724 DEBUG (OverseerAutoScalingTriggerThread-99420278774431753-127.0.0.1:40409_solr-n_0000000000) [n:127.0.0.1:40409_solr    ] o.a.s.c.a.OverseerTriggerThread Refreshing /autoscaling.json with znode version 1
   [junit4]   2> 795724 DEBUG (SyncThread:0) [    ] o.a.s.c.ZkTestServer Watch added: children: /solr/overseer/collection-queue-work
   [junit4]   2> 795724 DEBUG (SyncThread:0) [    ] o.a.s.c.ZkTestServer Watch fired: children: /solr/live_nodes
   [junit4]   2> 795724 DEBUG (SyncThread:0) [    ] o.a.s.c.ZkTestServer Watch fired: children: /solr/live_nodes
   [junit4]   2> 795724 DEBUG (SyncThread:0) [    ] o.a.s.c.ZkTestServer Watch fired: children: /solr/live_nodes
   [junit4]   2> 795724 DEBUG (SyncThread:0) [    ] o.a.s.c.ZkTestServer Watch fired: children: /solr/live_nodes
   [junit4]   2> 795727 DEBUG (SyncThread:0) [    ] o.a.s.c.ZkTestServer Watch added: children: /solr/overseer/queue
   [junit4]   2> 795727 DEBUG (SyncThread:0) [    ] o.a.s.c.ZkTestServer Watch added: children: /solr/live_nodes
   [junit4]   2> 795727 DEBUG (OverseerAutoScalingTriggerThread-99420278774431753-127.0.0.1:40409_solr-n_0000000000) [n:127.0.0.1:40409_solr    ] o.a.s.c.a.NodeLostTrigger Initial livenodes: [127.0.0.1:36005_solr, 127.0.0.1:38321_solr, 127.0.0.1:44409_solr]
   [junit4]   2> 795727 DEBUG (SyncThread:0) [    ] o.a.s.c.ZkTestServer Watch added: children: /solr/live_nodes
   [junit4]   2> 795727 DEBUG (OverseerAutoScalingTriggerThread-99420278774431753-127.0.0.1:40409_solr-n_0000000000) [n:127.0.0.1:40409_solr    ] o.a.s.c.a.OverseerTriggerThread Current znodeVersion 1, lastZnodeVersion -1
   [junit4]   2> 795727 DEBUG (SyncThread:0) [    ] o.a.s.c.ZkTestServer Watch added: children: /solr/live_nodes
   [junit4]   2> 795727 DEBUG (OverseerAutoScalingTriggerThread-99420278774431753-127.0.0.1:40409_solr-n_0000000000) [n:127.0.0.1:40409_solr    ] o.a.s.c.a.OverseerTriggerThread Processed trigger updates upto znodeVersion 1
   [junit4]   2> 795727 DEBUG (SyncThread:0) [    ] o.a.s.c.ZkTestServer Watch added: children: /solr/live_nodes
   [junit4]   2> 795727 INFO  (zkCallback-1670-thread-1-processing-n:127.0.0.1:44409_solr) [n:127.0.0.1:44409_solr    ] o.a.s.c.c.ZkStateReader Updated live nodes from ZooKeeper... (3) -> (4)
   [junit4]   2> 795727 INFO  (zkCallback-1666-thread-1-processing-n:127.0.0.1:36005_solr) [n:127.0.0.1:36005_solr    ] o.a.s.c.c.ZkStateReader Updated live nodes from ZooKeeper... (3) -> (4)
   [junit4]   2> 795727 INFO  (zkCallback-1664-thread-1-processing-n:127.0.0.1:40409_solr) [n:127.0.0.1:40409_solr    ] o.a.s.c.c.ZkStateReader Updated live nodes from ZooKeeper... (3) -> (4)
   [junit4]   2> 795727 DEBUG (OverseerStateUpdate-99420278774431753-127.0.0.1:40409_solr-n_0000000000) [n:127.0.0.1:40409_solr    ] o.a.s.c.Overseer processMessage: queueSize: 1, message = {
   [junit4]   2>   "operation":"downnode",
   [junit4]   2>   "node_name":"127.0.0.1:40409_solr"} current state version: 0
   [junit4]   2> 795727 INFO  (zkCallback-1668-thread-1-processing-n:127.0.0.1:38321_solr) [n:127.0.0.1:38321_solr    ] o.a.s.c.c.ZkStateReader Updated live nodes from ZooKeeper... (3) -> (4)
   [junit4]   2> 795727 DEBUG (OverseerStateUpdate-99420278774431753-127.0.0.1:40409_solr-n_0000000000) [n:127.0.0.1:40409_solr    ] o.a.s.c.o.NodeMutator DownNode state invoked for node: 127.0.0.1:40409_solr
   [junit4]   2> 795734 DEBUG (OverseerAutoScalingTriggerThread-99420278774431753-127.0.0.1:40409_solr-n_0000000000) [n:127.0.0.1:40409_solr    ] o.a.s.c.a.OverseerTriggerThread -- clean old nodeAdded markers
   [junit4]   2> 795734 DEBUG (SyncThread:0) [    ] o.a.s.c.ZkTestServer Watch added: children: /solr/autoscaling/events/.auto_add_replicas
   [junit4]   2> 795734 DEBUG (OverseerAutoScalingTriggerThread-99420278774431753-127.0.0.1:40409_solr-n_0000000000) [n:127.0.0.1:40409_solr    ] o.a.s.c.a.OverseerTriggerThread Current znodeVersion 1, lastZnodeVersion 1
   [junit4]   2> 795734 DEBUG (ScheduledTrigger-3352-thread-1) [n:127.0.0.1:40409_solr    ] o.a.s.c.a.NodeLostTrigger Running NodeLostTrigger: .auto_add_replicas with currently live nodes: 4
   [junit4]   2> 795742 INFO  (jetty-launcher-1636-thread-1) [n:127.0.0.1:38321_solr    ] o.a.s.m.r.SolrJmxReporter JMX monitoring for 'solr_38321.solr.node' (registry 'solr.node') enabled at server: com.sun.jmx.mbeanserver.JmxMBeanServer@3347ea23
   [junit4]   2> 795744 INFO  (jetty-launcher-1636-thread-2) [n:127.0.0.1:44409_solr    ] o.a.s.m.r.SolrJmxReporter JMX monitoring for 'solr_44409.solr.node' (registry 'solr.node') enabled at server: com.sun.jmx.mbeanserver.JmxMBeanServer@3347ea23
   [junit4]   2> 795747 INFO  (jetty-launcher-1636-thread-1) [n:127.0.0.1:38321_solr    ] o.a.s.m.r.SolrJmxReporter JMX monitoring for 'solr_38321.solr.jvm' (registry 'solr.jvm') enabled at server: com.sun.jmx.mbeanserver.JmxMBeanServer@3347ea23
   [junit4]   2> 795747 INFO  (jetty-launcher-1636-thread-1) [n:127.0.0.1:38321_solr    ] o.a.s.m.r.SolrJmxReporter JMX monitoring for 'solr_38321.solr.jetty' (registry 'solr.jetty') enabled at server: com.sun.jmx.mbeanserver.JmxMBeanServer@3347ea23
   [junit4]   2> 795747 INFO  (jetty-launcher-1636-thread-1) [n:127.0.0.1:38321_solr    ] o.a.s.c.CorePropertiesLocator Found 0 core definitions underneath /home/jenkins/workspace/Lucene-Solr-master-Linux/solr/build/solr-core/test/J2/temp/solr.cloud.MoveReplicaHDFSTest_DA3283F84AD85003-001/tempDir-001/node1/.
   [junit4]   2> 795749 INFO  (jetty-launcher-1636-thread-2) [n:127.0.0.1:44409_solr    ] o.a.s.m.r.SolrJmxReporter JMX monitoring for 'solr_44409.solr.jvm' (registry 'solr.jvm') enabled at server: com.sun.jmx.mbeanserver.JmxMBeanServer@3347ea23
   [junit4]   2> 795749 INFO  (jetty-launcher-1636-thread-2) [n:127.0.0.1:44409_solr    ] o.a.s.m.r.SolrJmxReporter JMX monitoring for 'solr_44409.solr.jetty' (registry 'solr.jetty') enabled at server: com.sun.jmx.mbeanserver.JmxMBeanServer@3347ea23
   [junit4]   2> 795750 INFO  (jetty-launcher-1636-thread-2) [n:127.0.0.1:44409_solr    ] o.a.s.c.CorePropertiesLocator Found 0 core definitions underneath /home/jenkins/workspace/Lucene-Solr-master-Linux/solr/build/solr-core/test/J2/temp/solr.cloud.MoveReplicaHDFSTest_DA3283F84AD85003-001/tempDir-001/node2/.
   [junit4]   2> 795750 INFO  (jetty-launcher-1636-thread-3) [n:127.0.0.1:36005_solr    ] o.a.s.m.r.SolrJmxReporter JMX monitoring for 'solr_36005.solr.node' (registry 'solr.node') enabled at server: com.sun.jmx.mbeanserver.JmxMBeanServer@3347ea23
   [junit4]   2> 795757 INFO  (jetty-launcher-1636-thread-3) [n:127.0.0.1:36005_solr    ] o.a.s.m.r.SolrJmxReporter JMX monitoring for 'solr_36005.solr.jvm' (registry 'solr.jvm') enabled at server: com.sun.jmx.mbeanserver.JmxMBeanServer@3347ea23
   [junit4]   2> 795757 INFO  (jetty-launcher-1636-thread-3) [n:127.0.0.1:36005_solr    ] o.a.s.m.r.SolrJmxReporter JMX monitoring for 'solr_36005.solr.jetty' (registry 'solr.jetty') enabled at server: com.sun.jmx.mbeanserver.JmxMBeanServer@3347ea23
   [junit4]   2> 795758 INFO  (jetty-launcher-1636-thread-3) [n:127.0.0.1:36005_solr    ] o.a.s.c.CorePropertiesLocator Found 0 core definitions underneath /home/jenkins/workspace/Lucene-Solr-master-Linux/solr/build/solr-core/test/J2/temp/solr.cloud.MoveReplicaHDFSTest_DA3283F84AD85003-001/tempDir-001/node3/.
   [junit4]   2> 795783 INFO  (jetty-launcher-1636-thread-4) [n:127.0.0.1:40409_solr    ] o.a.s.m.r.SolrJmxReporter JMX monitoring for 'solr_40409.solr.node' (registry 'solr.node') enabled at server: com.sun.jmx.mbeanserver.JmxMBeanServer@3347ea23
   [junit4]   2> 795788 INFO  (jetty-launcher-1636-thread-4) [n:127.0.0.1:40409_solr    ] o.a.s.m.r.SolrJmxReporter JMX monitoring for 'solr_40409.solr.jvm' (registry 'solr.jvm') enabled at server: com.sun.jmx.mbeanserver.JmxMBeanServer@3347ea23
   [junit4]   2> 795788 INFO  (jetty-launcher-1636-thread-4) [n:127.0.0.1:40409_solr    ] o.a.s.m.r.SolrJmxReporter JMX monitoring for 'solr_40409.solr.jetty' (registry 'solr.jetty') enabled at server: com.sun.jmx.mbeanserver.JmxMBeanServer@3347ea23
   [junit4]   2> 795788 INFO  (jetty-launcher-1636-thread-4) [n:127.0.0.1:40409_solr    ] o.a.s.c.CorePropertiesLocator Found 0 core definitions underneath /home/jenkins/workspace/Lucene-Solr-master-Linux/solr/build/solr-core/test/J2/temp/solr.cloud.MoveReplicaHDFSTest_DA3283F84AD85003-001/tempDir-001/node4/.
   [junit4]   2> 795828 DEBUG (SyncThread:0) [    ] o.a.s.c.ZkTestServer Watch fired: children: /solr/overseer/queue
   [junit4]   2> 795828 DEBUG (SyncThread:0) [    ] o.a.s.c.ZkTestServer Watch added: children: /solr/overseer/queue
   [junit4]   2> 795837 INFO  (zkConnectionManagerCallback-1681-thread-1) [    ] o.a.s.c.c.ConnectionManager zkClient has connected
   [junit4]   2> 795840 INFO  (zkConnectionManagerCallback-1685-thread-1) [    ] o.a.s.c.c.ConnectionManager zkClient has connected
   [junit4]   2> 795841 DEBUG (SyncThread:0) [    ] o.a.s.c.ZkTestServer Watch added: create/delete: /solr/clusterprops.json
   [junit4]   2> 795841 DEBUG (SyncThread:0) [    ] o.a.s.c.ZkTestServer Watch added: children: /solr/live_nodes
   [junit4]   2> 795841 INFO  (SUITE-MoveReplicaHDFSTest-seed#[DA3283F84AD85003]-worker) [    ] o.a.s.c.c.ZkStateReader Updated live nodes from ZooKeeper... (0) -> (4)
   [junit4]   2> 795841 DEBUG (SyncThread:0) [    ] o.a.s.c.ZkTestServer Watch added: data: /solr/clusterstate.json
   [junit4]   2> 795841 DEBUG (SyncThread:0) [    ] o.a.s.c.ZkTestServer Watch added: children: /solr/collections
   [junit4]   2> 795841 DEBUG (SyncThread:0) [    ] o.a.s.c.ZkTestServer Watch added: create/delete: /solr/aliases.json
   [junit4]   2> 795842 INFO  (SUITE-MoveReplicaHDFSTest-seed#[DA3283F84AD85003]-worker) [    ] o.a.s.c.s.i.ZkClientClusterStateProvider Cluster at 127.0.0.1:44867/solr ready
   [junit4]   2> 795845 INFO  (qtp868831421-9665) [n:127.0.0.1:36005_solr    ] o.a.s.h.a.CollectionsHandler Invoked Collection Action :overseerstatus with params action=OVERSEERSTATUS&wt=javabin&version=2 and sendToOCPQueue=true
   [junit4]   2> 795845 DEBUG (SyncThread:0) [    ] o.a.s.c.ZkTestServer Watch fired: children: /solr/overseer/collection-queue-work
   [junit4]   2> 795845 DEBUG (SyncThread:0) [    ] o.a.s.c.ZkTestServer Watch added: create/delete: /solr/overseer/collection-queue-work/qnr-0000000000
   [junit4]   2> 795845 DEBUG (SyncThread:0) [    ] o.a.s.c.ZkTestServer Watch added: children: /solr/overseer/collection-queue-work
   [junit4]   2> 795845 DEBUG (OverseerCollectionConfigSetProcessor-99420278774431753-127.0.0.1:40409_solr-n_0000000000) [n:127.0.0.1:40409_solr    ] o.a.s.c.ZkDistributedQueue Found child node with improper name: qnr-0000000000
   [junit4]   2> 795845 DEBUG (SyncThread:0) [    ] o.a.s.c.ZkTestServer Watch fired: children: /solr/overseer/collection-queue-work
   [junit4]   2> 795846 DEBUG (SyncThread:0) [    ] o.a.s.c.ZkTestServer Watch added: children: /solr/overseer/collection-queue-work
   [junit4]   2> 795846 DEBUG (OverseerCollectionConfigSetProcessor-99420278774431753-127.0.0.1:40409_solr-n_0000000000) [n:127.0.0.1:40409_solr    ] o.a.s.c.ZkDistributedQueue Found child node with improper name: qnr-0000000000
   [junit4]   2> 795846 DEBUG (OverseerCollectionConfigSetProcessor-99420278774431753-127.0.0.1:40409_solr-n_0000000000) [n:127.0.0.1:40409_solr    ] o.a.s.c.OverseerTaskQueue Returning topN elements: [/overseer/collection-queue-work/qn-0000000000, ]
   [junit4]   2> 795846 DEBUG (OverseerCollectionConfigSetProcessor-99420278774431753-127.0.0.1:40409_solr-n_0000000000) [n:127.0.0.1:40409_solr    ] o.a.s.c.OverseerTaskProcessor Got 1 tasks from work-queue : [[org.apache.solr.cloud.OverseerTaskQueue$QueueEvent@2e684ecf]]
   [junit4]   2> 795846 DEBUG (OverseerCollectionConfigSetProcessor-99420278774431753-127.0.0.1:40409_solr-n_0000000000) [n:127.0.0.1:40409_solr    ] o.a.s.c.OverseerTaskProcessor Marked task [/overseer/collection-queue-work/qn-0000000000] as running
   [junit4]   2> 795846 DEBUG (OverseerCollectionConfigSetProcessor-99420278774431753-127.0.0.1:40409_solr-n_0000000000) [n:127.0.0.1:40409_solr    ] o.a.s.c.OverseerTaskProcessor Overseer Collection Message Handler: Get the message id:/overseer/collection-queue-work/qn-0000000000 message:{"operation":"overseerstatus"}
   [junit4]   2> 795846 DEBUG (OverseerThreadFactory-3354-thread-1-processing-n:127.0.0.1:40409_solr) [n:127.0.0.1:40409_solr    ] o.a.s.c.OverseerTaskProcessor Runner processing /overseer/collection-queue-work/qn-0000000000
   [junit4]   2> 795847 DEBUG (OverseerCollectionConfigSetProcessor-99420278774431753-127.0.0.1:40409_solr-n_0000000000) [n:127.0.0.1:40409_solr    ] o.a.s.c.OverseerTaskProcessor Cleaning up work-queue. #Running tasks: 1
   [junit4]   2> 795847 DEBUG (OverseerThreadFactory-3354-thread-1-processing-n:127.0.0.1:40409_solr) [n:127.0.0.1:40409_solr    ] o.a.s.c.a.c.OverseerCollectionMessageHandler OverseerCollectionMessageHandler.processMessage : overseerstatus , {"operation":"overseerstatus"}
   [junit4]   2> 795847 DEBUG (OverseerCollectionConfigSetProcessor-99420278774431753-127.0.0.1:40409_solr-n_0000000000) [n:127.0.0.1:40409_solr    ] o.a.s.c.OverseerTaskProcessor RunningTasks: [/overseer/collection-queue-work/qn-0000000000]
   [junit4]   2> 795847 DEBUG (OverseerCollectionConfigSetProcessor-99420278774431753-127.0.0.1:40409_solr-n_0000000000) [n:127.0.0.1:40409_solr    ] o.a.s.c.OverseerTaskProcessor BlockedTasks: []
   [junit4]   2> 795847 DEBUG (OverseerCollectionConfigSetProcessor-99420278774431753-127.0.0.1:40409_solr-n_0000000000) [n:127.0.0.1:40409_solr    ] o.a.s.c.OverseerTaskProcessor CompletedTasks: []
   [junit4]   2> 795847 DEBUG (OverseerCollectionConfigSetProcessor-99420278774431753-127.0.0.1:40409_solr-n_0000000000) [n:127.0.0.1:40409_solr    ] o.a.s.c.OverseerTaskProcessor RunningZKTasks: [/overseer/collection-queue-work/qn-0000000000]
   [junit4]   2> 795847 DEBUG (OverseerCollectionConfigSetProcessor-99420278774431753-127.0.0.1:40409_solr-n_0000000000) [n:127.0.0.1:40409_solr    ] o.a.s.c.OverseerTaskQueue Peeking for top 99 elements. ExcludeSet: [/overseer/collection-queue-work/qn-0000000000],[]
   [junit4]   2> 795847 DEBUG (OverseerThreadFactory-3354-thread-1-processing-n:127.0.0.1:40409_solr) [n:127.0.0.1:40409_solr    ] o.a.s.c.OverseerTaskProcessor Completed task:[/overseer/collection-queue-work/qn-0000000000]
   [junit4]   2> 795847 DEBUG (SyncThread:0) [    ] o.a.s.c.ZkTestServer Watch fired: data: /solr/overseer/collection-queue-work/qnr-0000000000
   [junit4]   2> 795848 DEBUG (SyncThread:0) [    ] o.a.s.c.ZkTestServer Watch fired: children: /solr/overseer/collection-queue-work
   [junit4]   2> 795848 DEBUG (zkCallback-1666-thread-1-processing-n:127.0.0.1:36005_solr) [n:127.0.0.1:36005_solr    ] o.a.s.c.OverseerTaskQueue NodeDataChanged fired on path /overseer/collection-queue-work/qnr-0000000000 state SyncConnected latchEventType null
   [junit4]   2> 795848 DEBUG (OverseerThreadFactory-3354-thread-1-processing-n:127.0.0.1:40409_solr) [n:127.0.0.1:40409_solr    ] o.a.s.c.OverseerTaskProcessor Marked task [/overseer/collection-queue-work/qn-0000000000] as completed.
   [junit4]   2> 795848 DEBUG (OverseerThreadFactory-3354-thread-1-processing-n:127.0.0.1:40409_solr) [n:127.0.0.1:40409_solr    ] o.a.s.c.OverseerTaskProcessor RunningTasks: []
   [junit4]   2> 795848 DEBUG (OverseerThreadFactory-3354-thread-1-processing-n:127.0.0.1:40409_solr) [n:127.0.0.1:40409_solr    ] o.a.s.c.OverseerTaskProcessor BlockedTasks: []
   [junit4]   2> 795848 DEBUG (SyncThread:0) [    ] o.a.s.c.ZkTestServer Watch added: children: /solr/overseer/collection-queue-work
   [junit4]   2> 795848 DEBUG (OverseerThreadFactory-3354-thread-1-processing-n:127.0.0.1:40409_solr) [n:127.0.0.1:40409_solr    ] o.a.s.c.OverseerTaskProcessor CompletedTasks: [/overseer/collection-queue-work/qn-0000000000]
   [junit4]   2> 795848 DEBUG (OverseerThreadFactory-3354-thread-1-processing-n:127.0.0.1:40409_solr) [n:127.0.0.1:40409_solr    ] o.a.s.c.OverseerTaskProcessor RunningZKTasks: [/overseer/collection-queue-work/qn-0000000000]
   [junit4]   2> 795848 DEBUG (OverseerCollectionConfigSetProcessor-99420278774431753-127.0.0.1:40409_solr-n_0000000000) [n:127.0.0.1:40409_solr    ] o.a.s.c.ZkDistributedQueue Found child node with improper name: qnr-0000000000
   [junit4]   2> 795848 DEBUG (SyncThread:0) [    ] o.a.s.c.ZkTestServer Watch fired: children: /solr/overseer/collection-queue-work
   [junit4]   2> 795848 DEBUG (OverseerThreadFactory-3354-thread-1-processing-n:127.0.0.1:40409_solr) [n:127.0.0.1:40409_solr    ] o.a.s.c.OverseerTaskProcessor Overseer Collection Message Handler: Message id:/overseer/collection-queue-work/qn-0000000000 complete, response:{leader=127.0.0.1:40409_solr,overseer_queue_size=0,overseer_work_queue_size=0,overseer_collection_queue_size=2,overseer_operations={am_i_leader={requests=3,errors=0,avgRequestsPerSecond=24.223165504584525,5minRateRequestsPerSecond=0.0,15minRateRequestsPerSecond=0.0,avgTimePerRequest=0.1770193333333333,medianRequestTime=0.193475,75thPcRequestTime=0.202251,95thPcRequestTime=0.202251,99thPcRequestTime=0.202251,999thPcRequestTime=0.202251},downnode={requests=1,errors=0,avgRequestsPerSecond=8.362571811285722,5minRateRequestsPerSecond=0.0,15minRateRequestsPerSecond=0.0,avgTimePerRequest=0.050913,medianRequestTime=0.050913,75thPcRequestTime=0.050913,95thPcRequestTime=0.050913,99thPcRequestTime=0.050913,999thPcRequestTime=0.050913}},collection_operations={am_i_leader={requests=3,errors=0,avgRequestsPerSecond=24.246711256907485,5minRateRequestsPerSecond=0.0,15minRateRequestsPerSecond=0.0,avgTimePerRequest=0.15383466666666665,medianRequestTime=0.161375,75thPcRequestTime=0.191268,95thPcRequestTime=0.191268,99thPcRequestTime=0.191268,999thPcRequestTime=0.191268},overseerstatus={requests=0,errors=0,avgRequestsPerSecond=0.0,5minRateRequestsPerSecond=0.0,15minRateRequestsPerSecond=0.0,avgTimePerRequest=0.0,medianRequestTime=0.0,75thPcRequestTime=0.0,95thPcRequestTime=0.0,99thPcRequestTime=0.0,999thPcRequestTime=0.0}},overseer_queue={},overseer_internal_queue={peek={avgRequestsPerSecond=8.130750864841545,5minRateRequestsPerSecond=0.0,15minRateRequestsPerSecond=0.0,avgTimePerRequest=0.25891,medianRequestTime=0.25891,75thPcRequestTime=0.25891,95thPcRequestTime=0.25891,99thPcRequestTime=0.25891,999thPcRequestTime=0.25891}},collection_queue={peektopn_wait2000={avgRequestsPerSecond=8.143088792793927,5minRateRequestsPerSecond=0.0,15minRateRequestsPerSecond=0.0,avgTimePerRequest=121.774177,medianRequestTime=121.774177,75thPcRequestTime=121.774177,95thPcRequestTime=121.774177,99thPcRequestTime=121.774177,999thPcRequestTime=121.774177}}}
   [junit4]   2> 795848 DEBUG (SyncThread:0) [    ] o.a.s.c.ZkTestServer Watch added: children: /solr/overseer/collection-queue-work
   [junit4]   2> 795848 INFO  (qtp868831421-9665) [n:127.0.0.1:36005_solr    ] o.a.s.s.HttpSolrCall [admin] webapp=null path=/admin/collections params={action=OVERSEERSTATUS&wt=javabin&version=2} status=0 QTime=3
   [junit4]   1> Formatting using clusterid: testClusterID
   [junit4]   2> 795913 WARN  (SUITE-MoveReplicaHDFSTest-seed#[DA3283F84AD85003]-worker) [    ] o.a.h.m.i.MetricsConfig Cannot locate configuration: tried hadoop-metrics2-namenode.properties,hadoop-metrics2.properties
   [junit4]   2> 795919 WARN  (SUITE-MoveReplicaHDFSTest-seed#[DA3283F84AD85003]-worker) [    ] o.a.h.h.HttpRequestLog Jetty request log can only be enabled using Log4j
   [junit4]   2> 795920 INFO  (SUITE-MoveReplicaHDFSTest-seed#[DA3283F84AD85003]-worker) [    ] o.m.log jetty-6.1.x
   [junit4]   2> 795925 INFO  (SUITE-MoveReplicaHDFSTest-seed#[DA3283F84AD85003]-worker) [    ] o.m.log Extract jar:file:/home/jenkins/.ivy2/cache/org.apache.hadoop/hadoop-hdfs/tests/hadoop-hdfs-2.7.4-tests.jar!/webapps/hdfs to ./temp/Jetty_localhost_localdomain_45231_hdfs____ss637t/webapp
   [junit4]   2> 796002 INFO  (SUITE-MoveReplicaHDFSTest-seed#[DA3283F84AD85003]-worker) [    ] o.m.log Started HttpServer2$SelectChannelConnectorWithSafeStartup@localhost.localdomain:45231
   [junit4]   2> 796046 WARN  (SUITE-MoveReplicaHDFSTest-seed#[DA3283F84AD85003]-worker) [    ] o.a.h.h.HttpRequestLog Jetty request log can only be enabled using Log4j
   [junit4]   2> 796047 INFO  (SUITE-MoveReplicaHDFSTest-seed#[DA3283F84AD85003]-worker) [    ] o.m.log jetty-6.1.x
   [junit4]   2> 796049 INFO  (SUITE-MoveReplicaHDFSTest-seed#[DA3283F84AD85003]-worker) [    ] o.m.log Extract jar:file:/home/jenkins/.ivy2/cache/org.apache.hadoop/hadoop-hdfs/tests/hadoop-hdfs-2.7.4-tests.jar!/webapps/datanode to ./temp/Jetty_localhost_37325_datanode____.yj5kqv/webapp
   [junit4]   2> 796108 INFO  (SUITE-MoveReplicaHDFSTest-seed#[DA3283F84AD85003]-worker) [    ] o.m.log Started HttpServer2$SelectChannelConnectorWithSafeStartup@localhost:37325
   [junit4]   2> 796126 WARN  (SUITE-MoveReplicaHDFSTest-seed#[DA3283F84AD85003]-worker) [    ] o.a.h.h.HttpRequestLog Jetty request log can only be enabled using Log4j
   [junit4]   2> 796127 INFO  (SUITE-MoveReplicaHDFSTest-seed#[DA3283F84AD85003]-worker) [    ] o.m.log jetty-6.1.x
   [junit4]   2> 796129 INFO  (SUITE-MoveReplicaHDFSTest-seed#[DA3283F84AD85003]-worker) [    ] o.m.log Extract jar:file:/home/jenkins/.ivy2/cache/org.apache.hadoop/hadoop-hdfs/tests/hadoop-hdfs-2.7.4-tests.jar!/webapps/datanode to ./temp/Jetty_localhost_39747_datanode____lvsm2j/webapp
   [junit4]   2> 796205 INFO  (SUITE-MoveReplicaHDFSTest-seed#[DA3283F84AD85003]-worker) [    ] o.m.log Started HttpServer2$SelectChannelConnectorWithSafeStartup@localhost:39747
   [junit4]   2> 796208 ERROR (DataNode: [[[DISK]file:/home/jenkins/workspace/Lucene-Solr-master-Linux/solr/build/solr-core/test/J2/temp/solr.cloud.MoveReplicaHDFSTest_DA3283F84AD85003-001/tempDir-002/hdfsBaseDir/data/data1/, [DISK]file:/home/jenkins/workspace/Lucene-Solr-master-Linux/solr/build/solr-core/test/J2/temp/solr.cloud.MoveReplicaHDFSTest_DA3283F84AD85003-001/tempDir-002/hdfsBaseDir/data/data2/]]  heartbeating to localhost.localdomain/127.0.0.1:39383) [    ] o.a.h.h.s.d.DirectoryScanner dfs.datanode.directoryscan.throttle.limit.ms.per.sec set to value below 1 ms/sec. Assuming default value of 1000
   [junit4]   2> 796212 INFO  (Block report processor) [    ] BlockStateChange BLOCK* processReport 0x1294414d61e59: from storage DS-e8554951-5e06-44cd-b7da-82eb17610408 node DatanodeRegistration(127.0.0.1:37133, datanodeUuid=c22677f3-debe-4e07-af0d-0da20aef4756, infoPort=34439, infoSecurePort=0, ipcPort=45253, storageInfo=lv=-56;cid=testClusterID;nsid=1152164462;c=0), blocks: 0, hasStaleStorage: true, processing time: 0 msecs
   [junit4]   2> 796212 INFO  (Block report processor) [    ] BlockStateChange BLOCK* processReport 0x1294414d61e59: from storage DS-73828d0b-66fe-4639-8af3-188e46b6569d node DatanodeRegistration(127.0.0.1:37133, datanodeUuid=c22677f3-debe-4e07-af0d-0da20aef4756, infoPort=34439, infoSecurePort=0, ipcPort=45253, storageInfo=lv=-56;cid=testClusterID;nsid=1152164462;c=0), blocks: 0, hasStaleStorage: false, processing time: 0 msecs
   [junit4]   2> 796295 ERROR (DataNode: [[[DISK]file:/home/jenkins/workspace/Lucene-Solr-master-Linux/solr/build/solr-core/test/J2/temp/solr.cloud.MoveReplicaHDFSTest_DA3283F84AD85003-001/tempDir-002/hdfsBaseDir/data/data3/, [DISK]file:/home/jenkins/workspace/Lucene-Solr-master-Linux/solr/build/solr-core/test/J2/temp/solr.cloud.MoveReplicaHDFSTest_DA3283F84AD85003-001/tempDir-002/hdfsBaseDir/data/data4/]]  heartbeating to localhost.localdomain/127.0.0.1:39383) [    ] o.a.h.h.s.d.DirectoryScanner dfs.datanode.directoryscan.throttle.limit.ms.per.sec set to value below 1 ms/sec. Assuming default value of 1000
   [junit4]   2> 796299 INFO  (Block report processor) [    ] BlockStateChange BLOCK* processReport 0x129441a054e27: from storage DS-5f61172d-393e-4e63-bb5c-cc5e644cf740 node DatanodeRegistration(127.0.0.1:39903, datanodeUuid=a95f5645-8e5f-451b-b39a-8a651631fe63, infoPort=44095, infoSecurePort=0, ipcPort=38381, storageInfo=lv=-56;cid=testClusterID;nsid=1152164462;c=0), blocks: 0, hasStaleStorage: true, processing time: 0 msecs
   [junit4]   2> 796299 INFO  (Block report processor) [    ] BlockStateChange BLOCK* processReport 0x129441a054e27: from storage DS-deb59bf4-6a94-4703-937e-db66b722e046 node DatanodeRegistration(127.0.0.1:39903, datanodeUuid=a95f5645-8e5f-451b-b39a-8a651631fe63, infoPort=44095, infoSecurePort=0, ipcPort=38381, storageInfo=lv=-56;cid=testClusterID;nsid=1152164462;c=0), blocks: 0, hasStaleStorage: false, processing time: 0 msecs
   [junit4]   2> 796377 INFO  (TEST-MoveReplicaHDFSTest.testNormalFailedMove-seed#[DA3283F84AD85003]) [    ] o.a.s.SolrTestCaseJ4 ###Starting testNormalFailedMove
   [junit4]   2> 796378 DEBUG (SyncThread:0) [    ] o.a.s.c.ZkTestServer Watch added: create/delete: /solr/clusterprops.json
   [junit4]   2> 796378 DEBUG (SyncThread:0) [    ] o.a.s.c.ZkTestServer Watch added: children: /solr/live_nodes
   [junit4]   2> 796378 INFO  (TEST-MoveReplicaHDFSTest.testNormalFailedMove-seed#[DA3283F84AD85003]) [    ] o.a.s.c.c.ZkStateReader Updated live nodes from ZooKeeper... (0) -> (4)
   [junit4]   2> 796378 DEBUG (SyncThread:0) [    ] o.a.s.c.ZkTestServer Watch added: data: /solr/clusterstate.json
   [junit4]   2> 796378 DEBUG (SyncThread:0) [    ] o.a.s.c.ZkTestServer Watch added: children: /solr/collections
   [junit4]   2> 796378 DEBUG (SyncThread:0) [    ] o.a.s.c.ZkTestServer Watch added: create/delete: /solr/aliases.json
   [junit4]   2> 796379 INFO  (TEST-MoveReplicaHDFSTest.testNormalFailedMove-seed#[DA3283F84AD85003]) [    ] o.e.j.s.Server jetty-9.4.8.v20171121, build timestamp: 2017-11-21T15:27:37-06:00, git hash: 82b8fb23f757335bb3329d540ce37a2a2615f0a8
   [junit4]   2> 796380 INFO  (TEST-MoveReplicaHDFSTest.testNormalFailedMove-seed#[DA3283F84AD85003]) [    ] o.e.j.s.session DefaultSessionIdManager workerName=node0
   [junit4]   2> 796380 INFO  (TEST-MoveReplicaHDFSTest.testNormalFailedMove-seed#[DA3283F84AD85003]) [    ] o.e.j.s.session No SessionScavenger set, using defaults
   [junit4]   2> 796380 INFO  (TEST-MoveReplicaHDFSTest.testNormalFailedMove-seed#[DA3283F84AD85003]) [    ] o.e.j.s.session Scavenging every 660000ms
   [junit4]   2> 796380 INFO  (TEST-MoveReplicaHDFSTest.testNormalFailedMove-seed#[DA3283F84AD85003]) [    ] o.e.j.s.h.ContextHandler Started o.e.j.s.ServletContextHandler@7b1480c{/solr,null,AVAILABLE}
   [junit4]   2> 796380 INFO  (TEST-MoveReplicaHDFSTest.testNormalFailedMove-seed#[DA3283F84AD85003]) [    ] o.e.j.s.AbstractConnector Started ServerConnector@6d5b0196{HTTP/1.1,[http/1.1]}{127.0.0.1:35875}
   [junit4]   2> 796380 INFO  (TEST-MoveReplicaHDFSTest.testNormalFailedMove-seed#[DA3283F84AD85003]) [    ] o.e.j.s.Server Started @797855ms
   [junit4]   2> 796380 INFO  (TEST-MoveReplicaHDFSTest.testNormalFailedMove-seed#[DA3283F84AD85003]) [    ] o.a.s.c.s.e.JettySolrRunner Jetty properties: {hostContext=/solr, hostPort=35875}
   [junit4]   2> 796381 ERROR (TEST-MoveReplicaHDFSTest.testNormalFailedMove-seed#[DA3283F84AD85003]) [    ] o.a.s.u.StartupLoggingUtils Missing Java Option solr.log.dir. Logging may be missing or incomplete.
   [junit4]   2> 796381 INFO  (TEST-MoveReplicaHDFSTest.testNormalFailedMove-seed#[DA3283F84AD85003]) [    ] o.a.s.s.SolrDispatchFilter  ___      _       Welcome to Apache Solr™ version 8.0.0
   [junit4]   2> 796381 INFO  (TEST-MoveReplicaHDFSTest.testNormalFailedMove-seed#[DA3283F84AD85003]) [    ] o.a.s.s.SolrDispatchFilter / __| ___| |_ _   Starting in cloud mode on port null
   [junit4]   2> 796381 INFO  (TEST-MoveReplicaHDFSTest.testNormalFailedMove-seed#[DA3283F84AD85003]) [    ] o.a.s.s.SolrDispatchFilter \__ \/ _ \ | '_|  Install dir: null
   [junit4]   2> 796381 INFO  (TEST-MoveReplicaHDFSTest.testNormalFailedMove-seed#[DA3283F84AD85003]) [    ] o.a.s.s.SolrDispatchFilter |___/\___/_|_|    Start time: 2018-01-27T06:04:23.201280Z
   [junit4]   2> 796386 INFO  (zkConnectionManagerCallback-1688-thread-1) [    ] o.a.s.c.c.ConnectionManager zkClient has connected
   [junit4]   2> 796386 INFO  (TEST-MoveReplicaHDFSTest.testNormalFailedMove-seed#[DA3283F84AD85003]) [    ] o.a.s.s.SolrDispatchFilter solr.xml found in ZooKeeper. Loading...
   [junit4]   2> 796391 INFO  (TEST-MoveReplicaHDFSTest.testNormalFailedMove-seed#[DA3283F84AD85003]) [    ] o.a.s.c.ZkContainer Zookeeper client=127.0.0.1:44867/solr
   [junit4]   2> 796392 INFO  (zkConnectionManagerCallback-1692-thread-1) [    ] o.a.s.c.c.ConnectionManager zkClient has connected
   [junit4]   2> 796393 DEBUG (TEST-MoveReplicaHDFSTest.testNormalFailedMove-seed#[DA3283F84AD85003]) [n:127.0.0.1:35875_solr    ] o.a.s.c.ZkController Added new OnReconnect listener org.apache.solr.cloud.ZkController$$Lambda$400/626461221@823505f
   [junit4]   2> 796394 INFO  (zkConnectionManagerCallback-1694-thread-1-processing-n:127.0.0.1:35875_solr) [n:127.0.0.1:35875_solr    ] o.a.s.c.c.ConnectionManager zkClient has connected
   [junit4]   2> 796396 DEBUG (SyncThread:0) [    ] o.a.s.c.ZkTestServer Watch added: create/delete: /solr/clusterprops.json
   [junit4]   2> 796396 DEBUG (SyncThread:0) [    ] o.a.s.c.ZkTestServer Watch added: children: /solr/live_nodes
   [junit4]   2> 796396 INFO  (TEST-MoveReplicaHDFSTest.testNormalFailedMove-seed#[DA3283F84AD85003]) [n:127.0.0.1:35875_solr    ] o.a.s.c.c.ZkStateReader Updated live nodes from ZooKeeper... (0) -> (4)
   [junit4]   2> 796396 DEBUG (SyncThread:0) [    ] o.a.s.c.ZkTestServer Watch added: data: /solr/clusterstate.json
   [junit4]   2> 796397 DEBUG (SyncThread:0) [    ] o.a.s.c.ZkTestServer Watch added: children: /solr/collections
   [junit4]   2> 796397 DEBUG (SyncThread:0) [    ] o.a.s.c.ZkTestServer Watch added: create/delete: /solr/aliases.json
   [junit4]   2> 796397 DEBUG (SyncThread:0) [    ] o.a.s.c.ZkTestServer Watch added: create/delete: /solr/security.json
   [junit4]   2> 796397 INFO  (TEST-MoveReplicaHDFSTest.testNormalFailedMove-seed#[DA3283F84AD85003]) [n:127.0.0.1:35875_solr    ] o.a.s.c.Overseer Overseer (id=null) closing
   [junit4]   2> 796398 DEBUG (TEST-MoveReplicaHDFSTest.testNormalFailedMove-seed#[DA3283F84AD85003]) [n:127.0.0.1:35875_solr    ] o.a.s.c.LeaderElector Joined leadership election with path: /overseer_elect/election/99420278774431761-127.0.0.1:35875_solr-n_0000000004
   [junit4]   2> 796398 DEBUG (SyncThread:0) [    ] o.a.s.c.ZkTestServer Watch added: data: /solr/overseer_elect/election/99420278774431754-127.0.0.1:36005_solr-n_0000000003
   [junit4]   2> 796398 DEBUG (TEST-MoveReplicaHDFSTest.testNormalFailedMove-seed#[DA3283F84AD85003]) [n:127.0.0.1:35875_solr    ] o.a.s.c.LeaderElector Watching path /overseer_elect/election/99420278774431754-127.0.0.1:36005_solr-n_0000000003 to know if I could be the leader
   [junit4]   2> 796398 DEBUG (TEST-MoveReplicaHDFSTest.testNormalFailedMove-seed#[DA3283F84AD85003]) [n:127.0.0.1:35875_solr    ] o.a.s.c.ZkController Publish node=127.0.0.1:35875_solr as DOWN
   [junit4]   2> 796398 DEBUG (SyncThread:0) [    ] o.a.s.c.ZkTestServer Watch fired: children: /solr/overseer/queue
   [junit4]   2> 796398 INFO  (TEST-MoveReplicaHDFSTest.testNormalFailedMove-seed#[DA3283F84AD85003]) [n:127.0.0.1:35875_solr    ] o.a.s.c.ZkController Register node as live in ZooKeeper:/live_nodes/127.0.0.1:35875_solr
   [junit4]   2> 796399 DEBUG (SyncThread:0) [    ] o.a.s.c.ZkTestServer Watch added: children: /solr/overseer/queue
   [junit4]   2> 796399 DEBUG (OverseerStateUpdate-99420278774431753-127.0.0.1:40409_solr-n_0000000000) [n:127.0.0.1:40409_solr    ] o.a.s.c.Overseer processMessage: queueSize: 1, message = {
   [junit4]   2>   "operation":"downnode",
   [junit4]   2>   "node_name":"127.0.0.1:35875_solr"} current state version: 0
   [junit4]   2> 796399 DEBUG (OverseerStateUpdate-99420278774431753-127.0.0.1:40409_solr-n_0000000000) [n:127.0.0.1:40409_solr    ] o.a.s.c.o.NodeMutator DownNode state invoked for node: 127.0.0.1:35875_solr
   [junit4]   2> 796399 DEBUG (SyncThread:0) [    ] o.a.s.c.ZkTestServer Watch fired: children: /solr/live_nodes
   [junit4]   2> 796399 DEBUG (SyncThread:0) [    ] o.a.s.c.ZkTestServer Watch fired: children: /solr/live_nodes
   [junit4]   2> 796399 DEBUG (SyncThread:0) [    ] o.a.s.c.ZkTestServer Watch fired: children: /solr/live_nodes
   [junit4]   2> 796399 DEBUG (SyncThread:0) [    ] o.a.s.c.ZkTestServer Watch fired: children: /solr/live_nodes
   [junit4]   2> 796399 DEBUG (SyncThread:0) [    ] o.a.s.c.ZkTestServer Watch fired: children: /solr/live_nodes
   [junit4]   2> 796399 DEBUG (SyncThread:0) [    ] o.a.s.c.ZkTestServer Watch fired: children: /solr/live_nodes
   [junit4]   2> 796399 DEBUG (SyncThread:0) [    ] o.a.s.c.ZkTestServer Watch added: children: /solr/live_nodes
   [junit4]   2> 796399 DEBUG (SyncThread:0) [    ] o.a.s.c.ZkTestServer Watch added: children: /solr/live_nodes
   [junit4]   2> 796399 INFO  (zkCallback-1668-thread-1-processing-n:127.0.0.1:38321_solr) [n:127.0.0.1:38321_solr    ] o.a.s.c.c.ZkStateReader Updated live nodes from ZooKeeper... (4) -> (5)
   [junit4]   2> 796399 DEBUG (SyncThread:0) [    ] o.a.s.c.ZkTestServer Watch added: children: /solr/live_nodes
   [junit4]   2> 796399 INFO  (zkCallback-1666-thread-1-processing-n:127.0.0.1:36005_solr) [n:127.0.0.1:36005_solr    ] o.a.s.c.c.ZkStateReader Updated live nodes from ZooKeeper... (4) -> (5)
   [junit4]   2> 796399 INFO  (zkCallback-1670-thread-1-processing-n:127.0.0.1:44409_solr) [n:127.0.0.1:44409_solr    ] o.a.s.c.c.ZkStateReader Updated live nodes from ZooKeeper... (4) -> (5)
   [junit4]   2> 796399 DEBUG (SyncThread:0) [    ] o.a.s.c.ZkTestServer Watch added: children: /solr/live_nodes
   [junit4]   2> 796399 INFO  (zkCallback-1664-thread-1-processing-n:127.0.0.1:40409_solr) [n:127.0.0.1:40409_solr    ] o.a.s.c.c.ZkStateReader Updated live nodes from ZooKeeper... (4) -> (5)
   [junit4]   2> 796403 DEBUG (SyncThread:0) [    ] o.a.s.c.ZkTestServer Watch added: children: /solr/live_nodes
   [junit4]   2> 796403 INFO  (zkCallback-1684-thread-1) [    ] o.a.s.c.c.ZkStateReader Updated live nodes from ZooKeeper... (4) -> (5)
   [junit4]   2> 796405 DEBUG (SyncThread:0) [    ] o.a.s.c.ZkTestServer Watch added: children: /solr/live_nodes
   [junit4]   2> 796405 DEBUG (SyncThread:0) [    ] o.a.s.c.ZkTestServer Watch added: children: /solr/live_nodes
   [junit4]   2> 796405 INFO  (zkCallback-1693-thread-1-processing-n:127.0.0.1:35875_solr) [n:127.0.0.1:35875_solr    ] o.a.s.c.c.ZkStateReader Updated live nodes from ZooKeeper... (4) -> (5)
   [junit4]   2> 796405 INFO  (zkCallback-1684-thread-2) [    ] o.a.s.c.c.ZkStateReader Updated live nodes from ZooKeeper... (4) -> (5)
   [junit4]   2> 796434 INFO  (TEST-MoveReplicaHDFSTest.testNormalFailedMove-seed#[DA3283F84AD85003]) [n:127.0.0.1:35875_solr    ] o.a.s.m.r.SolrJmxReporter JMX monitoring for 'solr_35875.solr.node' (registry 'solr.node') enabled at server: com.sun.jmx.mbeanserver.JmxMBeanServer@3347ea23
   [junit4]   2> 796439 INFO  (TEST-MoveReplicaHDFSTest.testNormalFailedMove-seed#[DA3283F84AD85003]) [n:127.0.0.1:35875_solr    ] o.a.s.m.r.SolrJmxReporter JMX monitoring for 'solr_35875.solr.jvm' (registry 'solr.jvm') enabled at server: com.sun.jmx.mbeanserver.JmxMBeanServer@3347ea23
   [junit4]   2> 796440 INFO  (TEST-MoveReplicaHDFSTest.testNormalFailedMove-seed#[DA3283F84AD85003]) [n:127.0.0.1:35875_solr    ] o.a.s.m.r.SolrJmxReporter JMX monitoring for 'solr_35875.solr.jetty' (registry 'solr.jetty') enabled at server: com.sun.jmx.mbeanserver.JmxMBeanServer@3347ea23
   [junit4]   2> 796440 INFO  (TEST-MoveReplicaHDFSTest.testNormalFailedMove-seed#[DA3283F84AD85003]) [n:127.0.0.1:35875_solr    ] o.a.s.c.CorePropertiesLocator Found 0 core definitions underneath /home/jenkins/workspace/Lucene-Solr-master-Linux/solr/build/solr-core/test/J2/temp/solr.cloud.MoveReplicaHDFSTest_DA3283F84AD85003-001/tempDir-001/node5/.
   [junit4]   2> 796473 INFO  (zkConnectionManagerCallback-1698-thread-1) [    ] o.a.s.c.c.ConnectionManager zkClient has connected
   [junit4]   2> 796475 INFO  (qtp1966811557-9958) [n:127.0.0.1:35875_solr    ] o.a.s.h.a.CollectionsHandler Invoked Collection Action :create with params replicationFactor=2&collection.configName=conf1&autoAddReplicas=false&name=MoveReplicaHDFSTest_failed_coll_false&nrtReplicas=2&action=CREATE&numShards=2&wt=javabin&version=2 and sendToOCPQueue=true
   [junit4]   2> 796476 DEBUG (SyncThread:0) [    ] o.a.s.c.ZkTestServer Watch fired: children: /solr/overseer/collection-queue-work
   [junit4]   2> 796476 DEBUG (SyncThread:0) [    ] o.a.s.c.ZkTestServer Watch added: create/delete: /solr/overseer/collection-queue-work/qnr-0000000002
   [junit4]   2> 796476 DEBUG (SyncThread:0) [    ] o.a.s.c.ZkTestServer Watch added: children: /solr/overseer/collection-queue-work
   [junit4]   2> 796476 DEBUG (OverseerCollectionConfigSetProcessor-99420278774431753-127.0.0.1:40409_solr-n_0000000000) [n:127.0.0.1:40409_solr    ] o.a.s.c.ZkDistributedQueue Found child node with improper name: qnr-0000000002
   [junit4]   2> 796476 DEBUG (SyncThread:0) [    ] o.a.s.c.ZkTestServer Watch fired: children: /solr/overseer/collection-queue-work
   [junit4]   2> 796476 DEBUG (SyncThread:0) [    ] o.a.s.c.ZkTestServer Watch added: children: /solr/overseer/collection-queue-work
   [junit4]   2> 796476 DEBUG (OverseerCollectionConfigSetProcessor-99420278774431753-127.0.0.1:40409_solr-n_0000000000) [n:127.0.0.1:40409_solr    ] o.a.s.c.ZkDistributedQueue Found child node with improper name: qnr-0000000002
   [junit4]   2> 796476 DEBUG (OverseerCollectionConfigSetProcessor-99420278774431753-127.0.0.1:40409_solr-n_0000000000) [n:127.0.0.1:40409_solr    ] o.a.s.c.OverseerTaskQueue Returning topN elements: [/overseer/collection-queue-work/qn-0000000002, ]
   [junit4]   2> 796476 DEBUG (OverseerCollectionConfigSetProcessor-99420278774431753-127.0.0.1:40409_solr-n_0000000000) [n:127.0.0.1:40409_solr    ] o.a.s.c.OverseerTaskProcessor Got 1 tasks from work-queue : [[org.apache.solr.cloud.OverseerTaskQueue$QueueEvent@2e684ed1]]
   [junit4]   2> 796476 DEBUG (OverseerCollectionConfigSetProcessor-99420278774431753-127.0.0.1:40409_solr-n_0000000000) [n:127.0.0.1:40409_solr    ] o.a.s.c.OverseerTaskProcessor Marked task [/overseer/collection-queue-work/qn-0000000002] as running
   [junit4]   2> 796477 DEBUG (OverseerCollectionConfigSetProcessor-99420278774431753-127.0.0.1:40409_solr-n_0000000000) [n:127.0.0.1:40409_solr    ] o.a.s.c.OverseerTaskProcessor Overseer Collection Message Handler: Get the message id:/overseer/collection-queue-work/qn-0000000002 message:{
   [junit4]   2>   "name":"MoveReplicaHDFSTest_failed_coll_false",
   [junit4]   2>   "fromApi":"true",
   [junit4]   2>   "replicationFactor":"2",
   [junit4]   2>   "collection.configName":"conf1",
   [junit4]   2>   "numShards":"2",
   [junit4]   2>   "autoAddReplicas":"false",
   [junit4]   2>   "nrtReplicas":"2",
   [junit4]   2>   "stateFormat":"2",
   [junit4]   2>   "operation":"create"}
   [junit4]   2> 796477 DEBUG (OverseerThreadFactory-3354-thread-2-processing-n:127.0.0.1:40409_solr) [n:127.0.0.1:40409_solr    ] o.a.s.c.OverseerTaskProcessor Runner processing /overseer/collection-queue-work/qn-0000000002
   [junit4]   2> 796477 DEBUG (OverseerThreadFactory-3354-thread-2-processing-n:127.0.0.1:40409_solr) [n:127.0.0.1:40409_solr    ] o.a.s.c.a.c.OverseerCollectionMessageHandler OverseerCollectionMessageHandler.processMessage : create , {
   [junit4]   2>   "name":"MoveReplicaHDFSTest_failed_coll_false",
   [junit4]   2>   "fromApi":"true",
   [junit4]   2>   "replicationFactor":"2",
   [junit4]   2>   "collection.configName":"conf1",
   [junit4]   2>   "numShards":"2",
   [junit4]   2>   "autoAddReplicas":"false",
   [junit4]   2>   "nrtReplicas":"2",
   [junit4]   2>   "stateFormat":"2",
   [junit4]   2>   "operation":"create"}
   [junit4]   2> 796477 INFO  (OverseerThreadFactory-3354-thread-2-processing-n:127.0.0.1:40409_solr) [n:127.0.0.1:40409_solr    ] o.a.s.c.a.c.CreateCollectionCmd Create collection MoveReplicaHDFSTest_failed_coll_false
   [junit4]   2> 796477 DEBUG (OverseerCollectionConfigSetProcessor-99420278774431753-127.0.0.1:40409_solr-n_0000000000) [n:127.0.0.1:40409_solr    ] o.a.s.c.OverseerTaskProcessor Cleaning up work-queue. #Running tasks: 1
   [junit4]   2> 796477 INFO  (OverseerCollectionConfigSetProcessor-99420278774431753-127.0.0.1:40409_solr-n_0000000000) [n:127.0.0.1:40409_solr    ] o.a.s.c.OverseerTaskQueue Response ZK path: /overseer/collection-queue-work/qnr-0000000000 doesn't exist.  Requestor may have disconnected from ZooKeeper
   [junit4]   2> 796477 DEBUG (OverseerCollectionConfigSetProcessor-99420278774431753-127.0.0.1:40409_solr-n_0000000000) [n:127.0.0.1:40409_solr    ] o.a.s.c.OverseerTaskProcessor RunningTasks: [/overseer/collection-queue-work/qn-0000000002]
   [junit4]   2> 796477 DEBUG (OverseerCollectionConfigSetProcessor-99420278774431753-127.0.0.1:40409_solr-n_0000000000) [n:127.0.0.1:40409_solr    ] o.a.s.c.OverseerTaskProcessor BlockedTasks: []
   [junit4]   2> 796477 DEBUG (OverseerThreadFactory-3354-thread-2-processing-n:127.0.0.1:40409_solr) [n:127.0.0.1:40409_solr    ] o.a.s.c.a.c.Assign Identify nodes using default
   [junit4]   2> 796477 DEBUG (OverseerCollectionConfigSetProcessor-99420278774431753-127.0.0.1:40409_solr-n_0000000000) [n:127.0.0.1:40409_solr    ] o.a.s.c.OverseerTaskProcessor CompletedTasks: []
   [junit4]   2> 796477 DEBUG (OverseerCollectionConfigSetProcessor-99420278774431753-127.0.0.1:40409_solr-n_0000000000) [n:127.0.0.1:40409_solr    ] o.a.s.c.OverseerTaskProcessor RunningZKTasks: [/overseer/collection-queue-work/qn-0000000002]
   [junit4]   2> 796477 DEBUG (OverseerThreadFactory-3354-thread-2-processing-n:127.0.0.1:40409_solr) [n:127.0.0.1:40409_solr    ] o.a.s.c.a.c.OverseerCollectionMessageHandler creating collections conf node /collections/MoveReplicaHDFSTest_failed_coll_false 
   [junit4]   2> 796477 DEBUG (OverseerCollectionConfigSetProcessor-99420278774431753-127.0.0.1:40409_solr-n_0000000000) [n:127.0.0.1:40409_solr    ] o.a.s.c.OverseerTaskQueue Peeking for top 99 elements. ExcludeSet: [/overseer/collection-queue-work/qn-0000000002],[]
   [junit4]   2> 796478 DEBUG (SyncThread:0) [    ] o.a.s.c.ZkTestServer Watch fired: children: /solr/collections
   [junit4]   2> 796478 DEBUG (SyncThread:0) [    ] o.a.s.c.ZkTestServer Watch fired: children: /solr/collections
   [junit4]   2> 796478 DEBUG (SyncThread:0) [    ] o.a.s.c.ZkTestServer Watch fired: children: /solr/collections
   [junit4]   2> 796478 DEBUG (SyncThread:0) [    ] o.a.s.c.ZkTestServer Watch fired: children: /solr/collections
   [junit4]   2> 796478 DEBUG (SyncThread:0) [    ] o.a.s.c.ZkTestServer Watch fired: children: /solr/collections
   [junit4]   2> 796478 DEBUG (SyncThread:0) [    ] o.a.s.c.ZkTestServer Watch fired: children: /solr/collections
   [junit4]   2> 796478 DEBUG (SyncThread:0) [    ] o.a.s.c.ZkTestServer Watch added: children: /solr/collections
   [junit4]   2> 796478 DEBUG (SyncThread:0) [    ] o.a.s.c.ZkTestServer Watch added: children: /solr/collections
   [junit4]   2> 796478 DEBUG (SyncThread:0) [    ] o.a.s.c.ZkTestServer Watch added: children: /solr/collections
   [junit4]   2> 796478 DEBUG (SyncThread:0) [    ] o.a.s.c.ZkTestServer Watch added: children: /solr/collections
   [junit4]   2> 796478 DEBUG (SyncThread:0) [    ] o.a.s.c.ZkTestServer Watch added: children: /solr/collections
   [junit4]   2> 796478 DEBUG (OverseerThreadFactory-3354-thread-2-processing-n:127.0.0.1:40409_solr) [n:127.0.0.1:40409_solr    ] o.a.s.c.a.c.CreateCollectionCmd Check for collection zkNode:MoveReplicaHDFSTest_failed_coll_false
   [junit4]   2> 796478 DEBUG (SyncThread:0) [    ] o.a.s.c.ZkTestServer Watch added: children: /solr/collections
   [junit4]   2> 796478 DEBUG (SyncThread:0) [    ] o.a.s.c.ZkTestServer Watch added: children: /solr/collections
   [junit4]   2> 796478 DEBUG (OverseerThreadFactory-3354-thread-2-processing-n:127.0.0.1:40409_solr) [n:127.0.0.1:40409_solr    ] o.a.s.c.a.c.CreateCollectionCmd Collection zkNode exists
   [junit4]   2> 796478 DEBUG (SyncThread:0) [    ] o.a.s.c.ZkTestServer Watch fired: children: /solr/overseer/queue
   [junit4]   2> 796478 DEBUG (SyncThread:0) [    ] o.a.s.c.ZkTestServer Watch added: children: /solr/overseer/queue
   [junit4]   2> 796479 DEBUG (OverseerStateUpdate-99420278774431753-127.0.0.1:40409_solr-n_0000000000) [n:127.0.0.1:40409_solr    ] o.a.s.c.Overseer processMessage: queueSize: 2, message = {
   [junit4]   2>   "name":"MoveReplicaHDFSTest_failed_coll_false",
   [junit4]   2>   "fromApi":"true",
   [junit4]   2>   "replicationFactor":"2",
   [junit4]   2>   "collection.configName":"conf1",
   [junit4]   2>   "numShards":"2",
   [junit4]   2>   "autoAddReplicas":"false",
   [junit4]   2>   "nrtReplicas":"2",
   [junit4]   2>   "stateFormat":"2",
   [junit4]   2>   "operation":"create"} current state version: 0
   [junit4]   2> 796479 DEBUG (OverseerStateUpdate-99420278774431753-127.0.0.1:40409_solr-n_0000000000) [n:127.0.0.1:40409_solr    ] o.a.s.c.o.ClusterStateMutator building a new cName: MoveReplicaHDFSTest_failed_coll_false
   [junit4]   2> 796479 DEBUG (OverseerStateUpdate-99420278774431753-127.0.0.1:40409_solr-n_0000000000) [n:127.0.0.1:40409_solr    ] o.a.s.c.o.ZkStateWriter going to create_collection /collections/MoveReplicaHDFSTest_failed_coll_false/state.json
   [junit4]   2> 796479 DEBUG (SyncThread:0) [    ] o.a.s.c.ZkTestServer Watch fired: children: /solr/overseer/queue
   [junit4]   2> 796479 DEBUG (SyncThread:0) [    ] o.a.s.c.ZkTestServer Watch added: children: /solr/overseer/queue
   [junit4]   2> 796579 DEBUG (OverseerThreadFactory-3354-thread-2-processing-n:127.0.0.1:40409_solr) [n:127.0.0.1:40409_solr    ] o.a.s.c.a.c.CreateCollectionCmd Creating SolrCores for new collection MoveReplicaHDFSTest_failed_coll_false, shardNames [shard1, shard2] , message : {
   [junit4]   2>   "name":"MoveReplicaHDFSTest_failed_coll_false",
   [junit4]   2>   "fromApi":"true",
   [junit4]   2>   "replicationFactor":"2",
   [junit4]   2>   "collection.configName":"conf1",
   [junit4]   2>   "numShards":"2",
   [junit4]   2>   "autoAddReplicas":"false",
   [junit4]   2>   "nrtReplicas":"2",
   [junit4]   2>   "stateFormat":"2",
   [junit4]   2>   "operation":"create"}
   [junit4]   2> 796582 DEBUG (OverseerThreadFactory-3354-thread-2-processing-n:127.0.0.1:40409_solr) [n:127.0.0.1:40409_solr    ] o.a.s.c.a.c.CreateCollectionCmd Creating core MoveReplicaHDFSTest_failed_coll_false_shard1_replica_n1 as part of shard shard1 of collection MoveReplicaHDFSTest_failed_coll_false on 127.0.0.1:35875_solr
   [junit4]   2> 796583 DEBUG (SyncThread:0) [    ] o.a.s.c.ZkTestServer Watch fired: children: /solr/overseer/queue
   [junit4]   2> 796584 DEBUG (SyncThread:0) [    ] o.a.s.c.ZkTestServer Watch added: children: /solr/overseer/queue
   [junit4]   2> 796584 DEBUG (OverseerStateUpdate-99420278774431753-127.0.0.1:40409_solr-n_0000000000) [n:127.0.0.1:40409_solr    ] o.a.s.c.Overseer processMessage: queueSize: 1, message = {
   [junit4]   2>   "operation":"ADDREPLICA",
   [junit4]   2>   "collection":"MoveReplicaHDFSTest_failed_coll_false",
   [junit4]   2>   "shard":"shard1",
   [junit4]   2>   "core":"MoveReplicaHDFSTest_failed_coll_false_shard1_replica_n1",
   [junit4]   2>   "state":"down",
   [junit4]   2>   "base_url":"http://127.0.0.1:35875/solr",
   [junit4]   2>   "type":"NRT",
   [junit4]   2>   "waitForFinalState":"false"} current state version: 0
   [junit4]   2> 796584 INFO  (OverseerStateUpdate-99420278774431753-127.0.0.1:40409_solr-n_0000000000) [n:127.0.0.1:40409_solr    ] o.a.s.c.o.SliceMutator createReplica() {
   [junit4]   2>   "operation":"ADDREPLICA",
   [junit4]   2>   "collection":"MoveReplicaHDFSTest_failed_coll_false",
   [junit4]   2>   "shard":"shard1",
   [junit4]   2>   "core":"MoveReplicaHDFSTest_failed_coll_false_shard1_replica_n1",
   [junit4]   2>   "state":"down",
   [junit4]   2>   "base_url":"http://127.0.0.1:35875/solr",
   [junit4]   2>   "type":"NRT",
   [junit4]   2>   "waitForFinalState":"false"} 
   [junit4]   2> 796584 DEBUG (OverseerThreadFactory-3354-thread-2-processing-n:127.0.0.1:40409_solr) [n:127.0.0.1:40409_solr    ] o.a.s.c.a.c.CreateCollectionCmd Creating core MoveReplicaHDFSTest_failed_coll_false_shard1_replica_n2 as part of shard shard1 of collection MoveReplicaHDFSTest_failed_coll_false on 127.0.0.1:40409_solr
   [junit4]   2> 796585 DEBUG (OverseerStateUpdate-99420278774431753-127.0.0.1:40409_solr-n_0000000000) [n:127.0.0.1:40409_solr    ] o.a.s.c.o.SliceMutator Old Slice: shard1:{
   [junit4]   2>   "range":"80000000-ffffffff",
   [junit4]   2>   "state":"active",
   [junit4]   2>   "replicas":{}}
   [junit4]   2> 796585 DEBUG (OverseerStateUpdate-99420278774431753-127.0.0.1:40409_solr-n_0000000000) [n:127.0.0.1:40409_solr    ] o.a.s.c.o.SliceMutator New Slice: shard1:{
   [junit4]   2>   "range":"80000000-ffffffff",
   [junit4]   2>   "state":"active",
   [junit4]   2>   "replicas":{"core_node3":{
   [junit4]   2>       "core":"MoveReplicaHDFSTest_failed_coll_false_shard1_replica_n1",
   [junit4]   2>       "base_url":"http://127.0.0.1:35875/solr",
   [junit4]   2>       "state":"down",
   [junit4]   2>       "node_name":null,
   [junit4]   2>       "type":"NRT"}}}
   [junit4]   2> 796585 DEBUG (SyncThread:0) [    ] o.a.s.c.ZkTestServer Watch fired: children: /solr/overseer/queue
   [junit4]   2> 796586 DEBUG (SyncThread:0) [    ] o.a.s.c.ZkTestServer Watch added: children: /solr/overseer/queue
   [junit4]   2> 796586 DEBUG (OverseerStateUpdate-99420278774431753-127.0.0.1:40409_solr-n_0000000000) [n:127.0.0.1:40409_solr    ] o.a.s.c.Overseer processMessage: queueSize: 2, message = {
   [junit4]   2>   "operation":"ADDREPLICA",
   [junit4]   2>   "collection":"MoveReplicaHDFSTest_failed_coll_false",
   [junit4]   2>   "shard":"shard1",
   [junit4]   2>   "core":"MoveReplicaHDFSTest_failed_coll_false_shard1_replica_n2",
   [junit4]   2>   "state":"down",
   [junit4]   2>   "base_url":"http://127.0.0.1:40409/solr",
   [junit4]   2>   "type":"NRT",
   [junit4]   2>   "waitForFinalState":"false"} current state version: 0
   [junit4]   2> 796586 INFO  (OverseerStateUpdate-99420278774431753-127.0.0.1:40409_solr-n_0000000

[...truncated too long message...]

icTrigger_shard2_replica_n2] o.a.s.m.SolrMetricManager Closing metric reporters for registry=solr.collection.testMetricTrigger.shard2.leader, tag=322391667
   [junit4]   2> 3313248 INFO  (coreCloseExecutor-7842-thread-1) [n:127.0.0.1:44725_solr c:testMetricTrigger s:shard1 r:core_node3 x:testMetricTrigger_shard1_replica_n1] o.a.s.m.SolrMetricManager Closing metric reporters for registry=solr.collection.testMetricTrigger.shard1.leader, tag=1532616215
   [junit4]   2> 3313249 INFO  (jetty-closer-3723-thread-8) [    ] o.e.j.s.h.ContextHandler Stopped o.e.j.s.ServletContextHandler@7993d45d{/solr,null,UNAVAILABLE}
   [junit4]   2> 3313250 INFO  (jetty-closer-3723-thread-8) [    ] o.e.j.s.session Stopped scavenging
   [junit4]   2> 3313250 INFO  (jetty-closer-3723-thread-5) [    ] o.e.j.s.h.ContextHandler Stopped o.e.j.s.ServletContextHandler@1bac4466{/solr,null,UNAVAILABLE}
   [junit4]   2> 3313250 INFO  (jetty-closer-3723-thread-5) [    ] o.e.j.s.session Stopped scavenging
   [junit4]   2> 3313251 INFO  (coreCloseExecutor-7834-thread-1) [n:127.0.0.1:33839_solr c:collection1 s:shard1 r:core_node6 x:collection1_shard1_replica_n5] o.a.s.m.SolrMetricManager Closing metric reporters for registry=solr.collection.collection1.shard1.leader, tag=2134913502
   [junit4]   2> 3313251 INFO  (coreCloseExecutor-7834-thread-2) [n:127.0.0.1:33839_solr c:collection1 s:shard1 r:core_node16 x:collection1_shard1_replica_n15] o.a.s.m.SolrMetricManager Closing metric reporters for registry=solr.collection.collection1.shard1.leader, tag=1576541844
   [junit4]   2> 3313252 INFO  (jetty-closer-3723-thread-1) [    ] o.a.s.c.Overseer Overseer (id=99420432572022807-127.0.0.1:33839_solr-n_0000000006) closing
   [junit4]   2> 3313252 INFO  (OverseerStateUpdate-99420432572022807-127.0.0.1:33839_solr-n_0000000006) [n:127.0.0.1:33839_solr    ] o.a.s.c.Overseer Overseer Loop exiting : 127.0.0.1:33839_solr
   [junit4]   2> 3313252 WARN  (OverseerAutoScalingTriggerThread-99420432572022807-127.0.0.1:33839_solr-n_0000000006) [n:127.0.0.1:33839_solr    ] o.a.s.c.a.OverseerTriggerThread OverseerTriggerThread woken up but we are closed, exiting.
   [junit4]   2> 3313252 DEBUG (jetty-closer-3723-thread-1) [    ] o.a.s.c.a.OverseerTriggerThread OverseerTriggerThread has been closed explicitly
   [junit4]   2> 3313253 INFO  (jetty-closer-3723-thread-1) [    ] o.e.j.s.h.ContextHandler Stopped o.e.j.s.ServletContextHandler@aa69338{/solr,null,UNAVAILABLE}
   [junit4]   2> 3313253 INFO  (jetty-closer-3723-thread-1) [    ] o.e.j.s.session Stopped scavenging
   [junit4]   2> 3314739 WARN  (zkCallback-3936-thread-2-processing-n:127.0.0.1:39171_solr) [n:127.0.0.1:39171_solr    ] o.a.s.c.c.ZkStateReader ZooKeeper watch triggered, but Solr cannot talk to ZK: [KeeperErrorCode = Session expired for /live_nodes]
   [junit4]   2> 3314740 INFO  (jetty-closer-3723-thread-13) [    ] o.e.j.s.h.ContextHandler Stopped o.e.j.s.ServletContextHandler@260f4e7f{/solr,null,UNAVAILABLE}
   [junit4]   2> 3314740 INFO  (jetty-closer-3723-thread-13) [    ] o.e.j.s.session Stopped scavenging
   [junit4]   2> 3314741 ERROR (SUITE-TriggerIntegrationTest-seed#[DA3283F84AD85003]-worker) [    ] o.a.z.s.ZooKeeperServer ZKShutdownHandler is not registered, so ZooKeeper server won't take any action on ERROR or SHUTDOWN server state changes
   [junit4]   2> 3314742 INFO  (SUITE-TriggerIntegrationTest-seed#[DA3283F84AD85003]-worker) [    ] o.a.s.c.ZkTestServer connecting to 127.0.0.1:46351 46351
   [junit4]   2> 3320526 INFO  (Thread-8173) [    ] o.a.s.c.ZkTestServer connecting to 127.0.0.1:46351 46351
   [junit4]   2> 3320527 WARN  (Thread-8173) [    ] o.a.s.c.ZkTestServer Watch limit violations: 
   [junit4]   2> Maximum concurrent create/delete watches above limit:
   [junit4]   2> 
   [junit4]   2> 	21	/solr/aliases.json
   [junit4]   2> 	20	/solr/security.json
   [junit4]   2> 	7	/solr/configs/conf
   [junit4]   2> 
   [junit4]   2> Maximum concurrent data watches above limit:
   [junit4]   2> 
   [junit4]   2> 	104	/solr/collections/collection1/state.json
   [junit4]   2> 	21	/solr/clusterprops.json
   [junit4]   2> 	21	/solr/clusterstate.json
   [junit4]   2> 	11	/solr/collections/testMetricTrigger/state.json
   [junit4]   2> 	5	/solr/autoscaling.json
   [junit4]   2> 	3	/solr/overseer_elect/election/99420432572022810-127.0.0.1:43883_solr-n_0000000007
   [junit4]   2> 	3	/solr/overseer_elect/election/99420432572022831-127.0.0.1:35753_solr-n_0000000014
   [junit4]   2> 	3	/solr/collections/collection1/leader_elect/shard1/election/99420432572022807-core_node6-n_0000000002
   [junit4]   2> 	3	/solr/overseer_elect/election/99420432572022795-127.0.0.1:34897_solr-n_0000000002
   [junit4]   2> 	2	/solr/collections/collection1/leader_elect/shard1/election/99420432572022810-core_node10-n_0000000004
   [junit4]   2> 	2	/solr/overseer_elect/election/99420432572022828-127.0.0.1:44725_solr-n_0000000013
   [junit4]   2> 	2	/solr/overseer_elect/election/99420432572022807-127.0.0.1:33839_solr-n_0000000006
   [junit4]   2> 	2	/solr/overseer_elect/election/99420432572022819-127.0.0.1:45995_solr-n_0000000010
   [junit4]   2> 	2	/solr/overseer_elect/election/99420432572022822-127.0.0.1:46651_solr-n_0000000011
   [junit4]   2> 
   [junit4]   2> Maximum concurrent children watches above limit:
   [junit4]   2> 
   [junit4]   2> 	21	/solr/live_nodes
   [junit4]   2> 	21	/solr/collections
   [junit4]   2> 	5	/solr/overseer/queue-work
   [junit4]   2> 	5	/solr/autoscaling/events/.auto_add_replicas
   [junit4]   2> 	5	/solr/overseer/queue
   [junit4]   2> 	5	/solr/overseer/collection-queue-work
   [junit4]   2> 	2	/solr/autoscaling/events/node_lost_triggerMR
   [junit4]   2> 	2	/solr/autoscaling/events/node_added_triggerCTOOR
   [junit4]   2> 
   [junit4]   2> NOTE: leaving temporary files on disk at: /home/jenkins/workspace/Lucene-Solr-master-Linux/solr/build/solr-core/test/J0/temp/solr.cloud.autoscaling.TriggerIntegrationTest_DA3283F84AD85003-001
   [junit4]   2> NOTE: test params are: codec=Lucene70, sim=Asserting(org.apache.lucene.search.similarities.AssertingSimilarity@32974a72), locale=fr-CF, timezone=Libya
   [junit4]   2> NOTE: Linux 4.13.0-31-generic amd64/Oracle Corporation 9.0.1 (64-bit)/cpus=8,threads=1,free=196649320,total=518979584
   [junit4]   2> NOTE: All tests run in this JVM: [ChangedSchemaMergeTest, TestIndexSearcher, TestRandomFaceting, TestRebalanceLeaders, SolrIndexMetricsTest, SolrIndexConfigTest, TestManagedSchema, DocExpirationUpdateProcessorFactoryTest, MissingSegmentRecoveryTest, TestHashQParserPlugin, StatsComponentTest, TestSolrXml, TestCSVResponseWriter, FacetPivotSmallTest, CheckHdfsIndexTest, SolrCoreCheckLockOnStartupTest, TestHttpShardHandlerFactory, TestStressLucene, SuggestComponentTest, BlockJoinFacetSimpleTest, OpenCloseCoreStressTest, TestReplicationHandlerBackup, TestSimDistributedQueue, HealthCheckHandlerTest, TestFieldCollectionResource, ExternalFileFieldSortTest, TestRequestStatusCollectionAPI, TestEmbeddedSolrServerSchemaAPI, ConcurrentCreateRoutedAliasTest, RestartWhileUpdatingTest, SimpleFacetsTest, TestWriterPerf, SolrCoreMetricManagerTest, TestIBSimilarityFactory, TermVectorComponentDistributedTest, TestMaxTokenLenTokenizer, DeleteShardTest, TestDistribIDF, TestCopyFieldCollectionResource, TestConfig, RAMDirectoryFactoryTest, AtomicUpdateProcessorFactoryTest, TestCloudPivotFacet, TestImpersonationWithHadoopAuth, TestFieldSortValues, BinaryUpdateRequestHandlerTest, TestLegacyFieldCache, HdfsAutoAddReplicasIntegrationTest, SolrRequestParserTest, ChaosMonkeyNothingIsSafeTest, AutoScalingHandlerTest, TestCloudSchemaless, SegmentsInfoRequestHandlerTest, BasicDistributedZkTest, TestTrieFacet, OverseerTaskQueueTest, TestFileDictionaryLookup, SolrCloudExampleTest, HdfsWriteToMultipleCollectionsTest, MBeansHandlerTest, JSONWriterTest, TestMergePolicyConfig, TestJoin, UUIDFieldTest, SolrCloudReportersTest, FieldAnalysisRequestHandlerTest, AnalyticsQueryTest, SpellingQueryConverterTest, HdfsThreadLeakTest, TestLeaderInitiatedRecoveryThread, TestLMDirichletSimilarityFactory, TestPayloadScoreQParserPlugin, PKIAuthenticationIntegrationTest, ClassificationUpdateProcessorIntegrationTest, HLLSerializationTest, TestIndexingPerformance, TestExecutePlanAction, TestLuceneMatchVersion, DebugComponentTest, BJQParserTest, LeaderFailoverAfterPartitionTest, TestSlowCompositeReaderWrapper, TestTolerantUpdateProcessorRandomCloud, FullSolrCloudDistribCmdsTest, SolrMetricsIntegrationTest, DistributedFacetPivotSmallAdvancedTest, CreateCollectionCleanupTest, TestHdfsUpdateLog, JavabinLoaderTest, CloudExitableDirectoryReaderTest, HdfsChaosMonkeySafeLeaderTest, SpatialRPTFieldTypeTest, TestSolrCloudWithSecureImpersonation, ShufflingReplicaListTransformerTest, TestSolrCLIRunExample, ZkStateReaderTest, CollectionsAPIAsyncDistributedZkTest, HdfsDirectoryTest, TestCollationField, RequestLoggingTest, TestSolrQueryParser, AssignTest, TestFieldCache, AssignBackwardCompatibilityTest, SystemLogListenerTest, TestDynamicLoading, OutOfBoxZkACLAndCredentialsProvidersTest, TestNumericRangeQuery32, RequestHandlersTest, CustomHighlightComponentTest, RuleEngineTest, SimpleCollectionCreateDeleteTest, TestManagedResourceStorage, CdcrBidirectionalTest, TestFieldTypeResource, SpellCheckCollatorWithCollapseTest, DistributedFacetExistsSmallTest, TestSmileRequest, SolrJmxReporterCloudTest, MetricsHandlerTest, TestSolrConfigHandlerConcurrent, UUIDUpdateProcessorFallbackTest, DocValuesMissingTest, TestCollectionAPIs, TestSolrFieldCacheBean, TestExclusionRuleCollectionAccess, TestLeaderElectionWithEmptyReplica, TestMiniSolrCloudClusterSSL, TestPullReplicaErrorHandling, TestSegmentSorting, TestSkipOverseerOperations, TestTlogReplica, CollectionReloadTest, CustomCollectionTest, TestCollectionAPI, TestReplicaProperties, AutoAddReplicasPlanActionTest, NodeAddedTriggerTest, TestPolicyCloud, TriggerIntegrationTest]
   [junit4] Completed [616/770 (2!)] on J0 in 178.20s, 14 tests, 2 failures <<< FAILURES!

[...truncated 41428 lines...]

Mime
View raw message